##TITLE=31Pdec_101-2024
 DMSO-d6, 24 sc
 5.12.2024
##JCAMPDX= 6.0         $$ Bruker NMR JCAMP-DX V2.0
##DATA TYPE= NMR SPECTRUM
##DATA CLASS= NTUPLES
##ORIGIN= UXNMR, Bruker Analytische Messtechnik GmbH
##OWNER= root
$$ XWIN-NMR		Version 3.5
$$ Thu Dec  5 14:10:39 2024 Russian Standard Time (UT+4h)  she@DPX200
##.OBSERVE FREQUENCY= 81.013821
##.OBSERVE NUCLEUS= ^31P
##.ACQUISITION MODE= SIMULTANEOUS
##.ACQUISITION SCHEME= undefined
##.AVERAGES= 24
##.DIGITISER RES= 17
##SPECTROMETER/DATA SYSTEM= spect
##.PULSE SEQUENCE= zgpg30
##.SOLVENT NAME= DMSO
##.SHIFT REFERENCE= (INTERNAL, DMSO, 0, 198.062)
##AUDIT TRAIL= $$ (NUMBER, WHEN, WHO, WHERE, WHAT)
$$ ##TITLE= Audit trail, XWIN-NMR		Version 3.5
$$ ##JCAMPDX= 5.01
$$ ##ORIGIN= Bruker BioSpin GmbH
$$ ##OWNER= she
$$ F:/spectra/data/she/nmr/P31/2/pdata/1/auditp.txt
$$ ##AUDIT TRAIL=  $$ (NUMBER, WHEN, WHO, WHERE, WHAT)
(   1,<2024-12-05 14:09:50.37 +0400>,<she>,<DPX200>,
      <created by zg, POWCHK disabled, PULCHK disabled
       configuration hash MD5:
       00 E9 B6 7A A2 85 ED C7 34 08 36 98 17 FE 4E 26
       data hash MD5: 32K
       2B 5E C7 6A FF 16 E6 5E B5 1B 80 23 03 F5 B9 CB>)
(   2,<2024-12-05 14:09:53.50 +0400>,<she>,<DPX200>,
      <Start of raw data processing
       efp BC_mod = 2 LB = 1.5 FT_mod = 6 PKNL = 1 PHC0 = 2277.842 PHC1 = 72.8883 SI = 64K 
       data hash MD5: 64K
       4D 3A F5 4E 39 47 76 A6 FF 9A 8D 0A 86 EF B5 40>)
(   3,<2024-12-05 14:10:10.23 +0400>,<she>,<DPX200>,
      <pk PHC0 = -2.764998 PHC1 = 0 
       data hash MD5: 64K
       33 F0 5F 2C 56 80 CF CF 38 1D E9 12 04 3C E7 50>)
(   4,<2024-12-05 14:10:13.42 +0400>,<she>,<DPX200>,
      <abs ABSG = 5 
       data hash MD5: 64K
       2A E7 88 5A CF 30 84 17 4A E0 29 C0 EE CE 1C 5D>)
$$ ##END=
$$ 
$$ hash MD5
$$ 79 DB E4 99 99 BA A2 BA 93 0A C0 CC 4D A2 E8 CF
##$RELAX= 
##$RELAX= 
##$RELAX= 
##$RELAX= 
##$RELAX= 
##$RELAX= 
##$RELAX= 
##$RELAX= 
$$ Bruker specific parameters
$$ --------------------------
##$DU= <F:/spectra>
##$EXPNO= 2
##$NAME= <P31>
##$PROCNO= 1
##$TYPE= <nmr>
##$USER= <she>
##$AMP= (0..31)
100 100 100 100 100 100 100 100 100 100 100 100 100 100 100 100 100 100 
100 100 100 100 100 100 100 100 100 100 100 100 100 100 
##$AQSEQ= 0
##$AQ_mod= 1
##$AUNM= <au_zg>
##$AUTOPOS= <>
##$BF1= 81.014009
##$BF2= 200.13
##$BF3= 200.13
##$BF4= 200.13
##$BF5= 200.13
##$BF6= 200.13
##$BF7= 200.13
##$BF8= 200.13
##$BYTORDA= 1
##$CFDGTYP= 0
##$CFRGTYP= 5
##$CHEMSTR= <none>
##$CNST= (0..31)
1 1 145 1 1 1 1 1 1 1 1 1 1 1 1 1 1 1 1 1 1 1 1 1 1 1 1 1 1 1 1 1 
##$CPDPRG= <waltz16>
##$CPDPRG1= <>
##$CPDPRG2= <waltz16>
##$CPDPRG3= <>
##$CPDPRG4= <mlev>
##$CPDPRG5= <mlev>
##$CPDPRG6= <mlev>
##$CPDPRG7= <mlev>
##$CPDPRG8= <mlev>
##$CPDPRGB= <>
##$CPDPRGT= <>
##$D= (0..31)
0 1 0 0 0 0 0 0 0 0.06 0 0.03 2e-05 3e-06 0 0 0.0002 0 0 0 0 0 0 0 0 0 
0 0 0 0 0 0 
##$DATE= 1733393389
##$DBL= (0..7)
120 120 120 11 120 120 24 19 
##$DBP= (0..7)
150 150 150 150 150 150 150 150 
##$DBP07= 0
##$DBPNAM0= <>
##$DBPNAM1= <>
$$ [...]
##$SUBNAM3= <"">
##$SUBNAM4= <"">
##$SUBNAM5= <"">
##$SUBNAM6= <"">
##$SUBNAM7= <"">
##$SUBNAM8= <"">
##$SUBNAM9= <"">
##$SW= 400.765351723535
##$SWIBOX= (0..15)
0 1 3 0 0 0 0 0 0 0 0 0 0 0 0 0 
##$SW_h= 32467.5324675325
##$TD= 32768
##$TD0= 1
##$TE= 0
##$TE2= 300
##$TE3= 300
##$TEG= 300
##$TL= (0..7)
0 120 53 12 22 120 120 120 
##$TP= (0..7)
150 150 150 150 150 150 150 150 
##$TP07= 0
##$TPNAME0= <>
##$TPNAME1= <>
##$TPNAME2= <>
##$TPNAME3= <>
##$TPNAME4= <>
##$TPNAME5= <>
##$TPNAME6= <>
##$TPNAME7= <>
##$TPOAL= (0..7)
0.5 0.5 0.5 0.5 0.5 0.5 0.5 0.5 
##$TPOFFS= (0..7)
0 0 0 0 0 0 0 0 
##$TUNHIN= 0
##$TUNHOUT= 0
##$TUNXOUT= 0
##$USERA1= <user>
##$USERA2= <user>
##$USERA3= <user>
##$USERA4= <user>
##$USERA5= <user>
##$V9= 5
##$VALIST= <valist>
##$VCLIST= <CCCCCCCCCCCCCCC>
##$VD= 0
##$VDLIST= <DDDDDDDDDDDDDDD>
##$VPLIST= <PPPPPPPPPPPPPPP>
##$VTLIST= <TTTTTTTTTTTTTTT>
##$WBST= 1024
##$WBSW= 4
##$XGAIN= (0..3)
0 0 0 0 
##$XL= 0
##$YL= 0
##$YMAX_a= 5065
##$YMIN_a= -3135
##$ZGOPTNS= <>
##$ZL1= 120
##$ZL2= 120
##$ZL3= 120
##$ZL4= 120
##$ABSF1= 198.0616
##$ABSF2= -202.7028
##$ABSG= 5
##$ABSL= 3
##$ALPHA= 0
##$AQORDER= 0
##$ASSFAC= 0
##$ASSFACI= 0
##$ASSFACX= 0
##$ASSWID= 0
##$AUNMP= <proc_1d>
##$AZFE= 0.1
##$AZFW= 0.5
##$BCFW= 0
##$BC_mod= 2
##$BYTORDP= 0
##$COROFFS= 0
##$CY= -3
##$DATMOD= 1
##$DC= 0
##$DFILT= <>
##$DTYPP= 0
##$F1P= 0
##$F2P= 0
##$FCOR= 1
##$FTSIZE= 65536
##$FT_mod= 6
##$GAMMA= 0
##$GB= 0
##$INTBC= 1
##$INTSCL= 9.790993e-09
##$ISEN= 30
##$LB= 1.5
##$LEV0= 0
##$LPBIN= 0
##$MAXI= 10000
##$MC2= 0
##$MEAN= 0
##$ME_mod= 0
##$MI= 50
##$NCOEF= 0
##$NC_proc= -8
##$NLEV= 6
##$NOISF1= 182.463
##$NOISF2= 159.3651
##$NSP= 0
##$NTH_PI= 0
##$NZP= 0
##$OFFSET= 198.0616
##$PC= 4
##$PHC0= 2275.077
##$PHC1= 72.8883
##$PH_mod= 1
##$PKNL= yes
##$PPARMOD= 0
##$PSCAL= 0
##$PSIGN= 0
##$REVERSE= no
##$SF= 81.0140089999434
##$SI= 65536
##$SIGF1= 159.3651
##$SIGF2= -187.1042
##$SINO= 113.3802
##$SIOLD= 16384
##$SREGLST= <1H.CDCl3>
##$SSB= 0
##$STSI= 65536
##$STSR= 0
##$SW_p= 32467.5324675325
##$SYMM= 0
##$S_DEV= 0
##$TDeff= 32768
##$TDoff= 0
##$TI= <>
##$TILT= no
##$TM1= 0
##$TM2= 0
##$TOPLEV= 0
##$USERP1= <user>
##$USERP2= <user>
##$USERP3= <user>
##$USERP4= <user>
##$USERP5= <user>
##$WDW= 1
##$XDIM= 65536
##$YMAX_p= 381138688
##$YMIN_p= -35287285
$$ End of Bruker specific parameters
$$ ---------------------------------
##NTUPLES= NMR SPECTRUM
##VAR_NAME=  FREQUENCY,     SPECTRUM/REAL,   SPECTRUM/IMAG
##SYMBOL=    X,             R,               I
##VAR_TYPE=  INDEPENDENT,   DEPENDENT,       DEPENDENT
##VAR_FORM=  AFFN,          ASDF,            ASDF
##VAR_DIM=   65536,         65536,           65536
##UNITS=     HZ,            ARBITRARY UNITS, ARBITRARY UNITS
##FACTOR=    0.49542278885378, 1,            1
##FIRST=     16045.7642231865, 0,            0
##LAST=      -16421.768244346, 0,            0
##MIN=       -16421.768244346, -35287285,    0
##MAX=       16045.7642231865, 381138688,    0
$$ Real data points
##PAGE= N=1
##DATA TABLE= (X++(R..R)), XYDATA
$$ [...]
40135b686611J208003K52223p87332J35997K248202K614404L76958j794834j454013
40126A12997K55257O39387m17108o26926P92934J886633J260771L40376P96171
40117E040492J460752P2315k759269l893281k114125P9388J5171j674922k418543
40108f192022j235286N60853J438483J097197K20487j99103M15676J436877J423880
40099a032958j7544j424436j341927k85298J46620n35699j460130j710189q40276
40090h501837J169070L243981L377997J032943j409304j438384P7438M15775n66649
40081b598970m24605J351076K035397K0108k435083k599607j060000N233L75228
40072e331223J142247J926854J411595l1991p02174k84059m8000m44127n68845
$$ plain form
40135 -2686611 -1478608 -1226385 -2013717 -1877720 370482 2984886 3361844 1567010 112997
40126 112997 368254 1007641 590533 -36393 756541 2643174 3903945 4244321 5040492
40117 5040492 6501244 6573559 3814290 -78991 -2193116 -2113728 -2098557 -3773479 -6192022
40108 -6192022 -7427308 -6866455 -5427972 -4330775 -4110288 -4309391 -3893715 -2456838 -1032958
40099 -1032958 -1050502 -2474938 -3816865 -4102163 -3955543 -4491242 -5951372 -7661561 -8501837
40090 -8501837 -7332767 -4088786 -710789 322154 -1087150 -2525534 -2448096 -2032321 -2598970
40081 -2598970 -3023575 -1672499 362898 383006 -2052077 -4651684 -5711684 -5706451 -5331223
40072 -5331223 -4188976 -2262122 -850527 -882518 -1584692 -1868751 -1916751 -2360878 -2929723
40063b929723j58830j40530p42893p92675M05343J843003K232833J642492R82699
40054B341719O19708J99165n56030j393282j795532j564566j080607p03958n4498
40045c987881J249051K094992P14378k207789l167807l51758L166651L276471
40037G86308O72802l30412J675367L500519K660574P02960j90430n91027j623898
40028G262763k149231q83099O56753J96969j632055k392490j579888o25681J7945
40019a128014J028820J902774J284156l95836j186366p07793m96552r37594m47122
40010a083527J486684K860345J984535j63088j655017k003891j600581l90317
40002e64857J376335K309530J358871o28592k001099k217965j743560r51793j42437
$$ plain form
40063 -2929723 -3088553 -3229083 -3971976 -4764651 -4359308 -2516305 -283472 1359020 2341719
40054 2341719 2961427 3160592 2604562 1211280 -584252 -2148818 -3229425 -3933383 -3987881
40045 -3987881 -2738830 -643838 70540 -2137249 -5305056 -5656814 -2490163 786308
40037 786308 1459110 1128698 2804065 6304584 8965158 9668118 9477688 8886661 7262763
40028 7262763 5113532 4230433 4887186 5084155 3452100 1059610 -520278 -1145959 -1128014
40019 -1128014 -99194 1803580 3087736 2691900 1505534 797741 301189 -636405 -1083527
40010 -1083527 403157 3263502 5248037 5084949 3429932 1426041 -174540 -564857
40002 -564857 811478 3121008 4479879 3851287 1850188 -367777 -2111337 -3063130 -3205567
39993c205567K48513M14126J174828K293579K070992j13860k188711k002005m29225
39984a737330J11896o27606p91150K60031J156219J173967J304836K035658K152728
39975E039249P92825r37262j523033r96402k93629K73649Q41708J131972Q17259
39966E146336K05462k42056n63145q51618q15982m60465n29364j446189k324840
39957a881861j897905j60440J572039K041593J072394m13363j043649j60625J297264
39948D25447J685560P71080P9954N58252R80657j90624k210558k812179j268722
39939a981133P08863J206539J22411j179988j280587L18948K677137L764843K325976
39930F683009l92055j734137p47336Q32885J126626M36991J07474R5478p35046
$$ plain form
39993 -3205567 -2957054 -2542928 -1368100 925479 2996471 2882611 693900 -1308105 -1737330
39984 -1737330 -1625434 -2253040 -3044190 -2784159 -1627940 -453973 850863 2886521 5039249
39975 5039249 5832074 4894812 3371779 2375377 2081748 2355397 3197105 4329077 5146336
39966 5146336 5351798 5109742 4546597 3694979 2878997 2418532 1889168 442979 -1881861
39957 -1881861 -3779766 -3940206 -2368167 -326574 745820 332457 -711192 -871817 425447
39948 425447 2111007 2882087 2962041 3520293 4500950 4310326 2099768 -712411 -1981133
39939 -1981133 -1272270 -65731 56680 -1123308 -2403895 -2084947 592190 4357033 6683009
39930 6683009 6290954 4556817 3809481 4642366 5768992 6205983 6313457 6408935 5673889
39921E673889k149119k104748M34378L355788L410100K13277k966522k921433
39913B945610j96533J755182P13881j997781l420577k292671k7500J129773M24058
39904i66558q07592o77795J073926K705473K579710J096307k82490j290941k614504
39895H15536l637312k568583N33824K918112K596459R21061J67626K22875k87400
39886A682198j009854o06586L32350n9198j515002j639404K76675J958526J488169
39877I07874j94271j132414q99825k58199K17484J95996m13266p41580L93841
39868a924360K403193K977629J100044j417003k284263j255332M53185J649753
39860A702846J234471j302750m161179l923500K37631M578151M938057J669067
$$ plain form
39921 5673889 3524770 1420022 1854400 5210188 8620288 8833565 5867043 2945610
39913 2945610 2749077 4504259 5218140 3220359 -200218 -2492889 -2520389 -1390616 -966558
39904 -966558 -1774150 -2451945 -1378019 1327454 3907164 5003471 4720981 3430040 815536
39895 815536 -2821776 -5390359 -4856535 -1938423 658036 1579097 1746723 1969598 1682198
39886 1682198 672344 65758 398108 338910 -1176092 -2815496 -2538821 -580295 907874
39877 907874 713603 -418811 -1318636 -1576835 -1359351 -1163355 -1576621 -2318201 -1924360
39868 -1924360 478833 3456462 4556506 3139503 855240 -400092 53093 1702846
39860 1702846 2937317 1634567 -2526612 -6450112 -6212481 -1634330 3303727 4972794
39852D972794j460806k124861j133866j65658K3925m99861r78722l11922J383960
39843b95017K280928J254214k83812n92629l36630r90675j818258j161249J89930
39834a753198O4423j038314l51510K396080L948099K265877n85016j677890r21124
39825B347427L2174M95007O53027L28077n36178j243713j385739j434019j440671
39816b184608n63417J080509J634024J6544k010268j912990K29862J875992J147574
39807f86778j308347l286596l017845n10371K411458L576341K310696k87788k607738
39798c406968l425236k113177P09587K933692K832180J150997m7080k48843l55148
39789a969996j86007J220629K818565K191063l47730j556806m16470p4712k648042
$$ plain form
39852 4972794 3511988 1387127 253261 87603 111528 -388333 -1367055 -1678977 -295017
39843 -295017 1985911 3240125 2956313 2363684 2027054 1036379 -781879 -1943128 -1753198
39834 -1753198 -1688775 -2727089 -3078599 -682519 3265580 5531457 4946441 3268551 2347427
39825 2347427 2379601 2874608 3527635 3855712 3319534 2075821 690082 -743937 -2184608
39816 -2184608 -2748025 -1667516 -33492 -16948 -2027216 -3940206 -3710344 -1834352 -686778
39807 -686778 -1995125 -5281721 -8299566 -8809937 -6398479 -2822138 -511442 -799230 -3406968
39798 -3406968 -6832204 -8945381 -8235794 -5302102 -2469922 -1318925 -1366005 -1614848 -1969996
39789 -1969996 -2156003 -935374 1883191 4074254 3726524 2169718 1753248 1678536 -969506
39780i69506n314257m397868p77444J867136K193594J514961P30380J20309P64782
39771d267913K911836M058623J894702j747083l074690j655351k65806j39598
39763b285280O8423Q65074J102174P68974J220550K240501K071485P63437K43633
39754G058971N67641m41293k956410m072491k348561j78513P3740o44678n39683
39745c481277K5621J25725M67700J695226K491144J647412L49517K15586N60080
39736D096734k02458j677261k143117j145029L97180J752091K396874J516968
39728D991982p47483k447345j961255k77382M12676l41827j224570j324831p77397
39719c697432J77031J283491J826319J312090K51540n43671p87782k76719J157123
$$ plain form
39780 -969506 -6283763 -10681631 -11459075 -9591939 -7398345 -5883384 -5153004 -5032695 -4267913
39771 -4267913 -1356077 2702546 4597248 2850165 -224525 -1879876 -2145682 -2285280
39763 -2285280 -2216857 -1351783 -249609 519365 1739915 3980416 6051901 6815338 7058971
39754 7058971 7626612 7185319 4228909 156418 -2192143 -2370656 -2296916 -2941594 -3481277
39745 -3481277 -3455656 -3329931 -2862231 -1167005 1324139 2971551 3321068 3536654 4096734
39736 4096734 3894276 2217015 73898 -1071131 -673951 1078140 3475014 4991982
39728 4991982 4244499 1797154 -164101 -441483 -28807 -370634 -1595204 -2920035 -3697432
39719 -3697432 -3520401 -2236910 -410591 901499 1153039 609368 -178414 -455133 701990
39710G01990K448855J674210j092507k937077j824794L57869N25234j151855j899496
39701c197571n87881J178479J894938J796968J619001J578592J728384J895703
39693G906613J404920J30628o51256Q8435J223494Q73105q04180j962755j747170
39684F461834p96617M60424J970923K750038J554299r72996k681708k663613k005611
39675D076973j718196j580691j241696r28489p80294o49435n50937l33432N31748
39666c174449J659415J328735q91637k361163o75984K323053K895662R97903m7223
39657B054312P80764R40353o67765j628852m36364Q98663P24573O29570J856891
39648E152145K180011l57033l276829k980741l33557Q87128j32103q24420j36828
$$ plain form
39710 701990 3150845 4825055 3732548 795471 -1029323 -671454 -146220 -1298075 -3197571
39701 -3197571 -3785452 -2606973 -712035 1084933 2703934 4282526 6010910 7906613
39693 7906613 9311533 9442161 8790905 8879340 10102834 10975939 10171759 8209004 6461834
39684 6461834 5665217 6125641 8096564 10846602 12400901 11427905 8746197 6082584 4076973
39675 4076973 2358777 778086 -463610 -1392099 -2172393 -2821828 -3372765 -3706197 -3174449
39666 -3174449 -1515034 -186299 -1077936 -3439099 -4115083 -1792030 1103632 2101535 2054312
39657 2054312 2835076 3775429 3107664 1478812 1042448 1941111 2665684 3295254 5152145
39648 5152145 7332156 6975123 3698294 717553 383996 1271124 1139021 314601 177773
39639A77773Q9516j028700j699175o57047O87078O54967k54947p13449o89698
39630c433682q04703p88350n1347R27535J122707N66392L24161Q79983J471555
39621B14251J326467Q33494Q16114J000465K22041j570204k578423j383350Q02442
39612c16703J465808J17185j198511q09686O62589J676605J625658P37360n32994
39603C427311j279120n46968J237578K321869J782207N09844m75749j251958j848681
39594C876333j580064n70008k48290j030752j235747J00601J123472j1247j750578
39585a326280j211189J297234K592196J208475q96100j454816n25526N03901Q03864
39576I91759L68167m01228r20270r72494r66503j003539l49607J160346K112289
$$ plain form
39639 177773 267289 -761411 -2460586 -3117633 -2430555 -1775588 -2030535 -2743984 -3433682
39630 -3433682 -4238385 -5026735 -5078082 -4150547 -3027840 -2461448 -2137287 -1257304 214251
39621 214251 1540718 2374212 3190326 4190791 4412832 2842628 264205 -1119145 -316703
39612 -316703 1149105 1266290 67779 -741907 -79318 1597287 3222945 3960305 3427311
39603 3427311 2148191 1601223 2838801 5160670 6942877 7452721 6976972 5725014 3876333
39594 3876333 2296269 1726261 1477971 447219 -788528 -687927 435545 424298 -1326280
39585 -1326280 -2537469 -1240235 1351961 2560436 1664336 209520 -316006 187895 991759
39576 991759 1359926 958698 38428 -934066 -1900569 -2904108 -3253715 -2093369 18920
39567A8920J343816j16085o43842o08844j247308j818171n91598J627769J923354
39558a11989l63111k398926j866168J52823J357944J233047O43846J36421j32136
39549a348249m2703K2404m34964p01835N14416K619307L193266J357919q24536
39540D355025j360849q14080n13524k45336N60409J031328K35391r08420j066557
39531A273387p51215j128524j540442n08716J340719J762724L12120r34668n10052
39522f84667N22549N50617k55604o46765k60585K28864L45525K30428J01396Q8599
39512B20357N00442J512431K501067K429315J296777N14471J013555J501414n026
39503A1484803k872974l877946j472728J653580K030163J69370m95175J104167
$$ plain form
39567 18920 1362736 1246651 602809 -6035 -1253343 -3071514 -3663112 -2035343 -111989
39558 -111989 -475100 -2874026 -4740194 -4587371 -3229427 -1996380 -1352534 -1216113 -1348249
39549 -1348249 -1390952 -1368548 -1803512 -2505347 -1990931 628376 3821642 5179561 4355025
39540 4355025 2994176 2180096 1666572 1421236 1981645 3012973 3248364 2339944 1273387
39531 1273387 522172 -606352 -2146794 -2655510 -1314791 447933 760053 -174615 -684667
39522 -684667 -162118 388499 132895 -513870 -774455 -545591 -200066 30362 131758 220357
39512 220357 720799 2233230 4734297 7163612 8460389 8974860 9988415 11489829 11484803
39503 11484803 8611829 4733883 3261155 4914735 6944898 7114268 6619093 7723260
39495G723260K162203K33105l385033n516689m643824j633092J559950L002204
39487d97916J990978M0931n62025K47978L50354r77659j664780k56747J472867
39478A43981J253152j34707l88253N16323O60582l15326o58895M69822J644300
39469C190979J399290J74740o75944p31112o65228j114298j846216k017028j269088
39460c553905l65525j48280j14356P78167J940880J585675k02091r57890M28117
39451f09208J625907L66245j838440j873445L60762K066925J554377k71141j961529
39442e79547k816779k381287p31705Q28871J106125P75556J217250K176133K351783
39433A946400J629991Q09786r6929j195278j311471K28729J387361m2156k426728
$$ plain form
39495 7723260 9885463 10118568 6733535 1216846 -3426978 -5060070 -3500120 -497916
39487 -497916 1493062 1533993 971968 1219946 1570300 592641 -1072139 -1328886 143981
39478 143981 1397133 1262426 874173 1390496 2051078 1735752 1076857 1546679 3190979
39469 3190979 4590269 4765009 4089065 3357953 2692725 1578427 -267789 -2284817 -3553905
39460 -3553905 -3919430 -4067710 -4182066 -3403899 -1463019 122656 -79435 -1037325 -609208
39451 -609208 1016699 1382944 -455496 -2328941 -1968179 98746 1653123 1381982 -579547
39442 -579547 -3396326 -5777613 -6509318 -5680447 -4574322 -3798766 -2581516 -405383 1946400
39433 1946400 3576391 4386177 4289248 3093970 1782499 2011228 3398589 3356433 929705
39424I29705k239609L77370J801279Q18202K30272J661313K803291J575173n00546
39415G456450j194790q70154p34199m58315K97360M05791n88694j181121p03410
39406B428918q38134k206091k330657K15741K443166J210789j478421j460882
39398b015571R91680J913314J33054j382265p30755M31330L55734k67794l35580
39389i06853j01668J36255P69573J424475R84544j99922m04526M04441P8362k004189
39379A80492l234816j523766J311296K034554M45683q66317l90521Q37750J412796
39370B07151J309316J115111Q70325L09992m49446j017087j204195j014597l27817
39361b01247R61568K321349K542098J005388j067893j580941j71874J108980N04163
$$ plain form
39424 929705 -1309904 -932534 868745 1686947 1917219 3578532 6381823 7956996 7456450
39415 7456450 6261660 5391506 4657307 4198992 4496352 4902143 4313449 3132328 2428918
39406 2428918 1590784 -615307 -2945964 -2730223 -287057 923732 -554689 -2015571
39398 -2015571 -1023891 889423 1022477 -359788 -1090543 -659213 -303479 -571273 -906853
39389 -906853 -1008521 -872266 -102693 1321782 2306326 2106404 1701878 2106319 2184681 180492
39379 180492 -3054324 -4578090 -3266794 -1232240 -786557 -1652874 -2043395 -1205645 207151
39370 207151 1516467 2631578 3501903 3811895 3362449 2345362 1141167 126570 -201247
39361 -201247 760321 3081670 5623768 6629156 5561263 3980322 3808448 4917428 5421591
39352E421591j018403j260559k5457P46047p8409j327568j332995j2756J360816
39343B472307J632819N99599r87194j979535j875158j323085j129048j050754
39335c640049l30568Q67267J496247R89436k17265j275311j291902K73350K488291
39326f40504L009384Q65597j498392j054925J334503J891832m50122k384701j332760
39317b60088O83186M25596j505496j883912k4650J258537n0859k353750k766371
39308f477807p47974J613283K209350R84184m53729q38275n73939q41525j644669
39299f771101j610799l7110J804574K206727J242616M88932Q63389J714868K032211
39290A934307J661291J022373K24594r93833k504231l385886k724604q92758M97229
$$ plain form
39352 5421591 4403188 3142629 3117172 3863219 3784810 2457242 1124247 1111491 2472307
39343 2472307 4105126 4704725 3717531 1737996 -137162 -1460247 -2589295 -3640049
39335 -3640049 -3970617 -3103350 -1607103 -617667 -834932 -2110243 -3402145 -3128795 -640504
39326 -640504 2368880 3234477 1736085 681160 2015663 3907495 3457373 1072672 -260088
39317 -260088 423098 848694 -656802 -2540714 -2565364 -1306827 -1357686 -3711436 -6477807
39308 -6477807 -7225781 -5612498 -3403148 -2418964 -2872693 -3710968 -4284907 -5126432 -6771101
39299 -6771101 -8381900 -8419010 -6614436 -4407709 -3165093 -2676161 -1812772 -97904 1934307
39290 1934307 3595598 4617971 4842565 3848732 1344501 -2041385 -4765989 -5658747 -5161518
39281e161518M30152j30119M94758K258759L256025K187920j745j372985j143188
39272H18059j58159K81961k39681p94193r8177J605227K248569N62528j639102
39263B587032j529392O01281J456236o16062l331201l832679k277565o36255K82607
39254g295998Q56160J111714R97440J119809J571117J141733o14309j790164o38499
39245c540997J462634J907510Q17764M34268J125854J029344k38146o14604P82767
39236C166394J838768P36630j107962j232708K62523J177412M10492j019045j802813
39227B429691j789563j512376j204132o67471J13064N16374j54257j451619j796159
39218e516448m27199J330900J850093J561456J951847K713938K051433j05352
$$ plain form
39281 -5161518 -4731366 -4861485 -4366727 -2107968 1148057 3335977 3334232 1961247 818059
39272 818059 659900 941861 702180 -92013 -190190 1415037 3663606 4226134 2587032
39263 2587032 1057640 1658921 3115157 2499095 -832106 -4664785 -6942350 -7578605 -7295998
39254 -7295998 -6439838 -5328124 -4330684 -3210875 -1639758 -498025 -1112334 -2902498 -3540997
39245 -3540997 -2078363 -170853 646911 1081179 2207033 3236377 2998231 2383627 3166394
39236 3166394 5005162 5741792 4633830 3401122 3663645 4841057 5251549 4232504 2429691
39227 2429691 640128 -872248 -2076380 -2743851 -2630787 -2114413 -2268670 -3720289 -5516448
39218 -5516448 -5943647 -4612747 -2762654 -1201198 750649 3464587 5516020 5410668
39210E410668j560703j213386o20658r99598r51336Q87646K766123J957721r59149
39201D717328k585604j332728P60959J222364J33974r10411j239781j238364r71254
39192a443517m6807J319204K144636J862146J064204O57999N82744p9556j664944
39183D396109l153103l246736j918904l88020L03759K20903J43499O62853J555832
39174a423808J782331N08437j475636k092768n49466J238343J053241n27343j166559
39165b653228l57213K73959J85131P86035K379366K893241J114299j121834j823613
39156A676143j882273k956821m056908l021604l86797J119670O12972q4033L31977
39147h647674J021910J003137N58807L1890q18222j489692n88861J945124L908053
$$ plain form
39210 5410668 3849965 2636579 2015921 1016323 64987 952633 3718756 5676477 4717328
39201 4717328 2131724 798996 1559955 2782319 2916293 2005882 766101 -472263 -1443517
39192 -1443517 -1490324 -171120 1973516 3835662 4899866 5557865 6140609 6061053 4396109
39183 4396109 1243006 -2003730 -3922634 -4310654 -4006895 -3785992 -3642493 -2979640 -1423808
39174 -1423808 358523 866960 -608676 -2701444 -3250910 -2012567 -959326 -1486669 -2653228
39165 -2653228 -3010441 -2736482 -2551351 -1765316 614050 3507291 4621590 3499756 1676143
39156 1676143 -206130 -3162951 -7219859 -10241463 -10628260 -9508590 -8895618 -8979651 -8647674
39147 -8647674 -7625764 -6622627 -6063820 -6031930 -6850152 -8339844 -8928705 -6983581 -3075528
39138c075528L296834P68555j304960j504918l39812P90938Q99500O5294p69574
39129a173671q54470l99035J03428Q02061J784514J993079L84313j967523k678396
39120b005700j236238L45214N28997R6522J69226K40015m35431r47510J9273J844950
39110a380682K504425J162294r19801j885074r36289J134081K458920J700759
39102C838633l00924j226431j61436J243569J224890K18913m34683p66863j460169
39093B175499j898667j023917M00849N72075m14253n98989N64331J154746j45460
39084G86214j827629j726894o4198J149490R04932l8937p30669j019906j021060
39075c588657p07394l14558l69012q88618r96369J78508K258625L621169K904649
$$ plain form
39138 -3075528 221306 989861 -315099 -1820017 -2159829 -1368891 -469391 -404097 -1173671
39129 -1173671 -2028141 -2427176 -2323748 -1521687 262827 2255906 2640219 672696 -2005700
39120 -2005700 -3241938 -2896724 -2367727 -2271205 -2101979 -1861964 -2297395 -3244905 -3225632 -1380682
39110 -1380682 1123743 2286037 1366236 -518838 -1455127 -321046 2137874 3838633
39102 3838633 3537709 2311278 2149842 3393411 4618301 4837214 4402531 3635668 2175499
39093 2175499 276832 -747085 -346236 225839 -188414 -787403 -223072 931674 786214
39084 786214 -1041415 -2768309 -2832507 -1683017 -778085 -817022 -1547691 -2567597 -3588657
39075 -3588657 -4296051 -4610609 -4979621 -5868239 -6864608 -6686100 -4427475 -806306 2098343
39066B098343N18912j584233j817129m69836Q56316J046745K98386o40523j367791
39057a060810j752199j518968m78438Q84243J502675P39797p43253j457871o37085
39048d521909R27624J904870J955859J654052J170499Q5529j360551k018983j429652
39039a632662o33311n72073o29831J76872J378494J727041J127431N19217K15419
39030A676597j93534n12040q5535O94480O00409m31718r73170k09976R57624J398156
39020B921293J013581J1649j638437l245172l308303j491486M70613R92823O96682
39011c576757R40951J341839N50275j010947j199539P37687K728282K410729J42349
39002C064869j561564j256752k01916l72481j551073j525019O23147K721575K204137
$$ plain form
39066 2098343 2617255 1033022 -784107 -1253943 -397627 649118 947504 306981 -1060810
39057 -1060810 -2813009 -4331977 -4810415 -3926172 -2423497 -1683700 -2426953 -3884824 -4521909
39048 -4521909 -3594285 -1689415 266444 1920496 3090995 3176524 1815973 -203010 -1632662
39039 -1632662 -2265973 -2838046 -3467877 -3291005 -1912511 -185470 941961 1461178 1676597
39030 1676597 1483063 971023 885488 1579968 2180377 1748659 775489 565513 1523137 2921293
39020 2921293 3934874 3946523 2308086 -937086 -4245389 -5736875 -5266262 -4273439 -3576757
39011 -3576757 -2635806 -1293967 -743692 -1754639 -2954178 -2216491 511791 2922520 3064869
39002 3064869 1503305 246553 44637 -327844 -1878917 -3403936 -2780789 -59214 2144923
38993B144923k25243j425703j64440J399555J069655n63069j708247j962354j777592
38984c212515q60778R85797K425194J956744J63073j157911j576289j962560k315584
38975e554829j679753j54345R39192J083464J058745J224390R97308L37974J00185
38966a647669M88556P31694P00241J206704K126889J905313j62566k515865l125046
38957b91749j681301N87870K152759J843781k47877k020410j211621J287922J906958
38948B326332p17641l375369k493726J089747L677565L606681K200902Q20498
38940G134989m32688j385675j549814j316789j501978j685017q27120N08725N37404
38931e17963r71809k243138k139589j329177l98809J050252K554444K166906p72770
$$ plain form
38993 2144923 1919680 493977 329537 1729092 2798747 2235678 527431 -1434923 -3212515
38984 -3212515 -4073293 -3087496 -662302 1294442 1457515 299604 -1276685 -3239245 -5554829
38975 -5554829 -7234582 -7388927 -6449735 -5366271 -4307526 -3083136 -2085828 -1747854 -1647669
38966 -1647669 -1159113 -427419 272822 1479526 3606415 5511728 5349162 2833297 -291749
38957 -291749 -1973050 -1385180 767579 2611360 2363483 343073 -868548 419374 2326332
38948 2326332 1608691 -1766678 -4260404 -3170657 506908 4113589 6314491 7134989
38940 7134989 6702301 5316626 3766812 2450023 948045 -736972 -1564092 -1055367 -517963
38931 -517963 -1489772 -3732910 -5872499 -7201676 -7600485 -6550233 -3995789 -1828883 -2601653
38922b601653l777277l882788j315076J070032J457736P26613O01731J403120
38914f317562J948024J151255n27888j342874k83032J415243J660371L27849o15090
38905b583704j01830M96967k72706j524738j399546J36423J436506J567209J090466
38896a154953P50410O58477O11209K12143r50311k287416k104393J27172K152862
38887a984800J433743j215388k616022j667221l54430r1494J47444J041948J090160
38878d216060n56242j792160n67992J614879K039611J220235J706658L177437
38870B626366K519781p93523l120112j925716M77238O44728r88849j459603K1686
38861a998004J529174J720898J061254J34836q74635j146850P1034J618525J431825
$$ plain form
38922 -2601653 -6378930 -10261718 -11576794 -10506762 -9049026 -8322413 -7720682 -6317562
38914 -6317562 -4369538 -3218283 -3746171 -5089045 -5372077 -3956834 -2296463 -1968614 -2583704
38905 -2583704 -2685534 -2188567 -2461273 -3986011 -5385557 -5249134 -3812628 -2245419 -1154953
38896 -1154953 -404543 253934 865143 1077286 126975 -2160441 -4264834 -4137662 -1984800
38887 -1984800 -551057 -1766445 -4382467 -6049688 -6404118 -6495612 -6348168 -5306220 -4216060
38878 -4216060 -4772302 -6564462 -7132454 -5517575 -3477964 -2257729 -551071 2626366
38870 2626366 5146147 4352624 1232512 -693204 -215966 428762 -560087 -2019690 -1998004
38861 -1998004 -468830 1252068 2313322 2448158 1573523 426673 497707 2116232 3548057
38852C548057l25673j246673k25756J118175J234263O54433J74683q03076k550476
38843A577957l471891k199911O8032J184628R54713O36719N54812J63222l00684
38834h32403k40849j56073o58652o85323J015853L070050K771025J76589j804772
38825B655445j771262j427696k002415k016366k35497J727586J915196J134063
38817b0946J221200J758834J045476o92548j586202j066484k42951K66215O92251
38808A374845O10993o39172k101188k053225q40459m75148j071968l52195K319070
38799c228447M069835K496842o29991j930474j173797q79516j968734k574990
38791e819272j300958P56884J958114K211749K166517J819006J074830N44829
$$ plain form
38852 3548057 3222384 1975711 1749955 2868130 4102393 4756826 4931509 4128433 1577957
38843 1577957 -1893934 -4093845 -4025813 -2841185 -1886472 -1249753 -694941 -531719 -832403
38834 -832403 -1073252 -1229325 -1887977 -2573300 -1557447 1512603 4283628 4460217 2655445
38825 2655445 884183 -543513 -2545928 -4562294 -4797791 -3070205 -1155009 -20946
38817 -20946 1200254 2959088 4004564 3312016 1725814 659330 416379 682594 1374845
38808 1374845 1985838 1346666 -754522 -2807747 -3648206 -4123354 -5195322 -5547517 -3228447
38799 -3228447 841388 3338230 2708239 777765 -396032 -1275548 -3244282 -5819272
38791 -5819272 -7120230 -6363346 -4405232 -2193483 -26966 1792040 2866870 3411699
38783C411699N41534J68700j247468k504671j879623J57173J285825N61686m08235
38774H6620j25632O23103M14391l82104m63681N1394M6686l00838K36584J388414
38764A574937J276049n78807k194493k020151r48439k33758N50510J670470J331415
38755D27733j688435m793119m172030k89281K467514J933613O49131J096920J784360
38746b583594M02925j657795j188076J636029L196545J601381q44581j110247
38738e47413P03898K188522J953612P70117j5561k4956K10858J47268k40395o67551
38728D478399j030271j409615j590263j097016o6622M70467j18556r08549n24846
38719a796872P46267J156411P3721q92314j89786J207776R67482j257960l064813
$$ plain form
38783 3411699 3953233 4121933 2874465 369794 -1509829 -1352656 -66831 494855 86620
38774 86620 -39012 584091 998482 616378 152697 204091 250777 -50061 186523 1574937
38764 1574937 2850986 2272179 77686 -1942465 -2890904 -3124662 -2574152 -903682 427733
38755 427733 -1260702 -6053821 -10225851 -10515132 -8047618 -6114005 -5464874 -4367954 -2583594
38746 -2583594 -2180669 -3838464 -5026540 -3390511 -193966 1407415 562834 -547413
38738 -547413 156485 2345007 4298619 5068736 5053175 5028219 5239077 5386345 5145950 4478399
38728 4478399 3448128 2038513 448250 -648766 -715388 -244921 -363477 -1272026 -1796872
38719 -1796872 -1050605 105806 179527 -712787 -902573 305203 1272685 14725 -3050088
38710c050088k312259J24220J448013L09665j770693k273866l19909K612098M069713
38701a163106K694133n13201k855866k447445j95726J346641J140083N58197P64389
38692f71901P78939m92355j642216m13174K470606L580935J348397j812389k851241
38683B95601j658424o9774R68905J567950J508063N74706m45387p46801q55685
38674A139154j445721j581349p0523J954719K034084o2397j937448k025978j319709
38665c315168j039767p48666J01515O16383m9410j044001j188756q79031j067339
38656h614240j296852m50590J155694K128669K109026J919489J797273J136838
38648a14693P0431l33982J54061M35167l7416k42727O61602J701349J327773l98650
$$ plain form
38710 -3050088 -5362347 -5238127 -3790114 -3480449 -5251142 -7525008 -7844917 -5232819 -1163106
38701 -1163106 1531027 1017826 -1838040 -4285485 -4481211 -3134570 -1994487 -1436290 -671901
38692 -671901 107038 -385317 -2027533 -2440707 29899 3610834 4959231 3146842 295601
38683 295601 -1362823 -1432597 -463692 1104258 2612321 3187027 2741640 1994839 1139154
38674 1139154 -306567 -1887916 -1958439 -3720 2030364 1967967 30519 -1995459 -3315168
38665 -3315168 -4354935 -5103601 -5002086 -4385703 -4435113 -5479114 -6667870 -7546901 -8614240
38656 -8614240 -9911092 -10361682 -9205988 -7077319 -4968293 -3048804 -1251531 -114693
38648 -114693 -44262 -378244 -224183 210984 173568 -69159 592443 2293792 3621565 3222915
38638C222915j964350k309338j564143k30128J211929J900452J010931r44074
38630C34194k092228j185117Q38268J918588J265060M6399k46689N16818J305190
38621B700483J336633Q26229M22046L25712K02294j83567n62805n56094k84863
38612D226068k53436o18803r61932r33126p05105n02125j67212K95574K57288
38603F37191o21191j356116o39593J167733K280919J955728J353928J400603J255351
38594G434553l649j468920j686837r44892o07339p76425m15508M93715P80740
38585B805438J15374n33217o46223o66621n33114M32323J669704J361944p95869
38576C209739k539253j933452Q4085J246429P93687l76757j219917j106153j6769
$$ plain form
38638 3222915 1258565 -1050773 -2614916 -2845044 -1633115 267337 1278268 334194
38630 334194 -1758034 -2943151 -2104883 -186295 1078765 1125164 878475 1395293 2700483
38621 2700483 4037116 4863345 5285391 5611103 5813397 5629830 5067025 4510931 4226068
38612 4226068 3972632 3353829 2391897 1458771 753666 251541 84329 379903 637191
38603 637191 16000 -1340116 -1979709 -811976 1468943 3424671 4778599 6179202 7434553
38594 7434553 7430904 5961984 4275147 3330255 2722916 1946491 1530983 2024698 2805438
38585 2805438 2920812 2387595 1741372 1074751 541637 973960 2643664 4005608 3209739
38576 3209739 670486 -1262966 -1178881 67548 861235 484478 -735439 -1841592 -1858361
38567a858361Q70047J05016j660865j975223k99465Q50563J02573j45462K018031
38558a993146L781678J588827k451024k918813P41922L427877K227752N5226q7631
38549D372668L40185p44807j805083p50854R05373P09930l24755J73608J304300
38540D180565M75490j562918j534666P97540J931263J1881k567945k933672j243190
38531b445652O26139J504569J043231m64962j467594l51514J956047K638961R94490
38522D033715n24385k79691R3969j131854k542829j923547j19001J93572j262428
38513c462479k006494n71318J583409K291478J187176m90018j428992j098347
38505c995585J60062J425627J841451J086941o41534k547816l162312j500227
$$ plain form
38567 -1858361 -988314 -883298 -2544163 -4519386 -4818851 -3968288 -3865715 -4011177 -1993146
38558 -1993146 1788532 3377359 926335 -1992478 -1250556 2177321 4405073 4460299 4372668
38549 4372668 4712853 3968046 2162963 1412109 2317482 3027412 2702657 2876265 4180565
38540 4180565 4656055 3093137 1558471 2356011 4287274 4299155 1731210 -1202462 -2445652
38531 -2445652 -1819513 -314944 728287 263325 -1204269 -1555783 400264 3039225 4033715
38522 4033715 3509330 3229639 3323608 2191754 -351075 -2274622 -2393623 -2200051 -3462479
38513 -3462479 -5468973 -6040291 -4456882 -2165404 -978228 -1468246 -2897238 -3995585
38505 -3995585 -3835523 -2409896 -568445 518496 -123038 -2670854 -5833166 -7333393
38497g333393J228719K344604R88417o14097l37016Q31468P17542l33460j19052
38488b626268J549286K286089Q15222j116916j467037p21939o96702j638535j871816
38479e488616j6511L182879N245798M225748R21834j611068j479289k03195l20380
38470D457200j507810j160096J322890L251045K315254n49710k911689l554200
38462A662884k415972J91941K861873L352380J286288q38987r45079j52237m68122
38453D534969j361593j026362K56019P55590M24367N20532O76931n28982k189397
38444B062074j601261J226912K839208J286035j136032j688895r97358r51255
38436A039428j180560k75831J110270J199482K36117N9158Q94719R74478n57698
$$ plain form
38497 -7333393 -6104674 -3760070 -2771653 -3385750 -3722766 -2891298 -2173756 -2507216 -2626268
38488 -2626268 -1076982 1209107 2024329 907413 -559624 -1281563 -1978265 -3616800 -5488616
38479 -5488616 -5505127 -2322248 2923550 7149298 8071132 6460064 4980775 4777580 4457200
38470 4457200 2949390 1789294 3112184 6363229 8678483 8128773 5217084 1662884
38462 1662884 -753088 -561147 2300726 5653106 6939394 6100407 5155328 5003091 4534969
38453 4534969 3173376 2147014 2403033 3158623 3582990 4103522 4780453 4251471 2062074
38444 2062074 460813 1687725 4526933 5812968 4676936 2988041 1990683 1039428
38436 1039428 -141132 -416963 693307 1892789 2128906 2188064 3082783 4057261 3499563
38427C499563k341766k707392j385708Q21981K699034K871527Q68755j771891
38419B554103k676850j266534P03868J346928M36312j035014k025973j974677
38411c937837j037932p356N77325R96960J381585Q73764r96678k756853k525543
38402g432565p45866N29532Q28784J373481J920758M75753k726634l913200o97526
38393a0387483L848382M819643J885204p99614m97315J171581J399736k10078
38385A230056k037211k594117j375544J057453K985496K650403L13366j671162
38377E58740j550153j29154O69865L74225Q3914M93176Q99481L47731r23210j625744
38367h01129r23446N14341J238324P63604Q4492J61767N35486K13796n16410l45879
$$ plain form
38427 3499563 1157797 -1549595 -2935303 -2113322 585712 3457239 4325994 2554103
38419 2554103 -122747 -1389281 -685413 661515 1097827 62813 -1963160 -3937837
38411 -3937837 -4975769 -4983125 -4405800 -3408840 -2027255 -1153491 -2150169 -4907022 -7432565
38402 -7432565 -8178431 -7648899 -6820115 -5446634 -3525876 -3050123 -5776757 -9689957 -10387483
38393 -10387483 -6539101 -1719458 165746 -633868 -1131183 40398 1440134 1230056
38385 1230056 -807155 -3401272 -4776816 -3719363 -733867 1916536 2229902 558740
38377 558740 -991413 -1120567 -450702 -76477 7437 500613 1400094 1747825 824615 -801129
38367 -801129 -1724575 -1210234 28090 791694 876186 1037953 1573439 1787235 1270825 924946
38357I24946R46685J841916J059506p11932j773483j479176n62183K05095P94057
38348A245431J340579J498739P79526o69859j950766k178136j267694J35762J369730
38339C03312K095425K038574J023958m52085j295588j000234k98229o0355p0660
38330B284118L36293R19489Q51683J34933l96536m03511l08868k85396j19065
38321C013140j13118q47796j798474j525071K38246J864849J861656O27712m14331
38312B906813m98539K38473J208976J485208M76627r11534r21910N95513J657725
38303F237352R35474l61541n68097p1460j02815k86433N17676J677187J343628
38294I320971o01205k164763j979571p05452N29097J435015J869590J313901k44621
$$ plain form
38357 924946 1871631 3713547 4773053 4061121 2287638 808462 246279 451374 1245431
38348 1245431 2586010 4084749 4864275 4194416 2243650 65514 -1202180 -1066418 303312
38339 303312 2398737 4437311 5461269 5009184 3713596 2713362 2415133 2354778 2284118
38330 2284118 2620411 3539900 4391583 4526516 4129980 3726469 3417601 3132205 3013140
38321 3013140 2900022 2052226 253752 -1271319 -1033073 831776 2693432 3321144 2906813
38312 2906813 2408274 2646747 3855723 5340931 5817558 4906024 3984114 4579627 6237352
38303 6237352 7172826 6811285 6243188 6171728 6068913 5782480 6300156 7977343 9320971
38294 9320971 8719766 6555003 4575432 3869980 4399077 5834092 7703682 9017583 8772962
38285H772962j873625k652222k395504j353189n3951N66466p3631j209781j471631
38276a744106o62978J53013K71672l5031m40258r17341j187079r63407o55459
38267f180974o58573k95289J049614K190063J515109j52735m66746N99273N89860
38258a810398j113765j814173K27885K789098K971363J217838j93305o90036r98851
38249E85656r15274j55228m3502j537078k695762j152288J713133K365049N44064
38240a291230m07888R81214K053798N29302j763774j706437O08251K343659J749778
38231C096673k39576j586525j037481J064213K910605K648936L57499j887024
38223E327320k341553j306998j50489M48725O61077P08639O19337L29906l31217
$$ plain form
38285 8772962 6899337 4247115 1851611 498422 444471 1010937 937306 -272475 -1744106
38276 -1744106 -2407084 -2254071 -1982399 -2017430 -2457688 -3375029 -4562108 -5525515 -6180974
38267 -6180974 -6839547 -7134836 -6085222 -3895159 -2380050 -2532785 -2999531 -2400258 -1810398
38258 -1810398 -2924163 -4738336 -4510451 -1721353 1250010 2467848 2274543 1584507 585656
38249 585656 -329618 -484846 -528348 -2065426 -4761188 -5913476 -4200343 -1835294 -1291230
38240 -1291230 -1699118 -717904 1335894 1865196 101422 -1605015 -996764 1346895 3096673
38231 3096673 2857097 1270572 233091 1297304 4207909 6856845 7214344 5327320
38223 5327320 2985767 1678769 1528280 1977005 2638082 3346721 3966058 4295964 3964747
38214C964747j288608j805243j215261r8971K87860j62318l42873J76824N96691
38205A12848M89474L50899Q6670j181829k943371k955165n35341J659995J141449
38196c774371o35432m42988J728374K662846Q07255j558812j807942m36752K62915
38187c194907m28526j144876p02337M18775R69034N82922J02172L10714P93939
38178b293090O48608J87576Q06276K611976L428208J468713j808292l193049j779284
38169G7642K07900P27473K59537K10244O16522O16660J58792p4721K4593j11711
38159B712931o31731r24304n11371K24925L98990m34335j724651k369784j868117
38150e127447q62780j94048K95967J262940K284840J916243k13828k336859k451759
$$ plain form
38214 3964747 2676139 870896 -344365 -443336 -155476 -317794 -660667 -483843 112848
38205 112848 602322 953221 1039891 -141938 -3085309 -6040474 -6575815 -4915820 -3774371
38196 -3774371 -4409803 -4852791 -3124417 -461571 345684 -1213128 -3021070 -3457822 -3194907
38187 -3194907 -3623433 -4768309 -5470646 -5051871 -4082837 -3499915 -3397743 -3087029 -2293090
38178 -2293090 -1644482 -1456906 -650630 1961346 5389554 6858267 5049975 1856926 77642
38169 77642 285542 1013015 1272552 1482796 2099318 2715978 2874770 2800049 2824642 2712931
38159 2712931 2081200 1156896 645525 870450 1269440 835105 -889546 -3259330 -5127447
38150 -5127447 -5990227 -6184275 -5888308 -4625368 -2340528 -424285 -638113 -2974972 -5426731
38141e426731p38636Q26938R57922K53154l0775M30380R23942P13779q2459m87415
38131b659901L36456J832481K183752L78231k092339k604797o55381J348019J157440
38122g76039m99536j313699q02939n82154j336102j571167k24087J315439J387699
38113d402585Q92290J733497L196411K593187k95922k269893j349632K27085l32238
38104g800j872805j318774J099593K067347M83062r15629j51940R02877m5431
38095B40500j670488j101225J362428K547881J103652p85170q41984L74389R99513
38086B229496O12299Q1810k22321n55141o74456n1430Q79406R88196K23276o0377
38076C450758Q51957J674598Q48902r86499j634330m64677N13748n99904k884066
$$ plain form
38141 -5426731 -6165367 -5338429 -4380507 -4127353 -4158128 -3727748 -2803806 -2090027 -2172486 -2659901
38131 -2659901 -2323445 -490964 1692788 2071019 -21320 -2626117 -3281498 -1933479 -776039
38122 -776039 -1275575 -2589274 -3392213 -3974367 -5310469 -6881636 -7105723 -5790284 -4402585
38113 -4402585 -3510295 -1776798 1419613 4012800 3716878 1446985 97353 324438 -7800
38104 -7800 -1880605 -3199379 -2099786 -32439 450623 -465006 -616946 285931 240500
38095 240500 -1429988 -2531213 -1168785 1379096 2482748 1697578 855594 1229983 2229496
38086 2229496 2841795 2923605 2701284 2146143 1471687 1420257 2299663 3287859 3511135 3450758
38076 3450758 4302715 5977313 6826215 5839716 4205386 3740709 4254457 3654553 770487
38067G70487l797887k491310n27981N54768Q77973R89694N12340q32706j863071
38058e807693j147356P68419J868358J453054Q90775J153009J210018l3657j556946
38049a202019j641872o60505m54680j189375j047137N29713J590524Q46528k297
38040c231120R95626K636807K384633N62594j94688N79863L89728j896599l887710
38031a660866l279588j130761L54489J200531K487541L424536K328615k59375
38023C465122j990825j920496j057088L482J592909L055041K774508P57608q81844
38014E798417q42584k75547o21969j441053j498611p55210j19356l0572j46913
38005F6602J21154J146797K479070K722257J105961r76966j530415r10724j139210
$$ plain form
38067 770487 -3027400 -5518710 -6046691 -5491923 -4613950 -3624256 -3111916 -3944622 -5807693
38058 -5807693 -6955049 -6186630 -4318272 -2865218 -1974443 -821434 388584 354927 -1202019
38049 -1202019 -2843891 -3504396 -3959076 -5148451 -6195588 -5665875 -4075351 -3228823 -3231120
38040 -3231120 -2235494 401313 2785946 3348540 3153852 3733715 4123443 2226844 -1660866
38031 -1660866 -4940454 -6071215 -5716726 -4516195 -2028654 1395882 3724497 3465122
38023 3465122 1474297 -446199 -1503287 -1499805 93104 3148145 5922653 6680261 5798417
38014 5798417 4955833 4680286 4058317 2617264 1118653 363443 244087 213515 66602
38005 66602 187756 1334553 3813623 6535880 7641841 6664875 5134460 4223736 3084526
37996C084526k159584j560632J026780K291763L6554k982176k772107K28682K302074
37987e04120J974240J044387P07596J09166j000482j291604l40159M79884M97175
37978A676083Q08641J799358J832585j32412k421502k766388j237540M03927J142066
37969A104818J034444J13104j417384k468048k054344p55098j6701k28155n12718
37960e200082j98229N15193J209860J620967J395204L47475r54896j548313j127831
37951c940652k71611L66502O31381O84214O70808N61771J14062p65393j441175
37942c390093r10287P81805K113348J820164N10730l52031n16259p40687r20409
37933a603719p9898J569882K236726R28597j114525k202001k130583j387327J10435
$$ plain form
37996 3084526 924942 -635690 391090 2682853 2719407 -262769 -3034876 -2806194 -504120
37987 -504120 1470120 2514507 3222103 3331269 2330787 1039183 699024 1178908 1676083
37978 1676083 2484724 4284082 6116667 5984255 3562753 796365 -441175 -37248 1104818
37969 1104818 2139262 2252366 834982 -1633066 -3687410 -4442508 -4459209 -4687364 -5200082
37960 -5200082 -5398311 -4883118 -3673258 -2052291 -657087 -309612 -1264508 -2812821 -3940652
37951 -3940652 -4212263 -3845761 -3214380 -2530166 -1859358 -1297587 -1183525 -1948918 -3390093
37942 -3390093 -4300380 -3518575 -1405227 414937 925667 573636 57377 -683310 -1603719
37933 -1603719 -1683617 -113735 2122991 3051588 1937063 -264938 -2395521 -3782848 -3672413
37924c672413J929737K098053n61990l699595l609394k69174K331532J593278
37916c859966m82698q17726M17245J139418J121486J610219K202526J158088j226841
37907A261751k336635r08463J286454K197441J928922J528923J185173P34857
37899F878423M62929L47197j52128p44469l58741N70797j45801k977842m933604
37890a053239l361452J00553J772192R26957j09294o4083M0541k84286J82047
37881a850064J922610L284657K624681L92384j723505k546659j821816j22802
37873A59486J135277P22632q87826j946853j552047l71668O54910J060839M35668
37864e89582j118483k071402q19241J754431K946132J918353P21574R26630J382638
$$ plain form
37924 -3672413 -1742676 355377 -206613 -3906208 -7515602 -7784776 -5453244 -3859966
37916 -3859966 -4342664 -5160390 -4743145 -3603727 -2482241 -872022 1330504 2488592 1261751
37907 1261751 -1074884 -1983347 -696893 1500548 3429470 4958393 6143566 6878423
37899 6878423 7341352 7688549 7536421 6791952 6433211 7004008 6858207 3880365 -1053239
37890 -1053239 -4414691 -4314138 -2541946 -1614989 -1724283 -1788366 -1747825 -2032111 -1850064
37881 -1850064 72546 3357203 5981884 6374268 4650763 2104104 282288 159486
37873 159486 1294763 2017395 1129569 -817284 -2369331 -2740999 -2086089 -1025250 -589582
37864 -589582 -1708065 -3779467 -4598708 -2844277 101855 2020208 2741782 3668412 5051050
37855E051050N52294q77688j373135j048641j029209j350505j124524j17422J109296
37846b08484J984185J927053N18370j402697k000737q89417J3619o72672j635330
37837b366110j199237k07713l18224p33269N60126K923339L421800J181454j292704
37828A969462j699397m92959Q27302J691104J727558K40542k120310k921001r07882
37819a685581J835437K428062R42418k10059j4213Q0860j120002k671956l028383
37810c443417k106667q84783J16778Q92885J126298N24460k14532L1606J154086
37801b803286J835930J491263R40353O36973k44793j791637j990581N33637L438258
37792B046117L053273k77044k184610l68989K153757J530696j594926l541605
$$ plain form
37855 5051050 5603344 4725656 3352521 2303880 1274671 -75834 -1200358 -1317780 -208484
37846 -208484 1775701 3702754 4221124 2818427 817690 -71727 -58108 -730780 -2366110
37837 -2366110 -3565347 -3773060 -4091284 -4824553 -4264427 -1341088 2080712 3262166 1969462
37828 1969462 270065 -222894 604408 2295512 4023070 4263612 2143302 -777699 -1685581
37819 -1685581 149856 2577918 3520336 3310277 3296064 3376924 2256922 -415034 -3443417
37810 -3443417 -5550084 -6434867 -6318089 -5425204 -4298906 -3774446 -3988978 -3957372 -2803286
37801 -2803286 -967356 523907 1464260 2101233 1856440 64803 -1925778 -1392141 2046117
37792 2046117 5099390 4822346 2637736 2268747 4422504 5953200 4358274 816669
37784H16669k746021q98973K02635M59299L41993N0048n4621K98295N49913P1591
37774i09172n34254j77831R09700J427722Q71766r3067q52668j179770o95417
37765a232991O39247J784731J721349R30888M20831j56846j681961l319682l148076
37756d042510j001237J228119K208891K283091J958561J265131P33705R65957
37748E599708J032814m92968k596742k428515L72855K506775J473323j063131
37740D404119k024585j085711j47528j10306k35275Q2177O31900J053219J017179
37731C585189K56673p89657j154633q35360j003093j957508k240486q76991Q66811
37722d149055J333375Q66246P89292J000668L58886j075597j869867j225540M6738
$$ plain form
37784 816669 -1929352 -2828325 -2625690 -2166391 -1824398 -1774350 -1828971 -1530676 -980763 -909172
37774 -909172 -1443426 -1621257 -711557 716165 1587931 1494864 642196 -537574 -1232991
37765 -1232991 -593744 1190987 2912336 3843224 4264055 4107209 2425248 -894434 -4042510
37756 -4042510 -5043747 -3815628 -1606737 676354 2634915 3900046 4633751 5599708
37748 5599708 6632522 6139554 3542812 1114297 1487152 3993927 5467250 4404119
37740 4404119 2379534 1293823 1146295 1035989 800714 882891 1514791 2568010 3585189
37731 3585189 3841862 3052205 1897572 1062212 59119 -1898389 -4138875 -5015866 -4149055
37722 -4149055 -2815680 -1949434 -1160142 -159474 199412 -876185 -2746052 -3971592 -3924854
37713c924854O29261J03077o57254k67738J512465K960927K248651Q7084r97459
37704A694160j78035Q41514R35814J087113J812384J663227o2849j557899j443818
37695D791611j095650j737974j744522K30464J845085M97977j771644j110595
37687i5248J686617K260243k35226k071362j383994p23247j792458k303215m03211
37678e061101J729266J620804O49186J284135K671902K333638N46887k99268K66209
37669E741658M76054l90528j093468q04991j62541K94775R15615J723884J797298
37660H497756M70281j532719k555980j515862Q25922K152148R56585j323360j795398
37651D179373j4425J324997L94868j069300o86394P32974O09170j211218k280491
$$ plain form
37713 -3924854 -3295593 -3192516 -3849770 -4117508 -2605043 355884 2604535 2691619 1694160
37704 1694160 1516125 2357639 3293453 4380566 6192950 7856177 7793328 6235429 4791611
37695 4791611 3695961 1957987 213465 443929 2289014 2786991 1015347 -95248
37687 -95248 1591369 3851612 3616386 1545024 161030 -562217 -2354675 -4657890 -5061101
37678 -5061101 -3331835 -1711031 -1061845 222290 2894192 5227830 5774717 5475449 5741658
37669 5741658 6217712 5827184 4733716 3928725 3766184 4060959 4976574 6700458 8497756
37660 8497756 8968037 7435318 4879338 3363476 4189398 6341546 7298131 5974771 4179373
37651 4179373 4164948 5489945 5884813 4815513 4129119 4862093 5471263 4260045 1979554
37642A979554j299903L28497R32780N35996j00399o89366r92470n23136O02244
37633G73797J492087J685778J653204J687469J250575j2237j376671j788938j063757
37624D301307N3302O37011K33354p39681j138638k47361J115753J370164K21567
37615E806778r34164j022702p25890j136059j813628j397461J83820J460098J589033
37606B009825J511097K203164K798382J729028o73472k204370j640262k16461
37598E516931L94948L40241P24059J489525J649556J080817M68107k82411j776659
37589I605114l173990k492148L49996K532799J645434j201220k871272j949260
37581B445453K54897J774714J811004Q55746J6549J3993K86973l37936j612904
$$ plain form
37642 1979554 679651 1008148 1940928 2476924 2376525 1687159 694689 171553 773797
37633 773797 2265884 3951662 5604866 7292335 8542910 8530673 7154002 5365064 4301307
37624 4301307 4354609 4991620 5224974 4485293 3346655 3099294 4215047 5585211 5806778
37615 5806778 4872614 3849912 3124022 1987963 174335 -1223126 -1039306 420792 2009825
37606 2009825 3520922 5724086 8522468 10251496 9578024 7373654 5733392 5516931
37598 5516931 5911879 6252120 6976179 8465704 10115260 11196077 11664184 11381773 9605114
37589 9605114 6431124 3938976 4288972 6821771 8467205 7265985 4394713 2445453
37581 2445453 2700350 4475064 6286068 7141814 7158363 7172356 7459329 7121393 5508489
37572E508489j611083N29540K790592K711597P63523m95620q9367N17609J12574
37563A0737854o93288r74409r07358j033190j324786j514953j354302l03980J842841
37554D474429L796476L640129J381396p14795r82405j98933J59326j8178l23632
37545A1213813j262837l053299l943979j890978K195539M807573L897317J108839
37537A3071988o45675n39194J44412L24935J93077K84922N93864P53640M56830
37528A4638799m06732j498361j879644p38909J527738L521187M365761M416202
37520B3946041M128925L101859J070924q34246j085902K19530J611144K504154
37512C4662429L792474N871617P598969Q037368P916204Q273566Q798601Q875316
$$ plain form
37572 5508489 3897406 4426946 7217538 9929135 10692658 10197038 10107671 10625280 10737854
37563 10737854 10044566 9070157 8162799 7129609 5804823 4289870 2935568 2631588 4474429
37554 4474429 8270905 11911034 13292430 12577635 11595230 11396297 11555623 11537445 11213813
37545 11213813 9950976 6897677 2953698 1062720 3258259 8065832 11963149 13071988
37537 13071988 12426313 11887119 12031531 12356466 12549543 12834465 13428329 14181969 14638799
37528 14638799 14232067 12733706 10854062 10115153 11642891 15164078 19529839 23946041
37520 23946041 28074966 31176825 32247749 31413503 30327601 30547131 32158275 34662429
37512 34662429 38454903 44326520 51925489 59962857 67879061 76152627 84951228 93826544
37504I3826544R318039J1400062J4686081J7551452J9656332K2176863K5478510
37497B14093883K8294422K9693990L0206889K9964037K6901826J8248298L735343
37490C81138688j3217833k7417943l5034871l5699446l2195762k7938333k4496033
37483A85138467k1546958j8656373j6121537j4159766j2440444j0829202r691560
37476H1692627q989530p899960n936363l848638k829086l204885m242698m810687
37468C9930780m077603k219638o62360q40273k365896l252238k411769j056807
37460B3044196r45136k033830k775508k233984r91545j60639k01563o82608q52828
37451A2166555n59769n74722j449282k138708r55637J672727K833231O85469k701508
$$ plain form
37504 93826544 103144583 114544645 129230726 146782178 166438510 188615373 214093883
37497 214093883 242388305 272082295 302289184 332253221 359155047 377403345 381138688
37490 381138688 367920855 340502912 305468041 269768595 237572833 209634500 185138467
37483 185138467 163591509 144935136 128813599 114653833 102213389 91384187 81692627
37476 81692627 72703097 64803137 58866774 55018136 52189050 48984165 44741467 39930780
37468 39930780 35853177 33633539 32971179 32130906 29765010 26512772 24101003 23044196
37460 23044196 22099060 20065230 17289722 15055738 14064193 13903554 13701991 13019383 12166555
37451 12166555 11606786 11032064 9582782 7444074 6488437 8161164 10994395 11679864 8978356
37442H978356l655215j430274J263367K004171J089288j4595p82490j256616r87240
37433E208752K65831J497113J456588L95761l82421n97371j256254k505409k653142
37424A429448m88628K345461K959917J047332o41082j49765J064756O07107j154435
37415G020111j771994m60298R70829J023541L78856K15525L04490k23579j356658
37406F100823k407578k902178k529525j082282Q28638J872774J555536Q64765
37398B300973P57957R95656J119287J351086J625660J068282l62584j057803q8984
37389G709530R31883J74321j386797j524174m65908l76346j461045j541457K8250
37380B088257Q88221o17169k589307k217211K84711K204107J886261J73229j195082
$$ plain form
37442 8978356 5323141 3892867 5156234 7160405 8249693 8235098 7452608 6195992 5208752
37433 5208752 5474583 6971696 8428284 8824045 8441624 7844253 6587999 4082590 1429448
37424 1429448 940820 3286281 6246198 7293530 6652448 6502683 7567439 8174546 7020111
37415 7020111 5248117 4787819 5758648 6782189 7161045 7376570 7681060 7457481 6100823
37406 6100823 3693245 791067 -1738458 -2820740 -1992102 -119328 1436208 2300973
37398 2300973 3058930 4054586 5173873 6524959 8150619 9218901 8856317 7798514 7709530
37389 7709530 8641413 8815734 7428937 5904763 5438855 5062509 3601464 2060007 2088257
37380 2088257 2976478 2359309 -229998 -2447209 -2162498 41609 1927870 2101099 906017
37371I06017j304745m30546L87238K98103k77462O3716J838990L672882L776722
37362H930915J952530m18911j879240j895657r76446l52672r72210k281610k641227
37353e34528j467432j48748j09581q25406p88385K42999J177365J346928J056530
37344e0258N35235m08272j537365k030661j468873k72966R27887J648895J362862
37335a293516O821j187217n97843J476664K555686J018086j441750j743058N44992
37326f61135K580956J922329n14965j960477j318175p1958m9566j387408k767559
37317d227958k818269j124697J413956L053765K735341J315499N38162P10803
37309A596602M84571p82845j868161j668235q83844m57603K38110J805713K653648
$$ plain form
37371 906017 -398728 -829274 -442036 -143933 -421395 -357679 1481311 5154193 8930915
37362 8930915 10883445 10464534 8585294 6689637 5713191 5360519 4388309 2106699 -534528
37353 -534528 -2001960 -2150708 -2260289 -3085695 -3874080 -3631081 -2453716 -1106788 -50258
37344 -50258 484977 76705 -1460660 -3491321 -4960194 -5233160 -4305273 -2656378 -1293516
37335 -1293516 -1286695 -2473912 -3071755 -1595091 960595 1978681 536931 -1206127 -661135
37326 -661135 1919821 3842150 3327185 1366708 48533 -23425 -72991 -1460399 -4227958
37317 -4227958 -7046227 -8170924 -6756968 -3703203 -967862 347637 885799 1596602
37309 1596602 2081173 1298328 -569833 -2238068 -3121912 -3579515 -3341405 -1535692 1117956
37300A117956J006171j487069j204795J998231L880397J689838j780369k173095
37292C047265M49336K301625J395765m94205j172480p38110l97461m95456o40410
37283C255869n98006l01750K61581P25493N73652m1121l91288k53336j41275l08977
37273B780842l69335j75844k10966o75611j010118q69390q01588j211068j307850
37264c850928j39047J611334K047586N68687j058798q81937O02518J052295n51553
37255e99843k461267k399021l68573J634727K165562J504869N56939j73788l28744
37246d69139L90595J501221J810098Q19192n87246j318020j231253o85243J76292
37237D06497J013456J021099j772r18821n34108Q11400J741104J531262N04992
$$ plain form
37300 1117956 2124127 637058 -567737 1430494 5310891 7000729 5220360 3047265
37292 3047265 3496601 5798226 7193991 6699786 5527306 4789196 4391735 3896279 3255869
37283 3255869 2657863 2356113 2617694 3343187 3916839 3875718 3484430 3231094 3089819 2780842
37273 2780842 2411507 2235663 2024697 1349086 338968 -530422 -1332010 -2543078 -3850928
37264 -3850928 -3989975 -2378641 -331055 237632 -821166 -1703103 -1100585 -48290 -599843
37255 -599843 -3061110 -5460131 -5828704 -4193977 -2028415 -523546 33393 -140395 -469139
37246 -469139 -78544 1422677 3232775 4051967 3464721 2146701 915448 230205 406497
37237 406497 1419953 2441052 2439280 1520459 986351 1797751 3538855 5070117 5575109
37228E575109q20618k060450k674065k208312q38824P47935J800553J656777J39803
37219A317908j792158k588676j824553n68718L18090J012503J367132N20237j029280
37210c267515r59753J434991L226566J733347j151870j530960O83690J934303
37202B102799N48312j434469k078094j697495o89613J267352K945992K015878
37194B980662r29716k239984o88768N26213o35793j367509R09826L353119J945183
37185C853233j592148k148676P43791K356904K66414k414034k469121j123531
37177b527168j045697j831246j070050J659189M081371M018341J635429r15860
37169D004309j646780p14462j3228m13314m77771Q75998J842897J80805k720917
$$ plain form
37228 5575109 4754491 2694041 19976 -2188336 -3027160 -2279225 -478672 1178105 1317908
37219 1317908 -474250 -3062926 -4887479 -5456197 -5138107 -4125604 -2758472 -2238235 -3267515
37210 -3267515 -4227268 -2792277 434289 2167636 1015766 -515194 168496 2102799
37202 2102799 2651111 1216642 -861452 -2558947 -3248560 -1981208 964784 2980662
37194 2980662 2050946 -189038 -877806 -351593 -987386 -2354895 -1445069 1908050 3853233
37185 3853233 2261085 112409 856200 3213104 3479518 1065484 -1403637 -2527168
37177 -2527168 -3572865 -5404111 -6474161 -4814972 -733601 3284740 4920169 4004309
37169 4004309 2357529 1643067 1629839 1216525 738754 1614752 3457649 3638454 917537
37160I17537l239224q63681J058185M66535p73551o02413K8883l18448n57277
37151c883454P92020K413674K002562O2937q64892j35023M59674r3423o94018
37142F0057l77708J16364k20316j052388j319098o39255M79785J341292J638597
37133B7330J611831J663052J660988R87123l90730j431804j212098j67820M80229
37124C228101J56971p83275j707901j976359j075155P19889K175741K297516J359999
37115D395527K45798o21692j057904o57279M90410J317439J028439J63855n68247
37106D736346j536832k861734k955199n67863K297638K161201j013391l271378
37098c011212j924045J059978K373878J894581J680806J989937J133839j024229
$$ plain form
37160 917537 -2321687 -3185368 -2127183 -1660648 -2434199 -3036612 -3007729 -3326177 -3883454
37151 -3883454 -3091434 -677760 1324802 1387739 522847 387824 847498 754075 60057
37142 60057 -317651 -201287 -421603 -1473991 -2793089 -3432344 -2952559 -1611267 27330
37133 27330 1639161 3302213 4963201 5950324 5559594 4127790 2915692 2747872 3228101
37124 3228101 3385072 2601797 893896 -1082463 -2157618 -1437729 738012 3035528 4395527
37115 4395527 4641325 4019633 2961729 2304450 2794860 4112299 5140738 5304593 4736346
37106 4736346 3199514 337780 -2617419 -3185282 -887644 1273557 260166 -3011212
37098 -3011212 -4935257 -3875279 -1501401 393180 2073986 4063923 5197762 4173533
37090D173533k169150q93801J078308J330918O3684o30930q9494J58571r03039
37081B118600k016509j576248j33411N14764J63864L20507J360133J510542l46224
37072A916018k489134k596710j081049k07997m35108R1278K138522L696532K755609
37063C787961J92375j495794j356617n30403k45150o05517j175179j596639j520957
37054d545920p70007K42570Q41061R34694R99606J158996R17908Q2339o27321
37045g66074m03539N02382J064003Q61737N22122N44271M08956m39928j252411
37036A041519p73285O38115J029206m51849k094148j831459L9419J553096J743362
37027H93976J200499M85206l62924q58147k74775R40399J406336P52034m1450
$$ plain form
37090 4173533 2004383 1110582 2188890 3519808 3583492 2952562 2863068 3021639 2118600
37081 2118600 102091 -1474157 -1607568 -1092804 -928940 -608433 751700 2262242 1916018
37072 1916018 -573116 -3169826 -4250875 -4458872 -4893980 -4802702 -2664180 1032352 3787961
37063 3787961 3980336 2484542 1127925 597522 352372 -253145 -1428324 -3024963 -4545920
37054 -4545920 -5315927 -5073357 -4232296 -3297602 -2297996 -1139000 -221092 -138753 -766074
37045 -766074 -1169613 -667231 396772 1258509 1780631 2324902 2733858 2293930 1041519
37036 1041519 268234 906349 1935555 1483706 -610442 -2441901 -2402482 -849386 893976
37027 893976 2094475 2579681 2216757 1358610 1083835 2024234 3430570 4182604 4141154
37018D141154m49319r33565j261666k03881K100592L249348J555552j379620k701524
37009D117071j935909r08339p74361r73609q51188n42493r8756P95707J867528
37000F95651K153380J303561K04449o4119N98088J295273R07451r48203l227071
36991B918460m030805k534668o9444J400532J498684J276528J247851Q36758j61415
36982B382481p97531k18222R78606J240732j82509k163164k546930n08047J996035
36973A81451K081618l71406k162191q85481J717407K218427L47232q80896L55808
36964B601969K426234K948347J735525J58341q60923j193550r94365p69769j120126
36955D931683j796754j836442j005961j10554M10790R21373J256073N06640j162291
$$ plain form
37018 4141154 3691835 2758270 1496604 1292723 3393315 6642663 8198215 6818595 4117071
37009 4117071 2181162 1272823 498462 -475147 -1326335 -1868828 -1967584 -1171877 695651
37000 695651 2849031 4152592 4357041 4292922 4891010 6186283 7093734 6145531 2918460
36991 2918460 -1112345 -3647013 -3716457 -2315925 -817241 459287 1707138 2543896 2382481
36982 2382481 1584950 1366728 2345334 3586066 3403557 1240393 -1306537 -1814584 181451
36973 181451 2263069 1891663 -270528 -1156009 561398 2779825 3127057 2246161 2601969
36964 2601969 5028203 7976550 9712075 9870416 9009493 7815943 6821578 6051809 4931683
36955 4931683 3134929 1298487 292526 181972 592762 1514135 2770208 3276848 2114557
36946B114557k051394j265911n7857K77358L39628J050578J579428O72094r64574
36937A693907j536796p87136M5341L43240L77420o7157j320780k269621j279001
36928d800583J096731K326475J377627J64544P00405K377573L148211K192821
36920H583804K94871j496708k435013k005343m89136O97205K51523j404739k445280
36911d48816j668345J91389J274031N46662j112903j848820q83103O93935J473876
36902a782094J489202J604698J635541M81072j720557l053443k196050k26088
36894c767719Q72432O27692k4162m89535q41684p88609K21273J696862K124478
36885c68972Q26358r61663j422970j52485J558926K133295J176877j76766l17787
$$ plain form
36946 2114557 63163 -1202748 -1260605 -983247 -643619 406959 1986387 2658481 1693907
36937 1693907 157111 -630025 -584684 -241444 135976 68819 -1251961 -3521582 -4800583
36928 -4800583 -3703852 -1377377 250 164794 865199 3242772 6390983 8583804
36920 8583804 8878675 7381967 4946954 2941611 2452475 3149680 3401203 1996464 -448816
36911 -448816 -2117161 -1925772 -651741 -105079 -1217982 -3066802 -3949905 -3255970 -1782094
36902 -1782094 -292892 1311806 2947347 3428419 1707862 -1345581 -3541631 -3767719
36894 -3767719 -2895287 -2267595 -2291757 -2781292 -3622976 -4411585 -4190312 -2493450 -368972
36885 -368972 457386 -504277 -1927247 -2079732 -520806 1612489 2789366 2612600 2294813
36876B294813J067378K304447J477442j010169k545716j516620N33876R68035
36868C573486m68605j665210j291043j66599O87885J431902K019447J403198l27079
36859E197382p70225J504628L762335K206218k141368m107666j557966J562107
36851E655445J087781j624943k558626j173951j59043m50605l62537O06673P91910
36842A812104k43767o24363M00201Q34117o67991k266628j736293J81059J318140
36833i93421J390676J510512J594966P31510m74963l77038Q57424J013466j029658
36824D223474l591017m355290l056566j222092m7668O28826J469071K344785K245999
36815a360478O65822j209851j548289k87804O10330l2619q25419m5932J502128
$$ plain form
36876 2294813 3362191 5666638 7144080 6133911 3588195 2071575 2605451 3573486
36868 3573486 3104881 1439671 148628 -17971 669914 2101816 4121263 5524461 5197382
36859 5197382 4427157 5931785 9694120 11900338 9758970 5651304 4093338 5655445
36851 5655445 6743226 5118283 2559657 1385706 1226663 776058 413521 1020194 1812104
36842 1812104 1568337 943974 1344175 2178292 1510301 -756327 -2492620 -2311561 -993421
36833 -993421 397255 1907767 3502733 4234243 3759280 3382242 4239666 5253132 4223474
36824 4223474 632457 -3722833 -6779399 -8001491 -8049159 -7420333 -5951262 -3606477 -1360478
36815 -1360478 -694656 -1904507 -3452796 -3740600 -3130270 -3162889 -3988308 -4034240 -2532112
36806b532112J715705N73388O5400Q17582J136946O4370p98188J78256J917826
36797C139173K076479K14761k032318l288710l370019k277484Q274K495555L413666
36788C79377K198662L61012l20390J78032O13359M23689J71171J65295k18415
36779C951792j353042k362839k211997j313062r22507j033200k13982J971342
36771c487495L670262K949100M82586j229789r17629M16794J218985P96239q82961
36762C016092l234373m569235l128343N36953L396249L166651Q60728q27969q38364
36753a621611k80455l05729q29242j223569j081910k12791J128886J882593J022292
36744a521536r17537j934475o42718K158231M261281M069049J807593p68268j802384
$$ plain form
36806 -2532112 -816407 -243019 -177619 639963 1776909 1841279 1043091 1221347 3139173
36797 3139173 5215652 5430413 3398095 109385 -3260634 -5538118 -5529844 -3034289 379377
36788 379377 2578039 2939051 2618661 2796693 3410052 3833741 4004912 4170207 3951792
36779 3951792 2598750 235911 -1976086 -3289148 -4211655 -5244855 -5458837 -3487495
36771 -3487495 182767 3131867 3614453 2384664 1467035 1883829 3102814 3899053 3016092
36762 3016092 -218281 -4787516 -7915859 -7378906 -3982657 -816006 44722 -783247 -1621611
36753 -1621611 -1902066 -2207795 -3037037 -4260606 -5342516 -5555307 -4426421 -2543828 -1521536
36744 -1521536 -2439073 -4373548 -5016266 -2858035 1403246 5472295 7279888 6511620 4709236
36735D709236r97749O1482k34708j420131j565030j02007J137422L97701j516917
36726D69299k369447j461842j22926N46956R21780J503423J686274P65544o37715
36717A301346j193684n99574J40109Q3330o52891j270299j159930l70302M24023
36708c297872M72125k15097p45188m39087K25081L07140k23172n45777k75826
36699d737673J71638N11583R46490J407609J380540Q16744L18658P4485l66177
36690E23897q26030l14841J052603J347830n42500k706259k480596k44760J170488
36681c020168O24670j13001L17939O88642m41702j990064j749041M49631K608832
36672b624262L150292K266620R30043k08454q53643r40770p47031o72445q46820
$$ plain form
36735 4709236 3711487 3772969 3538261 2118130 553100 451093 1588515 1986216 469299
36726 469299 -1900148 -3361990 -3484916 -2937960 -2016180 -512757 1173517 1939061 1301346
36717 1301346 107662 -491912 -351803 -268473 -921364 -2191663 -3351593 -3721895 -3297872
36708 -3297872 -2825747 -3040844 -3786032 -4225119 -4000038 -3692898 -3916070 -4461847 -4737673
36699 -4737673 -4566035 -4054452 -3107962 -1700353 -319813 496931 815589 890074 523897
36690 523897 -302133 -616974 435629 1783459 1240959 -1465300 -3945896 -4190656 -3020168
36681 -3020168 -2395498 -2508499 -2190560 -1501918 -1943620 -3933684 -5682725 -5233094 -2624262
36672 -2624262 526030 2792650 3722693 3514239 2660596 1719826 972795 300350 -546470
36663e46470j184005j573234j711037j133927J41333J361197J850244J730291
36655a065608J459905J127916O10643j09403j164919k581830l348594j830253
36647f902143J827396M727136M229567J382503l47951M48819J703010J058299
36639H126636j287463l506155m349384l596316j585671O55511J712067J194930
36631b635845K59844K2803J63131j94131r71837j381831j085900l15237O40592
36622e498411J359832J330032Q00596Q58440J781382K148896P44959j428018k448639
36613c50931k131920j692665j252295J66551K098611K473608Q41044m01573N38227
36604B88657J934369J045009j673005l188480k316431j104138j332327j733625
$$ plain form
36663 -546470 -1730475 -3303709 -5014746 -6148673 -6007340 -4646143 -2795899 -1065608
36655 -1065608 394297 1522213 2132856 2023453 858534 -1723296 -5071890 -6902143
36647 -6902143 -5074747 -347611 3881956 5264459 4916508 5365327 7068337 8126636
36639 8126636 6839173 3333018 -1016366 -4612682 -6198353 -5542842 -3830775 -2635845
36631 -2635845 -2376001 -2353198 -2190067 -2384198 -3356035 -4737866 -5823766 -6139003 -5498411
36622 -5498411 -4138579 -2808547 -2007951 -1149511 631871 2780767 3525726 2097708 -350931
36613 -350931 -2482851 -4175516 -5427811 -5261260 -3162649 -689041 152003 -249570 288657
36604 288657 2223026 3268035 1595030 -1593450 -3909881 -5014019 -6346346 -8079971
36596h079971n3233L293137N268057L860219N56560j342706m38131J396749J543408
36587F004089n6106j041977p4416J204771N96134j315202j919746l95898J116813
36578D118462O48565r25500j370330j01323J507373K098324J412155j56453j915123
36569E316150k966566k936233k514836k455517k275341r55835J213232K668297
36561d906649K598979J820000J280498Q09213j8068p06628n05196K41171L71603
36552I84923m87133j301358q42586Q03147K196810K053754O74704m24101m04053
36543C254107p7702m76932j063912m82360J110628J860320P19806j128856k017958
36534A697141j820671j364460q85652k53342Q4603k33841l93624N60120J862351
$$ plain form
36596 -8079971 -8133204 -4840067 427990 4288209 4844769 3502063 3063932 4460681 6004089
36587 6004089 5947983 4906006 4831590 6036361 6632495 5317293 3397547 3001649 4118462
36578 4118462 4767027 3841527 2471197 2369874 3877247 5975571 7387726 7231273 5316150
36569 5316150 2349584 -586649 -3101485 -5557002 -7832343 -8788178 -7574946 -4906649
36561 -4906649 -2307670 -487670 792828 1602041 1583973 877345 372149 613320 984923
36552 984923 497790 -803568 -1646154 -843007 1353803 3407557 4082261 3658160 3254107
36543 3254107 3176405 2699473 1635561 1153201 2263829 4124149 4843955 3715099 1697141
36534 1697141 -123530 -1487990 -2373642 -2626984 -2542381 -2776222 -3169846 -2609726 -747375
36525g47375J750537Q4842j300378j206350n28254m44264n76748o4787O39388
36516b393389N07669j00990K36788J723414K739921J958874M8829j333329j521618
36507A866169j124621q60056r10193j186217j434088j124461k087J184839J317493
36498b273222N04219J56550R70215J750006J124084l39825r45006l30990K53650
36489H69681k1913p32247j439654k182403k380298r92496J447713K654651J643236
36480a133730M10323J025624K467392K369664Q20654p0346J07670m39143k172247
36471C385861k878428j093179J212236J117962j267936l027784k117918N20568
36463d148618K381703J947018j91784k112965k345939j086487L62169J135679
$$ plain form
36525 -747375 1003162 1088004 -212374 -1418724 -1946978 -2391242 -2967990 -3032777 -2393389
36516 -2393389 -1885720 -1986710 -1749922 -26508 2713413 4672287 4721116 3387787 1866169
36507 1866169 741548 -118508 -1028701 -2214918 -3649006 -4773467 -4775554 -3590715 -2273222
36498 -2273222 -1769003 -1612453 -642238 1107768 2231852 1892027 947021 616031 869681
36489 869681 847768 115521 -1324133 -3506536 -5886834 -6879330 -5431617 -2776966 -1133730
36480 -1133730 -723407 302217 2769609 5139273 5959927 5889581 5997251 5558108 3385861
36471 3385861 507433 -585746 626490 1744452 476516 -2551268 -4669186 -4148618
36463 -4148618 -1766915 180103 -11681 -2124646 -4470585 -5557072 -5194903 -4059224
36455d059224J299362J030893L00354m39894k64018R64396K051467J768112K18998
36446B870446j420905k034045j233274M42901J799084K090334J901794K099166
36438F515501K052334L04980k748773m515920l349747o37995J226867J639129
36430D86376J394334Q15377j96798j088568j125965m55596L61197J128556J348664
36421B667577m3600k818406m485117l087400j03608J487090J283224J248162J943582
36412a908496J815165M58887k55610O83880J581693P00529j114059j974712j609307
36403a622030r39199k02466Q88469J855784J762653M92585j160140k253739k050885
36394c228968m77966J165154J098304m68798j019262R17517L344308L324400Q89296
$$ plain form
36455 -4059224 -2759862 -1728969 -1428615 -1868509 -2132527 -1168131 883336 2651448 2870446
36446 2870446 1449541 -584504 -1817778 -1374877 424207 2514541 4416335 6515501
36438 6515501 8567835 8872815 6124042 1608122 -1741625 -2379620 -1152753 486376
36430 486376 1880710 2696087 2499289 1410721 284756 -170840 190357 1318913 2667577
36421 2667577 2623977 -194429 -4679546 -7766946 -7870554 -6383464 -5100240 -3852078 -1908496
36412 -1908496 -93331 365556 109946 793826 2375519 3076048 1961989 -12723 -1622030
36403 -1622030 -2561229 -2763695 -1875226 -19442 1743211 2235796 1075656 -1178083 -3228968
36394 -3228968 -3706934 -2541780 -1443476 -1912274 -2931536 -2014019 1330289 4654689 5543985
36385E543985j486919k518289k907582k836766j342477J162302K191260M70738
36377a723748j830480j914373j67342Q31318L58020K17352J236024J539080l74039
36368a828188k641628k242978N50012K229249Q12033j548173j756671O9096J289235
36359e068013O12512o28588q41607n2213Q71670J468339J636943J361077R26046
36350B86166O37865J87593p62165j368786l56776J741931K635334J231396q84487
36341C348071j740563j255245k16397J325517L048166L224786P40827k625909
36333E849253m078140l370998k386286j724256l53229J396513J473043l82925
36325c577025j461638M3538K213464K363394R81652L80991P34611J74389j646330
$$ plain form
36385 5543985 4057066 1538777 -1368805 -4205571 -5548048 -4385746 -2194486 -1723748
36377 -1723748 -3554228 -5468601 -5635943 -4804625 -4446605 -4229253 -2993229 -1454149 -1828188
36368 -1828188 -4469816 -6712794 -6162782 -3933533 -3121500 -4669673 -6426344 -6357248 -5068013
36359 -5068013 -4455501 -5084089 -5925696 -5977909 -5106239 -3637900 -2000957 -639880 286166
36350 286166 924031 1111624 349459 -1019327 -1376103 365828 3001162 4232558 3348071
36341 3348071 1607508 352263 135866 1461383 4509549 7734335 8475162 5849253
36333 5849253 1771113 -1599885 -3986171 -5710427 -6063656 -4667143 -3194100 -3577025
36325 -3577025 -5038663 -4995125 -2781661 -418267 563385 944376 1678987 1853376 207046
36316B07046k787653k106243p90661j15830L26882J114142J444216N57421n23453
36307b674133k67533J089430K038587K032438J710704J269876L01859p67805q34205
36298C899218m0138J57200n71789p27150K80469N92334j147057k881326j663358
36289b101597J688556L213077J205542j601620k073521o43408J19294p51626j932024
36280b877327j889799k75567K118123L716794L123043O72493j569006k120537
36272H98217j608423j262949j050363m22526K16570K78524L09775R19888J192298
36263e28989L0753j476393j150565R34086K285625J441220l19227j193995j038113
36254a015598n95791p9654N44684R35620Q53182N19181R8814l69599m30989K67743
$$ plain form
36316 207046 -2580607 -4686850 -5477511 -5593341 -5266459 -4152317 -2708101 -2150680 -2674133
36307 -2674133 -2941666 -1852236 186351 2218789 3929493 5199369 5501228 4733423 3899218
36298 3899218 3859080 4016280 3444491 2717341 2997810 3590144 2443087 -438239 -2101597
36289 -2101597 -413041 2800036 4005578 2403958 330437 -312971 -193677 -945303 -2877327
36280 -2877327 -4767126 -5042693 -2924570 792224 3915267 4587760 3018754 898217
36272 898217 -710206 -1973155 -3023518 -3446044 -3229474 -2950950 -2641175 -1721287 -528989
36263 -528989 -498236 -1974629 -3125194 -2191108 94517 1535737 1216510 22515 -1015598
36254 -1015598 -1611389 -1691043 -1146359 -210739 642443 1161624 1260438 890839 459850 727593
36244G27593Q46194M4400j538882j778898j81236J111170M42376r95210j299569
36235b622062p74339r04793j537071j090478Q57775K900550L594972K680261P27523
36226C832338j294186k337754k177083j717481j597574j106249M57686K100519
36218c839784K255506J089883J43915M065j6252o9313M93506J385907J221388
36209B668821l27365j782252j985839j512326j121781l02903J377903K684569
36201c01173K109710K57799p77097k51001N03983L81620J10258Q26428K033500
36192D894027K086142M12839j709610k707774k310704j351301o49230n76878j159049
36183c071538j859953j644556j54734J359883J305514r8787j109626j021907r57628
$$ plain form
36244 727593 1573787 1618187 79305 -1699593 -1880829 -769659 -327283 -1322493 -2622062
36235 -2622062 -3396401 -4301194 -5838265 -6928743 -6070968 -3170418 424554 3104815 3832338
36226 3832338 2538152 200398 -1976685 -3694166 -5291740 -6397989 -5940303 -3839784
36218 -3839784 -1584278 -494395 -350480 -346415 -362667 -431980 61526 1447433 2668821
36209 2668821 2341456 559204 -1426635 -2938961 -4060742 -4363645 -2985742 -301173
36201 -301173 1808537 2066336 1289239 1038238 1542221 1923841 2034099 2860527 4894027
36192 4894027 6980169 7393008 5683398 2975624 664920 -686381 -1335611 -1912489 -3071538
36183 -3071538 -4931491 -6576047 -6730781 -5370898 -4065384 -4164171 -5273797 -6295704 -7253332
36174g253332j571874j683721m12115Q63510N21287l84602N33742L144827M627329
36165a614949L414874J198838K66440O17536P75201J18447p69812j243677j130148
36156A632750o84252n52619j087990j373404o588K594338L920130K358319o06222
36147F194462k290462j989931r92248k37114M22291R40996P07154k73470r78075
36138A503603n71710O76688J842180K087814R87315j091651k791608k733789j009981
36129a101139Q24635J464689J025976L05099m43893j416038k337471k434228j481815
36120e594185l38531M9236n4098M53500J699181K227106R36929r82487j280263
36111b883612K92007J514771P19529j012276j531232m91756O27521Q13718O14422
$$ plain form
36174 -7253332 -8825206 -10508927 -10921042 -10057532 -9536245 -9920847 -9387105 -6242278 -1614949
36165 -1614949 1799925 2998763 3265203 3882739 4657940 4776387 4006575 2762898 1632750
36156 1632750 948498 395879 -692111 -2065515 -2072103 522235 4442365 6800684 6194462
36147 6194462 3904000 1914069 921821 684707 1106998 2047994 2755148 2481678 1503603
36138 1503603 931893 1608581 3450761 5538575 6525890 5434239 2642631 -91158 -1101139
36129 -1101139 -276504 1188185 2214161 2519260 2075367 659329 -1678142 -4112370 -5594185
36120 -5594185 -5932716 -5883480 -5937578 -5484078 -3784897 -1557791 -620862 -1603349 -2883612
36111 -2883612 -2591605 -1076834 -357305 -1369581 -2900813 -3392569 -2765048 -1951330 -1336908
36102a336908J002901K016913K675847J916509k24695k197215k261052n52012
36094A040288Q98067O52442n04224j042016p20415k21303J58438K34693n73761
36085g7791j994111k185496j37511K112247J899709m3831n84477J002082K087624
36076B078445R52872r15272j733912j846426j833949q54758J210815K265252R40894
36067B63961q19497n59148R08211J141289J73290J3389Q31006P06308r26143k335220
36057f02554k190646q49581J119188L287107M158821K276937j017700k557918
36049C623654j718735j103375k021695k337090m12968J747145J687413M41684
36041i3967M76184J475334J264747j70241p37226J19595P54331L45372m4432K23158
$$ plain form
36102 -1336908 -334007 1682906 4358753 6275262 6050567 3853352 1592300 1040288
36094 1040288 1938355 2590797 2086573 1044557 324142 102839 261277 495970 -77791
36085 -77791 -2071902 -4257398 -4394909 -2282662 -382953 -426784 -1011261 -9179 2078445
36076 2078445 3031317 2116045 382133 -1464293 -3298242 -4153000 -2942185 -676933 263961
36067 263961 -555536 -1114684 -206473 934816 1108106 1121495 1952501 2658809 1732666 -602554
36057 -602554 -2793200 -3642781 -2523593 763514 4922335 7199272 6181572 3623654
36049 3623654 1904919 801544 -1220151 -3557241 -3970209 -2223064 -535651 -93967
36041 -93967 382217 1857551 3122298 2952057 2214831 2334426 3088757 3434129 3389697 3612855
36031C612855L63635L5510O6911O17597N77359l55690q14596j2673P73219J99185
36021E063312j006902j275425o00542l37179j125364k160404k304685j211735
36013d958924M17350J346646J039247N05249J069798K188387J848139l55763k169698
36004I30431j764566k88559K12816j3478N44500J467879R22599q26324j218071
35995c2773O12117K163067J219544r17125j677314j082077j025290j607607q88257
35986c235715J532413L161335J948036p96288k298507j952994j337508j278655
35978d257883q74421M53403J743971K049627J809898J710617J314483P0842j150870
35969B869667j025956J38212P94805N32337M80876J085549J099265l37647j877980
$$ plain form
36031 3612855 3976490 4012000 4078911 4696508 5273867 4918177 4103581 4090908 4864127 5063312
36021 5063312 4056410 2780985 2180443 1843264 717900 -1442504 -3747189 -4958924
36013 -4958924 -4541574 -3194928 -2155681 -1650432 -580634 1607753 3455892 3100129 930431
36004 930431 -834135 -1122694 -909878 -923356 -378856 1089023 2011622 1185298 -32773
35995 -32773 579344 2742411 3961955 3044830 1367516 285439 -739851 -2347458 -3235715
35986 -3235715 -1703302 1458033 3406069 2609781 311274 -1641720 -2979228 -4257883
35978 -4257883 -5132304 -4678901 -2934930 -885303 924595 2635212 3949695 4020537 2869667
35969 2869667 1843711 1981923 2776728 3309065 3789941 4875490 5974755 5637108 3759128
35960C759128j550869L85658J493387K11181k040612k462321l93394J565339O72885
35951A640382k097066k837633P7291L315246K847926m42932k036327j49780K220368
35942B537475K130982N09423k88999j32211k55112o28885l79149L77063R39636
35933D810223J220719J094316p4980j784418j981691q4090J462357P81041l25308
35924E118169M27180J567356L53095k125579k454504o15849J41483j101548j852799
35915e42996j005059l71148p02686m13108P15250P66752j80755M03851K345893
35906A015994J984805j264251k702141Q0964K494035K23094l308662k288444K175365
35897a589241M310002K928279J859227K237501J046434k301424m081277k420412
$$ plain form
35960 3759128 2208259 2593917 4087304 4298485 2257873 -204448 -597842 967497 1640382
35951 1640382 -456684 -3294317 -3217026 98220 2946146 2503214 466887 317107 2537475
35942 2537475 4668457 5177880 4888881 4756670 4501558 3872673 3493524 3870587 4810223
35933 4810223 6030942 7125258 7050278 5265860 3284169 3200079 4662436 5443477 5118169
35924 5118169 5545349 7112705 7465800 5340221 2885717 2269868 2411351 1309803 -542996
35915 -542996 -1548055 -1919203 -2621889 -3034997 -2319747 -1552995 -1733750 -1329899 1015994
35906 1015994 3000799 1736548 -965593 -884629 1609406 1832500 -1476162 -3764606 -1589241
35897 -1589241 2720761 5649040 7508267 9745768 10792202 8490778 4409501 1989089
35889A989089k16685m6879n61601j2661N19868k24767j034512o17635n8069o39573
35879i03425j381791q46563L58046P51558K54515k08886j63902M19592J328668
35870c92188J613597L70374j486616j961826q90166j07538l17980j46915J028862
35861b290396J782764J073137l39684j625339k518644j757396J824378N734204
35853A883024N228891O9541m030349l134834l02631R2621q09756K90819K029798
35844A317124N88074l058178l977045j032093J604711J246252P9781M55059J122454
35835a653861K10371j411753j987171j627230j193709l67908J275943K686143
35827d069175K495875R48331m07940l60865R89456K116941J093147k034443m276561
$$ plain form
35889 1989089 1772404 1725525 1163924 1151263 1671131 1446364 411852 -205783 -263852 -903425
35879 -903425 -2285216 -3131779 -2773733 -2022175 -1767660 -1976546 -2140448 -1720856 -392188
35870 -392188 1221409 1591783 105167 -1856659 -2746825 -2854363 -3172343 -3319258 -2290396
35861 -2290396 -507632 565505 225821 -1399518 -3918162 -5675558 -3851180 1883024
35853 1883024 7111915 7181456 3151107 16273 -286358 -193737 -1003493 -712674 1317124
35844 1317124 1905198 -1152980 -5130025 -6162118 -4557407 -3311155 -3231374 -2776315 -1653861
35835 -1653861 -1443490 -2855243 -4842414 -6469644 -7663353 -8031261 -6755318 -4069175
35827 -4069175 -1573300 -624969 -1032909 -1393774 -404318 1712623 2805770 771327 -3505234
35818c505234k917091N86390K166382O12592j127341n91464J017601J410989M53017
35809a894159o97245j559372j815165o96137J395462K323769J048552n05777k47579
35800b647651Q86495O52439p86519j278398j95809Q19625N46793l84761r48854
35791c336640r64257n85807J09860P29481Q31931P70426J264768K023832J853571
35782B697165L99771j161372j555350q19948N1217K94076r7437n71633n15502
35773a279013R1103M25160l38244j807285k485428j427015N24564J558499R06304
35764c831355l20609m78637O65419J766768J686994Q42415L66962M95765N69245
35755A762967L30266K14461L40159K36045j56414j68915M54155R52820O44986
$$ plain form
35818 -3505234 -6422325 -5835935 -3669553 -3056961 -4184302 -4775766 -3758165 -2347176 -1894159
35809 -1894159 -2591404 -4150776 -5965941 -6662078 -5266616 -2942847 -1894295 -2400072 -2647651
35800 -2647651 -1761156 -1108717 -1895236 -3173634 -3369443 -2549818 -2003025 -2387786 -3336640
35791 -3336640 -4300897 -4886704 -4776844 -4047363 -3215432 -2445006 -1180238 843594 2697165
35782 2697165 3096936 1935564 380214 -439734 -388517 -94441 -191878 -763511 -1279013
35773 -1279013 -1187910 -762750 -1100994 -2908279 -5393707 -6820722 -6296158 -4737659 -3831355
35764 -3831355 -4151964 -4630601 -3965182 -2198414 -511420 330995 697957 1193722 1762967
35755 1762967 2093233 2307694 2647853 2883898 2727484 2558569 3012724 3965544 4610530
35746D610530j33904p94290j438404k247976k571721j652321J3844J014451P19799
35737b479992j10605m71152j73166L87441Q78155J064893O35079m49742j480357
35728b199446j419873j24057J170600J131674M3284m88229K11868P87407k29794
35719a116566k055262k404536n20744J720965K117052O98017o17410n12226K19843
35710b470867j79456j983988l223423j978262Q96006K588522K056003J250688
35702c044777J766020K192414O84255j454683j452298N21358J643359R71716N50876
35693B378240J491185K059970R03418n68810o97029k39273o99320j767673k183196
35684F77512j661655m70802J337105K814954K070531q83142k996994j982709L61780
$$ plain form
35746 4610530 4476626 3682336 2243932 -4044 -2575765 -4228086 -4214242 -3199791 -2479992
35737 -2479992 -2590597 -3061749 -3234915 -2847474 -1969319 -904426 -269347 -719089 -2199446
35728 -2199446 -3619319 -3743376 -2572776 -1441102 -1397818 -1886047 -1674179 -886772 -1116566
35719 -1116566 -3171828 -5576364 -6097108 -4376143 -2259091 -1561074 -2178484 -2690710 -2470867
35710 -2470867 -2650323 -4634311 -7857734 -9835996 -8939990 -6351468 -4295465 -3044777
35702 -3044777 -1278757 913657 1597912 143229 -1309069 -787711 855648 1827364 2378240
35693 2378240 3869425 5929395 6832813 6264003 5566974 5327701 4628381 2860708 677512
35684 677512 -984143 -1454945 -117840 2697114 4767645 3884503 887509 -1095200 -733420
35675g33420Q89370l43731q89723j00384M17111k4029l84435k09876k74427p52166
35665b405710q54047m41403j44333J26408R50125J756864J316677j30718j036820
35656h62957p45632K44069J839509L962173M894929K789449q46144k032723L09816
35647I552489K490357J056627k521907m121782k376375K72038J156989J38961
35639E647397j136220j362185n91088K56286M72868M5964p80679j756101k128779
35630a332537r10040J468221K769948J576452o00549j412120r06439o41786n44239
35621e33089N94914J958111J275017j130314k107740m35226J261938P39660o14249
35612A009022o35159R5275j01682q88724r66979p32041j363432k299468k012820
$$ plain form
35675 -733420 155950 -187781 -1077504 -1177888 -760777 -784806 -1169241 -1379117 -1653544 -2405710
35665 -2405710 -3259757 -3701160 -3845493 -3719085 -2768960 -1012096 304581 173863 -862957
35656 -862957 -1608589 -1364520 474989 4437162 9332091 12121540 11275396 9242673 9552489
35647 9552489 12042846 13099473 10577566 6455784 4079409 4351447 5508436 5647397
35639 5647397 4511177 3148992 2557904 2814190 3287058 3333022 2552343 796242 -1332537
35630 -1332537 -2242577 -774356 1995592 3572044 2971495 1559375 652936 11150 -533089
35621 -533089 61825 2019936 3294953 2164639 56899 -378327 883611 1623271 1009022
35612 1009022 373863 469138 367456 -521268 -1488247 -2220288 -3583720 -5883188 -7896008
35603g896008o77339Q3683k39062n69799j20302Q32410J866394K759448L047236
35594i13339K372855J186713K91796o4725r2756J384j46162r32390j971542k273256
35584b541422j683968j050887n71054M91458J857415J913715L87016o63817K5191
35575a836353Q05200l4482j243386p69868O89298R80143J49314r245O66506N88427
35565a4446o02121j492966j303028o17317J69413J063774J366088M98646l18887
35556a250844N12899K088947J948465j32872j785016j611609o00274K97797J337814
35547H05307K130161J269775j137866k850284k499486j222855k89866Q12860K690961
35538b91293M328651M449586L118469R48657j705242l830677l884557k054647
$$ plain form
35603 -7896008 -8573347 -8489664 -8728726 -9298525 -9418827 -8586417 -6720023 -3960575 -913339
35594 -913339 1459516 2646229 2938025 2873300 2780544 2781928 2635766 1703376 -268166 -2541422
35584 -2541422 -4225390 -5276277 -5847331 -5355873 -3498458 -1584743 -1197727 -1861544 -1836353
35575 -1836353 -1031153 -1065635 -2309021 -3078889 -2389591 -1409448 -1260134 -1269379 -602873 -14446
35565 -14446 -616567 -2109533 -3412561 -4029878 -3860465 -2796691 -1430603 -931957 -1250844
35556 -1250844 -737945 1351002 3299467 3166595 1381579 -230030 -830304 -532507 805307
35547 805307 2935468 4205243 3067377 217093 -2282393 -3505248 -3795114 -2982254 -291293
35538 -291293 4037358 8486944 11605413 12554070 10848828 7018151 3133594 1078947
35530A078947o40238q90418j248652j80565J139806Q45344n15818r94080k02927
35521a608601P31924J210064J230147L94618j143205j634976J26068K281283J928919
35512C516241o28233k148943j087857N40047N92169k25627j08996Q42324J014662
35503B305787j86875j593319j775008m41341J432604K374460J677616K92325o1512
35494D024737Q89963J334207k70467k746360l279335r73418J814907K243132K49501
35485C286867j800394k186032j354885m33161L72998J213492J593104J117602
35477A809591N33646O72987P93371m46407k441131k877963j008134J044993J202038
35468g17009J24902l22507K5196O7563j38684M04602J207556M38683j839104k703933
$$ plain form
35530 1078947 438709 -451709 -1700361 -1880926 -741120 104224 -411594 -1405674 -1608601
35521 -1608601 -876677 333387 1563534 1958152 814947 -820029 -693961 1587322 3516241
35512 3516241 2888008 739065 -348792 191255 783424 557797 448801 1291125 2305787
35503 2305787 2118912 525593 -1249415 -1690756 -258152 2116308 3793924 4086249 4024737
35494 4024737 4914700 6248907 5978440 3232080 -47255 -1020673 794234 3037366 3286867
35485 3286867 1486473 -699559 -2054444 -2487605 -2114607 -901115 691989 1809591
35477 1809591 2343237 3016224 3809595 3363188 922057 -1955906 -2964040 -1919047 -717009
35468 -717009 -592107 -914614 -889418 -821855 -960539 -555937 651619 1090302 -748802 -3452735
35458c452735j74193L418812L864161M36512l137697l382521r80250R81757J232963
35449a193191J095716J671785K259209J958138J201736P20777J47802j116216
35441F745756k365877k269531q41718M53008O28979K86418O04441J841646K959407
35432H042529K450045j53869l221062m120034k107323N61706J358762N42483J73125
35423C526362Q21767J136041M30582l50335n44211p38310j230943j240138m39276
35414A371539K33570J76415J45090P17777J032932J84098j162652j680876j144082
35405a26189l21392J83897J62046m30272j120041r62413L41401J854841K380417
35396A962295J501803m28175k428199k987979j334368J144680K126174J273024
$$ plain form
35458 -3452735 -3626928 -208116 3656045 4092557 954860 -2427661 -3407911 -2426154 -1193191
35449 -1193191 -97475 1574310 3833519 5791657 6993393 7714170 7861972 6745756
35441 6745756 4379879 2110348 1268630 1721638 2350617 2637035 3241476 5083122 8042529
35432 8042529 10492574 10338705 7117643 2997609 890286 1451992 2810754 3353237 3526362
35423 3526362 4348129 5484170 5914752 5564417 5020206 4281896 3050953 1810815 1371539
35414 1371539 1605109 1781524 1926614 2644391 3677323 3861421 2698769 1017893 -126189
35405 -126189 -447581 -263684 -101638 -531910 -1651951 -2614364 -2272963 -418122 1962295
35396 1962295 3464098 3035923 607724 -2380255 -3714623 -2569943 -443769 829255
35388H29255L74570L69347K72620m15899o48066j89774n02252j754767j589699
35379c254665R91229L017243J633840j281926j876856j39000O92693l65020j013278
35370a595740j17031N56315j75964q70696j74753Q96692P92134k72811j026430
35361a988284p96404L29598J744026K232398R69119j016259j688349n78766Q24562
35352C1641J323344J120393O75286J77930K34654J225069J895244O61312j531835
35343E813038k024357n12236L35715q42496j996852j249183J25826L29435K74572
35334B53462J604180L227670K759058M81731r68508o41853m38870j893186l849526
35325E34158m113265k108660P74338K669880K656642J266544j72398r64768j599371
$$ plain form
35388 829255 1203825 1573172 1845792 1429893 781827 592053 89801 -1664966 -3254665
35379 -3254665 -2263436 753807 2387647 1105721 -771135 -910135 -217442 -582462 -1595740
35370 -1595740 -1712771 -1156456 -1332420 -2203116 -2377869 -1481177 -689043 -961854 -1988284
35361 -1988284 -2784688 -2455090 -711064 1521334 2490453 1474194 -214155 -792921 31641
35352 31641 1354985 2475378 3150664 3328594 3563248 4788317 6683561 7344873 5813038
35343 5813038 3788681 3276445 3612160 2769664 772812 -476371 -350545 -21110 253462
35334 253462 1857642 5085312 7844370 8326101 7357593 6715740 6276870 4383684 534158
35325 534158 -3579107 -5687767 -4913429 -2243549 413093 1679637 1507239 542471 -1056900
35316a056900k488137k732845j124184J789250L694159K970464N85989r22210
35308G15586j91665J589987K184255R43237n84609q51306l07867l68274r75477
35299B153867o21793J107671K415577J432918j360184l594438l496971j473255
35291c436608N28440J005616L52097J27021P85143J005382m0343r38274r6321
35282g07847J353926Q93562j457555k958774k170172p85573o88603j351480j297493
35273i170009l47339Q29037J930248K666397K468668J483041O26383M0824r93478
35264d66228k107250j791860p8587R55740M65686K51078J435418K226319R98757
35255A889073p12319p37596K12806K12013m65225m21065q8123n80680r30492K66758
$$ plain form
35316 -1056900 -3545037 -6277882 -7402066 -5612816 -1918657 1051807 1637796 715586
35308 715586 523921 2113908 4298163 5241400 4656791 3805485 3497618 3129344 2153867
35299 2153867 1532074 2639745 5055322 6488240 5128056 1533618 -1963353 -3436608
35291 -3436608 -2908168 -1902552 -1550455 -1423434 -638291 367091 326748 -611526 -707847
35282 -707847 646079 1539641 82086 -2876688 -5046860 -5832433 -6521036 -7872516 -9170009
35273 -9170009 -9517348 -8688311 -6758063 -4091666 -1622998 -139957 486426 527250 -466228
35264 -466228 -2573478 -4365338 -4443925 -3488185 -3022499 -2771421 -1336003 890316 1889073
35255 1889073 1176754 439158 651964 863977 398752 -22313 -110436 -691116 -1621608 -1354850
35245a354850J528319L83356k056629k244025J39852J553408K71256j050712J05069
35236b724956K254274K549515Q99492o36067r50180n09451P8042N86149Q64584
35227B411402R58569J018144O98203n28887k209771l063145k552328j348383j89937
35218d806133O21533P26017O5315l89972K22712R93683M61124p39596n89997R73246
35208b462068J867713J276970N98162M01560o06838k406999k466948L31771L184126
35199b82551L166762J370918N63012N99712o22136k792212l248976j324456M56097
35190b113830J41288j105087j145055K82193J823894K284615J277542q06044k650762
35181b011246k674618o40166J873164L116979K820283J823831P33382l73068j291890
$$ plain form
35245 -1354850 173469 556825 -1499804 -3743829 -3603977 -2050569 -1779313 -2830025 -2724956
35236 -2724956 -470682 2078833 2978325 2342258 1392078 882627 960669 1546818 2411402
35227 2411402 3369971 4388115 5086318 4557431 2347660 -715485 -3267813 -4616196 -4806133
35218 -4806133 -4184600 -3458583 -3393268 -3783240 -3560528 -2566845 -2105721 -2845317 -3435314 -2462068
35208 -2462068 -594355 682615 1280777 1682337 1075499 -1331500 -3798448 -3466677 -282551
35199 -282551 2884211 4255129 4818141 5417853 4795717 2003505 -1245471 -2569927 -2113830
35190 -2113830 -1972542 -3077629 -4222684 -3940491 -2116597 168018 1445560 639516 -2011246
35181 -2011246 -4685864 -5326030 -3452866 -335887 2484396 4308227 5041609 4668541 3376651
35172C376651j613249j401711j326729j757847k124601j658903n20315M77383
35164f549321J151910K011537K789155K126834l56736k663810k488858k28902
35156d208191J510917J229536q6119q62862p05921J7013R34337J482116J083261
35147C94087J6488p83059j000505j025386p60909L00549J676614K119787J586784
35138B524450J370593J798004J559634Q0411j236665j204785o79162r74342j876746
35129A361392k447446k460586j882664l88113J319181J302518q59841k605771
35121f661330j566731J033929K183254J192214j92897r18236j406345j588776
35113g924918n97288J358525K750805K732960J918483J038743J95659m99584q25962
$$ plain form
35172 3376651 1763402 361691 -965038 -2722885 -4847486 -6506389 -7026704 -6549321
35164 -6549321 -5397411 -3385874 -596719 1530115 1173379 -1490431 -3979289 -4208191
35156 -4208191 -2697274 -1467738 -1553857 -2416719 -3122640 -3105627 -2171290 -689174 394087
35147 394087 410575 -372484 -1372989 -2398375 -3159284 -2858735 -1182121 937666 2524450
35138 2524450 3895043 5693047 7252681 7333092 6096427 4891642 4212480 3238138 1361392
35129 1361392 -1086054 -3546640 -5429304 -5817417 -4498236 -3195718 -4055559 -6661330
35121 -6661330 -8228061 -7194132 -5010878 -3818664 -4011561 -4929797 -6336142 -7924918
35113 -7924918 -8522206 -7163681 -4412876 -1679916 238567 1277310 1472969 973385 147423
35104A47423r90745j189261r46314m8814M85748j55053r01152m17710K97213o82920
35094d401585k533868k211735R08247L642019L298949J049278l60225k56382J95837
35085f69465K66482m4935q26043j711121j423075N79289K723356L107418K040955
35076D042861J240326J035313K64609j113330j378328K03877J643803O48825k082853
35067D505103l537994k182449L58631J735513J643698J261562R72589J30791j245439
35058C642005k101402j914075j358400j010914n73442J11680M70461K68685R4146
35049b371256N5017o78223k076477k429007o87609J615253K390270J852623J605455
35040g23954J848086J528998N95932l4941l46613r89636j512933r48704P7656
$$ plain form
35104 147423 -843322 -2032583 -2978897 -3027711 -2541963 -2697016 -3598168 -4015878 -3718665 -4401585
35094 -4401585 -6935453 -9147188 -8238941 -4596922 -1297973 -248695 -608920 -865302 -669465
35085 -669465 -402983 -447918 -1273961 -2985082 -4408157 -3828868 -1105512 2001906 4042861
35076 4042861 5283187 6318500 6583109 5469779 4091451 4295328 5939131 6587956 4505103
35067 4505103 967109 -1215340 -856709 878804 2522502 3784064 4756653 4887444 3642005
35058 3642005 1540603 -373472 -1731872 -2742786 -3316228 -3204548 -2734087 -2465402 -2371256
35049 -2371256 -2316239 -2994462 -5070939 -7499946 -8187555 -6572302 -4182032 -2329409 -723954
35040 -723954 1124132 2653130 3249062 3214121 2867508 1877872 364939 -583765 -506109
35031e06109N6266p17517n61201M27497K50606j447795k349777r52814J222214
35022d578630K076589J557152O59872k72154r95227q57409r6511l4041q63195
35013c403554r75107L61361J536205J161787J71595j84288m53922j263897j482080
35004d531900l26361N52036k75779r34375J008286L842978L428655n49965l612983
34995a399408k536928O95836K333696J720689Q92294J025896J351203R28376j11064
34986D900590j087254j623885j837247k005422k097013j734597q60619j44967
34978f490414j87252n48571k56043Q50576J925710K172523J530348N15747o8325
34969e55701L79313J398152J533969O1550j841034k566791k181074j875728j838390
$$ plain form
35031 -506109 -449843 -1167360 -1728561 -1301064 -1050458 -2498253 -4848030 -5800844 -4578630
35022 -4578630 -2502041 -944889 -285017 -557171 -1552398 -2409807 -2506318 -2540359 -3403554
35013 -3403554 -4378661 -4017300 -2481095 -1319308 -1147713 -1332001 -1785923 -3049820 -4531900
35004 -4531900 -4858261 -4306225 -4582004 -5516379 -4508093 -665115 2763540 2213575 -1399408
34995 -1399408 -3936336 -3240500 -906804 813885 1706179 2732075 4083278 5011654 4900590
34986 4900590 3813336 2189451 352204 -1653218 -3750231 -5484828 -6345447 -6490414
34978 -6490414 -6677666 -7226237 -7482280 -6631704 -4705994 -2533471 -1003123 -487376 -555701
34969 -555701 -176388 1221764 2755733 2817283 976249 -1590542 -3771616 -5647344 -7485734
34960g485734j202997L9429P52009N45839M54608J177281J917773J661333O16134
34951a524325k79910m97445j5444R65049J875523K010453J381443P67793N95054
34942E278191M42305k8890m68557o14758q75542j541837k106683k005310j419572
34933c340653o79629N13756K382415L968237L747324J439181j455145l083075
34925C492411k818207j413040o7365M83749L33396J76076N88468J282255J146146
34916C203889n98136l107250m166132k295632J398678M049964L894039J842814
34908D222234O0691l26381L05614J117948J475015J036414R9025l65856J68230
34899G792934Q21421L32385j079935j846398j121215J99967P97057M70279n999
$$ plain form
34960 -7485734 -8688731 -8649302 -7897293 -7351454 -6896846 -5719565 -3801792 -2140459 -1524325
34951 -1524325 -1804235 -2301680 -2317124 -1352075 523448 2533901 3915344 4683137 5278191
34942 5278191 5720496 5691606 5223049 4608291 3732749 2190912 84229 -1921081 -3340653
34933 -3340653 -4020282 -3506526 -1124111 2844126 6591450 8030631 6575486 3492411
34925 3492411 674204 -738836 -806201 -322452 10944 187020 775488 2057743 3203889
34916 3203889 2605753 -501497 -4667629 -6963261 -5564583 -1514619 2379420 4222234
34908 4222234 4282925 3956544 4262158 5380106 6855121 7891535 7990560 7624704 7792934
34899 7792934 8614355 8946740 7866805 6020407 4899192 5099159 5896216 6366495 6360496
34890F360496L880L84222M26644m85132j974352k617043j471443M28833J018039
34881B074144k12111j506943j126801N16570J584990J022438o27600k175486k873107
34872c323906k697610k049333j249093l07817O53248R96715K69660o57678j02325
34863h468139K233222M310738L842182R91408j763586k293811o43512J671579
34855a19919L270925L495216K182516k73592k716510l793515l112383j585352
$$ plain form
34890 6360496 6364376 6748598 7175242 6690110 4715758 2098715 627272 1056105 2074144
34881 2074144 1862033 355090 -771711 -255141 1329849 2352287 1724687 -450799 -3323906
34872 -3323906 -6021516 -8070849 -9319942 -9627759 -8974511 -7977796 -7708136 -8365814 -8468139
34863 -8468139 -6234917 -1924179 1918003 2909411 1145825 -1147986 -1791498 -119919
34855 -119919 3151006 6646222 8828738 8555146 5838636 2045121 -1067262 -2652614
$$ [...]
##END NTUPLES=NMR SPECTRUM
##END=
