##TITLE=31Pdec_100-2025
CDCl3, 24 sc
 11.8.2025
##JCAMPDX= 6.0         $$ Bruker NMR JCAMP-DX V2.0
##DATA TYPE= NMR SPECTRUM
##DATA CLASS= NTUPLES
##ORIGIN= UXNMR, Bruker Analytische Messtechnik GmbH
##OWNER= root
$$ XWIN-NMR		Version 3.5
$$ Mon Aug 11 14:02:46 2025 Russian Standard Time (UT+4h)  she@DPX200
##.OBSERVE FREQUENCY= 81.013821
##.OBSERVE NUCLEUS= ^31P
##.ACQUISITION MODE= SIMULTANEOUS
##.ACQUISITION SCHEME= undefined
##.AVERAGES= 24
##.DIGITISER RES= 17
##SPECTROMETER/DATA SYSTEM= spect
##.PULSE SEQUENCE= zgpg30
##.SOLVENT NAME= CDCl3
##.SHIFT REFERENCE= (INTERNAL, CDCl3, 0, 198.062)
##AUDIT TRAIL= $$ (NUMBER, WHEN, WHO, WHERE, WHAT)
$$ ##TITLE= Audit trail, XWIN-NMR		Version 3.5
$$ ##JCAMPDX= 5.01
$$ ##ORIGIN= Bruker BioSpin GmbH
$$ ##OWNER= she
$$ F:/spectra/data/she/nmr/P31/2/pdata/1/auditp.txt
$$ ##AUDIT TRAIL=  $$ (NUMBER, WHEN, WHO, WHERE, WHAT)
(   1,<2025-08-11 14:01:18.25 +0400>,<she>,<DPX200>,
      <created by zg, POWCHK disabled, PULCHK disabled
       configuration hash MD5:
       00 E9 B6 7A A2 85 ED C7 34 08 36 98 17 FE 4E 26
       data hash MD5: 32K
       9F AE 16 03 EC 18 E5 73 E9 DE 04 16 9F 3A F1 72>)
(   2,<2025-08-11 14:01:27.85 +0400>,<she>,<DPX200>,
      <Start of raw data processing
       efp BC_mod = 2 LB = 1.5 FT_mod = 6 PKNL = 1 PHC0 = 2262.124 PHC1 = -1135.501 SI = 64K 
       data hash MD5: 64K
       F4 69 0C F7 75 BE B4 3B DC EF 0D 92 94 0D 05 D1>)
(   3,<2025-08-11 14:02:06.53 +0400>,<she>,<DPX200>,
      <pk PHC0 = -494.067 PHC1 = 1199.6 
       data hash MD5: 64K
       B9 80 DD C4 9D 76 E1 22 F0 A4 46 A8 82 35 FE 3E>)
(   4,<2025-08-11 14:02:14.03 +0400>,<she>,<DPX200>,
      <abs ABSG = 5 
       data hash MD5: 64K
       22 53 8B B9 DA 65 40 3F 56 F3 09 01 3B 31 D3 55>)
$$ ##END=
$$ 
$$ hash MD5
$$ 27 21 0A A5 88 49 C3 D3 68 49 B6 51 C0 AA D4 85
##$RELAX= 
##$RELAX= 
##$RELAX= 
##$RELAX= 
##$RELAX= 
##$RELAX= 
##$RELAX= 
##$RELAX= 
$$ Bruker specific parameters
$$ --------------------------
##$DU= <F:/spectra>
##$EXPNO= 2
##$NAME= <P31>
##$PROCNO= 1
##$TYPE= <nmr>
##$USER= <she>
##$AMP= (0..31)
100 100 100 100 100 100 100 100 100 100 100 100 100 100 100 100 100 100 
100 100 100 100 100 100 100 100 100 100 100 100 100 100 
##$AQSEQ= 0
##$AQ_mod= 1
##$AUNM= <au_zg>
##$AUTOPOS= <>
##$BF1= 81.014009
##$BF2= 200.13
##$BF3= 200.13
##$BF4= 200.13
##$BF5= 200.13
##$BF6= 200.13
##$BF7= 200.13
##$BF8= 200.13
##$BYTORDA= 1
##$CFDGTYP= 0
##$CFRGTYP= 5
##$CHEMSTR= <none>
##$CNST= (0..31)
1 1 145 1 1 1 1 1 1 1 1 1 1 1 1 1 1 1 1 1 1 1 1 1 1 1 1 1 1 1 1 1 
##$CPDPRG= <waltz16>
##$CPDPRG1= <>
##$CPDPRG2= <waltz16>
##$CPDPRG3= <>
##$CPDPRG4= <mlev>
##$CPDPRG5= <mlev>
##$CPDPRG6= <mlev>
##$CPDPRG7= <mlev>
##$CPDPRG8= <mlev>
##$CPDPRGB= <>
##$CPDPRGT= <>
##$D= (0..31)
0 1 0 0 0 0 0 0 0 0.06 0 0.03 2e-05 3e-06 0 0 0.0002 0 0 0 0 0 0 0 0 0 
0 0 0 0 0 0 
##$DATE= 1754906477
##$DBL= (0..7)
120 120 120 11 120 120 24 19 
##$DBP= (0..7)
150 150 150 150 150 150 150 150 
##$DBP07= 0
##$DBPNAM0= <>
##$DBPNAM1= <>
$$ [...]
##$SUBNAM3= <"">
##$SUBNAM4= <"">
##$SUBNAM5= <"">
##$SUBNAM6= <"">
##$SUBNAM7= <"">
##$SUBNAM8= <"">
##$SUBNAM9= <"">
##$SW= 400.765351723535
##$SWIBOX= (0..15)
0 1 3 0 0 0 0 0 0 0 0 0 0 0 0 0 
##$SW_h= 32467.5324675325
##$TD= 32768
##$TD0= 1
##$TE= 0
##$TE2= 300
##$TE3= 300
##$TEG= 300
##$TL= (0..7)
0 120 53 12 22 120 120 120 
##$TP= (0..7)
150 150 150 150 150 150 150 150 
##$TP07= 0
##$TPNAME0= <>
##$TPNAME1= <>
##$TPNAME2= <>
##$TPNAME3= <>
##$TPNAME4= <>
##$TPNAME5= <>
##$TPNAME6= <>
##$TPNAME7= <>
##$TPOAL= (0..7)
0.5 0.5 0.5 0.5 0.5 0.5 0.5 0.5 
##$TPOFFS= (0..7)
0 0 0 0 0 0 0 0 
##$TUNHIN= 0
##$TUNHOUT= 0
##$TUNXOUT= 0
##$USERA1= <user>
##$USERA2= <user>
##$USERA3= <user>
##$USERA4= <user>
##$USERA5= <user>
##$V9= 5
##$VALIST= <valist>
##$VCLIST= <CCCCCCCCCCCCCCC>
##$VD= 0
##$VDLIST= <DDDDDDDDDDDDDDD>
##$VPLIST= <PPPPPPPPPPPPPPP>
##$VTLIST= <TTTTTTTTTTTTTTT>
##$WBST= 1024
##$WBSW= 4
##$XGAIN= (0..3)
0 0 0 0 
##$XL= 0
##$YL= 0
##$YMAX_a= 11845
##$YMIN_a= -13161
##$ZGOPTNS= <>
##$ZL1= 120
##$ZL2= 120
##$ZL3= 120
##$ZL4= 120
##$ABSF1= 198.0616
##$ABSF2= -202.7028
##$ABSG= 5
##$ABSL= 3
##$ALPHA= 0
##$AQORDER= 0
##$ASSFAC= 0
##$ASSFACI= 0
##$ASSFACX= 0
##$ASSWID= 0
##$AUNMP= <proc_1d>
##$AZFE= 0.1
##$AZFW= 0.5
##$BCFW= 0
##$BC_mod= 2
##$BYTORDP= 0
##$COROFFS= 0
##$CY= -3
##$DATMOD= 1
##$DC= 0
##$DFILT= <>
##$DTYPP= 0
##$F1P= 0
##$F2P= 0
##$FCOR= 1
##$FTSIZE= 65536
##$FT_mod= 6
##$GAMMA= 0
##$GB= 0
##$INTBC= 1
##$INTSCL= 9.790993e-09
##$ISEN= 30
##$LB= 1.5
##$LEV0= 0
##$LPBIN= 0
##$MAXI= 10000
##$MC2= 0
##$MEAN= 0
##$ME_mod= 0
##$MI= 50
##$NCOEF= 0
##$NC_proc= -6
##$NLEV= 6
##$NOISF1= 182.463
##$NOISF2= 159.3651
##$NSP= 0
##$NTH_PI= 0
##$NZP= 0
##$OFFSET= 198.0616
##$PC= 4
##$PHC0= 1768.057
##$PHC1= 64.099
##$PH_mod= 1
##$PKNL= yes
##$PPARMOD= 0
##$PSCAL= 0
##$PSIGN= 0
##$REVERSE= no
##$SF= 81.0140089999434
##$SI= 65536
##$SIGF1= 159.3651
##$SIGF2= -187.1042
##$SINO= 113.3802
##$SIOLD= 16384
##$SREGLST= <1H.CDCl3>
##$SSB= 0
##$STSI= 65536
##$STSR= 0
##$SW_p= 32467.5324675325
##$SYMM= 0
##$S_DEV= 0
##$TDeff= 32768
##$TDoff= 0
##$TI= <>
##$TILT= no
##$TM1= 0
##$TM2= 0
##$TOPLEV= 0
##$USERP1= <user>
##$USERP2= <user>
##$USERP3= <user>
##$USERP4= <user>
##$USERP5= <user>
##$WDW= 1
##$XDIM= 65536
##$YMAX_p= 315184437
##$YMIN_p= -18909255
$$ End of Bruker specific parameters
$$ ---------------------------------
##NTUPLES= NMR SPECTRUM
##VAR_NAME=  FREQUENCY,     SPECTRUM/REAL,   SPECTRUM/IMAG
##SYMBOL=    X,             R,               I
##VAR_TYPE=  INDEPENDENT,   DEPENDENT,       DEPENDENT
##VAR_FORM=  AFFN,          ASDF,            ASDF
##VAR_DIM=   65536,         65536,           65536
##UNITS=     HZ,            ARBITRARY UNITS, ARBITRARY UNITS
##FACTOR=    0.49542278885378, 1,            1
##FIRST=     16045.7642231865, 0,            0
##LAST=      -16421.768244346, 0,            0
##MIN=       -16421.768244346, -18909255,    0
##MAX=       16045.7642231865, 315184437,    0
$$ Real data points
##PAGE= N=1
##DATA TABLE= (X++(R..R)), XYDATA
$$ [...]
42401a726281J03126J55357K88541O05523Q14104N52909K2723k87157l52085m90047
$$ -1726281 -1623155 -1467798 -1179257 -573734 240370 793279 816002 528845 176760 -313287
42391c13287o33541m03898J25171M15201K77424R1161J17783J74449J14074P9034
$$ -313287 -946828 -1350726 -1225555 -810354 -532930 -441769 -323986 -149537 -35463 43571
42381D3571J18494O2215n7771M8956L77214M83774J21127l92339o38752n62708
$$ 43571 162065 224280 166509 215465 592679 1076453 1197580 805241 166489 -396219
42371c96219l04418K5455K23695N8596l23609m26523n4039M05338N23420L08956
$$ -396219 -700637 -675182 -451487 -392891 -716500 -1143023 -1197062 -791724 -268304 40652
42361D0652j5694l13361m25104j90418J99118K78409k6916k36744m8321K40528
$$ 40652 24958 -288403 -713507 -903925 -704807 -426398 -453314 -690058 -738379 -497851
42351d97851L15986L35203M61728M43739J30132q0862J36650M01351K23957j58623
$$ -497851 -181865 153338 615066 1058805 1188937 1108075 1244725 1646076 1870033 1711410
42341A711410k44600k09332n55542j034964q53996K1292O71332N51900K01224
$$ 1711410 1466810 1257478 701936 -333028 -1187024 -1165732 -494400 57500 258724
42332B58724K52838M61767K54352k72810n33586l61698j59517k20362l74084l45260
$$ 258724 511562 973329 1227681 954871 421285 59587 -99930 -320292 -694376 -1039636
42322a039636j21216J28349K77960L01530K33314J42789Q2165L8330j2038j8758
$$ -1039636 -1160852 -1032503 -754543 -453013 -219699 -76910 5255 43585 31547 12789
42312A2789Q3696K30661K45322O2783j50930k15309k04514l06621m17227j73494
$$ 12789 96485 327146 572468 635251 484321 269012 64498 -242123 -659350 -832844
42302h32844M36037Q06601M31509l19119o18272l00414O198q8293k19403k9851
$$ -832844 -396807 409794 841303 522184 -96088 -396502 -390304 -478597 -698000 -727851
42292g27851J94217R5201q4835K1860J82328k9921l93865l28574J16773K87096
$$ -727851 -533634 -438433 -523268 -501408 -319080 -349001 -742866 -1071440 -954667 -667571
42282f67571n1480l77810k34308J92293M81350M87559K66747q1122l28245k55750
$$ -667571 -719051 -1096861 -1331169 -1138876 -657526 -169967 96780 15658 -312587 -568337
42272e68337n954O2007n9719l0282J90604K11916q5419k45257M7476M05578L03499
$$ -568337 -574291 -512284 -572003 -602285 -411681 -199765 -285184 -530441 -482965 -77387 226112
42261B26112j29325l12880k5748L66263M09539L5440m12033m91468j07085L23070
$$ 226112 96787 -216093 -241841 124422 533961 569401 157368 -334100 -441185 -118115
42251a18115L27696j571j62361k640J19650K6451K3692K65463L56593j1778m91817
$$ -118115 209581 208010 45649 43009 162659 189110 212802 478265 834858 823080 331263
42240C31263o12069m82782m51963m17875r2243L16392L52989J11889J07068L77590
$$ 331263 -280806 -763588 -1215551 -1633426 -1725669 -1409277 -1056288 -944399 -837331 -459741
42230d59741L99133j6571l74860k70892M3271J65945J57089K66008L93095K53293
$$ -459741 -60608 -77179 -452039 -722931 -679660 -513715 -356626 -90618 302477 555770
42220E55770j00809l07391j93801M7227J68744J23351m543j16975j09313O5288
$$ 555770 454961 147570 -46231 996 169740 293091 288548 171573 62260 127548
42210A27548K56425J92608j67079m70547l62159J8980K01573P6711O8549M01038
$$ 127548 383973 576581 409502 -61045 -423204 -404224 -202651 -125940 -57391 343647
42200C43647N84937R7875o83703q66393k97422K54680K93959K26284M60956O13236
$$ 343647 928584 1026459 342756 -523637 -821059 -566379 -272420 -46136 414820 1028056
42190A028056J93624m65937o93862n14237m52271n48532l48692K15014O82931
$$ 1028056 1221680 755743 61881 -452356 -904627 -1453159 -1801851 -1586837 -903906
42181i03906Q24524Q42953P65360L26872l81090p99706o73262l70467k21879r6889
$$ -903906 -79382 763571 1528931 1855803 1474713 675007 1745 -368722 -590601 -687490
42171f87490J20922K11851Q0471M040R5226M6804k34979l10449K9837K45786j25181
$$ -687490 -566568 -354717 -274246 -270206 -174980 -128176 -363155 -673604 -643767 -397981 -523162
42160e23162o10921m66576J68793N19309L34867M9469p8361j97474k59224K3876
$$ -523162 -1134083 -1600659 -1431866 -912557 -577690 -528221 -606582 -804056 -1063280 -1039404
42150a039404M87552N26361M0231k93532j8159M31718M57787J65647J7243M6401
$$ -1039404 -551852 -25491 14740 -278792 -296951 134767 592554 758201 775444 821845
42140H21845k0274j55346j23339j6624j40623m21443m40187p6398L33909N18780
$$ 821845 801571 646225 522886 506262 365639 -55804 -495991 -572389 -238480 280300
42130B80300N12437L35561p3111m77713m23735M5382K53836j44202n41751k52204
$$ 280300 792737 1128298 1055187 577474 153739 199121 452957 308755 -232996 -485200
42120d85200L90186N11633N7114j67457J75626M63234K22295r8418J1225J92661
$$ -485200 -95014 416619 473733 306276 481902 945136 1167431 1069013 1080238 1272899
42110A272899j25771o45550o18950q1284K12246L139j73316J1012J96171Q0101
$$ 1272899 1147128 501578 -117372 -198656 13590 16729 -156587 -145575 50596 130697
42100A30697r2449j01384j43075k86855j84395K42661M51456J39944j44805J01471
$$ 130697 38248 -63136 -206211 -493066 -677461 -434800 16656 156600 11795 113266
42090A13266M12630J14143m58334m58638M0033J71944k29582l62173J36596N51285
$$ 113266 525896 640039 181705 -276933 -236900 -64956 -294538 -656711 -520115 31170
42080C1170K83081k12899k64376l0477l6569k08557j00363K62640M54053L53604
$$ 31170 314251 101352 -163024 -193501 -230070 -438627 -538990 -276350 177703 531307
42070E31307J88052K1522k42129m58157l64346n2884J30113R7541L1881k34q694
$$ 531307 719359 740881 498752 40595 -323751 -376635 -246522 -148981 -117100 -117334 -126028
42059a26028J90009O67860R27161L93647o15675j091704o50953o327J24411o7952
$$ -126028 63981 731841 1659002 2052649 1436974 345270 -305683 -312010 -187599 -255551
42049b55551n6559J22544J05128p5116j07153j3970o1539j84681o0807K74691
$$ -255551 -312110 -189566 -84438 -159554 -266707 -280677 -342216 -526897 -587704 -313013
42039c13013M10971K18991N2383J53730K76223J17490j93268l18038k14376j28863
$$ -313013 97958 316949 369332 523062 799285 916775 723507 405469 191093 62230
42029F2230j69986j53347P7504L50632L33004k3696l56765l25493o3872K2384
$$ 62230 -107756 -261103 -183599 167033 500037 476341 119576 -205917 -269789 -247405
42019b47405j24357j30200J68410L85910J83448j33847o2923K79818L37108K0163
$$ -247405 -371762 -501962 -333552 52358 235806 101959 39036 318854 655962 676125
42009F76125j66251K2447K04258Q5581l1201J61440L56522J17425l44546m54552
$$ 676125 509874 532321 736579 822160 790959 952399 1308921 1426346 1081800 627248
41999F27248j68686O021j32591j89650J03179L77443J74908l18553m96528j75939
$$ 627248 458562 464583 331992 142342 245521 622964 797872 479319 -17209 -193148
41989a93148J67690P1859l03492m34822j40138K44070L75895L06102K25193Q0587
$$ -193148 -25458 46401 -257091 -691913 -832051 -587981 -212086 94016 319209 399796
41979C99796k48000n39489m05403R9328M24296K20967k34173m86099m47244k65948
$$ 399796 151796 -387693 -793096 -693768 -269472 -48505 -282678 -768777 -1216021 -1481969
41969a481969K1661L64123M74936J62377k55313k79590P7566L20460J75895j10215
$$ -1481969 -1460308 -1096185 -621249 -458872 -714185 -993775 -916209 -595749 -419854 -530069
41959e30069k26156j74865q7170K7073J74141K53329K01099J05101O8662R4639
$$ -530069 -756225 -931090 -1018260 -991187 -817046 -563717 -362618 -257517 -188855 -94216
41949i4216J53459K03205J07956k53466p17202q74296n06454J50833O67553Q16582
$$ -94216 59243 262448 370404 116938 -600264 -1474560 -1981014 -1830181 -1162628 -346046
41939c46046O53879L58025R4468n7225j25962j63797j54866r0830p7215k16417
$$ -346046 307833 665858 760326 703101 577139 413342 258476 167646 90431 -125986
41929a25986m19762m85673l24331K5825M87578Q57902Q02902K57130l01473l65025
$$ -125986 -545748 -1031421 -1355752 -1329927 -842349 15553 818455 1075585 774112 409087
41919D09087r6434o5738l40517l97678o956M06443M87586M42985M80109L22507
$$ 409087 312653 246915 -93602 -491280 -498236 -91793 395793 838778 1318887 1641394
41909A641394k50749q36920r11782n71456k68376j00474J16314L28874L58163
$$ 1641394 1390645 553725 -358057 -929513 -1197889 -1298363 -1182049 -853175 -495012
41900d95012L27133M21497M12633J6452m44957m26873j03526j45600n35913m80068
$$ -495012 -167879 253618 666251 682703 237746 -189127 -292653 -438253 -974166 -1454234
41890a454234K58172Q02804M46186k47221l06048K06608M22070N1916k96275j68210
$$ -1454234 -1196062 -393258 52928 -194293 -500341 -293733 128337 180253 -116022 -284232
41880b84232J39069K22506J88823K78295L25466L8398m20468n64626k36777K06821
$$ -284232 -145163 77343 266166 544461 869927 908325 487857 -76769 -313546 -106725
41870a06725L82068K70030O5398j08992j98756j34978M2822J07575q6075l22859
$$ -106725 275343 545373 610771 501779 303023 168045 210867 318442 232367 -90492
41860i0492k65920L8598J76458m1248k82680j72168J68859L19778J63649k847
$$ -90492 -356412 -317814 -141356 -182604 -465284 -637452 -468593 -148815 14834 11987
41850A1987O2611K38387K67711J11820m0916m6166N965r4949l58097m56199q1925
$$ 11987 74598 312985 580696 692516 651600 605434 611399 516450 158353 -297846 -379771
41839c79771N46432P89180L50642k87262m43148p1221K89602K84823R4483J7890
$$ -379771 166661 955841 1306483 1019221 576073 504852 794454 1079277 1173760 1191650
41829A191650O9089J02168P5890L8776K758n6248j57543l06641m44821m45762
$$ 1191650 1260739 1362907 1438797 1477573 1480331 1424083 1266540 959899 515078 69316
41819F9316k80018j06861n0201j581J39727J82003q1000m22030m18403r6869J12755
$$ 69316 -210702 -317563 -367764 -369345 -229618 -47615 -128615 -550645 -969048 -1065917 -953162
41808i53162Q5630J43389L67025L41511j16525m96601l00420J88952L47971J24817
$$ -953162 -867532 -724143 -357118 -15607 -132132 -628733 -929153 -740201 -392230 -267413
41798b67413m2700k4732j00327k91429k02938L04717P50636O06820m4326o47925
$$ -267413 -310113 -334845 -435172 -726601 -929539 -624822 125814 732634 688308 40383
41788D0383p82574m65380j8671K13137J26063n9925o9553N5608K5315k23695l66003
$$ 40383 -742191 -1207571 -1226242 -1013105 -887042 -946967 -1016520 -960912 -935597 -1159292 -1525295
41777a525295j40127K57535M40668L29557J33403l7027k22982l13186m8332N30001
$$ -1525295 -1665422 -1407887 -967219 -637662 -504259 -541286 -764268 -1077454 -1125786 -595785
41767e95785R21666P09845J06877k97211k46734j1277J07204J43860K43852L34397
$$ -595785 325881 1035726 1142603 845392 598658 587381 694585 838445 1082297 1416694
41757A416694K38697j4530j92738j26003J40089L93974L87440L3223m32287o24055
$$ 1416694 1655391 1640861 1448123 1322120 1462209 1856183 2243623 2276846 1844559 1220504
41747A220504m54872k33991j90180j41603J18402L55834J94928k60082n21458
$$ 1220504 765632 531641 341461 199858 318260 674094 869022 608940 87482
41738H7482l88432j13040R5089K93331M68995M13681R4793k10027l19952l64537
$$ 87482 -300950 -413990 -318901 -25570 443425 857106 951899 741872 421920 57383
41728E7383m30402l43304k0613K68659K47102l343k19737k73951j45301J51825
$$ 57383 -373019 -716323 -736936 -468277 -221175 -224518 -444255 -718206 -863507 -711682
41718g11682M28933L87948J9654l23800m06989l48125k45337R626L33638L53012
$$ -711682 -282749 105199 124853 -198947 -605936 -954061 -1199398 -1189772 -856134 -503122
41708e03122J6091j87670n471J14026j67085l61280N7189O38840N91274Q5819
$$ -503122 -487031 -674701 -680172 -566146 -733231 -1094511 -1037322 -398482 192792 278611
41698B78611l2649L26978L98205q2425m40398k33574Q2433M5521q9359k151M4906
$$ 278611 245962 572940 971145 888720 448322 214748 297181 342702 253343 251192 296098
41687B96098k22288m71582l16230k388M8349k3472J56525M49259L99692j1204
$$ 296098 73810 -397772 -714002 -716390 -668041 -691513 -534988 -85729 313963 302759
41677C02759l55875l79650j93722J0755O4150j70978n15583m51226J91651P94442
$$ 302759 -53116 -432766 -626488 -615733 -551583 -722561 -1238144 -1689370 -1497719 -703277
41667g03277P00589J46001j39395k4604K9791o2609J18271N72916O40840J9342
$$ -703277 -2688 143313 3918 -20686 9105 -53504 64767 637683 1278523 1297865
41657A297865o35188n84258j4444L19097J35013j74604k15152k1219J51270J48021
$$ 1297865 662677 78419 63975 383072 518085 343481 128329 107110 258380 406401
41647D06401N09j35226j17725J6575Q7154K0104n1658n70J30805K54899L65778
$$ 406401 406910 271684 153959 170534 257688 277792 226134 225564 356369 611268 977046
41636I77046M43995L99516K21921L6608q8422k26584l86810m23397k85942j55860
$$ 977046 1421041 1820557 2042478 2079086 1990664 1764080 1377270 953873 667931 512071
41626E12071j62135j52318M9358L19817L94339K18655n8523l13185m60756l89147
$$ 512071 349936 197618 246976 566793 961132 1179787 1121264 808079 347323 -41824
41616d1824j17060J07448J13773Q0850K27994L87970K54740m2596n5462K79245
$$ -41824 -158884 -51436 62337 143187 371181 759151 1013891 971295 915833 1195078
41606A195078M94408K73970j19316k83212j96599p6426j9563m8217k51041n81736
$$ 1195078 1689486 1963456 1844140 1560928 1364329 1287903 1268340 1220123 969082 387346
41596C87346p16453m20305P7286L46869K75330O2129j45579k96288k41377J10812
$$ 387346 -329107 -749412 -672126 -325257 -49927 12202 -133377 -429665 -671042 -560230
41586e60230M78049M31319p776l47194k87006n5707M7649Q8605K35087L56801
$$ -560230 -82181 349138 341362 -5832 -292838 -348545 -300896 -212291 22796 379597
41576C79597K16377j07106l15584l38812l77021n00341m91113j71238L20230O91475
$$ 379597 595974 488868 173284 -165528 -542549 -1042890 -1534003 -1705241 -1385011 -693536
41566f93536P97685O63562L32900j29076n20191n82733k92507M3669J11029m2600
$$ -693536 104149 767711 1100611 971535 451344 -131389 -423896 -380227 -269198 -311798
41556c11798j10617J5240J03252k3730j76907q4286J70695K50171K5679l11861
$$ -311798 -422415 -407175 -303923 -327653 -504560 -588846 -418151 -167980 -142301 -454162
41546d54162n52450o02729l61773J96245P68772R02571N48406J33073m3464j36972
$$ -454162 -1006612 -1609341 -1971114 -1774869 -1006097 -103526 444880 577953 534489 397517
41536C97517l12136l63125r4969K48570L35011K71430L49315M53072K17278l06387
$$ 397517 85381 -277744 -372713 -124143 210868 482298 831613 1284685 1501963 1195576
41526A195576o37939n50999l19696k12352j61912o7680l1950j07604j32417r536
$$ 1195576 557637 6638 -313058 -525410 -687322 -755002 -786952 -894556 -1026973 -1036509
41516a036509J25430J96186L55642O47544P76660N01314M8673j69923j24641j37889
$$ -1036509 -911079 -714893 -359251 288293 1064953 1566267 1614940 1445017 1320376 1182487
41506A182487l49896n16562l85820n5422J46841L9985k25778l35092j35708K07914
$$ 1182487 832591 316029 -69791 -125213 21628 61613 -164165 -499257 -634965 -427051
41496d27051M04328L30681O8162k74175n92038o80278l55727K35400O62209O86292
$$ -427051 -22723 307958 376120 101945 -490093 -1170371 -1526098 -1290698 -628489 57803
41486E7803N01194L74747K77232N6808k10896l04559j89292m5900k5924j41259
$$ 57803 558997 933744 1210976 1267784 1056888 752329 563037 517137 491213 349954
41476C49954l14538l85446j81905K32992N02980L72341K0391k18578l21698m60247
$$ 349954 35416 -350030 -531935 -298943 204037 576378 596769 378191 56493 -403754
41466d03754n45437l14400J23191K75511l1822l31605j57724K76268L75509k1954
$$ -403754 -949191 -1263591 -1140400 -864889 -896711 -1228316 -1386040 -1109772 -734263 -756217
41456g56217m70771n16354j79114J89319L12504J85589J1514l937J20825J36482
$$ -756217 -1226988 -1743342 -1922456 -1733137 -1420633 -1235044 -1223530 -1227467 -1106642 -970160
41446i70160j03042l57170k55404J65409M39036K74919p0271j95361r1028j9258
$$ -970160 -1073202 -1430372 -1685776 -1520367 -1081331 -806412 -876683 -1072044 -1163072 -1182330
41436a182330m9566n1873l9943j32179j91086P4509N63644P62641M49744K3618
$$ -1182330 -1231896 -1283769 -1323712 -1455891 -1646977 -1572468 -1008824 -246183 203561 227179
41426B27179j14278j03299k13876k95672j16982O8436r9699l39276m9346O46360
$$ 227179 112901 9602 -204274 -499946 -616928 -548492 -648191 -987467 -1036813 -390453
41416c90453Q98063L26722m28367o22872k92371R7001L32614L76148R7511l98428
$$ -390453 507610 834332 405965 -216907 -509278 -412277 -79663 296485 393996 -4432
41406d432n73317j41625L56479K60421j87125j94015L41407O81772L92521p7296
$$ -4432 -577749 -719374 -362895 -102474 -289599 -483614 -142207 539565 932086 854790
41396H54790j80624k3955K3212j4954Q9263K25208O8142l68020o89169o23137
$$ 854790 674166 650211 673423 658469 747732 972940 1041082 673062 -16107 -639244
41386f39244k88137M7289K44900L00421K49603J51612P4769M6020N8498J27920
$$ -639244 -927381 -880092 -635192 -334771 -85168 66444 141213 187233 245731 373651
41376C73651K67911L97705L66575J33767j40659k81392l32921m57718n92304m39735
$$ 373651 641562 1039267 1405842 1539609 1398950 1117558 784637 326919 -265385 -705120
41366g05120M1908L83364J67424k86554k59897L08844O17844R7808p39246r60523
$$ -705120 -663212 -279848 -112424 -398978 -658875 -350031 267813 365621 -373625 -1334148
41356a334148m10801K33594M29919K77201J09572P9090K22745N27234P77458O58237
$$ -1334148 -1744949 -1511355 -1081436 -804235 -694663 -615573 -392828 134406 911864 1570101
41346A570101J62016l43279n58213n31010m18236k49394o7213l0943j65565j98447
$$ 1570101 1732117 1388838 830625 299615 -118621 -368015 -435228 -466171 -631736 -830183
41336h30183J16414O07890Q35334O11984K21651O2635J60187J47306k18431o34121
$$ -830183 -713769 -105879 729455 1341439 1563090 1625725 1785912 1933218 1714787 1080666
41326A080666n69416j4484L98691J95083l21930n42912l84609k40881k81152k89343
$$ 1080666 511250 496766 895457 1090540 768610 225698 -158911 -399792 -680944 -970287
41316i70287j51563j8697N1093J66729K71292J82025K6146J52160M93943N39231
$$ -970287 -1121850 -1140547 -1089454 -922725 -651433 -469408 -443262 -291102 202841 742072
41306G42072J18784k94259l29425k36776l14767l33855Q30M33129N32697L65543
$$ 742072 860856 566597 237172 396 -314371 -648226 -647396 -214267 318430 683973
41296F83973K47363J05802l04445p26546n97576P9957O32383N70167Q8196l72183
$$ 683973 931336 1037138 732693 6147 -591429 -511472 120911 691078 779274 407091
41286D07091o18133o28223l80205L3949L76876M99732M25075J71946k33250n36253
$$ 407091 -211042 -839265 -1219470 -1185521 -808645 -308913 116162 288108 54858 -481395
41276d81395l81336J98073O78464O00496M5813n29598p34570m48399J49145O23997
$$ -481395 -862731 -664658 13806 614302 660115 130517 -604053 -1052452 -903307 -279310
41266b79310O12361K62642J26071M27036O86525L40523m50423r48569p39122j60841
$$ -279310 333051 595693 721764 1148800 1835325 2175848 1725425 776856 37734 -123107
41256a23107K03709J83034K7736k1281L7234Q7939N2954r0881k99769m20866k95007
$$ -123107 80602 263636 291372 270091 307325 395264 448218 357337 57568 -363298 -658305
41245f58305Q481J72293j5553l60535m75961k57928L8629J83431K08535K27109
$$ -658305 -649824 -477531 -493084 -853619 -1329580 -1587508 -1548879 -1365448 -1156913 -929804
41235i29804K54200L02255M24434N35097M22826J06368p5833M3963J48566p0680
$$ -929804 -675604 -373349 51085 586182 1009008 1115376 1039543 1083506 1232072 1161392
41225A161392l54383k51347J04880J48006j88083k87874J77217O42971M39299
$$ 1161392 807009 555662 660542 808548 620465 332591 509808 1152779 1592078
41216A592078j96475m49332j11525J65870r9335m95643l77032J23820K86008q2573
$$ 1592078 1395603 946271 834746 1000616 901281 405638 28606 152426 438434 355861
41206C55861l20144O9221N84486M20779l02215o71873l13476J29172Q0260r5962
$$ 355861 35717 104938 689424 1110203 807988 136115 -177361 -48189 32071 -63891
41196f3891J70525N93716M55395j75216m69638j01758K82429P9238m30872o16020
$$ -63891 106634 700350 1155745 980529 510891 409133 691562 770800 339928 -276092
41186b76092l73037m5070J90968L96674N27169M29773J22452k09592m29632m67436
$$ -276092 -649129 -694199 -503231 -106557 420612 850385 972837 763245 333613 -133823
41176a33823k71416K9698R4870k04485m71165k34008L75145P60875O48460L39069
$$ -133823 -405239 -375541 -280671 -485156 -956321 -1190329 -815184 -54309 594151 933220
41166I33220J42362k3106k89996m85182m16406k51787k56547l18175j35216J92190
$$ 933220 1075582 1052476 762480 277298 -139108 -390895 -647442 -965617 -1100833 -908643
41156i08643K27526n7835r1693M43689R62135O81949k16162p34666l83539K34878
$$ -908643 -681117 -738952 -830645 -386956 575179 1257128 1040966 306300 -77239 157639
41146A57639L70553Q9838j05107j46350k98964m69357k98293J07169J96281j51911
$$ 157639 528192 618030 512923 366573 67609 -401748 -700041 -592872 -396591 -548502
41136e48502l80170j32460J51780p3497n62954n74508R2515Q10708R10977M51733
$$ -548502 -928672 -1061132 -909352 -982849 -1545803 -2120311 -2027796 -1217088 -306111 145622
41126A45622P8570K31755O13869N43247j32088p02515m74359K00719L15133l51602
$$ 145622 224192 455947 1069816 1613063 1480975 778460 304101 504820 819953 468351
41116D68351q51668m37428L43014M99618M5762j99935J806K6298m48428q26990
$$ 468351 -383317 -820745 -477731 21887 67649 -132286 -130480 -104182 -552610 -1379600
41106a379600n05374K08623N56298L50195P7094J52545M54748N72138K83306k15222
$$ -1379600 -1884974 -1676351 -1120053 -769858 -692764 -540219 -85471 486667 769973 554751
41096E54751m73715k43076K14065M06380K12937k4848m5736m14j06322k77282
$$ 554751 81036 -162040 52025 458405 671342 646494 600758 600344 494022 216740
41086B16740l30420l17677l74369m16969k78709k2977J47763J97853K20673J97283
$$ 216740 -113680 -431357 -805726 -1222695 -1501404 -1524381 -1376618 -1178765 -958092 -760809
41076g60809O6293m6934L6242K31149K92250J89625P9683m9767l23317n60323
$$ -760809 -694516 -741450 -705208 -474059 -181809 7816 87499 37732 -285585 -845908
41066h45908l77317J46654L80435J4637l96084k06875L21664L83435j52415n32977
$$ -845908 -1223225 -1076571 -696136 -681499 -1077583 -1284458 -962794 -579359 -731774 -1264751
41056a264751k38180K98144L97154R1598q7334J4314M8548j67681l72455l32050
$$ -1264751 -1502931 -1204787 -807633 -716035 -803369 -789055 -740507 -908188 -1280643 -1612693
41046a612693j77019r0221J1504K57522N34563O60688O54554N88205L58420r5064
$$ -1612693 -1789712 -1879933 -1868429 -1610907 -1076344 -415656 238898 827103 1185523 1090459
41036A090459m83172m36459l7307K59516K37415R8304O53j75295m53365n46607
$$ 1090459 607287 170828 133521 393037 630452 728756 729409 554114 100749 -445858
41026d45858k79607Q1422K11130J71079J61069R7827j52228l38072j19260L08393
$$ -445858 -725465 -644043 -432913 -261834 -100765 -2938 -155166 -493238 -612498 -304105
41016c04105M07249J12035q6899M2115J34561p5515k58937o2390K45602J67517
$$ -304105 103144 215179 128280 170395 304956 229441 -29496 -91886 153716 321233
41006C21233k49494n03630l60612n6937J50539K47069K74302K17177J23732R3574
$$ 321233 71739 -431891 -792503 -849440 -698901 -451832 -177530 39647 163379 256953
40996B56953J15737J00286M9577K5293L697n8270r9112p7336r3053j79379j47682
$$ 256953 372690 472976 522553 547846 551543 493273 394161 316825 223772 44393 -103289
40985a03289R1975K59578J10798p8027J17773N49165O64510L43166m218j75090
$$ -103289 -11314 248264 359062 281035 398808 947973 1612483 1955649 1951431 1776341
40975A776341l94114o77322o32427j71210J71048J6010k55774j30315K27782K95929
$$ 1776341 1382227 704905 72478 -98732 72316 88326 -167448 -297763 -69981 225948
40965B25948L0335j42458j8902J57819J24700q3867k33492j16386K40290M97833
$$ 225948 256283 113825 94923 252742 377442 293575 60083 -56303 183987 681820
40955F81820L33428q1449k39858l2328J03574o7098k01462m4898R5641k8218q2312
$$ 681820 1015248 933799 693941 661613 765187 698089 496627 451729 547370 519152 436840
40944D36840J93952L51649m6077n34846m03981J08462J71866l03299o12012m38645
$$ 436840 630792 982441 936364 401518 -2463 105999 277865 -25434 -637446 -1076091
40934a076091j77075p0870O3615J84434j5885l65012l00990J18961J92195k19297
$$ -1076091 -1253166 -1324036 -1260421 -1075987 -1091872 -1456884 -1757874 -1638913 -1446718 -1666015
40924a666015l86903M2340M49165L52915J98525M30610O27858K91684k09846k60456
$$ -1666015 -2052918 -2010578 -1561413 -1208498 -1009973 -579363 48495 340179 130333 -130123
40914a30123K6888K01490K96336M85606M43990j01269o11101m17436J70925L35739
$$ -130123 -103235 98255 394591 880197 1324187 1222918 611817 194381 365306 701045
40904G01045L6696j02130K3051o6334l74970l41699Q6547K52091j00261l82287
$$ 701045 737741 635611 658662 592328 217358 -124341 -37794 214297 114036 -268251
40894b68251j71447J31187Q0101p2127P2556L25726L06173J49274K21119L76903
$$ -268251 -439698 -308511 -228410 -300537 -227981 97745 403918 553192 774311 1151214
40884A151214J10613n97680j094806q57946j70848K25131M1682k34196k3989N21200
$$ 1151214 1261827 664147 -430659 -1288605 -1459453 -1234322 -1192640 -1426836 -1450825 -929625
40874i29625O94725K26601l17993l49057m8985M1016j07766r8672J38983K90842
$$ -929625 -234900 -8299 -326292 -675349 -724334 -683318 -791084 -889756 -750773 -459931
40864d59931K68085K73358K67866n897m03390m19911k1240J85461j30175n05823
$$ -459931 -191846 81512 349378 343481 -59909 -479820 -501060 -315599 -445774 -951597
40854i51597m19149j9066K59945L52879M00434L31083Q9355l3653J98926M70241
$$ -951597 -1370746 -1389812 -1129867 -776988 -376554 -45471 43884 10231 209157 679398
40844F79398L12735j55581m07998l27142l11399n34741o17796k33185L48141N99449
$$ 679398 992133 836552 428554 101412 -209987 -744728 -1362524 -1595709 -1247568 -648119
40834f48119M03310Q8950q7744k07076l86245m66138k05546K91502N83244L94375
$$ -648119 -244809 -155859 -243603 -450679 -836924 -1303062 -1508608 -1217106 -633862 -239487
40824b39487o1425l65332l40849r8046J80259L10392J48691j96363l49784j29489
$$ -239487 -300912 -666244 -1007093 -1105139 -924880 -614488 -465797 -662160 -1011944 -1141433
40814a141433J54083J63924Q5695K80474N74968M71201J0498k03328O3988L39058
$$ -1141433 -987350 -823426 -737731 -457257 117711 588912 599410 396082 460070 799128
40804G99128K37385J7647L7253J59867P3929j93101m22926n31578m63309j22089
$$ 799128 1036513 1054160 1091413 1251280 1325209 1132108 709182 177604 -285705 -407794
40794d07794L16119M16982J04205j59512j07473q4460l40759m70488j08696L20374
$$ -407794 -91675 325307 429512 270000 162527 78067 -262692 -733180 -841876 -521502
40784e21502K39458j06644q6200K12121J61696k61326l98877J908M33199M86490
$$ -521502 -282044 -388688 -474888 -262767 -101071 -362397 -761274 -759366 -326167 160323
40774A60323L38393K04587k741k48529k51436m8050p1452l81204m26042P0575
$$ 160323 498716 703303 700562 452033 200597 152547 81095 -300109 -726151 -655576
40764f55576N79170N58167K44293J38073J70872j5903l15486l31982j10472o3241
$$ -655576 -76406 481761 726054 864127 1034999 1019096 703610 371628 261156 197915
40754A97915k45175k75769k245K53180J90713j10788m10117n48984m31437p3033
$$ 197915 -47260 -323029 -325274 -72094 118619 7831 -402286 -951270 -1382707 -1455740
40744a455740K70401L09987J16714M5199K29315M28548M21716K70829J23586K2860
$$ -1455740 -1185339 -875352 -758638 -713439 -484124 -55576 366140 636969 760555 783415
40734G83415r724M1057M9162j25467l12744j70524K36103L71462k7965m97529
$$ 783415 773691 814748 863910 738443 425699 255175 491278 862740 834775 337246
40724C37246m57326j2096K44242N7658k40870k53640N5090M28807N49188K36547
$$ 337246 -120080 -132176 112066 169724 -71146 -324786 -269696 159111 708299 944846
40714I44846l27509o37700l87749J14934L32585J91111M5055M7380R018j07531
$$ 944846 617337 -20363 -408112 -293178 39407 230518 275573 322953 331971 224440
40704B24440n0141K33318M13004K79954L8908j00972k25580l64500k60086J73794
$$ 224440 174299 407617 820621 1100575 1139483 1038511 812931 448431 188345 362139
40694C62139N25146M08298K5880j83185j86395k25854k84831j60644Q1147J77541
$$ 362139 887285 1295583 1321463 1138278 951883 726029 441198 280554 361701 539242
40684E39242R1897k8969j85993m02925m33423q6403K68615O8719n85359r66692
$$ 539242 631139 602170 416177 13252 -420171 -506574 -237959 -169240 -754599 -1721291
40674a721291o64987j5604M66554O13483M91538K19521O739j5314m5198l07035
$$ -1721291 -2386278 -2401882 -1935328 -1321845 -830307 -610786 -604047 -619361 -664559 -971594
40664i71594n41166l09706K19309M16759J74620N4980L06922M69790K36656j9931
$$ -971594 -1512760 -1822466 -1603157 -1186398 -1011778 -956798 -649876 -180086 56570 36639
40654C6639J3020K2481k45333l73077L0580N49751N56512J77511j0850Q8062J52875
$$ 36639 49659 72140 -173193 -546270 -515690 34061 590573 768084 757234 845296 998171
40643I98171J52027K72374L31367j6803n67564p28320l85011j1198Q8667P5917
$$ 998171 1150198 1422572 1753939 1737136 1169572 441252 56241 45043 133710 209627
40633B09627R7443O4545k0571j8809l846j86160m32098l45338Q2921L81859K79806
$$ 209627 307070 371615 351044 332235 328389 142229 -289869 -635207 -552286 -170427 109379
40622A09379K4337j06544j57402j87364n9191K16375L09772L1279l38748m45969
$$ 109379 133716 27172 -130230 -317594 -376785 -160410 149362 180641 -158107 -604076
40612f04076l27186k13964j12333J08478L60109L86819J37359j54358k67301j95943
$$ -604076 -931262 -1145226 -1257559 -1149081 -788972 -402153 -264794 -419152 -686453 -882396
40602h82396l7705J60480L62063M48591L05240P892j96177j74733q1832j19455
$$ -882396 -920101 -759621 -397558 51033 356273 364165 167988 -6745 -88577 -208032
40592b08032k20717j60381P7235K71314K80432J44305q9711l44779l65025K3755
$$ -208032 -428749 -589130 -511895 -240581 39851 184156 94445 -250334 -615359 -591604
40582e91604M98146N22569R5721k70677l60623m36367n11695k05034L96671N49032
$$ -591604 -93458 429111 524832 254155 -106468 -542835 -1054530 -1259564 -862893 -313861
40572c13861R143m14627j04933L54552K13065j47092M0635M81418L11552l36676
$$ -313861 -304718 -719345 -824278 -469726 -256661 -403753 -363118 118300 429852 93176
40562I3176n09974k9447K93921N7890k40758k32735j53651j30317L6214K03025
$$ 93176 -416798 -446245 -152324 -94434 -335192 -567927 -721578 -851895 -815681 -612656
40552f12656m3652m70673l23300M13017Q56998N98497K25926J77189R1309k77968
$$ -612656 -656308 -1126981 -1450281 -1037264 -180266 418231 644157 821346 912655 634687
40542F34687m99160l11362j17716j46794l8087K61260J81789l29652m05885L10659
$$ 634687 135527 -175835 -293551 -440345 -478432 -217172 -35383 -365035 -770920 -460261
40532d60261Q70865M79844k33168l47968j25728k79753o03131m97858j91296k20567
$$ -460261 410604 890448 657280 309312 183584 -96169 -699300 -1197158 -1388454 -1609021
40522a609021k84495J56196O36011L39052l84238m84505N1598K73123m7637j38646
$$ -1609021 -1893516 -1737320 -1101309 -762257 -1146495 -1631000 -1579402 -1306279 -1353916 -1492562
40512a492562L19300P30716P30552O25363N02231K7777o16820p01204j70619J28991
$$ -1492562 -1173262 -442546 288006 913369 1415600 1443377 826557 125353 -45266 83725
40502H3725j91892m88257k58955R5847J81135K99723O43197O89654J13796m69543
$$ 83725 -108167 -596424 -855379 -759532 -578397 -278674 364523 1054177 1167973 698430
40492F98430m14366l7859M1733m9010J19174K99916l6817o32711o86817r7184
$$ 698430 284064 246205 287938 238928 358102 658018 621201 -11510 -698327 -795511
40482g95511L61817J80628k49756l22722j019L32513M42966L97314L40537L23815
$$ -795511 -433694 -253066 -502822 -825544 -826563 -494050 -51084 346230 686767 1010582
40472A010582K98424J79632p8263m38517p70998q56167n12995J21402N47206M04735
$$ 1010582 1309006 1488638 1410375 971858 200860 -655307 -1168302 -1046900 -499694 -94959
40462i4959k8275j68737N7826J53887j17513l23775m9519M28943N49185K59928
$$ -94959 -123234 -291971 -234145 -80258 -197771 -521546 -571065 -142122 407063 666991
40452F66991j7225o5146p9076k21405l46911k76923j01872n6755j94599l11237
$$ 666991 649766 584620 505544 284139 -62772 -339695 -441567 -498322 -692921 -1004158
40442a004158k04726N8681K17106J44805j7928j17427j83739k40049j38794J63281
$$ -1004158 -1208884 -1150203 -933097 -788292 -806220 -923647 -1107386 -1347435 -1486229 -1322948
40432a322948L77936K76321J21078K73337N20948L53443j49054l49988o8575J20793
$$ -1322948 -945012 -668691 -547613 -274276 246672 600115 451061 101073 32498 153291
40422A53291j60641n07723m64073k25421j27612l125L41607N06988J17611l01112
$$ 153291 -7350 -515073 -979146 -1204567 -1332179 -1335304 -993697 -486709 -369098 -670210
40412f70210N0795Q90714J062019K03852o83992o74032j12325J39555O588J6624
$$ -670210 -619415 271299 1333318 1537170 853178 179146 66821 206376 212964 229588
40402B29588K29438J98435r8175j12477L13993N53981J33417m85648n79210k32685
$$ 229588 459026 657461 559286 446809 760802 1314783 1448200 962552 383342 150657
40392A50657j13182l67630m43920n1194L62554L31789K7199j50539j77362j99462
$$ 150657 37475 -330155 -774075 -825269 -462715 -130926 -103727 -254266 -431628 -631090
40382f31090j09268J79620L29397J1171m35727l69962J80805N06648K40868j57965
$$ -631090 -740358 -560738 -231341 -220170 -655897 -1025859 -845054 -338406 -97538 -255503
40372b55503j35228K22489M53151L74643J76074O4489O3898N3637j19940m53292
$$ -255503 -390731 -168242 284909 659552 835626 900115 964013 1017650 897710 444418
40362D44418o67270m64286N3662M32818L84679N1967k64652m02788l25637q2254
$$ 444418 -222852 -687138 -633476 -200658 184021 235988 -28664 -431452 -757089 -839343
40352h39343J40725J61329N7308N6703J59698J47248r263p1947N7567J77886J30063
$$ -839343 -698618 -537289 -479981 -423278 -263580 -116332 -125595 -197542 -139975 37911 167974
40341A67974j2176j84897m23619n91604l95007J31239M90937L23749j38402m37474
$$ 167974 155798 -29099 -452718 -1044322 -1439329 -1308090 -817153 -493404 -631806 -1069280
40331a069280m43932l01374p2958K48576N23570N36470K46919j70622m78933n18019
$$ -1069280 -1513212 -1814586 -1887544 -1638968 -1115398 -578928 -332009 -502631 -981564 -1499583
40321a499583l18311j07001n7597n4749R6343L05837L46671K84284L43372L83729
$$ -1499583 -1817894 -1924895 -1982492 -2037241 -1940898 -1635061 -1288390 -1004106 -660734 -277005
40311b77005M1706n28701o51581r5636N21092O24705M49652M72941N69277L15893
$$ -277005 -235299 -764000 -1415581 -1511217 -990125 -365420 84232 557173 1126450 1442343
40301A442343j67372l14139L4145L85004K52349k85699p46715p60168l97514o7557
$$ 1442343 1274971 960832 994977 1379981 1632330 1346631 599916 -160252 -557766 -625323
40291f25323m0784j20194J7065K43263J53839j85210k19740J95575M73105J83060
$$ -625323 -666107 -786301 -769236 -525973 -372134 -557344 -777084 -581509 -108404 74656
40281G4656k91598m13649k83850k56382k20584J23877O04571P89723O21008L06024
$$ 74656 -216942 -630591 -914441 -1170823 -1391407 -1267530 -662959 126764 747772 1053796
40271A053796j38636o75348q70729l85420L62467O67156M99294L53204L13660
$$ 1053796 915160 239812 -630917 -1016337 -653870 13286 512580 865784 1179444
40262A179444L2076m35187n68929k60634j0468q2019j39569L7684J23808j38637
$$ 1179444 1211520 776333 207404 -53230 -63698 -145717 -285286 -247602 -123794 -262431
40252b62431m33669l72072q3726P2147P0704J24480K40534K12592m4584l83031
$$ -262431 -696100 -1068172 -1151898 -1079751 -1009047 -884567 -644033 -431441 -476025 -859056
40242h59056n94508n83236m19199k41307n0446K94517P35161Q78585N11935N4405
$$ -859056 -1453564 -2036800 -2455999 -2697306 -2747752 -2453235 -1718074 -839489 -327554 -273149
40232b73149M6234L14397K11077l30867o31428l13568J31723J70899L3019J79737
$$ -273149 -226915 87482 298559 -32308 -663736 -977304 -845581 -674682 -641663 -461926
40222d61926M20481K15505l43913n39152o1191N14173N01301m2782n21282n80231
$$ -461926 -41445 174060 -169853 -709005 -770196 -256023 245278 202496 -318786 -899017
40212h99017l52841o5824K18409M40033M63918L16949K41925L14631K50234j37824
$$ -899017 -1251858 -1317682 -1099273 -659240 -195322 121627 363552 678183 928417 790593
40202G90593n20746m77982j59301m5342j53148n7151K93017M25677J63758p5195
$$ 790593 269847 -208135 -367436 -412778 -565926 -623077 -330060 95617 259375 184180
40192A84180n3587j11021m10772m74977l62M91432M55499K04637K63800L78334
$$ 184180 130593 19572 -391200 -866177 -866539 -375107 80392 285029 548829 927163
40182I27163L1388m74069m24399P9390L04194J44418J75138M76616M58018j2165
$$ 927163 958551 484482 60083 139473 443667 588085 763223 1239839 1697857 1685692
40172A685692l06551j30432J0941k30188m75877m01038k83521l42520k76535N7132
$$ 1685692 1379141 1248709 1259650 1029462 553585 152547 -130974 -473494 -750029 -692897
40162f92897K07407q6221l20239l4250L78298L15491m4741q3179K67268N21056
$$ -692897 -485490 -571711 -891950 -926200 -547902 -232411 -277152 -360331 -93063 427993
40152D27993M22943J63332m4978j33954n3748J29284J52325r7022l42198l24771
$$ 427993 850936 1014268 969290 835336 781588 910872 1063197 966175 623977 299206
40142B99206j96145j77129j25953J50056M27536L78932J43801J04815K38324J83111
$$ 299206 103061 -74068 -200021 -49965 377571 756503 900304 1005119 1243443 1426554
40132A426554j10039k83062j57284L841p3671k94722l82549k41313j0126J37355
$$ 1426554 1316515 1033453 876169 880010 806339 511617 129068 -112245 -122371 14984
40122A4984J62508J46207J21329m781k43902l34547k6033M47633N21107L3506
$$ 14984 177492 323699 445028 440247 196345 -138202 -164235 283398 804505 838011
40112H38011n25012o70485m93604l40326k54508p3081J55843K20416J04469n609
$$ 838011 312999 -357486 -851090 -1191416 -1445924 -1519005 -1363162 -1142746 -1038277 -1043886
40102a043886k0011r062J27R0154L04924N45199O24475M22472L7350k48351k48848
$$ -1043886 -1063897 -1072959 -1072832 -982678 -677754 -132555 491920 914392 951742 703391 454543
40091D54543n1366J92584M60685O26754L21167n31032j251122j091516k95906
$$ 454543 403177 595761 1056446 1683200 2004367 1473335 222213 -869303 -1165209
40082a165209J91707P1979k5671K63831M27833L9888m49660m56383j75208j23561
$$ -1165209 -973502 -901523 -927194 -663363 -235530 -195642 -645302 -1101685 -1276893 -1400454
40072a400454k58039j90857P9624K68855L49908M42564M26351J91698J0837J24835
$$ -1400454 -1658493 -1849350 -1769726 -1500871 -1150963 -708399 -282048 -90350 -79513 45322
40062D5322K18668j23194o41753o71444p9931N76280P78441N11142R1481j06312
$$ 45322 263990 140796 -500957 -1172401 -1252332 -676052 102389 613531 705012 598700
40052E98700J05984M41495L16648l46186q19035n10512J42813K90238j30098m61162
$$ 598700 704684 1146179 1462827 1116641 297606 -212906 -70093 220145 90047 -371115
40042c71115l89107k11498j18278P4164L97748N66342M80348L95000M46909M38800
$$ -371115 -760222 -971720 -1089998 -1015834 -618086 -51744 428604 823604 1270513 1709313
40032A709313K14919j10906l79642n24009m73672k45950r4537k23825m19815l35013
$$ 1709313 1924232 1813326 1433684 909675 436003 190053 95516 -128309 -548124 -883137
40022h83137m4782J07108J16707K64141M92027M06643k6448l27241j99349Q6241
$$ -883137 -927919 -820811 -704104 -439963 52064 458707 432259 105018 -94331 -8090
40012h090J85298J21191J7860j91540m91397n46815j06790N15384O97721K39401
$$ -8090 177208 298399 316259 124719 -366678 -913493 -1020283 -504899 192822 432223
40002D32223l76745n10938n4438M94195O19458L22441l2810k45352l82279m49888
$$ 432223 55478 -455460 -509898 -15703 603755 926196 893386 648034 265755 -184133
39992a84133l56145k32051l44548n61688l87365K42524O93868M95042j250k12784
$$ -184133 -540278 -772329 -1116877 -1678565 -2065930 -1823406 -1129538 -634496 -635746 -848530
39982h48530j42705j39754k43324k74299k47164k05824K7433M70692P10140M96598
$$ -848530 -991235 -1130989 -1374313 -1648612 -1895776 -2101600 -2074167 -1603475 -893335 -396737
39972c96737K20109K70402L74528J70202n4234Q1989K33906p7692m78966l11457
$$ -396737 -176628 93774 468302 638504 584270 666259 900165 822473 343507 32050
39962C2050J44272P1950m61186o03009j67131J40705J5060l2651K53685M21305
$$ 32050 176322 248272 -212914 -815923 -983054 -842349 -827289 -859940 -606255 -184950
39952a84950K20426L9751J10095J18326p9013j61581m4412p3172k65487j88783
$$ -184950 35476 75227 185322 303648 224635 63054 18642 -54530 -320017 -508800
39942e08800J48575J83948j14285k5283O18262Q97142K04584p13057q57575l73640
$$ -508800 -360225 -176277 -290562 -315845 302417 1199559 1404143 691086 -166489 -540129
39932e40129n6638r4059j22913o8799j17874j66176n931J68359L9895k43504k75976
$$ -540129 -596767 -690826 -813739 -882538 -1000412 -1166588 -1172519 -1004160 -964265 -1207769 -1483745
39921a483745q792K62379L40615K29039J9170o0560K14256O44967P08889L03875
$$ -1483745 -1492537 -1230158 -889543 -660504 -641334 -701894 -487638 157329 866218 1170093
39911A170093n7331m2729M2912q9655j96750o1490P042k43544m45077k06852J67509
$$ 1170093 1112762 1070033 1112945 1023290 826540 765050 772092 528548 83471 -123381 44128
39900D4128J64506j16644k36562j89970k81880m63138l97467o7447K00909K46301
$$ 44128 208634 91990 -144572 -334542 -616422 -1079560 -1477027 -1544474 -1343565 -1097264
39890a097264K06821K27327L31240M67454M81619K43118n3737l8923K25738K12583
$$ -1097264 -890443 -663116 -331876 135578 617197 860315 806578 767655 993393 1205976
39880A205976k80609p75728q18297n41454k32557J17660M74388N31443K44699
$$ 1205976 925367 149639 -668658 -1210112 -1442669 -1325009 -850621 -319178 -74479
39871g4479M3698Q9759o0083n55644p12788m8897P62890P89629K11175o0465K10788
$$ -74479 -30781 58978 -1105 -556749 -1269537 -1318434 -555544 234085 445260 384795 595583
39860E95583M17407J49218l73808p95850r08577n77887M2446M09431K33080l3090
$$ 595583 1012990 1162208 788400 -7450 -916027 -1493914 -1451468 -1042037 -808957 -842047
39850h42047J30807M88261N04334K45381J10116J5444l38050o55866l77620L19392
$$ -842047 -711240 -222979 281355 526736 636852 652296 314246 -341620 -719240 -399848
39840c99848O76502M50512Q5622j41902l64623n31299l68169m555Q3037j48769
$$ -399848 276654 727166 812788 670886 306263 -225036 -593205 -597760 -514723 -663492
39830f63492k39845k4442J30806p175k15257k61760j55479J05894N20840P97709
$$ -663492 -903337 -927779 -796973 -804148 -1019405 -1281165 -1436644 -1330750 -809910 -12201
39820a2201O11448J58025o9017k7110q8272l01238l34521j76797k16326n03534
$$ -12201 599247 757272 688255 661145 572873 271635 -62886 -239683 -456009 -959543
39810i59543n77575k17426K07487L50993L42480M00845M49106L49553J58449m3966
$$ -959543 -1537118 -1754544 -1547057 -1196064 -853584 -452739 -3633 345920 504369 460403
39800D60403k64148m06746k88755L5138K37717J23391j33831k11346L6855M33460
$$ 460403 196255 -210491 -499246 -464108 -226391 -103000 -236831 -448177 -411322 22138
39790B2138N67507K05583l01385l48748N6270K48862m1820k46924J2151K04461
$$ 22138 589645 795228 493843 145095 201365 450227 408407 161483 173634 378095
39780C78095j13843l41055J66091P69282M26415n37302q60506l27237Q6061L0444
$$ 378095 264252 -76803 89288 858570 1284985 747683 -112823 -440060 -353999 -323555
39770c23555K62446J002687J251704L81134p54412j053976o16131k14821r8818
$$ -323555 -61109 941578 2193282 2574416 1820004 766028 149897 -64924 -163742
39761a63742o4350j08324k73321k94782l1445J46698n2799k64567k2598M52913
$$ -163742 -228092 -336416 -609737 -904519 -935964 -789266 -842065 -1106632 -1129230 -676317
39751f76317N86897L11496O2635O6867J06243m0805k73110l26438j01703J88848
$$ -676317 -89420 222076 284711 351578 457821 417016 143906 -182532 -284235 -95387
39741i5387K15763n1023k38682q2831J33226j1604l88818m91639j95981J44679
$$ -95387 120376 69353 -169329 -252160 -118934 -130538 -519356 -1010995 -1206976 -1062297
39731a062297L16784M37197N27680M29378J93271O3300K1559j72202m56236m75404
$$ -1062297 -745513 -308316 219364 648742 842013 905313 926872 754670 298434 -176970
39721a76970j65026J40001K20402J64555N6245r1133j37224Q367J14982j3694
$$ -176970 -341996 -201995 18407 182962 239207 148074 10850 19217 134199 120505
39711A20505j07835J18783L43827J08698l28040l46432K5493K29125J10978n8570
$$ 120505 12670 131453 475280 583978 255938 -90494 -65001 164124 275102 216532
39701B16532k77692o43411p28657j26381N82214M89724j62619l42487O5419K14406
$$ 216532 -61160 -704571 -1433228 -1559609 -977395 -487671 -650290 -992777 -927358 -712952
39691g12952o5907k5309M42439M61927k17465o59372k75268L44521O19537P52640
$$ -712952 -778859 -804168 -361729 100198 -117267 -776639 -1051907 -707386 -87849 664791
39681F64791Q27392M18635l29495n08381O0448L96005M2954j48495L55123P55593
$$ 664791 1492183 1910818 1581323 1072942 1133390 1529395 1572349 1423854 1778977 2534570
39671B534570M14925J4719J98998L28622k61270r11076p63614k25096q3242j16695
$$ 2534570 2949495 2964214 3163212 3491834 3230564 2319488 1555874 1330778 1247536 1130841
39661A130841J71775L31695k07935q54308p13650r4404J17681j4964J43259M30240
$$ 1130841 1302616 1634311 1426376 572068 -141582 -235986 -118305 -133269 9990 440230
39651D40230K04547l19880k98345L69106R25509Q78012M03708j48046m68084l17271
$$ 440230 644777 324897 26552 395658 1321167 2199179 2602887 2454841 1986757 1669486
39641A669486P2521P1662l80113n39504j16488J09536l66909p72296k99415N29924
$$ 1669486 1742007 1813669 1433556 894052 777564 887100 520191 -252105 -551520 -21596
39631b1596P58922M62884K92102K65722M0530k51222l47202m06822m65579j26260
$$ -21596 737326 1200210 1492312 1758034 1798564 1547342 1200140 793318 327739 201479
39621B01479N09011N90688m5561l55934J68169N60262J59296j51363L07716N71124
$$ 201479 710490 1301178 1255617 899683 1067852 1628114 1787410 1636047 1943763 2514887
39611B514887k02283j011232o95146P3830J85370O7025M67689P04371O1543m84626
$$ 2514887 2312604 1301372 606226 680056 865426 932451 1400140 2104511 2166054 1681428
39601A681428K8624N85939O2958n15494R0752Q20671L22921k43286O83726J901226
$$ 1681428 1710052 2295991 2358949 1843455 1934207 2754878 3077799 2834513 3518239 5419465
39591E419465J611434J019921K164335L845565L730215K865050L653649N006289
$$ 5419465 7030899 8050820 10215155 14060720 17790935 20655985 24309634 29315923
39583B9315923M594087M302037P544201J2840556J7351244K5085781M1013695
$$ 29315923 33910010 38212047 45756248 58596804 75948048 101033829 142047524
39576A42047524N5619671M7999162J1871050l0651183n0997494m4346045k8817850
$$ 142047524 197667195 245666357 257537407 226886224 175888730 131542685 102724835
39569A02724835j9649878j5923391j1602532p116732n587106n875228n120420
$$ 102724835 83074957 67151566 55549034 48432302 42845196 36969968 31849548
39562C1849548l755246l604929m004874l301789j985728j479750j541607j177447
$$ 31849548 28094302 24489373 20484499 17182710 15196982 13717232 12175625 10998178
39554A0998178o72126p55189j005359p50485m36139o55574q54983l33317L76065
$$ 10998178 10326052 9570863 8565504 7815019 7378880 6723306 5868323 5535006 5911071
39545E911071L47442k58696o30394n90396n14664m89214l51546j66897n0832J04546
$$ 5911071 6258513 5999817 5369423 4779027 4264363 3775149 3423603 3256706 3205874 3310420
39535C310420K81278J43731m08955r18386r44152n90078j90904J36654L83246
$$ 3310420 3591698 3735429 3326474 2408088 1463936 873858 682954 819608 1202854
39526A202854M52748L35207K11839J96977J71450K755k11263k29380J6829K34943
$$ 1202854 1655602 1990809 2202648 2399625 2571075 2573830 2362567 2133187 2150016 2384959
39516B384959N1608m02679m79570P2718N50549K56665l52351l43062J95466M31153
$$ 2384959 2436567 2033888 1554318 1627036 2177585 2434250 2081899 1738837 1934303 2365456
39506B365456L21547N26166R00846O32770n5019l5105O57303P11754j16541m89269
$$ 2365456 2687003 3213169 4114015 4746785 4691766 4656661 5313964 6025718 5909177 5419908
39496E419908J45493O85067N46527O11133J240875J560896J516020K249872L622420
$$ 5419908 5565401 6250468 6796995 7408128 8649003 10209899 11725919 13975791 17598211
39487A7598211M026914L491625L845722M999536M971187M676217P777858J4213203
$$ 17598211 21625125 25116750 28962472 33962008 38933195 43609412 51387270 65600473
39479F5600473K0257760K7613736M3226804O2907504O4502112L1076048k2295553
$$ 65600473 85858233 113471969 156698773 219606277 284108389 315184437 292888884
39472B92888884n9148657o0571189m1537047k6147439k0262170j5733158r538586
$$ 292888884 233740227 173169038 131631991 105484552 85222382 69489224 59950638
39465E9950638o193852o670723o683132m907529m249971n121590m514155k026521
$$ 59950638 53756786 47086063 40402931 35495402 31245431 26123841 21609686 19583165
39457A9583165p90183j810374k533336j710229j089040j491244j379723k73473
$$ 19583165 18792982 16982608 14449272 12739043 11650003 10158759 8779036 8505563
39449H505563J33456p22118j151318l88771J14592m45098q41014l11670P9899
$$ 8505563 8639019 7916901 6765583 6376812 6491404 6046306 5205292 4893622 4973521
39440D973521l85509q06714n26117k39634l78888k78782K65231M11129o2830k42762
$$ 4973521 4588012 3781298 3255181 3015547 2636659 2357877 2623108 3034237 2971407 2728645
39430B728645J57086K46714k59054m79280j60072k12533q09311p96024J94531
$$ 2728645 2885731 3132445 2873391 2394111 2234039 2021506 1212195 416171 610702
39421F10702Q46268L34015k95566Q036N95614M57958q5311k53684k10767m09912
$$ 610702 1456970 1790985 1495419 1503455 2099069 2557027 2471716 2218032 2007265 1597353
39411A597353n16650j21268L06548K16768j7760J46959L91181J86175j74309j35249
$$ 1597353 1080703 959435 1265983 1482751 1464991 1611950 2003131 2189306 2014997 1879748
39401A879748P6856j17144n88991o97824k73403K48096M54973K67642j29404l52918
$$ 1879748 1956604 1839460 1250469 552645 279242 527338 982311 1249953 1120549 767631
39391G67631j49346J57069J0068m64084n29147N492M68691M34754L10877M33636
$$ 767631 618285 775354 785422 321338 -207809 -202317 266374 701128 1012005 1445641
39381A445641M49654J37120J5430M44900Q16015M06950m73013r41045p44317l28082
$$ 1445641 1895295 2032415 2047845 2492745 3308760 3715710 3242697 2301652 1557335 1229253
39371A229253l0819J43339J79932M9495r2845j11442j26740k49059l22620k12909
$$ 1229253 1198434 1341773 1521705 1571200 1478355 1366913 1240173 991114 668494 455585
39361D55585o8812m2270n0807m2049j40649l12061k77502N77J72719R1946R2701
$$ 455585 386773 344503 293696 251647 110998 -201063 -478565 -477988 -305269 -213323 -120622
39350a20622L91544O75951O31062M31715L35965K06534j49867n20748n82157l82328
$$ -120622 270922 946873 1577935 2009650 2345615 2552149 2402282 1881534 1299377 917049
39340I17049j79535m9136M9233P0569K0321M2273J54014J63214J6881q2666n9453
$$ 917049 737514 688378 737611 808180 828501 870774 1024788 1188002 1204883 1122217 1062764
39329A062764r1659k08711j86737k8398q1705m35772o50830l78910J48692N21157
$$ 1062764 971105 762394 575657 547259 465554 29782 -621048 -999958 -851266 -330109
39319c30109O44108N92619L72535P6546r6353j64278l12207m29562k27293R6439
$$ -330109 313999 906618 1279153 1355699 1259346 1095068 782861 353299 126006 222445
39309B22445p633m60489n07684L7527L81113P4896j49030L83271J013602O85586
$$ 222445 214812 -245677 -753361 -715834 -334721 -259825 -408855 -25584 988018 1673604
39299A673604l93766j052724q07099k44678Q3205K31169L14820K09606n2486j81841
$$ 1673604 1279838 227114 -579985 -824663 -741458 -510289 -195469 14137 -38349 -220190
39289b20190p6931M6700K7209p9550j70480j44047Q0930L22508J80391l33937
$$ -220190 -297121 -250421 -223212 -302762 -473242 -617289 -536359 -213851 -33460 -367397
39279c67397n68353j00132N29088N34201K2362k69512j21150M4514M0432J26691
$$ -367397 -935750 -1035882 -506794 27407 49769 -219743 -340893 -296379 -255947 -129256
39269a29256L44473L88208K27386J72759K17886k751m35027m69122J34305P70326
$$ -129256 215217 603425 830811 1003570 1221456 1218705 783678 314556 448861 1219187
39259A219187P83724K64585k73013n79206o84348n78313k48508J64577N03921
$$ 1219187 2002911 2267496 1994483 1415277 730929 152616 -95892 68685 572606
39250E72606P10092O74703K81913k36960l58076L9965L62097N6449n53315o58648
$$ 572606 1282698 1957401 2239314 2002354 1644278 1684243 2046340 2102789 1549474 890826
39240H90826j01376L77361J52484m30779n48237l3849M19187K57740j64108j62584
$$ 890826 789450 1166811 1319295 888516 340279 306430 725617 983357 819249 656665
39230F56665K07688K18854l95738r66922q16220j67047K84946L34292K83516K59893
$$ 656665 864353 1083207 687469 -279453 -1095673 -1262720 -977774 -643482 -359966 -100073
39220a00073J13825q6827m6818K12978L00825O1481j92471k00090j07823j22634
$$ -100073 13752 -73075 -119893 93085 393910 455391 262920 62830 -44993 -167627
39210a67627j57956n2058J26584K10964J73269N9294j22625k86490k32366R1824
$$ -167627 -325583 -377641 -251057 -40093 133176 192470 69845 -216645 -449011 -357187
39200c57187M32962N01754K90072p239k60747m44445n04703l72767j01567J32530
$$ -357187 75775 577529 867601 860362 599615 155170 -349533 -722300 -823867 -691337
39190f91337K01121J47814J08236J19051O4045j32411l18753k75010n5436L4835
$$ -691337 -490216 -342402 -234166 -115115 -51070 -183481 -502234 -777244 -832680 -797845
39180g97845j27281l02997k67882j16113k253J50231M06779N40679L55599R3892
$$ -797845 -925126 -1228123 -1496005 -1612118 -1614371 -1464140 -1057361 -516682 -161083 -67191
39170f7191J10489K78300J72315k25003m78201l59816r2619J13398K98012M26454
$$ -67191 43298 321598 493913 268910 -209291 -569107 -661726 -548328 -250316 176138
39160A76138K95424o1162k80969j82186j699M3272M5050P0902l9099k81481l08790
$$ 176138 471562 410400 129431 -52755 -54454 -11182 33868 104770 65671 -215810 -524600
39149e24600L0398L37056K20198j12592k26117j27658j12107j69279m4428K43486
$$ -524600 -494202 -157146 63052 -49540 -275657 -403315 -515422 -684701 -729129 -485643
39139d85643M23130M33524M19664L41417O6015j86944k7097M14561N10517K8925
$$ -485643 -62513 371011 790675 1132092 1198107 1011163 984066 1398627 1909144 1938069
39129A938069m91994n22686k51952j66491k83739k43341M9908L10751L16315J12449
$$ 1938069 1446075 923389 671437 504946 221207 -22134 27774 338525 654840 767289
39119G67289j63304l57735k79567O3537K70808j7427m99086m76173J51962O37079
$$ 767289 603985 246250 -33317 30220 301028 283601 -215485 -691658 -539696 97383
39109I7383L85365k19301m08684j20174N6726j19503k13872J13705N51803O31729
$$ 97383 482748 263447 -145237 -265411 -208685 -328188 -542060 -428355 123448 755177
39099G55177L86431J65824O2959q1833k50004k30352l2658M5172j33930l05264
$$ 755177 1141608 1307432 1370391 1288558 1038554 808202 775544 820716 686786 381522
39089C81522j71287J71433L58436K20733m9781j88513j74939j93755l36378m49534
$$ 381522 210235 381668 740104 960837 911056 722543 547604 353849 17471 -432063
39079d32063l41761p5201Q5705L0812n2679J6869J33771J00382k2550j3128J05181
$$ -432063 -773824 -849025 -763320 -732508 -785187 -768318 -634547 -534165 -556715 -569843 -464662
39068d64662M2158l01075o04432n16511j01137K75318L86053K97472J63177O1751
$$ -464662 -422504 -723579 -1328011 -1844522 -1945659 -1670341 -1284288 -986816 -823639 -761888
39058g61888K5713N5964P0092l3511k11071k76249j24495J26997K83616K86898
$$ -761888 -736175 -680211 -610119 -643630 -854701 -1130950 -1255445 -1128448 -844832 -557934
39048e57934K13054J22322J4157q9394j33681j39315k19295m05332n22124l61481
$$ -557934 -344880 -222558 -208401 -297795 -431476 -570791 -790086 -1195418 -1717542 -2079023
39038b079023J5571K84959K41696O3810N7038K12089K35961M5250m6367J82735
$$ -2079023 -2063452 -1778493 -1536797 -1472987 -1415949 -1203860 -967899 -922649 -969016 -786281
39028g86281M17243J89780l82156o63277l72772M5186J41915J21139L61739O34539
$$ -786281 -369038 -179258 -561414 -1224691 -1597463 -1552277 -1410362 -1289223 -927484 -292945
39018b92945M11210j78824l92756K6698M55567L60092N7326P8543K92421K39198
$$ -292945 118265 -60559 -453315 -426617 28950 389042 446368 524911 817332 1056530
39008A056530l2167j24105p8072l02546p54034q72810m60246k2719j0295k04504
$$ 1056530 1024363 900258 822186 519640 -234394 -1107204 -1567450 -1590169 -1600464 -1804968
38998a804968j52790J72247M53922M92797L18315N4438j10271r754K71366M41229
$$ -1804968 -1957758 -1785511 -1331589 -838792 -520477 -466039 -576310 -586064 -314698 126531
38988A26531L85528K77733K12428M2663k52868l70093r8388L18550M90186L30286
$$ 126531 512059 789792 1002220 1044883 792015 421922 323534 642084 1132270 1462556
38978A462556r184m03160p14091p41466m84518k34754j52338n485L73139O51247
$$ 1462556 1453372 1050212 336121 -405345 -889863 -1124617 -1276955 -1282440 -909301 -258054
38968b58054M19307j45610m63755k94051R2504L85677M88009L55383J422l13470
$$ -258054 161253 15643 -448112 -742163 -649659 -263982 224027 579410 580832 267362
38958B67362k62999R8745L52079K27441j32651m44084n63321m73964k37080j0100
$$ 267362 4363 103108 455187 682628 549977 105893 -457428 -931392 -1168472 -1178572
38948a178572P3705P1336J19748J91878J50460J0398n2754N7446K61296L84436
$$ -1178572 -1104867 -1033531 -913783 -721905 -571445 -561047 -613801 -556355 -295059 89377
38938H9377K13047l59619j036928j194088n77201K58795N98133M75327M60653
$$ 89377 302424 -57195 -1094123 -2288211 -2865412 -2606617 -2008484 -1533157 -1072504
38929a072504O75999O51822K05297j93360j65443K3993j1361j71159j78452j23622
$$ -1072504 -396505 255317 460614 267254 101811 125804 114443 -56716 -235168 -358790
38919c58790k51558m57211m31616j56889J32380L57300N81700O79797M23183q6954
$$ -358790 -610348 -1067559 -1499175 -1656064 -1523684 -1166384 -584684 95113 518296 431342
38909D31342m26267l56562n7761J96317L18550K98261J07424j35516j64588O6120
$$ 431342 5075 -351487 -409248 -212931 105619 403880 511304 375788 211200 277320
38899B77320K16699R303l13207k83149J04064L44902J26529k61256l78148k07072
$$ 277320 494019 503322 190115 -93034 11030 355932 482461 221205 -156943 -364015
38889c64015j2340J46534L88023N94016M39788r3622n83273o79318m75443k14530
$$ -364015 -376355 -229821 158202 752218 1192006 1098384 515111 -164207 -639650 -854180
38879h54180Q3673M56227O88956N07093M207l94718m14727j93334m1656p7608
$$ -854180 -770507 -314280 374676 881769 885976 491258 76531 -116803 -158459 -236067
38869b36067j38988r811K83830M39409K24310j82582l66381j94128O0531J44690
$$ -236067 -375055 -384866 -101036 338373 562683 380101 13720 -180408 -119877 24813
38859B4813J03990L0596j53224m36118n02307q7342N75625R35927P04966R1130
$$ 24813 128803 159399 6175 -429943 -932250 -1019592 -443967 491960 1196926 1288056
38849A288056m52320n68872k14179K97761N46659M15053J47298l0245j34851k17327
$$ 1288056 835736 266864 52685 350446 897105 1312158 1459456 1429211 1294360 1077033
38839A077033k18943j67841k18953l38426k62275M8577K47367J00000k05354m42553
$$ 1077033 858090 690249 471296 132870 -129405 -80828 166539 266539 61185 -381368
38829c81368o18885o39367k38573L97465N28680r9906o71730l99932K93937M83476
$$ -381368 -1000253 -1639620 -1878193 -1480728 -952048 -1051954 -1723684 -2123616 -1829679 -1346203
38819a346203J83761J55968N27755O33362K08525k18761k69311j96718k25688
$$ -1346203 -1162442 -1006474 -478719 154643 363168 144407 -124904 -321622 -547310
38810e47310j67292N4096J61930P3064P7537K38286K00768j49177l98299k42373
$$ -547310 -714602 -660506 -498576 -425512 -347975 -109689 91079 -58098 -456397 -698770
38800f98770R6835L25318M49809M82859K92053j8595p9849J45852K30008k0754
$$ -698770 -601935 -276617 173192 656051 948104 929509 849660 995512 1225520 1204766
38790A204766k37654j33191L4954m0491k21875k64859k36258k57680j98107N4171
$$ 1204766 967112 833921 868875 828384 606509 341650 105392 -152288 -350395 -296224
38780b96224L21599M07969L57740K51240M7911k08005l46831l57121l77863l65117
$$ -296224 25375 433344 791084 1042324 1090235 882230 535399 178278 -199585 -564702
38770e64702j68672O4249O1556k4736J38719K98123j16034q46509q59879J40535
$$ -564702 -733374 -669125 -607569 -632305 -493586 -195463 -311497 -1158006 -2017885 -1877350
38760a877350J145744J245183P55793L94142J55374k55390n82122m47277j15110
$$ -1877350 -731606 513577 1269370 1663512 1818886 1563496 981374 534097 418987
38751D18987l5899m7669K13696M95789L07458j73076l35929r7147Q0366j2564
$$ 418987 383088 335419 549115 1044904 1352362 1179286 843357 746210 826576 814012
38741H14012j47363j80903j99407k02536j02049N0407J83635L63388N18700L44279
$$ 814012 666649 485746 286339 83803 -18246 32161 215796 579184 1097884 1442163
38731A442163j41685l49980P5756O08745N65602J07595j24646l9560m1217j99191
$$ 1442163 1300478 950498 1026254 1634999 2200601 2308196 2183550 2143990 2102773 1903582
38721A903582k29585j69354l29914o13309n59017j14385K38859K02767K075o5902
$$ 1903582 1673997 1504643 1174729 561420 2403 -111982 126877 329644 331719 265817
38711B65817J0878J10559J39303L1213j41520j48602M7949J15664j64062m79802
$$ 265817 276695 387254 526557 557770 416250 267648 315597 431261 267199 -212603
38701b12603m37212j64129l1217j4781J63411M46224N00963K60116m0462k61576
$$ -212603 -649815 -813944 -845161 -859942 -696531 -250307 250656 510772 470310 208734
38691B08734m13621m37439k84501p5134J01759L22070N20774M15514L1923j48379
$$ 208734 -204887 -642326 -926827 -1001961 -900202 -578132 -57358 358156 390079 241700
38681B41700O0420J72903j16245k92460J26662O57905N61692K8921k14914j39274
$$ 241700 302120 475023 358778 66318 192980 850885 1412577 1441498 1226584 1087310
38671A087310k98498o96311p16476j74693L85289N15449L27620J09655L3837J98608
$$ 1087310 788812 92501 -623975 -798668 -413379 102070 429690 539345 573182 771790
38661G71790M62688L85136j79209o73882n62008j28284L4436m8670j3432N1625
$$ 771790 1234478 1619614 1440405 766523 204515 76231 110667 61997 48565 100190
38651A00190j04731k00508J07928M17100J83117k06037o345N26234N04509m7673
$$ 100190 -4541 -205049 -97121 319979 503096 297059 290714 816948 1321457 1273784
38641A273784k44834J00636K08756k40349n86793l80018m6580k8915j51189j68482
$$ 1273784 1028950 1129586 1338342 1097993 511200 131182 84602 55687 -95502 -263984
38631b63984j66177j42628R9946M53193N49217M06993L84767M95725M60718L49089
$$ -263984 -430161 -572789 -472843 -19650 529567 936560 1321327 1817052 2277770 2626859
38621B626859M04364L90740k2873m24724j98734K83857J31499n32394p27823k85536
$$ 2626859 3031223 3421963 3399090 2974366 2775632 3059489 3190988 2658594 1930771 1645235
38611A645235n3228l35008m58388j40992J0089k82116m59427k37291q0462j80326
$$ 1645235 1592007 1256999 798611 657619 667708 385592 -73835 -311126 -391588 -571914
38601e71914n8705M14815O70214M67997K54552J97989m7156l57813j11066N59969
$$ -571914 -630619 -215804 454410 922407 1176959 1374948 1327792 969979 858913 1418882
38591A418882P14965J69155j65531Q8414J35130m67412r56035p01175j98209l1129
$$ 1418882 2133847 2303002 2137471 2225885 2361015 1893603 937568 236393 38184 7055
38581G055N3626L63694N67625M12152K12713J46053k4061j97430L9556M03075
$$ 7055 60681 424375 992000 1404152 1616865 1762918 1738857 1541427 1580983 1984058
38571A984058J14997o54886q57264l02277Q9172m957Q2894M26414K56522l31344
$$ 1984058 2099055 1444169 586905 284628 373800 368843 451737 878151 1134673 803329
38561H03329k35266O17592R52593L69544n8847P2666j33473p66513o15098M56485
$$ 803329 568063 1185655 2138248 2507792 2448945 2521611 2388138 1621625 1006527 1463012
38551A463012R48544L65474K6094M25596M04062j71567J93010J477344J584374
$$ 1463012 2411556 2777030 2803124 3228720 3632782 3461215 3654225 5131569 6715943
38542F715943K07193j93427J188993J908507R95579J105180L465213N095311M135557
$$ 6715943 6923136 6729709 7918702 9827209 10822788 11927968 15393181 20488492 24624049
38533B4624049L353367M743340N639149M608122N759017J1719289J8478393K4385018
$$ 24624049 27977416 32720756 38359905 42968027 48727044 60446333 78924726 103309744
38525A03309744L6813716N7952127O9240817M6864541n017344n1533564o4105165
$$ 103309744 140123460 198075587 267316404 314180945 309163601 257630037 193524872
38518A93524872m8764505l0652292k2096890j7441191j1189946o382338n786063
$$ 193524872 144760367 114108075 92011185 74569994 63380048 56997710 51211647
38511E1211647o475395n728197m885668n092001m742312l080347j921698k194749
$$ 51211647 44736252 39008055 34122387 29030386 24288074 21207727 19286029 17091280
38503A7091280k384865j634449j152545j510738j506451o84705k89184p90827
$$ 17091280 14706415 13071966 11919421 10408683 8902232 8217527 7928343 7137516
38495G137516r46254j88571L36614k4219l22717L4871J99629l38958o78303j82144
$$ 7137516 6191262 6002691 6339305 6315086 5992369 6027240 6226869 5887911 5209608 5027464
38485E027464L22099Q187n94004o41681k89800j04156o5339O5429J01721j70151
$$ 5027464 5349563 5357750 4763746 4122065 3832265 3728109 3662770 3728199 3829920 3659769
38475C659769m73958m40211j38094J04769R4449j50368l98377l00489J71911N03859
$$ 3659769 3185811 2745600 2607506 2712275 2806724 2656356 2257979 1957490 2129401 2633260
38465B633260K42848l42388o25460m44377j30200P3651J83968K50066L29693N19988
$$ 2633260 2876108 2533720 1908260 1463883 1333683 1407334 1591302 1841368 2171061 2691049
38455B691049P37575O95492L16896q7156k03574k0400K71353L74620L0619n42942
$$ 2691049 3428624 4124116 4441012 4353856 4150282 4129882 4401235 4775855 4806474 4263532
38445D263532o71778j70499K74513L10980O50972J612958K064582J317573Q45969
$$ 4263532 3591754 3421255 3695768 4006748 4657720 6270678 8335260 9652833 10498802
38436A0498802K083977L735488L799539L027725L290772L866298L285514L567873
$$ 10498802 12582779 16318267 20117806 23145531 26436303 30302601 33588115 37155988
38428C7155988P643872J3752972J8864041K6618208M2083901N6429030M8771042
$$ 37155988 44799860 58552832 77416873 104035081 146118982 202548012 251319054
38421B51319054J1889285l2236253n3579634m6335784k9662265k0109760j6383547
$$ 251319054 263208339 230972086 177392452 131056668 101394403 81284643 64901096
38414F4901096j1549255o432308m905064n364312m287535k735072l249107m382735
$$ 64901096 53351841 46919533 42014469 36650157 32362622 29627550 26378443 21995708
38406B1995708l538783j911060j910896k528377j594624j55581m29338j535351
$$ 21995708 18456925 16545865 14634969 12106592 10511968 10356387 9927049 8391698
38398H391698j235470j21180k49622j137667q19765L20927L30335o39880p81674
$$ 8391698 7156228 7035048 6785426 5647759 4827994 5148921 5479256 4839376 4057702
38389D057702n5854j6110p08724p03710Q6592L33699j59619l06761L5346k9026
$$ 4057702 4001848 3985738 3277014 2573304 2659896 2993595 2833976 2527215 2562561 2533535
38379B533535m61432l60942J45490R2406m17615l99540J32633K99487J05252K43409
$$ 2533535 2072103 1711161 1856651 1949057 1531442 1131902 1264535 1564022 1669274 1912683
38369A912683M65074o823p22283n48824K57611M10128j65619l46551N3528J06065
$$ 1912683 2377757 2370934 1648651 1099827 1357438 1767566 1601947 1255396 1308924 1414989
38359A414989k76645j51332N25992O41328j00310o52096m42138j34627k00322
$$ 1414989 1138344 987012 1513004 2154332 2054022 1401926 959788 825161 624839
38350F24839k06774P0689J97463J10117L20297P68119P10063N1246m01042k76091
$$ 624839 418065 488754 686217 796334 1116631 1884750 2594813 2646059 2245017 1968926
38340A968926p6053p6996K5287J98123J7472k96324m2921N74347N50384j90418
$$ 1968926 1892873 1815877 1841164 2039287 2056759 1760435 1717514 2291861 2842245 2651827
38330B651827n46711r0597K32770k10698o83002l79739L52165Q15017R71995R70558
$$ 2651827 2105116 2014519 2247289 2036591 1353589 973850 1326015 2141032 3113027 4083585
38320D083585N82424j76119o65632n23954k52555l54063n72007n00141k77122
$$ 4083585 4666009 4489890 3824258 3300304 3047749 2693686 2121679 1621538 1344416
38311A344416j80956j46269j01205j81071k83746p1267L21175L34126J074L8001
$$ 1344416 1163460 1017191 915986 734915 451169 379902 701077 1035203 1036277 1074278
38301A074278N69663P31063N1852p07652p58755m46782m37218n18891j33141M74686
$$ 1074278 1643941 2375004 2426856 1719204 960449 513667 76449 -442442 -575583 -100897
38291a00897N86855J68228j59213j13527M636k5101o2043L773M2290p5483k90957
$$ -100897 485958 654186 494973 381446 386082 360981 298938 302711 345001 269518 -21439
38280b1439m20154k99820J8847K10176M9614j73500L796M68302O21250K91915
$$ -21439 -441593 -741413 -722566 -512390 -462776 -636276 -632480 -164178 457072 748987
38270G48987j9627L906J2763l16017o52428n14528P798M43863N53992M06969J20827
$$ 748987 729360 733266 746029 430012 -222416 -736944 -729146 -285283 268709 675678 796505
38259G96505j62884k66820j75827o0056L840P2573O5265j64267m29279l42226
$$ 796505 633621 366801 190974 130918 134758 207331 272596 108329 -320950 -663176
38249f63176M8043K35480J2827k57186k88110k38193k12700K4129N15539Q15057
$$ -663176 -615133 -379653 -366826 -624012 -912122 -1150315 -1363015 -1338886 -823347 -8290
38239h290O06239J87338j8233k6223k8295J1716J20298O7219k32596m08500j47797
$$ -8290 597949 785287 767054 740831 712536 724252 844550 911769 679173 270673 122876
38228A22876K54212K74441j02967m03217k84660J44486N34958O12682L66136K5071
$$ 122876 377088 651529 548562 145345 -139315 5171 540129 1152811 1518947 1544018
38218A544018k28621m78495p99166r06489m88819J79081M60153K29555J0533J55914
$$ 1544018 1315397 836902 37736 -868753 -1357572 -1178491 -718338 -488783 -478250 -322336
38208c22336M21527M75204L02186l4506n01508q17537o23747q9392K16526J90342
$$ -322336 99191 574395 876581 842075 340567 -476970 -1100717 -1190109 -973583 -783241
38198g83241K94432O51269P84700N13251L06876L87447K74718k82828o85234l84065
$$ -783241 -488809 162460 947160 1460411 1767287 2154734 2429452 2146624 1461390 1077325
38188A077325K47406N48341M64458K22937k29550p87363q33534j28435N03001
$$ 1077325 1324731 1873072 2337530 2560467 2330917 1543554 710020 581585 1084586
38179A084586K36274m64244n33539R0060N18524L41314K2392n9895n8280q3962
$$ 1084586 1320860 856616 323077 413137 931661 1272975 1295367 1235472 1177192 1093230
38169A093230J3922J70707Q1537k15703l17589j28250k0959k11427m46201m33118
$$ 1093230 1107152 1277859 1359396 1143693 826104 697854 676895 465468 19267 -413851
38159d13851j83927J47540M18234M62357K31933m1598j13809o5225q6176j10403
$$ -413851 -597778 -450238 -32004 430353 662286 620688 506879 441654 355478 245075
38149B45075k1848L561j87014k90982L5641N13753N80170K66553J06885K19244
$$ 245075 223227 226788 39774 -251208 -215567 298186 878356 1144909 1251794 1471038
38139A471038J52830k74999o26699n23726j68560K5632o3162k89843m29387k53209
$$ 1471038 1623868 1348869 722170 198444 29884 55516 -7646 -297489 -726876 -980085
38129i80085K37370O06988L91401k41289o17750m01984P9923M05698N08753M53309
$$ -980085 -742715 -135727 255674 14385 -603365 -1005349 -925426 -519728 -10975 442334
38119D42334K05930j43710k72503Q844M65820O79181M52504n4839m52258m11213
$$ 442334 648264 504554 232051 240895 706715 1385896 1838400 1783561 1331303 920090
38109I20090k1752K28988N5820k05373r6964K26931K27717j61157m48015l69937
$$ 920090 898338 1127326 1183146 977773 880809 1107740 1335457 1174300 726285 356348
38099C56348k10136j95734j04243K69670O59842O50855K12740l15793o06893n68609
$$ 356348 146212 -49522 -153765 115905 775747 1426602 1639342 1323549 716656 148047
38089A48047l53308k20277k47333k04672Q7994L86098L21405j3407j91080j15935
$$ 148047 -205261 -425538 -672871 -877543 -789549 -403451 -82046 -95453 -286533 -402468
38079d02468q4731j57693j2284M16896O73247M30004j3624j95837j06406k4912
$$ -402468 -487199 -644892 -657176 -240280 432967 862971 849347 653510 547104 522192
38069E22192m0544o5085j06717k12776k81287j93846l8346k098j29505l17562
$$ 522192 481648 416563 309846 97070 -184217 -378063 -416409 -418507 -548012 -865574
38059h65574m43538m05204j71440J32905L33818M18571M53324L34868n5745m52084
$$ -865574 -1309112 -1714316 -1885756 -1752851 -1419033 -1000462 -547138 -212270 -268015 -720099
38049g20099l87238R3627L61584R1572k18042J4814N66604P42086L67109p0990
$$ -720099 -1107337 -1013710 -652126 -560554 -778596 -763782 -197178 544908 912017 841027
38039H41027j86543r8070k9417M3039J81051K51141J26483o0541p0935J14440
$$ 841027 654484 556414 526997 570036 751087 1002228 1128711 1068170 997235 1111675
38029A111675K65053J73660j19101l62327l34711q3917P1492j38129n76803p74996
$$ 1111675 1376728 1550388 1431287 1068960 734249 650332 721824 583695 6892 -768104
38019g68104m69425J6077J32547j52820k61166J87276P51759P33293K01369o6937
$$ -768104 -1237529 -1221452 -1088905 -1241725 -1502891 -1315615 -563856 169437 370806 303869
38009C03869K63846N69010K07867m90458o97211k62962J55225P6779k37302l02850
$$ 303869 567715 1136725 1344592 854134 156923 -106039 49186 125965 -111337 -414187
37999d14187o8414J43494Q9714j76179m04399l73216q8868K33626M31824N21038
$$ -414187 -482601 -339107 -249393 -425572 -829971 -1203187 -1292055 -1058429 -626605 -105567
37989a05567M85954J93940k73498m70076j07317M66557O77143M38715P4520k63057
$$ -105567 380387 574327 300829 -169247 -276564 189993 867136 1305851 1380371 1117314
37979A117314n95556p12747l68711J57240K97647L1097r7049J55592M35062M61616
$$ 1117314 521758 -190989 -559700 -402460 -104813 -73716 -170765 -15173 419889 881505
37969H81505L69208K31070r5474m37204l12182K12145L63817j93780p30567n10549
$$ 881505 1250713 1481783 1386309 949105 636923 849068 1212885 1019105 288538 -222011
37959b22011J20186L69815K05824J44027K13884R837l88070m09251M6203L85934
$$ -222011 -101825 267990 473814 617841 831725 841562 453492 44241 90444 476378
37949D76378K22244j31716k66686k33563k30263j84478K9791K76112L61202L38899
$$ 476378 698622 566906 300220 66657 -163606 -348084 -318293 -42181 319021 657920
37939F57920L50314L38080J74392n0090j26255p0351j16991l17388l63695O201
$$ 657920 1008234 1346314 1520706 1470616 1344361 1274010 1157019 839631 475936 482137
37929D82137N33373O29886J12533m99088o12111k91150o5628j52771k82893k66034
$$ 482137 1015510 1645396 1757929 1258841 646730 355580 289952 137181 -145712 -411746
37919d11746k46627k72666r5899L37931O24895M79346K19519K67503M58155L23964
$$ -411746 -658373 -931039 -1026938 -689007 -64112 415234 634753 902256 1360411 1684375
37909A684375j27044m28328l67683j97762j37236j19261j05984k26485m45359
$$ 1684375 1557331 1129003 761320 563558 426322 307061 201077 -25408 -470767
37900d70767m46950p1523L75195M80837K55197Q1504J78044L00562Q5677l74839
$$ -470767 -917717 -989240 -614045 -133208 121989 203493 381537 682099 767776 392937
37890C92937n08930K2577P35248P94826R5934n67026n87108l22304l89824o20006
$$ 392937 -115993 -93416 641832 1436658 1532592 965566 378458 56154 -333670 -953676
37880i53676l63619L63064P93936N49368J72450K54207N77462N46764R5965l01849
$$ -953676 -1317295 -954231 -160295 389073 561523 815730 1393192 1939956 2035921 1734072
37870A734072l44540j91475q8256n1848N416O2834R548j97477m30707m50463j44457
$$ 1734072 1389532 1198057 1109801 1057953 1063369 1126203 1135751 938274 507567 57104 -87353
37859h7353K59048L51117J2692m01936m85137k49459P301J85702M29204O92795
$$ -87353 171695 522812 535504 133568 -351569 -601028 -593727 -408025 21179 713974
37849G13974O35717J43113l23347k33167K65804M72992M0081n88265p78565m61267
$$ 713974 1349691 1492804 1169457 936290 1202094 1675086 1715167 1126902 348337 -112930
37839a12930n4863J30691J19189L9948m754J01228L66470N47057L93974K7106
$$ -112930 -167793 -37102 82087 122035 117281 218509 584979 1132036 1526010 1553116
37829A553116k18324k87246l97933n29455l49401J92490O08985M96284J08346
$$ 1553116 1334792 1047546 649613 120158 -229243 -36753 572232 1068516 1176862
37820A176862j1965K30240M39822L10745m3614k97898k46087L8748K40564P5696
$$ 1176862 1164897 1395137 1834959 2145704 2102090 1804192 1558105 1596853 1837417 1913113
37810A913113l52570n94059l70651Q3799L36646K50852O000k09828l23034l08597
$$ 1913113 1560543 966484 595833 679632 1016278 1267130 1273130 1063302 740268 431671
37800D31671k09616j57354k16648k77165k12729n8899O7185J22793J38005J64526
$$ 431671 222055 64701 -151947 -429112 -641841 -700740 -633555 -510762 -372757 -208231
37790b08231K51388L29116J66235k99619o50175m17352J61574L45918k5359k75130
$$ -208231 43157 372273 538508 238889 -411286 -828638 -667064 -321146 -346505 -621635
37780f21635l669K23993j47825o13568l17401N57629R88265N77641q536j32212
$$ -621635 -625304 -401311 -549136 -1162704 -1480105 -922476 65789 643430 634894 502682
37770E02682L7730M8701j35117k62848k33365j31809n6832m7706k5592J65556
$$ 502682 540412 589113 453996 191148 -42217 -174026 -230858 -278564 -304156 -138600
37760a38600M61760M77959K7720m40590l74397O2240K28694k3727k31783j69381
$$ -138600 323160 801119 828839 388249 13852 76092 304786 281059 49276 -120105
37750a20105j55000l62182m44446j24212L31571N06881L29202l1017l67997l94117
$$ -120105 -275105 -637287 -1081733 -1205945 -874374 -367493 -38291 -69308 -437305 -831422
37740h31422P1793O81695P79327K63827k26427k32789p7116k08959m39683k95580
$$ -831422 -759629 -77934 701393 965220 738793 506004 428888 219929 -219754 -515334
37730e15334K06570O12311O48250L98071L4564k88595m24378l79203l25324k94518
$$ -515334 -308764 303547 951797 1349868 1384432 1095837 671459 292256 -33068 -327586
37720c27586j05627K32034L90111K44633J42711L06499L63165p0918o63927p76835
$$ -327586 -433213 -201179 188932 433565 576276 882775 1245940 1175022 511095 -265740
37710b65740l90507n7031l6338o0984L7762M1191j69333l06207j08220K34559
$$ -265740 -656247 -713278 -749616 -810600 -772838 -731647 -900980 -1207187 -1315407 -1080848
37700a080848L46356J64165o0646j53419j89166k63214k54413L9316N40998Q46145
$$ -1080848 -734492 -570327 -630973 -784392 -973558 -1236772 -1491185 -1451869 -910871 -64726
37690f4726O74720K45364k1202o9254j62011l25312k74417J9676J59298n8228
$$ -64726 609994 855358 834156 764902 602891 277579 3162 22838 182136 123908
37680A23908k67969r6097K66906L98627K36939k1114l05733n52403m81490K4344
$$ 123908 -144061 -240158 26748 425375 662314 641200 335467 -216936 -698426 -674082
37670f74082N34521N45782J78569p2246j05015j94325l44193k72998k6969L204
$$ -674082 -139561 406221 584790 512544 407529 213204 -130989 -403987 -430956 -427752
37660d27752k39617l55071j75536l4043j49074k62344j47781m893l8740q2380
$$ -427752 -667369 -1022440 -1197976 -1232019 -1381093 -1643437 -1791218 -1796111 -1834851 -1917231
37650a917231J4589K9175j85674k54107K03460Q37922R24993L79474j20505p8920
$$ -1917231 -1902642 -1873467 -2059141 -2313248 -2109788 -1271866 -346873 32601 -87904 -166824
37640a66824K31702K97764P4976j01841n3788R5525J68220P3413j99774m89180
$$ -166824 64878 362642 437618 335777 281989 377514 545734 619147 419373 -69807
37630f9807m52682N0723O08606O30985J31643k49630j56326o20k06775m27868
$$ -69807 -522489 -471766 136840 767825 899468 649838 493512 492892 286117 -141751
37620a41751j25152L76716K50577m36486o24572J20897P85995L48780o65708r49203
$$ -141751 -266903 109813 360390 -76096 -700668 -579771 206224 555004 -110704 -1059907
37610a059907k81248L62086L93259K56931L61605L54084j10865o27179o23915
$$ -1059907 -1341155 -979069 -585810 -328879 32726 386810 275945 -351234 -975149
37601i75149k04205J19522J69269J15384N0153j365J07441L93069N24603K80962
$$ -975149 -1179354 -1059832 -890563 -775179 -725026 -726391 -618950 -225881 298722 579684
37591E79684n186O3839K35155l0815n84968o59669k1857N91640M93817k2396k06326
$$ 579684 574498 638337 873492 842677 257709 -401960 -423817 167823 661640 639244 432918
37580D32918O7699K60390M4965k91447l59758j76238q890J1278n6742j31724j47732
$$ 432918 500617 761007 805972 514525 154767 -21471 -30361 -19083 -75825 -207549 -355281
37569c55281j6527K64772M85004L72071m5397l43569j28456M48433P72754M72522
$$ -355281 -371808 -107036 377968 750039 704642 361073 232617 681050 1453804 1926326
37559A926326j01815l02584k441L03880K22316q0882k93733m40381o13069n61395
$$ 1926326 1824511 1521927 1519486 1823366 2045682 1964800 1671067 1230686 617617 56222
37549E6222o8802M47915L42724k61189n38388j83442J19084j97204o51791m79256
$$ 56222 -12580 435335 778059 516870 -21518 -204960 -85876 -283080 -934871 -1414127
37539a414127J67661M95456K71768J0432O6280K51955L63417M31115L73792K2447
$$ -1414127 -1246466 -751010 -479242 -468810 -402530 -150575 212842 643957 1017749 1040196
37529A040196l90195l61839J02445M27819L44411J93854J57883q7110n73467o55274
$$ 1040196 650001 288162 390607 818426 1162837 1356691 1514574 1427464 853997 198723
37519A98723j6314N72319K61407n67746q37296l31383J48574Q5789j59264j61524
$$ 198723 182409 754728 1016135 448389 -388907 -720290 -571716 -485927 -645191 -806715
37509h06715o2032j09336j72630o4058P8034O6649K4420J59679L96744M95987
$$ -806715 -868747 -978083 -1150713 -1214771 -1136737 -1070088 -1045668 -885989 -489245 6742
37499F742M05704K76744K08514J53291M6498q6362j81631k57631m12411o27458
$$ 6742 412446 689190 897704 1050995 1097493 1011131 829500 571869 159458 -468000
37489d68000o45039k49315L22101N35261K43934q3632j0467L00597M13638K12651
$$ -468000 -1113039 -1362354 -1040253 -504992 -261058 -344690 -355157 -54560 359078 571729
37479E71729j31506m77573o42376l40614L52200P76936M67103j05348j66817J91915
$$ 571729 440223 -37350 -679726 -1020340 -668140 108796 575899 470551 303734 495649
37469D95649K12171k67951n66310k91621N4228q5326n08122o58518l81144Q3168
$$ 495649 707820 439869 -126441 -418062 -363834 -449160 -957282 -1615800 -1996944 -1913776
37459a913776M86181O46813M39047l2328m66378o97336p30926m65245J72258P72791
$$ -1913776 -1427595 -780782 -341735 -374063 -840441 -1537777 -2268703 -2733948 -2561690 -1788899
37449a788899P17411Q5867k91353L4885N26649N36760K07864K0061k9629k00055
$$ -1788899 -1071488 -985621 -1276974 -1242089 -715440 -178680 29184 49245 19616 -180439
37439a80439l59531k13401P4133R9232r8971j35591N8563K13650K78444M51617
$$ -180439 -539970 -753371 -679238 -580006 -678977 -814568 -756005 -542355 -263911 187706
37429A87706O55568N13782k9829n03953m94666j27636J81940K15423N0097j37018
$$ 187706 843274 1357056 1327227 823274 328608 200972 382912 598335 648432 511414
37419E11414k23217j91447j14315o5006n0708m6701k2081Q2441K68346L50262
$$ 511414 288197 96750 -17565 -82571 -133279 -179980 -202061 -119620 148726 498988
37409D98988J16118l21457n75639m84363k80298j34215J19775N59840Q28493N84271
$$ 498988 615106 293649 -281990 -766353 -1046651 -1180866 -1061091 -501251 327242 911513
37399I11513O1483k19837j50354n9832j54216k89919k74795j03915Q3330R1329
$$ 911513 972996 753159 602805 542973 388757 98838 -175957 -279872 -196542 -105213
37389a05213j74679m63183l05927L47800Q76413P20892J50381j34210J8514J28769
$$ -105213 -279892 -743075 -1049002 -701202 175211 896103 1046484 912274 930788 1059557
37379A059557r7589m06230n01285m39610l76978k93790j40771J3405J17874K22758
$$ 1059557 961968 555738 54453 -385157 -762135 -1055925 -1196696 -1183291 -1065417 -842659
37369h42659L45128M15972L84091K30356o2522l80263m41448j43816J76301J32041
$$ -842659 -497531 -81559 302532 532888 470366 90103 -351345 -495161 -318860 -186819
37359a86819j74738l32276k29842j13288j12410j25582j30900j84011j31197K14404
$$ -186819 -361557 -693833 -923675 -1036963 -1149373 -1274955 -1405855 -1589866 -1721063 -1506659
37349a506659O02315N49859Q9243k00266m1595J69400M9359k05064k17227K5025
$$ -1506659 -904344 -354485 -265242 -465508 -507103 -337703 -288344 -493408 -710635 -685610
37339f85610L25618N88873O53514K23696o12302j127540p32398J76219O43470
$$ -685610 -359992 228881 882395 1106091 493789 -633751 -1366149 -1189930 -546460
37330e46460L63658k8838P2948M51009M74949K3296l65085k41534J53576K49894
$$ -546460 -182802 -211640 -138692 312317 787266 810562 445477 203943 357519 607413
37320F07413l3705j78644J26089M32592J34569o11824j039921p83544k50786N5985
$$ 607413 573708 395064 521153 953745 1088314 476490 -563431 -1346975 -1597761 -1541776
37310a541776R8685M0618p7229j32317J63581P79445J138005P81551K8968m21495
$$ -1541776 -1443091 -1402473 -1479702 -1612019 -1448438 -668993 469012 1250563 1279531 858036
37300H58036l59949j47130p6699q0551l7043J0313P058p528j8432p3238j62768
$$ 858036 498087 350957 274258 193707 156664 166977 174035 166507 148075 74837 -87931
37289h7931j95936j02253J19944L93380N21093K91740k35311o81708p40424m80582
$$ -87931 -283867 -386120 -266176 127204 648297 940037 704726 23018 -717406 -1197988
37279a197988j26551K49527N86960O30261K39683k16898k00108K75721O32929
$$ -1197988 -1324539 -1075012 -488052 142209 381892 164994 -35114 240607 873536
37270H73536M97068J07409j48850k49152l62018m47828l44017j11766O432l6652
$$ 873536 1370604 1478013 1329163 1080011 717993 270165 -73852 -185618 -179186 -215838
37260b15838o166K48697N12066M30678k2944m58548m93787j85996O6786K3918
$$ -215838 -222004 26693 538759 969437 946493 487945 -5842 -191838 -125052 -101134
37250a01134j40601j21899J08691K96828K42107K1276j27276p5350N6003L0389
$$ -101134 -241735 -363634 -254943 41885 283992 305268 177992 102642 158645 189034
37240A89034k07135m10160l10427J1836K08845J37897L4232J15017K48779K13239
$$ 189034 -18101 -428261 -738688 -726852 -518007 -380110 -345878 -230861 17918 231157
37230B31157P6448M6649Q5916P902j00220O2907M62539O07184J89620m21432o17780
$$ 231157 307605 354254 440170 448072 347852 410759 873298 1480482 1670102 1248670 630890
37219F30890l25668k9019o8857k51913k43906n8158O4320P0250J01269J66432
$$ 630890 305222 276203 207346 -44567 -288473 -346631 -282311 -212061 -110792 55640
37209E5640J29006M2876J56015M36871M48725j2856m54930k95369K44479L99636
$$ 55640 184646 227522 383537 820408 1269133 1256277 801347 505978 750457 1150093
37199A150093q285l17019r1031J68379j71547q12779q96460k45090M03558M35686
$$ 1150093 1141808 824789 733758 902137 730590 -82189 -978649 -1223739 -820181 -384495
37189c84495O8322j72651k06556k79505l81964k18079K70953O84402O02880J19600
$$ -384495 -316173 -488824 -695380 -974885 -1356849 -1574928 -1303975 -619573 -16693 102907
37179A02907k13172J3312N76975Q23544L93070l26095n95466j75794L80158L81559
$$ 102907 -110265 -96953 480022 1303566 1696636 1370541 775075 599281 979439 1360998
37169A360998j79921o57209n69586j46067Q7581M0351N6511K55878L01822j397
$$ 1360998 1181077 523868 -45718 -191785 -104204 -63853 -7342 248536 550358 548961
37159E48961k66644n6746L76412L70665j82895o51853n38291r2691J54811Q8924
$$ 548961 282317 225571 601983 972648 789753 137900 -400391 -493082 -338271 -249347
37149b49347n1295j13638p2210J42990M84784O04700K15603m08528o48758k94196
$$ -249347 -300642 -414280 -486490 -343500 141284 745984 961587 553059 -95699 -389895
37139c89895K01245K85237q4654m80887m97119j14490L35400N12669L86414J89922
$$ -389895 -188650 96587 11933 -468954 -966073 -1080563 -745163 -232494 153920 343842
37129C43842P5684m7467k73188m65916m18851j29497K21484M65979N11936L48153
$$ 343842 419526 372059 98871 -367045 -785896 -915393 -693909 -227930 284006 632159
37119F32159J10916l802j2318j30220l58089l62420N735L84606M26442L44093
$$ 632159 743075 739273 726955 596735 238646 -123774 -118039 266567 693009 1037102
37109A037102M81170N98466J94350n67669r21582n76100j05077m5483j79080o7287
$$ 1037102 1518272 2116738 2311088 1743419 821837 245737 140660 95177 -83903 -151190
37099a51190J72488J13902k20516l44259j032M82734N86985J53699m61354p03444
$$ -151190 21298 135200 -85316 -429575 -430607 52127 639112 792811 331457 -371987
37089c71987l38790K78208N54613L19451j8587l3286K06809L25690J58690j06706
$$ -371987 -710777 -432569 122044 441495 422908 389622 596431 922121 1080811 974105
37079I74105k13334r8971Q2354J26409J0580n2657Q4111K10200K5194k98640j95242
$$ 974105 760771 661800 744154 870563 881143 828486 912597 1122797 1147991 849351 654109
37068F54109M86264J099386R33842J10070n85865o31594k23288J24478J27249
$$ 654109 1140373 2239759 3173601 3283671 2697806 2066212 1842924 1967402 2094651
37059B094651j37032m04456m54700k74629l1255J33322K05867J88276N0278j31953
$$ 2094651 1957619 1553163 1098463 823834 792579 925901 1131768 1320044 1370322 1238369
37049A238369j95084j60160k45850m53799m36448m0469L20309K21203r3297p6474
$$ 1238369 1043285 883125 637275 183476 -252972 -293441 26868 248071 154774 78300
37039G8300K37097L03908M387j44971J16445L09799o970m74717m49557K7427L24964
$$ 78300 315397 619305 623692 478721 595166 904965 897995 423278 -26279 1148 326112
37028C26112J52584j25100j15515J17499L12302L79266L25265R4183k77181n20427
$$ 326112 478696 353596 238081 355580 667882 1047148 1372413 1466596 1189415 668988
37018F68988m02795o5980J06349m5727k79165k64325K7296L10600L22699J22748
$$ 668988 266193 200213 306562 260835 -18330 -282655 -255359 55241 377940 500688
37008E00688K4358K04122M24668K73644k86292p65385o90335j88550J88626J82417
$$ 500688 525046 729168 1153836 1427480 1141188 375803 -314532 -503082 -314456 -132039
36998a32039Q1699J85192L16319J35322k50478l47442N3288N78135P47501N05845
$$ -132039 -50340 134852 451171 586493 336015 -11427 41861 619996 1367497 1873342
36988A873342J30992j71562l68907m38286l61938k43494k05627j77716l78K44564
$$ 1873342 2004334 1832772 1463865 1025579 663641 420147 214520 36804 36426 280990
36978B80990K55912m5589l34503l04635q0404J5275m9254l9368J09121J97487
$$ 280990 536902 491313 156810 -147825 -228229 -212954 -262208 -301576 -192455 5032
36968E032J22447J4291n7932k01127l75841k91115J25050M40009K50732k04497
$$ 5032 127479 141770 83838 -117289 -493130 -784245 -659195 -219186 31546 -172951
36958a72951l67172j44725P6847J24980K13921L79611L06180p2738l08052r0627
$$ -172951 -540123 -684848 -608001 -483021 -269100 110511 416691 343953 35901 -54726
36948e4726K55961L12547K10682K96694M73695M00291J18931o6363j89834n16910
$$ -54726 201235 513782 724464 1021158 1494853 1895144 2014075 1947712 1757878 1240968
36938A240968r02327q71665l99716j7521l678l7715J21864J77986j29874m57465
$$ 1240968 338641 -533024 -932740 -950261 -953939 -991654 -869790 -691804 -821678 -1279143
36928a279143l18273J85771N29406M65296J83610p3087j98322j30631J07651L38475
$$ -1279143 -1597416 -1411645 -882239 -416943 -233333 -306420 -504742 -635373 -527722 -189247
36918a89247M23301M27396M01368K02967j91246m21779j81472K32098K39137k00380
$$ -189247 234054 661450 1062818 1265785 1074539 652760 471288 703386 942523 742143
36908G42143n34617m18680j21277j1279n1181k5799M9463L1820m4646l5636O6203
$$ 742143 207526 -211154 -332431 -343710 -394891 -420690 -371227 -339407 -384053 -419689 -353486
36897c53486J67081K51440L28829L00572R1861j53006k34089k18364l42299n60157
$$ -353486 -186405 65035 393864 694436 786297 633291 399202 180838 -161461 -721618
36887g21618m73507J17916Q00284R41477M32395k15210n02789m13993j88412P3035
$$ -721618 -1195125 -1077209 -276925 664552 1096947 881737 378948 -35045 -223457 -150422
36877a50422L56030M95995L06922j07145m27717m93927l83737j75482R7485K76136
$$ -150422 205608 701603 1008525 901380 473663 -20264 -404001 -579483 -481998 -205862
36867b05862J87643k4207j8890J94787J99517j70315m91241l58941N461J38033
$$ -205862 -18219 -42426 -61316 133471 332988 162673 -328568 -687509 -682048 -544015
36857e44015N6326J37602M13970M86259J63919k28439l01642o5968J69059J56595
$$ -544015 -487689 -350087 63883 550142 714061 485622 183980 118012 287071 443666
36847D43666q6791k83300j15740L68867O55645L26781l39564o71891m81815k38369
$$ 443666 356875 73575 -42165 326702 982347 1309128 969564 297673 -184142 -422511
36837d22511l02675m18445j73783L68664P73312P50542L59556j28285l99481l15551
$$ -422511 -725186 -1143631 -1317414 -948750 -175438 575104 934660 806375 406894 91343
36827I1343j01943j18091l35363l36663J5736K93519J63903m9148J06809M42113
$$ 91343 -10600 -128691 -464054 -800717 -784981 -491462 -327559 -376707 -269898 172215
36817A72215M32855J03033k4869J85878K89997M0949k43689l01305l31336m78647
$$ 172215 605070 708103 683234 869112 1159109 1200058 956369 655064 323728 -154919
36807a54919m49837o1711K98173K64377J43513L74702O71684M29428j96514m34056
$$ -154919 -604756 -666467 -368294 -103917 39596 414298 1085982 1515410 1318896 884840
36797H84840j28010J6545l61811o64498l63839P5297n2821n55630o97075l49592
$$ 884840 756830 773375 411564 -252934 -616773 -541476 -594297 -1149927 -1847002 -2196594
36787b196594j8411R9733K86757N50510M86052N6400j77598J00441M56467L88358
$$ -2196594 -2215005 -2115272 -1828515 -1278005 -791953 -735553 -913151 -812710 -356243 32115
36777C2115M3037j33774p8577k0281M436J14569K34781J68763o1660k46166k83395
$$ 32115 75152 -58622 -137199 -157480 -153044 -38475 196306 365069 303409 57243 -226152
36766b26152k20936r7166M6226J00457L3661j1739O7725J69412J95226K47028
$$ -226152 -447088 -544254 -498028 -397571 -363910 -375649 -307924 -138512 56714 303742
36756C03742M10814N28985M16895J49594q0234k23882k98996k61018j73501k59267
$$ 303742 714556 1243541 1660436 1810030 1729796 1505914 1206918 945900 772399 513132
36746E13132n13697n41498j17722L62051M06426J53004P7691J87598R4599j96289
$$ 513132 -565 -542063 -659785 -297734 108692 261696 339387 526985 621584 425295
36736D25295k12837J91365N39088M05472n9906m69181o59620o35254l99465n6525
$$ 425295 212458 403823 942911 1348383 1288477 819296 159676 -475578 -875043 -931568
36726i31568J78065K20108J63602N0584j28782k02211N5700N01471O96613M85776
$$ -931568 -753503 -533395 -369793 -319209 -447991 -650202 -594502 -93031 603582 1089358
36716A089358J50719o4798j91746k50933j84791j46834l51769n35426j64835O14695
$$ 1089358 1240077 1175279 983533 732600 547809 400975 49206 -486220 -651055 -36360
36706c6360R15679L53403l05506k53241K05524K69563r8201l28266l21397m72857
$$ -36360 879319 1232722 927216 673975 879499 1149062 1050861 722595 401198 -71659
36696g1659p39312n77763P5706N59530M73267K36503L10956M45927J86915k74145
$$ -71659 -810971 -1388734 -1313028 -753498 -280231 -43728 267228 713155 900070 625925
36686F25925l44438K7617K12020k09772q23333r09802l83263J34654J71551j5760
$$ 625925 281487 309104 521124 311352 -511981 -1421783 -1805046 -1670392 -1498841 -1514601
36676a514601O7233L72440M56742K89637L27290O52777O63714R045o93040o67744
$$ -1514601 -1447368 -1074928 -618186 -328549 -1259 651518 1315232 1324277 631237 -36507
36666c6507j45122J3665l32377m38899P1387N78199M00514k53357o96305o66749
$$ -36507 -181629 -167964 -500341 -939240 -867853 -289654 110860 -142497 -838802 -1505551
36656a505551l70614K3235M22772N69700K78446j49412k05742J16985L04160O8422
$$ -1505551 -1876165 -1852930 -1430158 -860458 -582012 -731424 -937166 -820181 -516021 -447599
36646d47599k73062l27844j78012j24223j34248P9235N09243P50727N23063K4041
$$ -447599 -720661 -1048505 -1226517 -1350740 -1484988 -1405753 -896510 -145783 377280 401321
36636D01321l61139m79858l92047j58696J13957J98954K1137j06249J41402N52357
$$ 401321 40182 -439676 -831723 -990419 -876462 -677508 -656371 -762620 -621218 -68861
36626f8861O14357L05941J64040M05674N03988P383o48836o89589j25775K57215
$$ -68861 545496 851437 1015477 1421151 1925139 1932522 1283686 594097 468322 725537
36616G25537J808m78301n74785k49412J02288K23757J61524M7730k3802K0991
$$ 725537 727345 249044 -325741 -575153 -472865 -249108 -87584 -39854 -63656 -42665
36606d2665J84158L28292K79143K6645k19849k18065L7210K57202J57992j85323
$$ -42665 141493 469785 748928 775573 555724 337659 374869 632071 790063 604740
36596F04740m13793l35525j17947L1198J29723K24581K02482M2931Q270K46061
$$ 604740 190947 -144578 -262525 -231327 -101604 122977 325459 368390 376660 622721
36586F22721M07020P2348n60582q68906o40865k67611p5417O0654L06864N06289
$$ 622721 1029741 1102089 541507 -327399 -968264 -1235875 -1311292 -1250638 -943774 -437485
36576d37485M49125K05472k254k5221K03709N87157P17125K18640o00505q96168
$$ -437485 11640 217112 214858 189637 393346 980503 1697628 1916268 1315763 419595
36566D19595l65205K64394K21576k32439k72950K14960N16150K12758k36448k57465
$$ 419595 54390 318784 540360 307921 34971 249931 766081 978839 742391 484926
$$ [...]
##END NTUPLES=NMR SPECTRUM
##END=
