##TITLE=31Pdec_100-2024
 CDCl3, 24 sc
 5.12.2024
##JCAMPDX= 6.0         $$ Bruker NMR JCAMP-DX V2.0
##DATA TYPE= NMR SPECTRUM
##DATA CLASS= NTUPLES
##ORIGIN= UXNMR, Bruker Analytische Messtechnik GmbH
##OWNER= root
$$ XWIN-NMR		Version 3.5
$$ Thu Dec  5 13:59:54 2024 Russian Standard Time (UT+4h)  she@DPX200
##.OBSERVE FREQUENCY= 81.013821
##.OBSERVE NUCLEUS= ^31P
##.ACQUISITION MODE= SIMULTANEOUS
##.ACQUISITION SCHEME= undefined
##.AVERAGES= 24
##.DIGITISER RES= 17
##SPECTROMETER/DATA SYSTEM= spect
##.PULSE SEQUENCE= zgpg30
##.SOLVENT NAME= DMSO
##.SHIFT REFERENCE= (INTERNAL, DMSO, 0, 198.062)
##AUDIT TRAIL= $$ (NUMBER, WHEN, WHO, WHERE, WHAT)
$$ ##TITLE= Audit trail, XWIN-NMR		Version 3.5
$$ ##JCAMPDX= 5.01
$$ ##ORIGIN= Bruker BioSpin GmbH
$$ ##OWNER= she
$$ F:/spectra/data/she/nmr/P31/2/pdata/1/auditp.txt
$$ ##AUDIT TRAIL=  $$ (NUMBER, WHEN, WHO, WHERE, WHAT)
(   1,<2024-12-05 13:58:58.04 +0400>,<she>,<DPX200>,
      <created by zg, POWCHK disabled, PULCHK disabled
       configuration hash MD5:
       00 E9 B6 7A A2 85 ED C7 34 08 36 98 17 FE 4E 26
       data hash MD5: 32K
       EA 2E A4 9E F9 AA 80 35 0B 77 BA 94 5E 4A 33 A7>)
(   2,<2024-12-05 13:59:00.67 +0400>,<she>,<DPX200>,
      <Start of raw data processing
       efp BC_mod = 2 LB = 1.5 FT_mod = 6 PKNL = 1 PHC0 = 2284.888 PHC1 = 72.8883 SI = 64K 
       data hash MD5: 64K
       44 45 E3 CC 01 6D F9 18 1C DC FB 66 38 0D 16 49>)
(   3,<2024-12-05 13:59:15.75 +0400>,<she>,<DPX200>,
      <pk PHC0 = -7.046274 PHC1 = 0 
       data hash MD5: 64K
       DA 29 C7 38 52 6B EB A9 10 A2 6F EF D7 CC 80 3E>)
(   4,<2024-12-05 13:59:19.17 +0400>,<she>,<DPX200>,
      <abs ABSG = 5 
       data hash MD5: 64K
       17 1A BD 16 00 68 24 A5 22 26 E9 2B 54 15 12 D3>)
$$ ##END=
$$ 
$$ hash MD5
$$ 4B 2C 62 76 54 29 D1 F3 58 51 5B 4B 93 FB 46 08
##$RELAX= 
##$RELAX= 
##$RELAX= 
##$RELAX= 
##$RELAX= 
##$RELAX= 
##$RELAX= 
##$RELAX= 
$$ Bruker specific parameters
$$ --------------------------
##$DU= <F:/spectra>
##$EXPNO= 2
##$NAME= <P31>
##$PROCNO= 1
##$TYPE= <nmr>
##$USER= <she>
##$AMP= (0..31)
100 100 100 100 100 100 100 100 100 100 100 100 100 100 100 100 100 100 
100 100 100 100 100 100 100 100 100 100 100 100 100 100 
##$AQSEQ= 0
##$AQ_mod= 1
##$AUNM= <au_zg>
##$AUTOPOS= <>
##$BF1= 81.014009
##$BF2= 200.13
##$BF3= 200.13
##$BF4= 200.13
##$BF5= 200.13
##$BF6= 200.13
##$BF7= 200.13
##$BF8= 200.13
##$BYTORDA= 1
##$CFDGTYP= 0
##$CFRGTYP= 5
##$CHEMSTR= <none>
##$CNST= (0..31)
1 1 145 1 1 1 1 1 1 1 1 1 1 1 1 1 1 1 1 1 1 1 1 1 1 1 1 1 1 1 1 1 
##$CPDPRG= <waltz16>
##$CPDPRG1= <>
##$CPDPRG2= <waltz16>
##$CPDPRG3= <>
##$CPDPRG4= <mlev>
##$CPDPRG5= <mlev>
##$CPDPRG6= <mlev>
##$CPDPRG7= <mlev>
##$CPDPRG8= <mlev>
##$CPDPRGB= <>
##$CPDPRGT= <>
##$D= (0..31)
0 1 0 0 0 0 0 0 0 0.06 0 0.03 2e-05 3e-06 0 0 0.0002 0 0 0 0 0 0 0 0 0 
0 0 0 0 0 0 
##$DATE= 1733392737
##$DBL= (0..7)
120 120 120 11 120 120 24 19 
##$DBP= (0..7)
150 150 150 150 150 150 150 150 
##$DBP07= 0
##$DBPNAM0= <>
##$DBPNAM1= <>
##$DBPNAM2= <>
$$ [...]
##$SUBNAM3= <"">
##$SUBNAM4= <"">
##$SUBNAM5= <"">
##$SUBNAM6= <"">
##$SUBNAM7= <"">
##$SUBNAM8= <"">
##$SUBNAM9= <"">
##$SW= 400.765351723535
##$SWIBOX= (0..15)
0 1 3 0 0 0 0 0 0 0 0 0 0 0 0 0 
##$SW_h= 32467.5324675325
##$TD= 32768
##$TD0= 1
##$TE= 0
##$TE2= 300
##$TE3= 300
##$TEG= 300
##$TL= (0..7)
0 120 53 12 22 120 120 120 
##$TP= (0..7)
150 150 150 150 150 150 150 150 
##$TP07= 0
##$TPNAME0= <>
##$TPNAME1= <>
##$TPNAME2= <>
##$TPNAME3= <>
##$TPNAME4= <>
##$TPNAME5= <>
##$TPNAME6= <>
##$TPNAME7= <>
##$TPOAL= (0..7)
0.5 0.5 0.5 0.5 0.5 0.5 0.5 0.5 
##$TPOFFS= (0..7)
0 0 0 0 0 0 0 0 
##$TUNHIN= 0
##$TUNHOUT= 0
##$TUNXOUT= 0
##$USERA1= <user>
##$USERA2= <user>
##$USERA3= <user>
##$USERA4= <user>
##$USERA5= <user>
##$V9= 5
##$VALIST= <valist>
##$VCLIST= <CCCCCCCCCCCCCCC>
##$VD= 0
##$VDLIST= <DDDDDDDDDDDDDDD>
##$VPLIST= <PPPPPPPPPPPPPPP>
##$VTLIST= <TTTTTTTTTTTTTTT>
##$WBST= 1024
##$WBSW= 4
##$XGAIN= (0..3)
0 0 0 0 
##$XL= 0
##$YL= 0
##$YMAX_a= 10748
##$YMIN_a= -3831
##$ZGOPTNS= <>
##$ZL1= 120
##$ZL2= 120
##$ZL3= 120
##$ZL4= 120
##$ABSF1= 198.0616
##$ABSF2= -202.7028
##$ABSG= 5
##$ABSL= 3
##$ALPHA= 0
##$AQORDER= 0
##$ASSFAC= 0
##$ASSFACI= 0
##$ASSFACX= 0
##$ASSWID= 0
##$AUNMP= <proc_1d>
##$AZFE= 0.1
##$AZFW= 0.5
##$BCFW= 0
##$BC_mod= 2
##$BYTORDP= 0
##$COROFFS= 0
##$CY= -3
##$DATMOD= 1
##$DC= 0
##$DFILT= <>
##$DTYPP= 0
##$F1P= 0
##$F2P= 0
##$FCOR= 1
##$FTSIZE= 65536
##$FT_mod= 6
##$GAMMA= 0
##$GB= 0
##$INTBC= 1
##$INTSCL= 9.790993e-09
##$ISEN= 30
##$LB= 1.5
##$LEV0= 0
##$LPBIN= 0
##$MAXI= 10000
##$MC2= 0
##$MEAN= 0
##$ME_mod= 0
##$MI= 50
##$NCOEF= 0
##$NC_proc= -7
##$NLEV= 6
##$NOISF1= 182.463
##$NOISF2= 159.3651
##$NSP= 0
##$NTH_PI= 0
##$NZP= 0
##$OFFSET= 198.0616
##$PC= 4
##$PHC0= 2277.842
##$PHC1= 72.8883
##$PH_mod= 1
##$PKNL= yes
##$PPARMOD= 0
##$PSCAL= 0
##$PSIGN= 0
##$REVERSE= no
##$SF= 81.0140089999434
##$SI= 65536
##$SIGF1= 159.3651
##$SIGF2= -187.1042
##$SINO= 113.3802
##$SIOLD= 16384
##$SREGLST= <1H.CDCl3>
##$SSB= 0
##$STSI= 65536
##$STSR= 0
##$SW_p= 32467.5324675325
##$SYMM= 0
##$S_DEV= 0
##$TDeff= 32768
##$TDoff= 0
##$TI= <>
##$TILT= no
##$TM1= 0
##$TM2= 0
##$TOPLEV= 0
##$USERP1= <user>
##$USERP2= <user>
##$USERP3= <user>
##$USERP4= <user>
##$USERP5= <user>
##$WDW= 1
##$XDIM= 65536
##$YMAX_p= 398166648
##$YMIN_p= -147885107
$$ End of Bruker specific parameters
$$ ---------------------------------
##NTUPLES= NMR SPECTRUM
##VAR_NAME=  FREQUENCY,     SPECTRUM/REAL,   SPECTRUM/IMAG
##SYMBOL=    X,             R,               I
##VAR_TYPE=  INDEPENDENT,   DEPENDENT,       DEPENDENT
##VAR_FORM=  AFFN,          ASDF,            ASDF
##VAR_DIM=   65536,         65536,           65536
##UNITS=     HZ,            ARBITRARY UNITS, ARBITRARY UNITS
##FACTOR=    0.49542278885378, 1,            1
##FIRST=     16045.7642231865, 0,            0
##LAST=      -16421.768244346, 0,            0
##MIN=       -16421.768244346, -147885107,   0
##MAX=       16045.7642231865, 398166648,    0
$$ Real data points
##PAGE= N=1
##DATA TABLE= (X++(R..R)), XYDATA
$$ [...]
40266H23659j151550j055572m45759m3757j6153j8713K30698N63031O19319M17629
$$ 823659 -327891 -1383463 -1829222 -1872979 -1889132 -1907845 -1677147 -1114116 -494797 -77168
40256g7168L79285O95981R87727Q25612L24126q8017k58946l32817l68791l31404
$$ -77168 302117 998098 1985825 2811437 3135563 3047546 2788600 2455783 2086992 1755588
40246A755588l49975n98258r48159j072329q75342n48360k47705m531J02275p351
$$ 1755588 1405613 807355 -140804 -1213133 -2088475 -2636835 -2884540 -2889071 -2786796 -2794147
40236b794147k10935l05574l17745m17210n27755l12889L64895J140364J380968
$$ -2794147 -3005082 -3310656 -3628401 -4045611 -4573366 -4886255 -4521360 -3380996 -2000028
40227b000028P30290m60831j239773q95125J65380P56085L74366j55549P1153
$$ -2000028 -1269738 -1730569 -2970342 -3865467 -3700087 -2944002 -2569636 -2725185 -2654032
40218b654032O88091P08048J53474J7144O00912R47931L04503p11760r98136m36813
$$ -2654032 -1965941 -1257893 -1104419 -1087275 -486363 461568 766071 54311 -943825 -1380638
40208a380638J65042K55099L8726n9687O6487K34344K46567R4444k7295K3966
$$ -1380638 -1215596 -960497 -921771 -981458 -914971 -680627 -434060 -339616 -366911 -342945
40198c42945Q9193n5329k29306J25O06066R80901P44616K60209M7063N7192r3735
$$ -342945 -253752 -309081 -538387 -538262 67804 1048705 1793321 2053530 2100593 2157785 2064050
40187B064050m70095p93732q92082q15988o24539l19995P4422M87148P20552M69967
$$ 2064050 1593955 800223 -91859 -907847 -1532386 -1852381 -1777959 -1290811 -570259 -100292
40177a00292k02437n10160K42736J396239J411108K3135j091193n75288O52108
$$ -100292 -302729 -812889 -570153 826086 2237194 2260329 1169136 593848 1245956
40168A245956Q45526L6218l25090J15014K14917m71995q61108k46801M59951K50460
$$ 1245956 2091482 2127700 1802610 1917624 2132541 1660546 799438 552637 1012588 1263048
40158A263048m42904o89436n31841m68900l07138L21244R04181O71206j36818
$$ 1263048 820144 130708 -401133 -870033 -1177171 -855927 48254 719460 582642
40149E82642o77146q09581r15296p73829J24967J281182J497379O27960j57814
$$ 582642 -94504 -904085 -1819381 -2593210 -2468243 -1187061 310318 938278 780464
40140G80464j03935K70654L84010N00822Q25580P46135j24264r04394m69337Q50951
$$ 780464 676529 947183 1331193 1832015 2657595 3403730 3279466 2375072 1905735 2756686
40130B756686J536159P79590n83669j156083n36530L53542L41506o58219j475454
$$ 2756686 4292845 5072435 4488766 3332683 2796153 3149695 3491201 2832982 1357528
40121A357528j070874Q4059N60469j28678r54212r19758l30483J4942J22262M78429
$$ 1357528 286654 370713 931182 802504 -151708 -1071466 -1401949 -1387007 -1264745 -786316
40111g86316R33617Q11731j6810q68325j014361l09220P36664J185513M29178
$$ -786316 147301 959032 942222 73897 -940464 -1249684 -513020 672493 1101671
40102A101671q33368r78278N11116K017892J699337j18863j527073j557000q60381
$$ 1101671 268303 -709975 -198859 1819033 3518370 3399507 1872434 315434 -544947
40093e44947j77871L73335M77347l31126j412641j279570K59884J500458J141796
$$ -544947 -722818 -349483 127864 -203262 -1615903 -2895473 -2635589 -1135131 6665
40084F665J3427l95799m6061J14382j47629l35919l60339n19896o82726m91341
$$ 6665 20092 -375707 -421768 -307386 -455015 -790934 -1151273 -1671169 -2353895 -2845236
40074b845236j21009N3670K35418P45085J116023O56292k98319p31401m48432
$$ -2845236 -2966245 -2912575 -2677157 -1932072 -816049 -159757 -458076 -1189477 -1637909
40065a637909j95637k76836j26648N27693J059864Q81924K29381l58459p00303
$$ -1637909 -1833546 -2110382 -2237030 -1709337 -649473 232451 461832 103373 -596930
40056e96930p76273m65216J34417N72026N65618L21435J53127J45982K93634N15174
$$ -596930 -1373203 -1838419 -1704002 -1131976 -566358 -244923 -91796 54186 347820 862994
40046H62994M44707k51723j172919j357339m43648Q19951J505455J473915J103999
$$ 862994 1307701 1055978 -116941 -1474280 -1917928 -1097977 407478 1881393 2985392
40037B985392N50468k32556j020870j382630j168562o49195j96755N151J3816
$$ 2985392 3535860 3303304 2282434 899804 -268758 -917953 -1114708 -1109557 -1095741
40028a095741L2626K29930N94880R75819J182425J010617L79085m13032q40371
$$ -1095741 -1063115 -833185 -238305 737514 1919939 2930556 3309641 2896609 2056238
40019B056238p92865p28059q82536p93072j05894O23198O58775K08270m1142j34342
$$ 2056238 1263373 535314 -347222 -1140294 -1246188 -622990 35785 244055 202913 68571
40009F8571n39253q96085l69196P58210J228634P93663O27141J262314J567225
$$ 68571 -470682 -1366767 -1735963 -977753 250881 1044544 1671685 2933999 4501224
40000D501224O19473o96703j074643p14143o17566p74802m18200M06338Q54055
$$ 4501224 5120697 4423994 3349351 2635208 2017642 1242840 824640 1230978 2085033
39991B085033O55981L35153J46594j92668p23481j035261q67521l28874L23141
$$ 2085033 2741014 3076167 3222761 3030093 2306612 1271351 403830 74956 398097
39982C98097O01763p2582j428140k031832q85294J038399J889661J277502M01560
$$ 398097 999860 927278 -500862 -2532694 -3417988 -2379589 -489928 787574 1189134
39973A189134R9061M0055j49358k65847k50676l79878m76748l8893N92353L89654
$$ 1189134 1288195 1328250 1178892 913045 662369 282491 -194257 -233150 359203 748857
39963G48857o20211j010860j3032J213592J236205L33704j94374N180J89804m5797
$$ 748857 128646 -882214 -895246 318346 1554551 1888255 1693881 1699061 1888865 1843068
39953A843068k84798k06316j21616l91206q16360q39532j92541P04862J037014
$$ 1843068 1558270 1351954 1230338 839132 22772 -816760 -1009301 -304439 732575
39944G32575M74112l43884n90513l47784k54928k28784L80833J215305Q77800
$$ 732575 1206687 862803 272290 -75494 -330422 -559206 -178373 1036932 1914732
39935A914732q19127j940481r91707P12982Q71498l76192q26267K07834R07652
$$ 1914732 1095605 -844876 -1836583 -1123601 -252103 -628295 -1454562 -1246728 -339076
39926c39076O6619q87372k36080J249118J573076O02695K781M27632O60216j65054
$$ -339076 -272457 -1159829 -1395909 -146791 1426285 2028980 2031761 2459393 3119609 2954555
39916B954555j126089j062297l27956l405k09605l04482k14361m07297p58820
$$ 2954555 1828466 766169 438213 434808 225203 -79279 -293640 -700937 -1459757
39907a459757n68079K30966Q49138Q27395N77881M86644L21301j01419m60740
$$ -1459757 -2027836 -1796870 -947732 -120337 457544 944188 1265489 1164070 703330
39898G03330o02745q94276j353017j193306K2040J415145J810407J231925N70099
$$ 703330 100585 -793691 -2146708 -3340014 -3317974 -1902829 -92422 1139503 1709602
39889A709602K18554n3726k47044j26988J29313J66865J41208L57602N28238K95603
$$ 1709602 1928156 1874430 1627386 1500398 1629711 1796576 1937784 2295386 2823624 3119227
39879C119227J02676M22895N07294o79886k431751k804620j332031L19022P62583
$$ 3119227 3221903 3644798 4152092 3472206 1040455 -1764165 -3096196 -2777174 -2014591
39870b014591M28371J87389M9482N568O18112J720164J898220M92291j069288
$$ -2014591 -1586220 -1398831 -1349349 -1343781 -725669 994495 2892715 3385006 2315718
39861B315718j222014m71437k40520m96945j78342O79174R60710L54152l00165
$$ 2315718 1093704 622267 381747 -115198 -293540 385634 1346344 1700496 1400331
39852A400331m46928l15430p1078L58139O86146N39992J59025j23156o73005j690820
$$ 1400331 953403 637973 566895 925034 1611180 2151172 2310197 2187041 1514036 -176784
39842a76784k093568p81728J307828K112971J324172N85280P23350O99483k09287
$$ -176784 -2270352 -3052080 -1744252 368719 1692891 2278171 3001521 3701004 3491717
39833C491717j083750j083269q36555j042105j108342m05666L32002J84751l23915
$$ 3491717 2407967 1324698 488143 -553962 -1662304 -2067970 -1735968 -1551217 -1875132
39824a875132j18130O46950J014792Q66131Q09643Q30801L43464n92951j255906
$$ -1875132 -1993262 -1346312 -331520 534611 1344254 2175055 2518519 1925568 669662
39815F69662j364128j199087p77848M6826P74018O88884J68122L87321J459180
$$ 669662 -694466 -1893553 -2671401 -2624575 -1850557 -1161673 -993551 -606230 852950
39806H52950J987311R87963o98243j582324j353365p69019l15330J21736N33455
$$ 852950 2840261 3828224 3129981 1547657 194292 -574727 -890057 -768321 -234866
39797b34866O24418L83903J37298n0010m14034q23390p20871l3620M61947J88054
$$ -234866 389552 773455 910753 860743 446709 -376681 -1097552 -1131172 -669225 -481171
39787d81171k91605m2910Q10473J212758O76353j48430n45327n70371m91066j81052
$$ -481171 -772776 -815686 -5213 1207545 1883898 1735468 1190141 619770 128704 -52348
39777e2348L65137N92200J91864j70719K29314R17599P94714k42128j200347j449655
$$ -52348 312789 904989 1096853 926134 1155448 2073047 2867761 2625633 1425286 -24369
39767b4369j310149j095245n52901M03888J224628J416563J110010N90595j28396
$$ -24369 -1334518 -2429763 -2982664 -2578776 -1354148 62415 1172425 1763020 1634624
39758A634624r01891j210659p88762q6754K58255Q1659l74094p26718m85482N82493
$$ 1634624 732733 -477926 -1266688 -1353442 -1095187 -1013528 -1387622 -2114340 -2599822 -2017329
39748b017329J823270K055045R68037l86804r30100p90910o84744o39183j09673
$$ -2017329 -194059 1860986 2829023 2442219 1512119 721209 36465 -602718 -712391
39739g12391R12430J644952J381505J89585j218844k027707j842009r34401P8950
$$ -712391 200039 1844991 3226496 3416081 2197237 169530 -1672479 -2606880 -2527930
39730b527930Q36546J297612J333586Q03124P9775j77842p518j94206j001128
$$ -2527930 -1691384 -393772 939814 1742938 1822713 1644871 1637353 1443147 442019
39721D42019j578916j138071m6871Q24660J248729J465673J409631Q83756J76617
$$ 442019 -1136897 -2274968 -2321839 -1497179 -248450 1217223 2626854 3510610 3687227
39712C687227j94760j69307q6753k04047o10131j202036j438710p56666L62304
$$ 3687227 3492467 3323160 3236407 3032360 2422229 1220193 -218517 -975183 -612879
39703f12879N67514m79495j302888o10823P46928J004345Q865q23322o72170l9963
$$ -612879 -45365 -524860 -1827748 -2438571 -1691643 -687298 -678433 -1501755 -2173925 -2213888
39693b213888M90160Q38649P79248K8741q47827q05041J80960J026018J118149
$$ -2213888 -1723728 -885079 -105831 -77090 -924917 -1729958 -1548998 -522980 595169
39684E95169R07298P38369K84414m57157p12533q0772O97109O92049j05973j027536
$$ 595169 1502467 2240836 2525250 2068093 1355560 1274788 1971897 2663946 2557973 1530437
39674A530437j482482j206229l62283L79996M50025J29033O6353J85723k0281
$$ 1530437 47955 -1158274 -1520557 -1140561 -690536 -561503 -495150 -309427 -329708
39665c29708k94878K9261N16472J4753j177002j266229K16910J311769M83044
$$ -329708 -624586 -595325 -78853 -64100 -1241102 -2507331 -2290421 -978652 -495608
39656d95608r86631r96301K19162P39304k3418q26877p94699l78757j15258J04177
$$ -495608 -1482239 -2478540 -2259378 -1520074 -1543492 -2370369 -3165068 -3543825 -3659083 -3554906
39646c554906L20292K51407l6281j46555j01552j73930o3074P06862J613088J544313
$$ -3554906 -3234614 -2983207 -3019488 -3166043 -3267595 -3441525 -3504599 -2797737 -1184649 359664
39636C59664N01903l04761k86387j41697l11959j22960P70229J301951M78972
$$ 359664 861567 556806 270419 128722 -183237 -306197 464032 1765983 2244955
39627B244955q94834j204355k50810O86138P54401L28898o9771m97626r29192
$$ 2244955 1350121 145766 -105044 581094 1335495 1664393 1594622 1096996 167804
39618A67804q68798j83255L73249J07382n98945q47080m47751Q6959N30493J087958
$$ 167804 -700994 -884249 -511000 -403618 -1002563 -1849643 -2297394 -2210435 -1679942 -591984
39608e91984J534343J109534k95088j522161j375368j07132R41721R75185M00664
$$ -591984 942359 2051893 1756805 234644 -1140724 -1247856 -306135 669050 1069714
39599A069714k7364o6017P9741J20145j74199p68850j205481j028024l99279J15623
$$ 1069714 1042350 976333 1056074 1176219 1002020 233170 -972311 -2000335 -2399614 -2283991
39589b283991L25594M43753M40010J17900j45699L13721J174769J188841M0288
$$ -2283991 -1958397 -1514644 -1074634 -956734 -1102433 -788712 386057 1574898 1615186
39580A615186r04052n27253L38111K81641m20594l84222M76958P78943n4140r43492
$$ 1615186 711134 183881 521992 803633 383039 -1183 475775 1254718 1200578 257086
39570B57086j022272q84484j194253j310958m22439Q30993J152782N52162K46084
$$ 257086 -765186 -1649670 -2843923 -4154881 -4577320 -3746327 -2593545 -2041383 -1795299
39561a795299P34074J176600Q71319K74265R0521J92938Q6294j38379m5384K61715
$$ -1795299 -1061225 115375 986694 1260959 1351480 1544418 1630712 1492333 1446949 1708664
39551A708664K06402l86811j049658j293164j007747k97750N41984Q87059K72236
$$ 1708664 1915066 1528255 478597 -814567 -1822314 -2120064 -1578080 -691021 -418785
39542d18785p93317j125737l24130O06316N04633n35942j457462j502488p02576
$$ -418785 -1212102 -2337839 -2661969 -2055653 -1551020 -2086962 -3544424 -5046912 -5749488
39533e749488M65558J347078J410961Q49796M82351N34911J64294j017803j739221
$$ -5749488 -5283930 -3936852 -2525891 -1676095 -1193744 -658833 -494539 -1512342 -3251563
39524c251563o88879J199046J727999N68781l63215J04731Q59594O05955j82717
$$ -3251563 -3940442 -2741396 -1013397 -444616 -807831 -703100 156494 762449 579732
39515E79732m26418j35350J93051O46038J167947R08477l73410j292355o85197
$$ 579732 153314 17964 211015 857053 2025000 2933477 2560067 1267712 582515
39506E82515M34021L57983o58685r95258l50251Q5535j07513q9815L72966M08800
$$ 582515 1016536 1374519 715834 -279424 -629675 -544140 -651653 -741468 -368502 40298
39496D0298k20737n23110M3659P00450P13616L74072J05010j69757k61894L71286
$$ 40298 -180439 -703549 -659890 40560 754176 1128248 1233258 1063501 801607 1172893
39486A172893J318080J141902n15417j962992j633538k05688N94771M46023L44769
$$ 1172893 2490973 3632875 3117458 1154466 -479072 -684760 -89989 356034 700803
39477G00803O23772N10888l58038j188758j122730l40744K83149K32498k05827
$$ 700803 1324575 1835463 1477425 288667 -834063 -1174807 -891658 -659160 -864987
39468h64987l72172L8439O91665J059593R97272O72871J53642m90543q48220n76863
$$ -864987 -1237159 -1198720 -507055 552538 1549810 2222681 2376323 1885780 1037560 460697
39458D60697j23941l14438j114201j544819j033265j10152N03478P46049P78341
$$ 460697 336756 22318 -1091883 -2636702 -3669967 -3780119 -3276641 -2530592 -1752251
39449a752251M42591k94238q97277q03627q7247P17097J113988Q55037J36546
$$ -1752251 -1309660 -1603898 -2501175 -3304802 -3392049 -2674952 -1560964 -705927 -569381
39440e69381l43243j19636K51277q4193p95601o64000M88096J380072J192331
$$ -569381 -912624 -1032260 -780983 -865176 -1660777 -2324777 -1836681 -456609 735722
39431G35722O60881O34556P51294L83537j73717l81895l84719l80063m1307N18216
$$ 735722 1396603 2031159 2782453 3165990 2992273 2610378 2225659 1845596 1804289 2322505
39421B322505K69102j128944k245841j667924l71J178705J467237J359398P63570
$$ 2322505 2591607 1462663 -783178 -2451102 -2451473 -1272768 194469 1553867 2317437
39412B317437n03918j462057j044336R465J32702n72399o86771k4721K24898j51889
$$ 2317437 1813519 351462 -692874 -683409 -550707 -1123106 -1809877 -1834598 -1609700 -1761589
39402a761589q0313N22824L80646o29587p76173P03666K045560J560385J53589
$$ -1761589 -1841902 -1319078 -938432 -1568019 -2344192 -1640526 405034 1965419 2119008
39393B119008k98596K14586L34490k11489m10361J19839N31524J28737p18482
$$ 2119008 1820412 2034998 2369488 2157999 1747638 1867477 2399001 2527738 1809256
39384A809256j197035r18413j13638N93423O71001K16822j83930k59501k63536
$$ 1809256 612221 -306192 -419830 173593 844594 1061416 877486 617985 354449
39375C54449k64163O6948O19500N86667l69408j346279j288774l86630K55274
$$ 354449 90286 157234 776734 1363401 993993 -352286 -1641060 -2027690 -1772416
39366a772416l1p89895j296879r50120O3641P69036M09714l72678j87134J026183
$$ -1772416 -1772447 -2562342 -3859221 -4809341 -4745700 -3976664 -3566950 -3939628 -4126762 -3100579
39356c100579J664532P91628l96389m04118L57902N21417P4868J45188Q87263
$$ -3100579 -1436047 -644419 -1040808 -1444926 -1087024 -565607 -490739 -345551 541712
39347E41712J207853N87021k34169n62099n37613l96886p1548J88330j42166q27171
$$ 541712 1749565 2336586 2102417 1540318 1002705 605819 534271 722601 580435 -246736
39337b46736q77102m2483O45018L93802j54478J4183P23420R66779M19528k58078
$$ -246736 -1123838 -1166321 -521303 -127501 -281979 -267796 455624 1422403 1841931 1583853
39327A583853m74485l28860j57702o0671l8817j70802m11645m78873j97692J64379
$$ 1583853 1109368 780508 622806 562135 523318 352516 -59129 -538002 -735694 -571315
39317e71315J68907j88614m09180j60484K31669K51521l8984j50707n958k6170
$$ -571315 -402408 -591022 -1000202 -1160686 -929017 -677496 -716480 -867187 -873145 -899315
39307h99315k70375j72985M98415J070227R02891L49981Q8186k4124n37460j173517
$$ -899315 -1169690 -1342675 -844260 225967 1128858 1478839 1567025 1542901 1005441 -168076
39297a68076j033357m6172P54898O17837o8738n48273n80102k55709L33228Q41142
$$ -168076 -1201433 -1247605 -492707 125130 56392 -491881 -1071983 -1327692 -994464 -153322
39287a53322P43123J28902j65879K85263P92946N79503o0395l80473m79424r90290
$$ -153322 589801 718703 552824 838087 1631033 2210536 2150141 1769668 1290244 299954
39277B99954j689882j552975m04797N13915K02520o53380o75491K56157R71372
$$ 299954 -1389928 -2942903 -3347700 -2833785 -2631265 -3284645 -3960136 -3703979 -2732607
39268b732607P75272K83513K86774O35056P60364O69894P22206P97785M51984
$$ -2732607 -1957335 -1673822 -1387048 -751992 8372 678266 1400472 2198257 2650241
39259B650241k55544p86275r31456r41711q92606o45543m41870o87294j028658
$$ 2650241 2394697 1608422 676966 -264745 -1157351 -1802894 -2244764 -2932058 -3960716
39250c960716o18978M09710Q35597K52140j00965O68786J426426P12727p06103
$$ -3960716 -4579694 -4169984 -3334387 -3082247 -3183212 -2514426 -1088000 -375273 -1081376
39241a081376p40707Q66858K085234J488640J6p74412n77562j47592O1175j4882
$$ -1081376 -1822083 -955225 1130009 2618649 2618665 1844253 1266691 1119099 1180274 1165392
39231A165392m14153q94448r37028n26472k53380k48267Q8178P94168Q78664m7512
$$ 1165392 751239 -143209 -1080237 -1606709 -1860089 -2108356 -2020178 -1226010 -347346 -394858
39221c94858p42463n6367J189417J351532L43271n39951p16943p33252p90402
$$ -394858 -1137321 -1193688 -4271 1347261 1690532 1150581 433638 -299614 -1090016
39212a090016m34935J81874K16153l70661n58967O4317O59115O56252O31707R54650
$$ -1090016 -1524951 -1343077 -1126924 -1497585 -2056552 -1992235 -1333120 -676868 -45161 909489
39202I09489Q53380j50958r87955n00666O20465P58811k28351r10980m25448N51631
$$ 909489 1762869 1611911 623956 123290 743755 1502566 1274215 363235 -62213 489418
39192D89418J008609O90843r8775q02893o48913O00782J847829J693529M22848
$$ 489418 1498027 2188870 2090095 1287202 638289 1239071 3086900 4780429 5203277
39183E203277k75185J40245K42053r39784k165872j880078o39030o6889k19967
$$ 5203277 4928092 5068337 5310390 4370606 2204734 324656 -314374 -381263 -601230
39174f01230J78152J248115J622902P36249l16106o42575o78098p99732l92103
$$ -601230 -423078 825037 2447939 3184188 2868082 2225507 1547409 747677 355574
39165C55574P09240J230220K55146j014244p98432O29797J407110Q08960o4721
$$ 355574 1064814 2295034 2550180 1535936 737504 1367301 2774411 3583371 3518650
39156C518650l02128l27688o86294j023374r18997p22149q18099q16772k34638
$$ 3518650 3216522 2888834 2202540 1179166 260169 -461980 -1280079 -2096851 -2331489
39147b331489N42865P47540L84482J95900N37046Q72102N47278k70269p04049
$$ -2331489 -1788624 -1041084 -656602 -460702 76344 948446 1495724 1225455 521406
39138E21406k20380O33704Q19611J24083n51777m38646Q9379K24134o9913k73051
$$ 521406 301026 934730 1754341 1878424 1326647 888001 977380 1201514 1131601 858550
39128H58550k97911l43039r6998P78823J535883J021968m42729j276968r89898
$$ 858550 560639 217600 120602 899425 2435308 3457276 3014547 1737579 747681
39119G47681p56357j104884q21804P21138J866435J036817n08624m26530R94698
$$ 747681 -8676 -1113560 -1935364 -1214226 652209 1689026 1180402 753872 1748570
39110A748570J256266m04180j926962j741125q96083q62406j108736l74045R62627
$$ 1748570 3004836 2600656 673694 -1067431 -1963514 -2825920 -3934656 -4308701 -3346074
39101c346074J475367R57016N22195P06569Q27493L08392m39006p12432l53316
$$ -3346074 -1870707 -913691 -391496 315073 1142566 1450958 1011952 299520 -53796
39092e3796L48604J016390J249034P95940q6772p49080p98760m64570k34032k99872
$$ -53796 294808 1311198 2560232 3356172 3269400 2520320 1721560 1256990 1022958 723086
39082G23086m42775l69238j08817l4565l96817r03213r92006m93555K80312J036054
$$ 723086 280311 -88927 -197744 -232309 -629126 -1532339 -2524345 -3017900 -2737588 -1701534
39072a701534J595393J517055M07629j085115j457366k26066J088818Q10609n81749
$$ -1701534 -106141 1410914 1818543 733428 -723938 -950004 138814 949423 367674
39063C67674j158132k98026O15729M15323l14672m99987j87524N394J35769N27388
$$ 367674 -790458 -1088484 -472755 -57432 -372104 -872091 -1059615 -1054221 -918452 -391064
39053c91064P41628J81841n85453l87966O76809J180867M78274l12894n2479P43231
$$ -391064 350564 532405 -53048 -441014 235795 1416662 1894936 1582042 1529563 2272794
39043B272794Q91424M29802L18472O24189L09739j021316k291185k337794j333326
$$ 2272794 3164218 3594020 3912492 4536681 4846420 3825104 1533919 -803875 -2137201
39034b137201k60543L78829O75839O39927K28253j49675P0723P65017J166550
$$ -2137201 -2397744 -2018915 -1343076 -703149 -474896 -624571 -553848 211169 1377719
39025A377719Q39985J06772n57391j002701j148192q16504j18319M43805N56928
$$ 1377719 2217704 2324476 1767085 764384 -383808 -1200312 -1318631 -874826 -317898
39016c17898M02244J51764l24101q97085r33572k16501L94318L7717p56249p17376
$$ -317898 84346 236110 -87991 -985076 -1918648 -2135149 -1740831 -1703114 -2459363 -3176739
39006c176739K60817R70073P77958M90940Q19640J094511M25626o82489j029319
$$ -3176739 -2915922 -1945849 -1167891 -676951 142689 1237200 1662826 980337 -48982
38997d8982n49802k01489k13714J91038J105259J305050M8215j478810j541527
$$ -48982 -598784 -800273 -1013987 -822949 282310 1587360 1635575 156765 -1384762
38988a384762j79547Q94761N89426l46528o27871j89697o0762p77043j537833
$$ -1384762 -1564309 -669548 -80122 -426650 -1054521 -1244218 -1304980 -2082023 -3619856
38979c619856j158312M07888J884838K088029J173564J87641k99033n27251o67505
$$ -3619856 -4778168 -4370280 -2485442 -397413 776151 963792 664759 137508 -529997
38970e29997m14862K94986Q91945R47445P62418O82242M13752l19314r70514q53232
$$ -529997 -944859 -649873 242072 1189517 1951935 2634177 3047929 2728615 1758101 904869
38960I04869k64533k6237j38057J43095R57145J561090J472577R62548K78042
$$ 904869 640336 614099 476042 619137 1576282 3137372 4609949 5572497 5850539
38951E850539o54805j503812j504865o10428J89627J71803k70746n04782n20984
$$ 5850539 5195734 3691922 2187057 1576629 1766256 1938059 1667313 1162531 641547
38942F41547m20019J6723N59452K85542r94305j906945j178861N36567J586109
$$ 641547 221528 238251 797703 1083245 88940 -1818005 -2996866 -2460299 -874190
38933h74190J468278Q85580K26422n99284j155387q26333j11174j20781p02652
$$ -874190 594088 1479668 1706090 1106806 -48581 -874914 -986088 -1106869 -1809521
38924a809521n35813O44873J415465P92400l64795q08465n67059l01432l4743
$$ -1809521 -2345334 -1700461 -284996 507404 142609 -665856 -1232915 -1534347 -1569090
38915a569090M85092R25636Q31234L81680r0134p36155j581421j934665j317637
$$ -1569090 -1083998 -158362 672872 1054552 964418 228263 -1353158 -3287823 -4605460
38906d605460m28631k08707l92481j3076R58339J547370J263306O78716M38228
$$ -4605460 -5034091 -5242798 -5635279 -5648355 -4690016 -3142646 -1879340 -1200624 -762396
38897g62396M77942L98301N6152l30176l35727K81040J039646R75975j10127j128506
$$ -762396 -284454 113847 169999 -160177 -495904 -214864 824782 1800757 1690630 562124
38887E62124j047455k35111L27868N62559R40266J147813N01767n24667o88635
$$ 562124 -485331 -720442 -392574 169985 1110251 2258064 2759831 2235164 1546529
38878A546529M4447L89356j56025o09428l44445q1244l28755l56515K73704N63807
$$ 1546529 1590976 1980332 1824307 1214879 870434 789190 460435 103920 377624 941431
38868I41431k27914r68064l13299R09944P90848o76671j517946o39993Q90422
$$ 941431 713517 -254547 -567846 342098 1132946 456275 -1061671 -1701664 -811242
38859h11242J635535J369512N22324n70370j310796r46235K77208J050997P46486
$$ -811242 824293 2193805 2716129 2145759 834963 -111272 165936 1216933 1963419
38850A963419K73395M90738P58556Q4316j075882j411697p65948l03079p01829
$$ 1963419 2236814 2727552 3486108 3570424 2494542 1082845 316897 13818 -688011
38841f88011j276954j132897l16473N41210J051850J105448O02429l08544r86994
$$ -688011 -1964965 -3097862 -3414335 -2873125 -1821275 -715827 -113398 -421942 -1408936
38832a408936q21119Q621O52537N86443K15865K53772O58547O33977j62839r06042
$$ -1408936 -2230055 -2221434 -1568897 -982454 -766589 -512817 145730 779707 616868 -289174
38822b89174o42810K39693M33494l42008p91157N6281J286279J345226K49813
$$ -289174 -931984 -692291 -258797 -600805 -1391962 -1335681 -49402 1295824 1545637
38813A545637n56865l00458L40114N80916N11561L99661O5915m77134o21860j08013
$$ 1545637 988772 688314 1028428 1609344 2120905 2520566 2586481 2109347 1487487 1379474
38803A379474L02792j22029q62171q15049J05449Q67877P21357k1880o09717o61437
$$ 1379474 1682266 1560237 698066 -116983 -11534 856343 1577700 1555820 946103 284666
38793B84666l01681N1784J1583l10592k80497M04639J064338Q19694j40544p79805
$$ 284666 -17015 34769 46352 -264240 -544737 -140098 924240 1743934 1603390 823585
38783H23585o28234j89045J12253M72017Q90431P02421m26771j630114j706951
$$ 823585 195351 6306 118559 590576 1481007 2183428 1756657 126543 -1580408
38774a580408o08301N26561O90527n0436q10456p54491J46325J003075Q67594
$$ -1580408 -2188709 -1662148 -971621 -1022057 -1832513 -2587004 -2440679 -1437604 -570010
38765e70010j29035q59334o33959k4525J53962Q1863M43033J143285J444071J194517
$$ -570010 -699045 -1558379 -2192338 -2216863 -2062901 -1981038 -1538005 -394720 1049351 2243868
38755B243868R53968Q39693K57836q81993j598096j104341l010N10563K25199
$$ 2243868 3197836 4037529 4295365 3413372 1815276 710935 707925 1218488 1443687
38746A443687o1746J09632K95068K7299m12735m64075j26459R3007p0951l28098
$$ 1443687 1381941 1491573 1786641 1813940 1401205 937130 810671 903678 832727 504629
38736E04629l17035j21496j05760l48987m93666k21927L17471P35299R21965J054329
$$ 504629 187594 66098 -39662 -388649 -882315 -1104242 -786771 -51472 870493 1924822
38726A924822J079202N52017p29610k102851k447039j351872L27133J266752R47762
$$ 1924822 3004024 3556041 2826431 723580 -1723459 -3075331 -2748198 -1481446 -533684
38717e33684j3911o94095p44921m34474j34873j1184m1317o9874Q3798L52843
$$ -533684 -547595 -1241690 -1986611 -2421085 -2555958 -2567142 -2608459 -2678333 -2594535 -2241692
38707b241692L75701o281l51696j29704M44467O04816J32540l04811j28125L91125
$$ -2241692 -1865991 -1872272 -2223968 -2353672 -1909205 -1304389 -1171849 -1476660 -1604785 -1213660
38697a213660O88688P10280O82970N25232P0964m18568n62445m69722m82757n32800
$$ -1213660 -524972 185308 868278 1393510 1464474 1045906 483461 13739 -469018 -1001818
38687a001818l64670j92899m05594p23407m61231L26176P72029M60766j57K2680
$$ -1001818 -1366488 -1559387 -1964981 -2688388 -3149619 -2823443 -2051414 -1590648 -1590805 -1568125
38677a568125L11337L24975M2993j60457p3061K71554P00108Q60891N12805K8523
$$ -1568125 -1256788 -931813 -888820 -1049277 -1122338 -850784 -150676 710215 1223020 1251543
38667A251543O6541N66886P56698L88431J08353J80369j33003j160252j793815
$$ 1251543 1318084 1884970 2641668 3030099 3138452 3318821 3185818 2025566 231751
38658B31751j003145L86657P76318J56092j04178L85841N12567k94487j027607
$$ 231751 -771394 -384737 391581 547673 443495 829336 1341903 1047416 19809
38649A9809p08165K07054P49567P61844N51856J29943l80726l50245M32778J064317
$$ 19809 -688356 -481302 268265 1030109 1581965 1711908 1331182 980937 1413715 2478032
38639B478032O81702j98021m64127j11364p6938o07917r30950o21361k71085m72230
$$ 2478032 3159734 2961713 2497586 2386222 2309284 1701367 770417 149056 -122029 -594259
38629e94259r10333q68689j35523Q70423J497789J270882L31735m58763l44565
$$ -594259 -1504592 -2373281 -2508804 -1638381 -140592 1130290 1462025 1003262 658697
38620F58697L40474N44832p8835p50006p14898j58583L18308N02549M73848K62775
$$ 658697 999171 1544003 1465168 715162 264 -158319 159989 662538 1136386 1399161
38610A399161M046m9489P512j97371m88044j45445P86327J103006J56951q88840
$$ 1399161 1403207 1353718 1361230 1163859 675815 530370 1316697 2419703 2576654 1687814
38600A687814o48404L59457N99877N4319R3556Q46454O83493j005365k334963
$$ 1687814 1039410 1398867 1998744 2053063 2146619 2993073 3676566 2671201 336238
38591C36238j512625M06546R32073m39340j813466j631259l42115P31195R53779
$$ 336238 -1176387 -769841 162232 -277108 -2090574 -3721833 -4063948 -3332753 -2378974
38582b378974M89572j92202n25217k33212J99565Q970p16373r82830j82252J139108
$$ -2378974 -1889402 -2081604 -2606821 -2840033 -2640468 -2631498 -3347871 -4330701 -4512953 -3373845
38572c373845K027659K087735J471269M90244m03284p16884l85437J46574N01970
$$ -3373845 -1346186 741549 2212818 2703062 2299778 1582894 1197457 1344031 1846001
38563A846001O59456N48346p5897j038666j560462j119011j42861N37907O02800
$$ 1846001 2505457 3053803 2977906 1939240 378778 -740233 -883094 -345187 257613
38554B57613K70770j84157n27006n15154k09004n8827k72793l95118L2423O70229
$$ 257613 528383 344226 -182780 -697934 -906938 -965765 -1238558 -1633676 -1601253 -931024
38544i31024P75796K35220l19665l81259j37341j56698p43638j536812j646924
$$ -931024 -155228 79992 -239673 -620932 -758273 -914971 -1658609 -3195421 -4842345
38535d842345n02058J246482K104648J391558Q2200m57776j05804K59785J91405
$$ -4842345 -5344403 -4097921 -1993273 -601715 -519515 -977291 -1083095 -823310 -631905
38526f31905M9018J73267M91501Q72541J176324J053532L93805j72185p392M20793
$$ -631905 -582887 -409620 81881 954422 2130746 3184278 3578083 3405898 3398506 3819299
38516C819299P2286j046931j785815j483666o96402o8427M50483Q57137O49574
$$ 3819299 3891585 2844654 1058839 -424827 -1121229 -1189656 -739173 117964 767538
38507G67538j94168o90814j10138R07927J245875P30620n2821p57027j254401
$$ 767538 573370 -117444 -227582 680345 1926220 2656840 2604019 1846992 592591
38498E92591j161166l36360M58902L15314n63970j121744q05242L5991Q78131
$$ 592591 -568575 -904935 -446033 -130719 -694689 -1816433 -2621675 -2585684 -1707553
38489a707553J356343J057888j16745j369767j591328o50398N25982J162136J256065
$$ -1707553 -351210 706678 589933 -779834 -2371162 -3021560 -2495578 -1333442 -77377
38480g7377J038049O04499J91785O7594R262m07119r15807p76600l1558L76641
$$ -77377 960672 1565171 1756956 1824550 1833812 1426693 510886 -265714 -297272 79369
38470G9369N5402k27584J19270N22511L18446m9964J27982M72861J47369n61895
$$ 79369 134771 -92813 26457 548968 867414 817450 945432 1418293 1565662 1003767
38460A003767n63215K15858O07885R4425k84521L96827J279320P52547j211561
$$ 1003767 440552 656410 1264295 1358720 1074199 1471026 2750346 3502893 2291332
38451B291332k786776k473893q03231M87087M76431k10051m56827R3312R07475
$$ 2291332 -495444 -2969337 -3772568 -3285481 -2809050 -3019101 -3475928 -3382616 -2475141
38442b475141J268572Q80186M267p35863q06320k60874K76142L28908J58806L47105
$$ -2475141 -1206569 -326383 -322116 -1057979 -1864299 -2125173 -1849031 -1520123 -1361317 -1014212
38432a014212Q85835J115342O58321k352j48496K37710M87169R9265o72972j115772
$$ -1014212 -128377 986965 1645286 1642934 1494438 1732148 2219317 2318582 1645610 529838
38422E29838q26097j69147P5178l84633r04308o17163M43823J307184J237512
$$ 529838 -296259 -465406 -390228 -774861 -1679169 -2296332 -1852509 -545325 692187
38413F92187N50907L4552p1576j40430m44552q04641r01017o28847j59209J44081
$$ 692187 1243094 1277646 1206070 1065640 621088 -183553 -1084570 -1713417 -1872626 -1728545
38403a728545n1327o64269j103653q18661L6543O93022N80004o8014m66508j12022
$$ -1728545 -1779872 -2444141 -3547794 -4366455 -4329912 -3636890 -3056886 -3124900 -3591408 -3703430
38393c703430O58452J006897N67001p5334j16093M08537P38201N17736K19654
$$ -3703430 -3044978 -2038081 -1471080 -1546414 -1662507 -1253970 -515769 1967 221621
38384B21621K82995M56548L56346J22455N0888M3569o2527o1044J70067K25433
$$ 221621 504616 961164 1317510 1439965 1490853 1534422 1471895 1410851 1580918 1806351
38374A806351j77312n45554l57328k5496k09610n40929j56504O76844P45569j95395
$$ 1806351 1629039 1083485 726157 700661 491051 -49878 -206382 470462 1216031 1020636
38364A020636r60395p48212k29847k56800n50427m16289J06568N84782R38933
$$ 1020636 60241 -687971 -917818 -1174618 -1725045 -2141334 -2034766 -1449984 -511051
38355e11051J094578O03509n34556j287589p51133N44126J309911J066126K63263
$$ -511051 583527 1187036 652480 -635109 -1386242 -842116 467795 1533921 1797184
38346A797184o32814j269601j118101j13095P55884N43160k64394n20743k09115
$$ 1797184 1164370 -105231 -1223332 -1336427 -580543 -37383 -301777 -822520 -1031635
38337a031635j72498l66397K4037P30062M54799p88267j193957Q5845J348345
$$ -1031635 -1204133 -1570530 -1546493 -816431 -361632 -1149899 -2343856 -2258011 -909666
38328i09666Q00650p12856j073703p7323N68670M7293o01621m57341k5705m930
$$ -909666 -109016 -821872 -1895575 -1972898 -1404228 -1356935 -1958556 -2415897 -2441602 -2446532
38318b446532l0832N03266J227702J324395Q35215N84581Q82832R96255J28067
$$ -2446532 -2477364 -1974098 -746396 577999 1413214 1997795 2880627 3876882 4004949
38309D004949j424102k404123j900838l53428R09317J088642N89847J89735k7865
$$ 4004949 2580847 176724 -1724114 -2077542 -1168225 -79583 510264 699999 672134
38300F72134m54946r63229q51721M8508Q04828L80150j010797j960018j333950
$$ 672134 217188 -746041 -1597762 -1549254 -744426 -364276 -1375073 -3335091 -4669041
38291d669041N29435K187035K535562J718433O00708l20000j087180j530725j065617
$$ -4669041 -4139606 -1952571 582991 2301424 2902132 2582132 1494952 -35773 -1101390
38282a101390L62522J658850J598356L18844q18965q57136j59724L51472K68378
$$ -1101390 -738868 919982 2518338 2837182 2018217 1161081 1001357 1352829 1621207
38273A621207k33483q42878j214172r97432k48415L81829L08123k21556m16848
$$ 1621207 1387724 544846 -669326 -1666758 -1915173 -1533344 -1225221 -1446777 -1863625
38264a863625K4109N86209P21491N43983M74211N06607K78088k16831m75129k16815
$$ -1863625 -1839516 -1253307 -531816 12167 486378 992985 1271073 1054242 579113 362298
38254C62298J42485Q2923k56517l53945j45725k8479p9830O3014M19870M63428
$$ 362298 504783 587706 331189 -22756 -168481 -196960 -276790 -213776 206094 669522
38244F69522K5758k72573j2992K43541j09077n62151k33332N58344N96480l50756
$$ 669522 695280 422707 409715 653256 544179 -17972 -251304 307040 903520 552764
38234E52764j103522q32834j84160p1498k78849r9766K88535R9390o81039j131503
$$ 552764 -550758 -1383592 -1567752 -1639250 -1918099 -2017865 -1729330 -1629940 -2310979 -3442482
38224c442482o77051J75696N72952K94170k07067m13632k02788J40213K63652
$$ -3442482 -4119533 -3943837 -3370885 -3076715 -3283782 -3697414 -3900202 -3759989 -3496337
38215c496337J51373J04579K48322K81257o4209n35599o41934k44326M46209J218397
$$ -3496337 -3344964 -3240385 -2992063 -2710806 -2775015 -3310614 -3952548 -4196874 -3750665 -2532268
38205b532268J766388J505826J98809j234783j342257N8317J342133R25112p65749
$$ -2532268 -765880 739946 938755 -296028 -1638285 -1579968 -237835 687277 -78472
38196g8472j848102j315222n9652N23726K30246q8074J50316P11931J174701J417817
$$ -78472 -1926574 -3241796 -3301448 -2777722 -2547476 -2635550 -2485234 -1773303 -598602 819215
38186H19215J321462N79272p07295j593929j128208L35481J251775O31636p40791
$$ 819215 2140677 2719949 2012654 418725 -709483 -374002 877773 1509409 768618
38177G68618j295404o22271J86034J51808l24705k56169L66688N67949r3031p87100
$$ 768618 -526786 -1149057 -963023 -811215 -1135920 -1392089 -1025401 -457452 -550483 -1337583
38167a337583n87345K20409O49233M83396M05140O92490P20035J10635m31332
$$ -1337583 -1924928 -1704519 -1055286 -571890 -166750 525740 1245775 1356410 925078
38158I25078j01217P48658J112926P40554K03718k17085p50219j212721r01798
$$ 925078 823861 1572519 2685445 3425999 3629717 3412632 2662413 1449692 547894
38149E47894K17470J066601P71981j74605o60798l77292J13526L37366K59285
$$ 547894 765364 1831965 2603946 2429341 1768543 1391251 1504777 1842143 2101428
38140B101428q3913o23201j006942q97815n10512l46955m07446j91898M43016
$$ 2101428 2017515 1394314 387372 -510443 -1020955 -1367910 -1775356 -1967254 -1524238
38131a524238R41565P67502R5254m36068m14036N4786N24215N43743P555o85415
$$ -1524238 -582673 184829 280083 -155985 -570021 -515235 8980 552723 560278 -125137
38121a25137r36301n09400K57618P81123O81480K3183o84266q12007k12655N31924
$$ -125137 -1061438 -1570838 -1313220 -532097 149383 172566 -511700 -1323707 -1536362 -1004438
38111a004438P32099M14933J88338L03553L28536p8768n49559n31270j01987K14254
$$ -1004438 -272339 142594 330932 634485 963021 884253 334694 -196576 -298563 -84309
38101h4309K57465L21388M63367L11689k31355o09982l47269K03937L61761J33814
$$ -84309 173156 494544 957911 1269600 1038245 428263 80994 284931 646692 780506
38091G80506Q7456K60335q511q91416j481068r88952J7721L67942l9126k12551
$$ 780506 867962 1128297 1119786 228370 -1252698 -2241650 -2223929 -1855987 -1895113 -2107664
38081b107664L23037Q21695M89579l79570q80909o14324Q3976O61000P55639L90242
$$ -2107664 -1784627 -962932 -473353 -852923 -1733832 -2348156 -2264180 -1603180 -847541 -457299
38071d57299K9893J72727O84950Q65879L46173m37885q21014n74467J01278P64043
$$ -457299 -427406 -254679 430271 1296150 1642323 1204438 383424 -191043 -89765 674278
38061F74278Q29461J09014o15667l06179Q26900J410053Q35522P6297L0745K08881
$$ 674278 1503739 1612753 997086 690907 1517807 2927860 3763382 3839679 3870424 4079305
38051D079305n8409k52647K52888P28192K15185o10725m01817N19353O17373k53938
$$ 4079305 4020896 3768249 4021137 4749329 4964514 4353789 3951972 4471325 5088698 4834760
38041D834760o57741j34808J1433r54635j886937j630616o98876j47020j02591
$$ 4834760 4177019 4042211 4053644 3099009 1212072 -418544 -1117420 -1264440 -1367031
38032a367031l51653j071735j915345j651663j942J326863R03242j56879J31070
$$ -1367031 -1718684 -2790419 -4705764 -6357427 -6359369 -5032506 -4129264 -4286143 -4155073
38023d155073J480640J856939P70612p1335L78532R78915M57942o08028r26099
$$ -4155073 -2674433 -817494 -46882 -118217 260315 1239230 1697172 1089144 163045
38014A63045m36820K7902K50747N99404R38062P41603J79693K1035L30223K40730
$$ 163045 -273775 -245873 4874 604278 1542340 2283943 2463636 2484671 2814894 3055624
38004C055624n93150j199463o33386N27309R56379M84143J24233K55767P4260
$$ 3055624 2462474 1263011 629625 1156934 2113313 2597456 2721689 2977456 3051716
37995C051716p40783j142842m33531K74254l35433j521963j481421j42178Q72835
$$ 3051716 2310933 1168091 734560 1008814 673381 -848582 -2330003 -2472181 -1599346
37986a599346R68141J219763J941605J749292M1578j477561j190031J8870L50488
$$ -1599346 -631205 588558 2530163 4279455 4321033 2843472 1653441 1672311 2022799
37977B022799j09911N919Q01066J062667L42902o05940j225029j462423r99026
$$ 2022799 1912888 1918807 2719873 3782540 4125442 3519502 2294473 832050 -166976
37968a66976K59150J177273N82466o70074o30969P15705J340917M30484l37596
$$ -166976 92174 1269447 1851913 1181839 550870 1266575 2607492 3037976 2700380
37959B700380L76115J389816R57750n78307j584228j526535j101303p09990k13894
$$ 2700380 3076495 4466311 5424061 4845754 3261526 1734991 633688 -76302 -290196
37950b90196K33910L34028L30540N65076O86401K45655l19163l12459m2732l52252
$$ -290196 -56286 277742 608282 1173358 1859759 2105414 1786251 1473792 1431060 1078808
37940A078808j121274j399754r45409m52336j89292L63593J236997J546823R18051
$$ 1078808 -42466 -1442220 -2387629 -2839965 -3029257 -2665664 -1428667 118156 1036207
37931A036207K75654M26412P31491J96043p57199q36592Q973L16854p45887k012356
$$ 1036207 1311861 1738273 2469764 2665807 1908608 1072016 1080989 1397843 651956 -1360400
37921a360400j770523J8600J692036J813670N27268q85662j256267l71533R39048
$$ -1360400 -3130923 -3112323 -1420287 393383 920651 34989 -1221278 -1592811 -653763
37912f53763J488287Q43066k47404p97996p31901n92178m15352K27688J088984
$$ -653763 834524 1677590 1430186 632190 -99711 -691889 -1107241 -879553 209431
37903B09431J195199K92647o19602p28118m62246m54257m05461O8385L41113k40316
$$ 209431 1404630 1697277 1077675 349557 -112689 -566946 -972407 -904022 -562909 -803225
37893h03225r35217n91541L62931M61128m09316p87728j5835P70102N60839l4846
$$ -803225 -1738442 -2329983 -1967052 -1505924 -1915240 -2702968 -2718803 -1948701 -1387862 -1422708
37883a422708L421N73597R78950J039173Q34088J87367p30030j051792l95432
$$ -1422708 -1419287 -845690 133260 1172433 2006521 2193888 1463858 412066 16634
37874A6634K66786j20475j093978j352177o49656L1822N2349j04488K91063J234487
$$ 16634 283420 162945 -931033 -2283210 -2932866 -2901044 -2848695 -2953183 -2662120 -1427633
37864a427633K024278J915323P87254n89405j205058r68463p73450j110497j283547
$$ -1427633 596645 2511968 3299222 2709817 1504759 536296 -237154 -1347651 -2631198
37855b631198n96161L74339N85090J33449L8650O57136J306261J386571R54206
$$ -2631198 -3227359 -2853020 -2267930 -2134481 -2095831 -1438695 -132434 1254137 2208343
37846B208343J85237q10379j533450j332975l50113M80554N93019L16985J00961
$$ 2208343 2393580 1583201 49751 -1283224 -1633337 -1152783 -559764 -242779 -141818
37837a41818o1598j93701p4668K07122J27599l88448o02447o3030N10941K13583
$$ -141818 -203416 -397117 -471785 -264663 -137064 -525512 -1127959 -1190989 -680048 -466465
37827d66465n88075p06145O6117N98152J36297n28303k70129N98893P18805k95214
$$ -466465 -1054540 -1760685 -1694568 -1096416 -960119 -1488422 -1758551 -1159658 -440853 -736067
37817g36067j200679q11816M47448J259877J148626P63095P08704Q58040Q06302
$$ -736067 -1936746 -2748562 -2301114 -1041237 107389 870484 1579188 2437228 3243530
37808C243530L74474l99486j244420j613892j189963m39848j41435l88414o41652
$$ 3243530 3618004 3218518 1974098 360206 -829757 -1269605 -1411040 -1799454 -2441106
37799b441106o55919o10305m08581K06245P92256N39459l07645m92817L74030
$$ -2441106 -3097025 -3707330 -4115911 -3909666 -3117410 -2577951 -2885596 -3378413 -3004383
37790c004383J136948Q73870J92698j6697K5318j72741k06313L60878Q45374M52595
$$ -3004383 -1867435 -993565 -800867 -817564 -792246 -964987 -1171300 -810422 34952 487547
37780D87547k66463k86853J69331J67148j94752o5515M39394L24029n51458j214309
$$ 487547 221084 -65769 103562 270710 75958 10443 449837 773866 222408 -991901
37770i91901j106873o37615j91229K27720L94576J13318n345O92071J436216Q15188
$$ -991901 -2098774 -2736389 -2927618 -2699898 -2305322 -2192004 -2197349 -1505278 -69062 746126
37760G46126q81179j675605o25773R55110J508352J058861M18115j03414m01002
$$ 746126 -135053 -1810658 -2436431 -1481321 27031 1085892 1504007 1400593 999591
37751I99591j27399O28739J096119Q95104N14148K69401j64959p04411n55296
$$ 999591 872192 1500931 2597050 3492154 4006302 4275703 4110744 3406333 2851037
37742B851037L33923P35418o8709j077093j114392n27179k53984j78098L43800
$$ 2851037 3184960 3920378 3851669 2774576 1660184 1133005 879021 700923 1044723
37733A044723J051083J144690N95577K427m17042p43622p77160m78915m36105
$$ 1044723 2095806 3240496 3836073 3838500 3421458 2677836 1900676 1421761 985656
37724I85656r11413j033897l5558J264543J431942M47304m86778q36207j095474
$$ 985656 74243 -959654 -995212 269331 1701273 2148577 1661799 825592 -269882
37715b69882j397122j122670q8529R50989J231476O60728m11774j353322j370803
$$ -269882 -1667004 -2789674 -2878203 -1927214 -695738 -35010 -446784 -1800106 -3170909
37706c170909l94682L62367k10171j334900j170881N64686K117705K088920J018393
$$ -3170909 -3565591 -3203224 -3413395 -4748295 -5919176 -5354490 -3236785 -1147865 -129472
37697a29472J42019j95597k25147N1625N00571N36088K6477j88895M29781R84961
$$ -129472 12547 -183050 -408197 -356572 143999 680087 706564 517669 947450 1932411
37687A932411L26119j062043j533436n52679O40032Q46912L69975J45248K58997
$$ 1932411 2258530 1196487 -336949 -889628 -249596 597316 967291 1112539 1371536
37678A371536J32959k88193m63310k64836j67885k58333Q2811J031641J620391
$$ 1371536 1504495 1216302 752992 488156 320271 61938 144749 1176390 2796781
37669B796781R65045l22921r04588o13155n04547j026216j308662o36930M17095
$$ 2796781 3761826 3438905 2534317 1921162 1416615 390399 -918263 -1555193 -1138098
37660a138098R26831Q40935O18683L46510m7333k64571p5650J36938n8094m27926
$$ -1138098 -211267 629668 1248351 1594861 1547528 1282957 1207307 1344245 1286151 858225
37650H58225n30967m50520m59080m20015j91386j48859n65990r09500n30225L25619
$$ 858225 327258 -123262 -582342 -1002357 -1193743 -1342602 -1908592 -2818092 -3348317 -3022698
37640c022698R43349J157210J170849Q58185J55151l12110j3370M54110J92489
$$ -3022698 -2079349 -922139 248710 1106895 1262046 949936 936566 1390676 1583165
37631A583165m90009n67555l159L12475J54165J26666K70915m4179o70695n94361
$$ 1583165 1093156 525601 522442 834917 989082 1115748 1386663 1342484 671789 77428
37621G7428L05530Q10569K62034l98838k48971J39821j92728r49091j123835n93080
$$ 77428 382958 1193527 1455561 1056723 807752 947573 754845 -194246 -1318081 -1911161
37611a911161r8541M6671L08581J024550J794667J884559R65610m98993j491581
$$ -1911161 -2009702 -1963031 -1654450 -629900 1164767 3049326 4014936 3515943 2024362
37602B024362j270601j03678R83377J186489M85588n38731j066354n06540Q08842
$$ 2024362 753761 650083 1633460 2819949 3305537 2766806 1700452 1193912 2002754
37593B002754J631594J138670o356o51928p76419j054706j230759m26772R56788
$$ 2002754 3634348 4773018 4766662 4114734 3338315 2283609 1052850 626078 1582866
37584A582866J328816L16782m95292K9656Q76615N80680n56877j153480q24136
$$ 1582866 2911682 3228464 2733172 2762828 3639443 4220123 3663246 2509766 1685630
37575A685630l91259m89160r21725j132056o85734L67414J234769J063351K02031
$$ 1685630 1294371 805211 -116514 -1248570 -1934304 -1566890 -332121 731230 933261
37566I33261l3991P46574J374921R51963J70358l2202M495l97497q22004o15377
$$ 933261 899270 1645844 3020765 3972728 4143086 4110884 4115379 3717882 2895878 2280501
37556B280501l48371q93485j589805r65733Q72330K119773J698313M90013j73648
$$ 2280501 1932130 1038645 -551160 -1516893 -644563 1475210 3173523 3663536 3489888
37547C489888j37919l9844j38805j70307L7082L10755M23416L79743L39947L05715
$$ 3489888 3351969 3312125 3173320 3003013 3040095 3350850 3774266 4154009 4493956 4799671
37537D799671P9726l06184m27280r8425K42509L76056R15931K056321K415376
$$ 4799671 4879397 4573213 4145933 4047508 4290017 4666073 5582004 7638325 10053701
37528A0053701Q12747j255046j154473Q79300J914409R83436N17866J895281K852709
$$ 10053701 10866448 9611402 8456929 9336229 11250638 12234074 12751940 14647221 17499930
37519A7499930J586800L77290K012171N084808O438976O289192O967657Q282585
$$ 17499930 19086730 19464020 21476191 26560999 32999975 39289167 46256824 54539409
37511E4539409Q619353R424951J3564025J9993098K5915112L4001410M9598187
$$ 54539409 63158762 72583713 86147738 106140836 132055948 166057358 215655545
37504B15655545O7707275P0397319M4406509j598704m3315644o3052618o1351828
$$ 215655545 283362820 353760139 398166648 396567944 353252300 290199682 228847854
37497B28847854m9096514l5370475k4276446j7312103j4124971j2518844j0524838
$$ 228847854 179751340 144380865 120104419 102792316 88667345 76148501 65623663
37490F5623663q202169o556053n750603n287449m967847m778799m471759l861696
$$ 65623663 57421494 50865441 45114838 39827389 34859542 30080743 25608984 21747288
37482B1747288l051564k110285j116061n55559q63053j478345j283988j96602
$$ 21747288 18695724 16585439 15469378 14913819 14050766 12572421 11288433 11091831
37474A1091831N60323P6151j137144j977881k001390j507579r93889q50095j119462
$$ 11091831 11652154 11728305 10591161 8613280 6611890 5104311 4110422 3260327 2140865
37465B140865j327687r62694k28925J40559j05983m13688j84725N94486J504598
$$ 2140865 813178 -149516 -378441 -237882 -343865 -757553 -942278 -347792 1156806
37456A156806J982870J516195J72912j022156r32722K66244J102871N19099r10772
$$ 1156806 3139676 4655871 4828783 3806627 2873905 3140149 4243020 4762119 3851347
37447C851347j759997j363069l31340L19476K61653M9076K73427O92592N64795
$$ 3851347 2091350 728281 396941 716417 978070 1027146 1300573 1993165 2557960
37438B557960j27706m36449J78731Q91232O34909l19267q13061n07917j48248
$$ 2557960 2430254 1993805 2172536 3063768 3698677 3379410 2566349 2058432 1910184
37429A910184k40334m79188n66065o60954q14522p43864l88000n225L79975Q90408
$$ 1910184 1669850 1190662 624597 -36357 -850879 -1594743 -1982743 -1987968 -1607993 -717585
37419g17585J134982N65858l53061l84210O93555J542613J077937q7535o85456
$$ -717585 417397 983255 630194 245984 939539 2482152 3560089 3472554 2787098
37410B787098m57409J7850M46160Q29040Q65017L36305j83597L9571O60891N37363
$$ 2787098 2329689 2347539 2793699 3622739 4487756 4824061 4640464 4680035 5340926 5878289
37400E878289o59835j874675j960338r98593k2802K27269m8699j94413L2761K36354
$$ 5878289 5218454 3343779 1383441 384848 362046 589315 540616 346203 378964 615318
37390F15318M6356k51800j16517L66526N92611M72300O01996J095675J077384
$$ 615318 661674 409874 293357 659883 1252494 1724794 2326790 3422465 4499849
37381D499849k05j220818j300542l82500K65004J09213j64286l3107R7484j67047
$$ 4499849 4499644 3278826 1978284 1595784 1860788 1970001 1805715 1772608 1870092 1703045
37371A703045m28668j68188M35963Q28213P35663J81722o28370j137661p99927
$$ 1703045 1274377 1106189 1542152 2370365 3106028 3287750 2659380 1521719 721792
37362G21792j6209J5478j013694j724622q26054Q90286J478072M99073n06412
$$ 721792 705583 721061 -292633 -2017255 -2843309 -1953023 -474951 24122 -482290
37353d82290l30828L49257K61271n83980j083060n79080M88316J201049R58011
$$ -482290 -813118 -463861 -202590 -786570 -1869630 -2448710 -1960394 -759345 198666
37344A98666p5608r52833p28519L84343J066166N11891m95743o85790L4988P54384
$$ 198666 123058 -829775 -1558294 -1173951 -107785 404106 -91637 -777427 -742439 11945
37334A1945R74550R40992P67052K31416m94834q11856n66522k25400m9452J25116
$$ 11945 986495 1927487 2694539 2925955 2431121 1619265 1052743 827343 777891 903007
37324I03007J56823m21189j361953j583554o55424L87376M11000k74281n10998
$$ 903007 1059830 638641 -723312 -2306866 -2962290 -2574914 -2163914 -2438195 -2949193
37315b949193L6313O26864O09438J03629m06113n84311l66495L2381K60050K09314
$$ -2949193 -2912880 -2286016 -1676578 -1572949 -1979062 -2563373 -2929868 -2897487 -2637437 -2428123
37305b428123J20622J77761L11457N28084R58701J371914J207897M17135l10814
$$ -2428123 -2307501 -2129740 -1818283 -1290199 -331498 1040416 2248313 2665448 2354634
37296B354634m90982l78152k39711P2518L73565q446r19531j022075K07069J212899
$$ 2354634 1863652 1485500 1245789 1318307 1691872 1683426 763895 -258180 -51111 1161788
37286A161788N00702r09159r25068L65390R25258M2855p58446l82296K64494O2247
$$ 1161788 1662490 753331 -171737 193653 1118911 1161766 403320 21024 285518 347765
37276C47765o31159r71038r51751q35018l83930M59654J078360J100146R28747
$$ 347765 -283394 -1254432 -2206183 -3041201 -3425131 -2965477 -1887117 -786971 141776
37267A41776P78005K14672p09019j007151k29631P05016R59846R21122R74905
$$ 141776 919781 1134453 425434 -581717 -811348 -106332 853514 1774636 2749541
37258B749541M09643j172611k419759j763582K35197J507550J048929l24489j366738
$$ 2749541 3159184 1986573 -433186 -2196768 -1961571 -454021 594908 270419 -1096319
37249a096319j411879m27865Q30540J145517L11471l08968K60522R67705M37972
$$ -1096319 -2508198 -2936063 -2105523 -960006 -648535 -957503 -696981 270724 708696
37240G08696n90278m11321O97541Q84200r7381m67127M84188J171818M28856n85284
$$ 708696 118418 -292903 404638 1288838 1191457 724330 1208518 2380336 2809192 2223908
37230B223908m04470M37464N29777j62209n85501l69184m3275K9520o2959k11549
$$ 2223908 1819438 2256902 2786679 2624470 2038969 1669785 1626510 1656030 1593071 1381522
37220A381522k73111k8836L25424K23847k63589k55634N02902R16105R1629j184773
$$ 1381522 1108411 1079575 1404999 1628846 1365257 1109623 1612525 2528630 2620259 1435486
37210A435486j531996q75034j80888J86783O60822J278077J445867R32696K20603
$$ 1435486 -96510 -971544 -1152432 -965649 -304827 973250 2419117 3351813 3572416
37201C572416k00165k58446r7449m297l42912r82353j111011k98710O35830O60937
$$ 3572416 3372251 3113805 3016356 3012059 2669147 1686794 575783 277073 912903 1573840
37191A573840P9551J60M72504L87923o31936j473643j149056j92792K35370m8046
$$ 1573840 1653391 1653551 2126055 2513978 1882042 408399 -740657 -933449 -698079 -746125
37181g46125k90472l8519L88913N54880M71649M05468M27324L65867J61263N9447
$$ -746125 -1036597 -1075116 -686203 -131323 340326 745794 1173118 1538985 1700248 1759695
37171A759695K43061L81903j0239o99519q13374j24969M04904j6894p30347n84346
$$ 1759695 2002756 2384659 2374420 1674901 861527 736558 1141462 1124568 394221 -190125
37161a90125K53999N55279o5417o61285m99216j5801Q9786j90698m90430n60034
$$ -190125 63874 619153 553736 -107549 -606765 -622566 -532780 -723478 -1213908 -1773942
37151a773942j59581P47626J451976J051862j52969q22070m94984j85357m93967
$$ -1773942 -1933523 -1185897 266079 1317941 1164972 342902 -152082 -337439 -831406
37142h31406m77069N96133J613307J182955p7806m56099K03461M69106k61431
$$ -831406 -1308475 -712342 900965 2083920 2006114 1550015 1753476 2222582 1961151
37133A961151j003178r44619m08452K16891J011013J550497Q81460q16972j832657
$$ 1961151 957973 13354 -395098 -178207 832806 2383303 3264763 2447791 615134
37124F15134j081063L90198R71251N76337J25064j45882n53679p58254r7810J045555
$$ 615134 -465929 -75731 895520 1471857 1596921 1451039 897360 139106 41296 1086851
37114A086851J466997P90205j12148m52396l77475l24550l53891l87431m59241
$$ 1086851 2553848 3344053 3231905 2779509 2402034 2077484 1723593 1336162 876921
37105H76921m75530k31695J79926M33859M78945N00319M38723J38933j18093L7215
$$ 876921 401391 169696 349622 783481 1262426 1762745 2201468 2340401 2222308 2259523
37095B259523K46412j70450r62479j115271m54462L3550j44635k25301K89422
$$ 2259523 2505935 2335485 1373006 257735 -196727 -163177 -307812 -533113 -243691
37086b43691N97711O7760m24289M2305N96557j24238j453506j405520K12641J383208
$$ -243691 354020 421780 -2509 39796 636353 512115 -941391 -2346911 -2134270 -751062
37076g51062R40246J44238L46336P75595J2535j509117k047243j027455M21206
$$ -751062 189184 333422 679758 1455353 1467888 -41229 -2088472 -3115927 -2694721
37067b694721J166679J135651P65569M11240L24019M24014J46575p44631j379480
$$ -2694721 -1528042 -392391 373178 784418 1108437 1532451 1679026 934395 -445085
37058d45085p28938P68896J552797R72958n4730n95978p73314r04403p07099n9375
$$ -445085 -1174023 -405127 1147670 2120628 2065898 1469920 696606 -207797 -914896 -974271
37048i74271L98591K46376O9198L85831N60694j48268j104093j127581m10624
$$ -974271 -575680 -329304 -260106 125725 686419 538151 -565942 -1693523 -2104147
37039b104147j99455p15053q56155j26275N96453O39788N12986O61274N60615
$$ -2104147 -2303602 -3018655 -3874810 -4001085 -3404632 -2764844 -2251858 -1590584 -1029969
37030a029969o1903l39856K41967N61428m79132j848134j668246j27003P81400
$$ -1029969 -1091872 -1431728 -1189761 -628333 -1107465 -2955599 -4623845 -4750848 -3969448
37021c969448L46522o722O40395J149554L77259q26060r83954k09343L50828M59896
$$ -3969448 -3622926 -3629648 -2989253 -1839699 -1462440 -2288500 -3272454 -3481797 -3130969 -2671073
37011b671073P28621J126646J000984L92112O9076K82879N40370N52166M03226
$$ -2671073 -1942452 -815806 185178 577290 646366 929245 1469615 2021781 2425007
37002B425007q0219j022059j655441j038811L34793R47904M51416M3255L10938
$$ 2425007 2344788 1322729 -332712 -1371523 -1036730 -88826 362590 405845 716783
36993G16783K65528p28587j579252j168061j73481J64327P7262N20903J166853
$$ 716783 982311 253724 -1325528 -2493589 -2667070 -2502743 -2425481 -1904578 -737725
36984g37725Q88809j33771n69985j47141N787n58287q49544k95878K06130o5567
$$ -737725 151084 17313 -552672 -699813 -694026 -1252313 -2101857 -2397735 -2191605 -2257172
36974b257172l09746L95999J383076J363460M44529j36081N5554K53809j2778
$$ -2257172 -2566918 -2170919 -787843 575617 1020146 884065 939619 1193428 1180650
36965A180650k23095N7081L62255J23139l54562l22673K80529O85303K91649n32578
$$ 1180650 957555 1014636 1376891 1500030 1145468 822795 1103324 1788627 2080276 1547698
36955A547698q37203j80949Q49587J302842R01722J83400l30482p01523j156435
$$ 1547698 710495 529546 1379133 2681975 3583697 3767097 3436615 2735092 1578657
36946A578657j492567j284399n20753L14583P57101P14676L70627j9708k42615
$$ 1578657 86090 -1198309 -1719062 -1404479 -647378 67298 437925 418217 175602
36937A75602k23283m8419J40796K01365l8295o02383j096097r43930r6396Q06971
$$ 175602 -47681 -96100 44696 246061 207766 -394617 -1490714 -2434644 -2531040 -1724069
36927a724069J210582J246909J287833J292156J044084O92939M78650J58818o30116
$$ -1724069 -513487 733422 2021255 3313411 4357495 5050434 5529084 5687902 5057786
36918E057786j542357j751029j076027k60975K4576j02667k12540j97563j48063
$$ 5057786 3515429 1764400 688373 427398 451974 349307 136767 -60796 -208859
36909b08859m2223J08699J31606j6391r8913N4070L29208N92774Q11560P74864
$$ -208859 -251082 -142383 -10777 -27168 -126081 -72011 257197 849971 1661531 2436395
36899B436395J69327p99794j330436r53082j60590K83739K96161K85710L89218
$$ 2436395 2605722 1805928 475492 -477590 -638180 -354441 -58280 227430 616648
36890F16648M66337N98815R49706J227494R28032J51977l88850l23005r6575k88536
$$ 616648 1082985 1681800 2631506 3859000 4787032 4939009 4550159 4227154 4130579 3842043
36880C842043q28001j156501r36269l61559J22312K57258J73036K00094M62185
$$ 3842043 3014042 1857541 921272 559713 682025 939283 1112319 1312413 1774598
36871A774598P15184O52283K60363k00975m10314j21369N85102J036244M44646
$$ 1774598 2489782 3142065 3402428 3201453 2791139 2669770 3254872 4291116 4735762
36862D735762r40901j666872p58030P86028J096885q2776j101585p86940l192
$$ 4735762 3794861 2127989 1369959 2155987 3252872 3170096 2068511 1281571 1278379
36853A278379j79637j188260j662726r55308K19773R51030J055444P85176L75698
$$ 1278379 1098742 -89518 -1752244 -2707552 -2487779 -1536749 -481305 303871 679569
36844F79569J13676K65495O39089O46305Q9938m71039m55211n1251J19997m4821
$$ 679569 793245 1058740 1697829 2344134 2434072 1963033 1507822 1456571 1576568 1531747
36834A531747L596N88476J196438J048664J36165o70785o65328k03075k47680
$$ 1531747 1535343 2123819 3320257 4368921 4505086 3834301 3168973 2965898 2718218
36825B718218j056478j701768j158003L47658J463980J221567N6441q45252r01354
$$ 2718218 1661740 -40028 -1198031 -850373 613607 1835174 1891615 1046363 145009
36816A45009m66762k9746L17287M87227J36102o91658j116393m07044P48945Q63247
$$ 145009 -321753 -351499 -34212 453015 589117 -102541 -1218934 -1625978 -877033 -13786
36806a3786l28472j389962j143703j83141K85526K55567M94972R06190O62393
$$ -13786 -342258 -1732220 -2875923 -3059064 -2773538 -2517971 -2022999 -1116809 -454416
36797d54416j92682o47770l68812j51609l96092m11772J65096M88027p6355o61719
$$ -454416 -647098 -1294868 -1663680 -1815289 -2211381 -2623153 -2458057 -1970030 -2046385 -2708104
36787b708104j39653J079483J626057J064994J17875o25378j086423j028428j89176
$$ -2708104 -2847757 -1768274 -142217 922777 1040652 415274 -671149 -1699577 -1888753
36778a888753Q91025J216622O64195R8823N9968K00675J81378K09932L79817K88804
$$ -1888753 -997728 218894 883089 981912 1041880 1242555 1423933 1633865 2013682 2302486
36768B302486k48643p45777p21342l26159M7252K91778L99543K29177j75958m25521
$$ 2302486 2053843 1308066 586724 260565 307817 599595 999138 1228315 1052357 626836
36758F26836k72875L9429J57226J0174l39892q34161j179457r09212o305Q58906
$$ 626836 353961 393390 550616 560790 220898 -613263 -1792720 -2701932 -2708237 -1849331
36748a849331J037080O35156K96361L99074O54070M48669l97921j185330r29876
$$ -1849331 -812251 -177095 119266 518340 1172410 1621079 1223158 37828 -892048
36739h92048L36832J301461R38197q1893l37318L45781Q88049P67482N62807N50652
$$ -892048 -555216 746245 1684442 1602549 1265231 1611012 2499061 3266543 3829350 4380002
36729D380002J05704r83135j770591j450533m82692K50156N71894O62589M55683
$$ 4380002 4485706 3502571 1731980 281447 -201245 48911 620805 1283394 1739077
36720A739077R9990J79126P18392Q11563J5506p79889p45183m15395n62431p42703
$$ 1739077 1839067 2018193 2736585 3548148 3563654 2783765 2038582 1623187 1060756 318053
36710C18053k52447L45137J43052l61646q8065N67687K70677q93523j412530p31509
$$ 318053 65606 410743 553795 192149 104084 671771 942448 48925 -1363605 -2095114
36700b095114R6287L35680M36637O15928K71734n71821p89351Q6834R67587Q68704
$$ -2095114 -1998827 -1663147 -1226510 -610582 -338848 -910669 -1700020 -1613186 -645599 223105
36690B23105K35783j94650n91153j113062j006836J61470J290552J044426k39394
$$ 223105 458888 264238 -326915 -1439977 -2446813 -2285343 -994791 49635 -189759
36681a89759j067279p10534L75518J494970K053317J508642R9825q22620l43089
$$ -189759 -1257038 -1967572 -1592054 -97084 1956233 3464875 3564700 2742080 2398991
36672B398991N32073J76173j182214j741683q71670M939k62437p91427j94542
$$ 2398991 2931064 3107237 1925023 183340 -688330 -683391 -945828 -1737255 -1931797
36663a931797J143178J570722N62096o00188o57981N5364L71081j1337l36843
$$ -1931797 -788619 782103 1344199 744011 86030 141394 512475 501138 164295
36654A64295j39103P1151k21134n49867j31202Q28806J274095O99419k92899q92502
$$ 164295 25192 96343 -124791 -674658 -805860 22946 1297041 1996460 1703561 811059
36644H11059q75255m20075J68996M25935J23269j73039K24442P85691K06937j434904
$$ 811059 -64196 -484271 -315275 110660 233929 60890 285332 1071023 1277960 -156944
36634a56944k252273j066964Q12209J417670P16129O5052o1645k05353l06074
$$ -156944 -2409217 -3476181 -2663972 -1246302 -530173 -465121 -526766 -732119 -1038193
36625a038193K84532J242984J371361M79108k82355k95834k94530q09537j149525
$$ -1038193 -753661 489323 1860684 2339792 2057437 1761603 1467073 657536 -491989
36616d91989o90069m5199k2716k80725k1488N90820P11891J72575l53586m03474
$$ -491989 -1182058 -1227257 -1249973 -1530698 -1552186 -961366 -249475 -76900 -430486 -833960
36606h33960j93557m0291Q2794K86107M52067L52982l8047m00874k80734L97787
$$ -833960 -1027517 -1067808 -985014 -698907 -246840 106142 68095 -332779 -613513 -215726
36596b15726J082744J135329N77670n1485n12274r96840j414880j230935l11550
$$ -215726 867018 2002347 2580017 2528532 2016258 1019418 -395462 -1626397 -1937947
36587a937947O44469R22997N89982J12278l16276o10428m55075K13469O99228
$$ -1937947 -1293478 -370481 219501 331779 15503 -594925 -1050000 -836531 -137303
36578a37303K53571p76333j178125l82081P97877J186951O29685j0702m8375K53155
$$ -137303 116268 -660065 -1838190 -2220271 -1422394 -235443 394242 383540 335165 588320
36568E88320K10941k95495p15232o14469j67922K35038M61170M85749K13285j83091
$$ 588320 799261 503766 -211466 -825935 -993857 -758819 -297649 188100 401385 218294
36558B18294j76891L46863O62699J98349m46361l30096L01584L93498j47360l05778
$$ 218294 41403 388266 1050965 1249314 802953 472857 774441 1167939 1020579 714801
36548G14801K67910O41433K01516l68194l81298k80881o18414r18452n90816j26772
$$ 714801 982711 1624144 1825660 1457466 1076168 795287 176873 -741579 -1332395 -1459167
36538a459167k48997n48441j75214O19497Q58993L94796j21064n10634j032767
$$ -1459167 -1708164 -2256605 -2431819 -1812322 -953329 -558533 -679597 -1190231 -2222998
36529b222998j268493m70054Q79494J251655K03550q82306p14755K87847R13960
$$ -2222998 -3491491 -3961545 -3082051 -1830396 -1626846 -2509152 -3223907 -2936060 -2022100
36520b022100Q01847M38066J76295J8719R086K38414O22692R69997J056533N87710
$$ -2022100 -1220253 -782187 -605892 -587173 -578087 -339673 283019 1253016 2309549 2897259
36510B897259m53488j369017j308516m40766J54293J3441j14197L77223Q79032
$$ 2897259 2443771 1074754 -233762 -674528 -520235 -506794 -620991 -243768 635264
36501F35264N68137k33592n86251l52578j79228l13383l23117L0727L72893K70405
$$ 635264 1203401 969809 383558 30980 -148248 -461631 -784748 -754021 -381128 -110723
36491a10723k62444q48917j017120n08987L63471R12170R47725J042681J450172
$$ -110723 -373167 -1222084 -2239204 -2748191 -2384720 -1472550 -524825 517856 1968028
36482A968028J348505L6096j550008j703102l14763Q33685M58842o63002j101051
$$ 1968028 3316533 3352629 1802621 99519 -215244 618441 1077283 414281 -686770
36473f86770p40405m58646n38389n03537k64865l29696p19605n85757O00941K000472
$$ -686770 -1427175 -1885821 -2424210 -2927747 -3192612 -3522308 -4241913 -4827670 -4226729 -2226257
36463b226257K165133P64356r17704j370459m77728N29876O29784P7220k50153
$$ -2226257 -61124 703232 -214472 -1584931 -2062659 -1532783 -902999 -825779 -1075932
36454a075932j02588R0541J64955M40273Q97249R22544K82158l00537j32815L80413
$$ -1075932 -1178520 -1087979 -923024 -482751 414498 1337042 1619200 1318663 1185848 1566261
36444A566261L77960r9646k41618J75946M68952K05942j55667j25346N8363P41
$$ 1566261 1944221 1844575 1602957 1778903 2247855 2453797 2298130 2172784 2231147 2231888
36434B231888j16174K1385J25287k77700r25436j037498m43524J42650J19711
$$ 2231888 2115714 2137099 2262386 1984686 1059250 21752 -421772 -279122 -159411
36425a59411k60089l97951j82127L1938K1588j03421k19028l54910m78982l95533
$$ -159411 -419500 -817451 -999578 -967640 -946052 -1049473 -1268501 -1623411 -2102393 -2497926
36415b497926n6760J93553j2878m81022n92020j73630J66678o0695l68617L1706
$$ -2497926 -2554686 -2361133 -2374011 -2855033 -3447053 -3620683 -3454005 -3514700 -3883317 -3851611
36405c851611Q86101J080881K95060m37360k46682L49685M47712K26826M28912
$$ -3851611 -2965510 -1884629 -1589569 -2026929 -2273611 -1923926 -1476214 -1249388 -820476
36396h20476Q77041O97602j45231p12731n66445k72159k16237m2304L09324J08517
$$ -820476 56565 754167 608936 -103795 -670240 -942399 -1158636 -1200940 -891616 -783099
36386g83099r09088j710564j277881r0021O20214N88413N36128P88730Q79409
$$ -783099 -1692187 -3402751 -4680632 -4770653 -4150439 -3562026 -3025898 -2237168 -1357759
36377a357759N04250M4238P934M99371J247248J699776J235712j40419j428856
$$ -1357759 -853509 -809271 -801337 -301966 945282 2645058 3880770 3740351 2311495
36368B311495j584695p73597n8425P0126Q8102L48357M84177K10646n6733J01625
$$ 2311495 726800 -46797 -105222 -35096 53006 401363 885540 1096186 1039453 1141078
36358A141078L63343K07448j72018j39350L34131N14469n9549q29079q59485q2081
$$ 1141078 1504421 1711869 1539851 1400501 1734632 2249101 2189552 1360473 500988 418907
36348D18907N39494K63111l80750k92491N85042J075957L93948p67213j245551
$$ 418907 958401 1221512 840762 548271 1133313 2209270 2603218 1836005 590454
36339E90454q88937l73684r4262n5282m37118j276590j810615j192318J61069
$$ 590454 -298483 -672167 -766429 -821711 -1258829 -2535419 -4346034 -5538352 -5377283
36330e377283R35912O86929K28536J70149J83479J2313N4969M17444M43973j23756
$$ -5377283 -4441371 -3754442 -3525906 -3355757 -3172278 -3159965 -3104996 -2687552 -2243579 -2367335
36320b367335m44461J80807J145787J444952J081075P30602N84208L90990J85785
$$ -2367335 -2811796 -2630989 -1485202 -40250 1040825 1771427 2355635 2746625 2932410
36311B932410J10303j11260p05061j203954j053291n13971j76335N5002O11206
$$ 2932410 3042713 2931453 2226392 1022438 -30853 -544824 -721159 -666157 -54951
36302e4951J199708J064535J95092n95851p66751m79479k9747M31821P11941P73642
$$ -54951 1144757 2209292 2404384 1808533 1041782 562303 532556 964377 1676318 2449960
36292B449960R28607J177909P68164o84002k040217j827406l91473M61132j463
$$ 2449960 3378567 4556476 5324640 4640638 2600421 773015 381542 842674 841211
36283H41211o52600n05996n7079l8560j25091K51441P41402O30255q4758q70692
$$ 841211 188611 -317385 -374464 -413024 -538115 -286674 454728 1084983 1000225 129533
36273A29533j343255j242791l96214P45838J225134P93059L07453L81214M92390
$$ 129533 -1213722 -2456513 -2852727 -2106889 -881755 -88696 218757 599971 1092361
36264A092361J29495j15039M29576J178535J108145L28289k90654n70018r07884
$$ 1092361 1221856 1106817 1536393 2714928 3823073 4151362 3860708 3290690 2382806
36255B382806j106384o31288J10557N5570q76846j574199j308944m92922K74217
$$ 2382806 1276422 645134 755691 811261 -65585 -1639784 -2948728 -3441650 -3167433
36246c167433Q40892R69562K66192r24005j475909q36481L05942J063525J301699
$$ -3167433 -2326541 -1356979 -1090787 -2014792 -3490701 -4327182 -4021240 -2957715 -1656016
36237a656016J213161P93801K31200L8273K56374K27508l13870o60955k49972
$$ -1656016 -442855 350946 582146 620419 876793 1104301 790431 129476 -120496
36228a20496L86730N05242K91796K75982K24643l72946j137965j183470m78285
$$ -120496 266234 771476 1063272 1339254 1563897 1190951 52986 -1130484 -1608769
36219a608769J25636J29845k17556o44068j036171r69763j01532Q60864O62489
$$ -1608769 -1483133 -1353288 -1570844 -2214912 -3251083 -4220846 -4322378 -3461514 -2799025
36210b799025o86158j611141j009435L30214J006256Q55849O13526L81435l43994
$$ -2799025 -3485183 -5096324 -6105759 -5775545 -4769289 -3913440 -3299914 -2918479 -3262473
36201c262473j296544j323668j0850J440393J552881L37757q38868r24374j79797
$$ -3262473 -4559017 -5882685 -5893535 -4453142 -2900261 -2562504 -3401372 -4325746 -4505543
36192d505543M73320O14314N70300P49382J089174J211518Q94654K67259l27712
$$ -4505543 -4032223 -3417909 -2847609 -2098227 -1009053 202465 1097119 1364378 1036666
36183A036666n42664k47489K77807M93542J70354k78550k93779P7082K57812k9337
$$ 1036666 494002 246513 524320 1017862 1188216 909666 615887 692969 950781 921444
36173I21444m04227m19854j63417n1839k66624n88888o33266j57956O33987J073748
$$ 921444 517217 97363 -66054 -117893 -384517 -973405 -1606671 -1764627 -1130640 -56892
36163e6892O72913j24311l17720L12741Q08999L59159n54314r26539o52665l88356
$$ -56892 616021 491710 173990 486731 1295730 1654889 1100575 174036 -478629 -866985
36153h66985l30909q8998L18903L12757k36224o91297o10133k56031J23740P20593
$$ -866985 -1197894 -1286892 -967989 -655232 -891456 -1582753 -2192886 -2448917 -2325177 -1604584
36143a604584J463618J699362J135962M07456Q3561j83279p86280j148561n71179
$$ -1604584 -140966 1558396 2694358 3101814 3185375 3002096 2215816 1067255 496076
36134D96076M18752O98465K32932m8932P5615j43130q99469j333932r85068n70692
$$ 496076 914828 1613293 1846225 1797293 1872908 1729778 830309 -503623 -1488691 -2059383
36124b059383p01295q48778l69082L45991O32379P03768J041292J277993Q18837
$$ -2059383 -2760678 -3609456 -3978538 -3632547 -3000168 -2296400 -1255108 22885 841722
36115H41722R3769m3727J36531l47093j306419j394195k83259O17465K70983m69104
$$ 841722 935491 891764 1028295 681202 -625217 -2019412 -2302671 -1685206 -1414223 -1883327
36105a883327l84741J87209K01053j65959Q1667Q29699R04442Q3916m39395o821
$$ -1883327 -2268068 -2080859 -1879806 -2045765 -1964098 -1134399 -229957 -146041 -585436 -592257
36095e92257M56983P7773m47747l6710Q90421J000875J62838l70200L4364M26804
$$ -592257 -135274 -57501 -505248 -541958 348463 1349338 1512176 1141976 1176340 1603144
36085A603144j91980j318418j678299r50416L8774N75302P22882P28435N05478
$$ 1603144 1411164 92746 -1585553 -2535969 -2497195 -1921893 -1199011 -470576 34902
36076C4902L4441k19740K04153J012419J345044P88049j21129n74195m43823k64791
$$ 34902 69343 -150397 53756 1066175 2411219 3199268 3078139 2503944 2060121 1795330
36066A795330l69291m45204j12252L87954M32458j57846q80924j164943r19668
$$ 1795330 1426039 980835 868583 1256537 1688995 1531149 650225 -514718 -1434386
36057a434386m03839J48490N69072O48861K88273k76644o04360m52020K7336M82185
$$ -1434386 -1838225 -1689735 -1120663 -471802 -183529 -460173 -1064533 -1516553 -1489217 -1007032
36047a007032O79040O12534L64283n2530o08056j046162j000670m84969m0557
$$ -1007032 -327992 284542 648825 596295 -11761 -1057923 -2058593 -2543562 -2584119
36038b584119r0092l12728r3609M91702P01893K33215k79560j35705N45286J132119
$$ -2584119 -2674211 -2986939 -3080548 -2588846 -1886953 -1653738 -1933298 -2069003 -1523717 -391598
36028c91598J227817P67693j37002j013783j181202o27524k48481n69158p81200
$$ -391598 836219 1603912 1466910 453127 -728075 -1355599 -1604080 -2173238 -2954438
36019b954438M0171J229700J270344R7201o93914j75952O92441P32627K17026
$$ -2954438 -2914267 -1684567 -414223 -317022 -1010936 -1186888 -494447 238180 455206
36010D55206K1290J01978j01527m45889m30977l28596p66560j389156j159323
$$ 455206 476496 578474 476947 31058 -399919 -728515 -1495075 -2884231 -4043554
36001d043554q2266N49271L2123o16613p4232J409754K334192J844734N95990
$$ -4043554 -4125820 -3576549 -3544426 -4161039 -4235271 -2825517 -491325 1353409 1949399
35992A949399k62805l81645k75485m52487q36460j020925q07090l35902J38406
$$ 1949399 1686594 1304949 1029464 576977 -259483 -1280408 -2087498 -2423400 -2284994
35983b284994L73143J67220l81116o80741j56336R41624J679903J565371J037822
$$ -2284994 -1911851 -1744631 -2125747 -2806488 -2962824 -2021200 -341297 1224074 2261896
35974B261896O14728J69504m69866q13411l37457N58173R85025P12422J60940
$$ 2261896 2876624 3046128 2576262 1762851 1425394 1983567 2968592 3681014 3841954
35965C841954m64093j170932j514788r46798J39210O81009M07074P7480R8887
$$ 3841954 3377861 2206929 692141 -254657 -115447 565562 972636 1050116 1149003
35956A149003m5766o33657j055291r06362p15802q51294o61165L36427J235621
$$ 1149003 1103237 469580 -585711 -1492073 -2207875 -3059169 -3720334 -3383907 -2148286
35947b148286R05073j57663l96704N85836J561199J426772L84281p47531j437952
$$ -2148286 -1243213 -1400876 -1797580 -1211744 349455 1776227 2160508 1412977 -24975
35938b4975j435779p24554J53410L98319p3229m84011k77998J88725K99217K782
$$ -24975 -1460754 -2185308 -2031898 -1633579 -1706808 -2190819 -2468817 -2280092 -1980875 -1978093
35928a978093l06612l11021P7887O80551R82484N62071k33782n47355j39258L19696
$$ -1978093 -2284705 -2595726 -2517839 -1837288 -854804 -292733 -526515 -1073870 -1213128 -893432
35918h93432L33185K55443M48519N10675Q1006j80645N82432J862227K103293
$$ -893432 -560247 -304804 143715 654390 735396 554751 1137183 2999410 5102703
35909E102703P33898r87382j533183q72782j76781j93933n60757o44420m64451
$$ 5102703 5836601 4849219 3316036 2443254 2266473 2072540 1511783 867363 402912
35900D02912m55246o06829l71125M26533J030772O17000m64509r67694l86727
$$ 402912 -52334 -659163 -1030288 -603755 427017 1044017 579508 -388186 -774913
35891g74913L85282M07150J6221J15398O38321O77480j31n49226l44731J64666
$$ -774913 -389631 17519 33740 149138 787459 1464939 1464808 915582 570851 735517
35881G35517K94507J30814J52308L12067J15078n64673j232113j316312o98679
$$ 735517 1030024 1160838 1313146 1625213 1740291 1175618 -56495 -1372807 -2071486
35872b071486K33070Q68801Q35573L51894J4926J37005M65922O11657M55336M3730
$$ -2071486 -1838416 -969615 -134042 217852 232778 369783 835705 1447362 1902698 1946428
35862A946428n31332r54026p99152j12188N04290O70193O53595O88288M45703
$$ 1946428 1415096 461070 -338082 -450270 54020 724213 1377808 2066096 2511799
35853B511799k59874q15222o43737k38576m13692q66773o32175J73913L84136
$$ 2511799 2251925 1436703 792966 554390 140698 -726075 -1358250 -1184337 -800201
35844h00201k53082n01261M05044J460999J401076M97491j50684k97484l95876
$$ -800201 -1053283 -1554544 -1149500 311499 1712575 2210066 2059382 1761898 1366022
35835A366022m24144j23359K8412n86864j356469j025924K99380J076797N19477
$$ 1366022 941878 818519 846931 260067 -1096402 -2122326 -1822946 -746149 -226672
35826b26672l95179n68779k42724j33508j47118J54888N68251O40930N08225M93740
$$ -226672 -621851 -1190630 -1433354 -1566862 -1713980 -1559092 -990841 -349911 158314 652054
35816F52054L64046j58879n66915j87185O39472R44046N42495J28797J1675k55505
$$ 652054 1016100 857221 290306 103121 742593 1686639 2229134 2357931 2369606 2114101
35806B114101q33089j116576o74786L5597K99457k0775n69390r24642p07137J81833
$$ 2114101 1281012 164436 -510350 -474753 -175296 -196071 -765461 -1690103 -2397240 -2215407
35796b215407J132512J194410K45389p03279p37581n8670O17604J048902J255851
$$ -2215407 -1082895 111515 356904 -346375 -1083956 -1142626 -525022 523880 1779731
35787A779731R32993m6332q87535o34145L72966P30558j58134j276006j386473
$$ 1779731 2712724 2666392 1778857 1144712 1517678 2248236 2090102 814096 -572377
35778e72377n34529L06825N39384L21771j3324l29963n43491n21952j92616L98780
$$ -572377 -1106906 -800081 -260697 61074 47750 -282213 -825704 -1347656 -1540272 -1141492
35768a141492J049334J345521R16187n4158q24518q78201m74419j56219k0229
$$ -1141492 -92158 1253363 2169550 2115392 1290874 412673 -61746 -217965 -238194
35759b38194J13292R9086l49140r57442j021473l61477L91514O42099M57553J31180
$$ -238194 -124902 -25816 -374956 -1332398 -2353871 -2715348 -2323834 -1681735 -1224182 -1093002
35749a093002l15098p77643p17186J99614J316769J494553M46222q96918j448708
$$ -1093002 -1408100 -2185743 -2902929 -2703315 -1386546 108007 554229 -342689 -1791397
35740a791397j025418k44110K76337M04597L91885M78219N85671M20541n3374
$$ -1791397 -2816815 -3060925 -2784588 -2379991 -1988106 -1509887 -924216 -503675 -557049
35731e57049m14756l09579j8401q5203m20878k93994O17449J617673J731987P56933
$$ -557049 -971805 -1281384 -1299785 -1384988 -1805866 -2099860 -1482411 135262 1867249 2624182
35721B624182o57455j654723j669387o94277N39449R83620L73935l24672r2198
$$ 2624182 1966727 312004 -1357383 -2051660 -1512211 -528591 -154656 -479328 -571526
35712e71526P52262R85189J99112o92056p88678k57397L01324Q03294J382785
$$ -571526 180736 1165925 1365037 672981 -115697 -373094 -71770 731524 2114309
35703B114309J656401J059445k44452j432039j965121j952136j627868j054871
$$ 2114309 3770710 4830155 4585703 3153664 1188543 -763593 -2391461 -3446332
35695c446332m14095l5407O4443K37610O02173Q09256O53467M85583O59188R08097
$$ -3446332 -3860427 -3895834 -3831391 -3593781 -2991608 -2182352 -1528885 -1043302 -384114 523983
35685E23983P03577K7310o02253p35453l04576M71861J120698J046197J13177
$$ 523983 1227560 1254870 652617 -82836 -387412 84449 1205147 2251344 2364521
35676B364521r78359j362756j010316n97935m41487j56972N19312J197407J401662
$$ 2364521 1386162 23406 -986910 -1584845 -2026332 -2183304 -1663992 -466585 935077
35667I35077J171087P70747K43824l86053q40783q97862o82050l50491J51439
$$ 935077 2106164 2876911 3120735 2734682 1893899 996037 313987 -36504 114935
35658A14935P07826Q62081M68584O5259P0111Q0106l53984p24333k54065P09520
$$ 114935 822761 1684842 2153426 2218685 2288796 2368902 2014918 1290585 1036520 1746040
35648A746040J058513O04613K39336K54797k41189j658970k785689k270567n71198
$$ 1746040 2804553 3409166 3648502 3903299 3662110 2003140 -782549 -3053116 -3624314
35639c624314O03506M65525j66597k44561K99244Q59789J031516Q63285N76549
$$ -3624314 -3020808 -2555283 -2721880 -2966441 -2667197 -1807408 -775892 87393 663942
35630F63942L17588J30545N3381J38322K64924O0305o48255j319372j130696q8375
$$ 663942 981530 1112075 1165456 1303778 1568702 1629007 980752 -338620 -1469316 -1557691
35620a557691Q08531Q07681L11617J39697L46921L38348j32255o53110p36883
$$ -1557691 -749160 58521 370138 509835 856756 1195104 1062849 409739 -327144
35611c27144l08437K82842M82109M750o63570o13519L35604J283302J425904J041433
$$ -327144 -635581 -352739 129370 134120 -529450 -1142969 -807365 475937 1901841 2943274
35601B943274P80721N74030j8187q47856j397267j579364j524301j005287P420
$$ 2943274 3723995 4298025 4279838 3431982 2034715 455351 -1068950 -2074237 -2066817
35592b066817O88108L75208j47193K79739J112243P16650q74084j593809l07807
$$ -2066817 -1378709 -1003501 -1150694 -870955 241288 957938 83854 -1509955 -1817762
35583a817762J465242J719301N28953o27555j018586r10512m82769K20957P14984
$$ -1817762 -352520 1366781 1895734 1268179 249593 -660919 -1143688 -922731 -207747
35574b07747N57292J21605O399N1280j87492m13738m9660N87804O22307J772m43538
$$ -207747 349545 471150 477549 528829 341337 -72401 -122061 465743 1088050 1089822 646284
35563F46284l06947m5311m7945j27616j05850j54940l30443l70844j71004M5524
$$ 646284 339337 294026 246081 118465 12615 -142325 -472768 -843612 -1014616 -969092
35553i69092J71581L67767O46444P31187M60244J4846k95794k47293J56285M78626
$$ -969092 -797511 -429744 216700 947887 1408131 1422977 1127183 879890 1036175 1514801
35543A514801J17984p83828j133542k85503P54619N05897q09474j441178n82150
$$ 1514801 1632785 848957 -284585 -570088 184531 690428 -119046 -1560224 -2142374
35534b142374N64178O67509R4185Q985M86707O01631K7170n10955m13345j1258
$$ -2142374 -1578196 -910687 -816502 -807517 -320810 280821 307991 -202964 -616309 -627567
35524f27567P3650j83704l39801k06607o0271j67499m02131m60625k88407r2351
$$ -627567 -553917 -737621 -1077422 -1284029 -1344300 -1511799 -1913930 -2374555 -2662962 -2755313
35514b755313j7783o4571k72327o31300p74977k25239Q60324J648465J623954
$$ -2755313 -2773096 -2837667 -3109994 -3741294 -4516271 -4741510 -3881186 -2232721 -608767
35505f08767J154065P36382K85442l06372n53702j33714K85167k7292n19327j38809
$$ -608767 545298 1281680 1567122 1260750 707048 573334 858501 831209 311882 173073
35495A73073P77279Q03206k86916j008262m22070M76120M22839k46493m44852
$$ 173073 950352 1753558 1466642 458380 36310 512430 935269 688776 243924
35486B43924j24670j3514j78022j19950J8613l80329j052609q49974N77191K016736
$$ 243924 119254 105740 -72282 -192232 -173619 -553948 -1606557 -2456531 -1879340 137396
35476A37396K111769R21566m23545j144310j295980j095032m85435M29644J033287
$$ 137396 2249165 3170731 2747186 1602876 306896 -788136 -1273571 -843927 189360
35467A89360P74562j4983l92798k3126L48953l7931q45263j100074m98337L57133
$$ 189360 963922 948939 556141 533015 881968 844037 -1226 -1101300 -1599637 -1242504
35457a242504Q53529Q58153M23328k53012n52475Q1499J200628J630520R55222
$$ -1242504 -388975 469178 892506 639494 87019 168518 1369146 2999666 3954888
35448C954888K7726k97293k16518l40037o55887o86823k66949K77732M55660l3092
$$ 3954888 3982614 3685321 3468803 3128766 2472879 1786056 1519107 1796839 2252499 2219407
35438B219407q61834j043819m1774J125810R13455m74858j127602k16093O87198
$$ 2219407 1357573 313754 271980 1397790 2311245 1836387 708785 492692 1179890
35429A179890J2486j404223j666165n88483M03004N46149L91179M54208N97674
$$ 1179890 1192376 -211847 -1878012 -2466495 -2063491 -1517342 -1126163 -671955 -74281
35420g4281O84242P35018N32398P905k43890J84049N39059q8360j188776j529086
$$ -74281 609961 1344979 1877377 1885282 1641392 1825441 2364500 2276140 1087364 -441722
35410d41722j068080p66653p61783l13443N17653Q17676N66929P54141J453508
$$ -441722 -1509802 -2276455 -3038238 -3351681 -2834028 -2016352 -1449423 -695282 758226
35401G58226J485265M78247l93369l81050k47428n91899p13788j71730O8666o60026
$$ 758226 2243491 2721738 2328369 1947319 1699891 1107992 394204 222474 291140 -368886
35391c68886j214422l32293J196293J609292O79610l61067q33620j046463j073180
$$ -368886 -1583308 -1915601 -719308 889984 1569594 1208527 374907 -671556 -1744736
35382a744736n56712L17772Q39088P83172N09301J79862k42821m23742O613O88255
$$ -1744736 -2301448 -1983676 -1144588 -361416 147885 327747 84926 -338816 -332203 356052
35372C56052R37917P25871M54519P5954o47279j291402j211403o55065m15842
$$ 356052 1293969 2019840 2474359 2550313 1903034 611632 -599771 -1254836 -1670678
35363a670678n11906k64186L95687Q00916P51064P43277R05726P76818L10339
$$ -1670678 -2182584 -2446770 -2051083 -1250167 -499103 244174 1149900 1926718 2237057
35354B237057M5891Q1442o1529l41027j29626M36874L31381n76962r12520J27708
$$ 2237057 2282948 2364390 2302861 1961834 1832208 2269082 2600463 2023501 1110981 1238689
35344A238689J238821P68252q12910j579589q58885J33217L11246N4870J49944
$$ 1238689 2477510 3245762 2432852 853263 -5622 127595 438841 493711 643655
35335F43655M31053K02009m92767p52497Q957J184807J504236M15253j224381
$$ 643655 1074708 1276717 783950 31453 40410 1225217 2729453 3144706 1920325
35326A920325k004068j446501l81419J68869R7057J2673K96793P35156R38146
$$ 1920325 -83743 -1530244 -1911663 -1742794 -1645737 -1633064 -1336271 -601115 337031
35317C37031P64504L40848q7361l02452k74881j87529j99495k17689j4259M30949
$$ 337031 1101535 1442383 1355022 1052570 777689 590160 390665 172976 158717 589666
35307E89666P95841O98798J58213k93084j48723L58385L66640n57370j725616
$$ 589666 1385507 2084305 2242518 1949434 1800711 2159096 2525736 1968366 242750
35298B42750k047643j266384r2316P03337Q36177L21114n94360j287072j208249
$$ 242750 -1804893 -3071277 -3163593 -2460256 -1624079 -1302965 -1897325 -3184397 -4392646
35289d392646o10091k23408j24492L23338J187679J531930Q02871j36954j31567
$$ -4392646 -5002737 -5226145 -5350637 -5027299 -3839620 -2307690 -1504819 -1641773 -1773340
35280a773340O82081J238530J073550O01544J33082m36448r97575j160117r22195
$$ -1773340 -1091259 147271 1220821 1822365 1955447 1518999 521424 -638693 -1560888
35271a560888o60047l53722L74698J242191J219693O929j131960q12890N63999
$$ -1560888 -2220935 -2574657 -2199959 -957768 261925 268854 -863106 -1675996 -1111997
35262a111997J225766L18964j013046j156337l2763R95208R59816L22705K8674
$$ -1111997 113769 432733 -580313 -1736650 -1769413 -774205 185611 508316 536990
35253E36990J63142R9965l47638o70469n88095m98708o90732p32689j80123N58695
$$ 536990 700132 800097 452459 -218010 -806105 -1304813 -1995545 -2728234 -2908357 -2349662
35243b349662P03009J85474l72095n95709o20219n12954j42681L44405O05762
$$ -2349662 -1646653 -1461179 -1833274 -2428983 -3049202 -3562156 -3704837 -3360432 -2754670
35234b754670P57793J237831J834194J647286M11320q78094j218163q62001o68136
$$ -2754670 -1996877 -759046 1075148 2722434 3133754 2255660 1037497 175496 -492640
35225d92640p38296n40304k9769K87948K97620L69272M83035J67022m87576o45858
$$ -492640 -1230936 -1771240 -1801009 -1513061 -1215441 -846169 -363134 -196112 -683688 -1329546
35215a329546J4911O62887N21984N6613J77726P55702Q66873L34730L7739N17622
$$ -1329546 -1314635 -651748 -129764 -73151 104575 860277 1727150 2061880 2099619 2617241
35205B617241J121667R38607o229r61336j422994j388144r34910j45331O03762
$$ 2617241 3738908 4677515 4671286 3709950 2286956 898812 -36098 -181429 422333
35196D22333P90732L41687k24401l82217j41813R3318M2919k03560l78500l68333
$$ 422333 1213065 1554752 1330351 948134 806321 899639 942558 738998 360498 -7835
35186g835l33789m83471p35217p16638j96112N78584J093333J049110N42525p5534
$$ -7835 -341624 -825095 -1560312 -2276950 -2473062 -1894478 -801145 247965 790490 714956
35176G14956l51927L8271Q58222J234657N09608p75448j266713m12137P81754
$$ 714956 363029 401300 1259522 2494179 3003787 2228339 961626 549489 1331243
35167A331243R97331K01953n65611p22019o86498q74995r53002m97131J81247
$$ 1331243 2328574 2530527 1964916 1242897 556399 -318596 -1271598 -1768729 -1587482
35158a587482M65120L60569L69742N74121M98011m4688n73250o51160m68355l61524
$$ -1587482 -1122362 -761793 -392051 182070 680081 635393 62143 -589017 -1057372 -1418896
35148a418896j85361L30998Q59533P07736k05650j090219j158358m60496L01838
$$ -1418896 -1604257 -1273259 -413726 294010 88360 -1001859 -2160217 -2620713 -2318875
35139b318875N94647N44350O81057J207690J546901Q81817o77481j857913j620351
$$ -2318875 -1724228 -1179878 -498821 708869 2255770 3137587 2460106 602193 -1018158
35130a018158m84743J98018P3398j9896L30032M28321j51459o05907j60867N53198
$$ -1018158 -1502901 -1304883 -1231485 -1251381 -921349 -493028 -644487 -1250394 -1411261 -858063
35120h58063M72487j20849m4683P91380J158696M23629n16257o59839k65397j31537
$$ -858063 -385576 -506425 -551108 240272 1398968 1822597 1306340 646501 381104 249567
35110B49567k74153j25828L67727O35541L56358j34854l37978j09150L26819O08197
$$ 249567 -24586 -150414 217313 852854 1209212 1074358 736380 627230 954049 1562246
35100A562246M55084j33223q22647j163404r33691l33835J36974J36770q0117
$$ 1562246 2017330 1884107 1061460 -101944 -1035635 -1369470 -1232496 -1095726 -1175843
35091a175843J18586Q81134J484396J169529J48487o94243r41060r07812q52434
$$ -1175843 -1057257 -176123 1308273 2477802 2626289 1932046 990986 83174 -769260
35082g69260o04616j11198K70824K74004M8971j83510l62043l53075p151M15163
$$ -769260 -1373876 -1485074 -1214250 -940246 -891275 -1074785 -1436828 -1789903 -1797054 -1381891
35072a381891M19404L1823j98672r6249p9580k81812k30083K30361M83587J43812
$$ -1381891 -962487 -930664 -1129336 -1225585 -1305165 -1586977 -1817060 -1586699 -1103112 -959300
35062i59300k07641P9706P09744J006269R45185Q71604O44570r7945j052515j380942
$$ -959300 -1166941 -1087235 -377491 628778 1573963 2445567 3090137 2992192 1939677 558735
35052E58735p01010M92847J276998R37125m47736j783264j854579p64794J75320
$$ 558735 -142275 350572 1627570 2564695 2116959 333695 -1520884 -2285678 -2110358
35043b110358L12917M42289J136128J461312M79387r34361j198241l21597L73611
$$ -2110358 -1797441 -1355152 -219024 1242288 1721675 787314 -410927 -732524 -358913
35034c58913L76631K99898L51347J06438k39877K8771O74196O34383j54110n64356
$$ -358913 17718 317616 668963 775401 535524 564295 1238491 1872874 1718764 1154408
35024A154408k16594n2248m75053m98855M40806J233734P07464n77227j209483
$$ 1154408 937814 885566 410513 -88342 352464 1586198 2293662 1716435 506952
35015E06952q14886j14757K52731J50186k62515m89723k1824Q04581R77714L09084
$$ 506952 -307934 -422691 -169960 -19774 -282289 -772012 -793836 10745 988459 1297543
35005A297543j33608L14683Q22362M42078l52115n00273L4487N09509O11050M32543
$$ 1297543 1163935 1478618 2300980 2743058 2390943 1890670 1925157 2434666 3045716 3478259
34995C478259j42749j015975j376903o85974K83057L73603l78618j014860j031207
$$ 3478259 3335510 2319535 942632 256658 539715 913318 534700 -480160 -1511367
34986a511367n54047L10565J230735J292223J31691r84383n63253Q66447J299187
$$ -1511367 -2065414 -1754849 -524114 768109 899800 -84583 -647836 218611 1517798
34977A517798J0960j562722j840824p84491O17954J433772J126152j31266j194828
$$ 1517798 1528758 -33964 -1874788 -2659279 -2041325 -607553 518599 387333 -807495
34968h07495r34516K91935J016233O15181j00114l71906m32880o32968p30326
$$ -807495 -1742011 -1450076 -433843 181338 81224 -290682 -723562 -1356530 -2086856
34959b086856n31405k90155k2126O33379J405738J273008m120j171244j089270
$$ -2086856 -2618261 -2908416 -2930542 -2297163 -891425 381583 377463 -793781 -1883051
34950a883051k58488J14819j14853j74604J79479L95602K06248J15816O23988
$$ -1883051 -2141539 -2026720 -2141573 -2316177 -2136698 -1741096 -1534848 -1419032 -795044
34941g95044J433350J649895P18387p88774j439805m15596J292090J747714L07259
$$ -795044 638306 2288201 3006588 2217814 778009 362413 1654503 3402217 3709476
34932C709476j625624k332873j614715n10647J42570K84159K22255K60396M98541
$$ 3709476 2083852 -249021 -1863736 -2374383 -2231813 -1947654 -1725399 -1465003 -966462
34923i66462O29526K13222o02851j078773q73149m93396m07106l44377M025K52240
$$ -966462 -336936 -123714 -726565 -1805338 -2678487 -3171883 -3578989 -3923366 -3919341 -3667101
34913c667101J3811j89571M04150J491562J943405J310917L37567j31657j17806
$$ -3667101 -3653290 -3842861 -3438711 -1947149 -3744 1307173 1644740 1513083 1395277
34904A395277j47842l72233m13848l1025L20768j22316j329325k096656j322417
$$ 1395277 1247435 875202 461354 430329 751097 628781 -700544 -2797200 -4119617
34895d119617M68153J589361J248804L33648o2031J8708j2634k24147l65485m53922
$$ -4119617 -3651464 -2062103 -813299 -479651 -541682 -522974 -535608 -759755 -1125240 -1579162
34885a579162m91706k15291K69349L10264j95758l88344R5106K63658n18662j040874
$$ -1579162 -2070868 -2286159 -2016810 -1706546 -1902304 -2290648 -2195542 -1931884 -2450546 -3491420
34875c491420l1873J422609J242783k85922p49879O54774J861523J125383n15184
$$ -3491420 -3523293 -2100684 -857901 -1143823 -1893702 -1238928 622595 1747978 1232794
34866A232794j100127m66670K25084M37236L23894j79298r22607r55672K03321
$$ 1232794 132667 -334003 -108919 328317 652211 472913 -449694 -1405366 -1202045
34857a202045J318807R50206k41427l51405P76048J231006L9973j283400j079697
$$ -1202045 116762 1066968 825541 474136 1250184 2481190 2521163 1237763 158066
34848A58066L585K33035m62354n65494M59755J245262N89888p30708j070447j74315
$$ 158066 161651 394686 -67668 -633162 -173407 1071855 1661743 931035 -139412 -313727
34838c13727O29202L14403o58655j233800j101173o74951j99372M48701J136381
$$ -313727 315475 629878 -28777 -1262577 -2363750 -3038701 -3238073 -2789372 -1652991
34829a652991J275207N37004n18071q80818j85493Q25697J088716M47672j39316
$$ -1652991 -377784 159220 -358851 -1239669 -1425162 -599465 489251 936923 797607
34820G97607J71070R03686Q01853m09932j461528j129933J51399R21711N89531
$$ 797607 968677 1872363 2674216 2264284 802756 -327177 -175778 745933 1335464
34811A335464r1049l47174l32167n02545p56374o72152k18871K25962L94595L44526
$$ 1335464 1244415 897241 565074 62529 -693845 -1365997 -1584868 -1358906 -964311 -619785
34801f19785K51857K10482J91874R8577r3673k47037k23247q6097J4499P3505
$$ -619785 -367928 -157446 34428 133005 39332 -207705 -430952 -517049 -502550 -429045
34791d29045J41847J44425P7202K19532P24917J107779O71562n16848j582785
$$ -429045 -287198 -142773 -65571 153961 878878 1986657 2658219 2141371 558586
34782E58586j845375j366007m47949P54188J861393K141754J273051q9311r24093
$$ 558586 -1286789 -2652796 -3100745 -2346557 -485164 1656590 2929641 2840330 1916237
34773A916237q33330j88960M13901N82976K81827j67481m08833m77519o13855
$$ 1916237 1082907 893947 1307848 1890824 2172651 2005170 1596337 1118818 504963
34764E04963o52979j51070P14674J033505L54890n81143q27166m44499j36347
$$ 504963 -148016 -299086 415588 1449093 1803983 1222840 395674 -48825 -185172
34755a85172j00490K1359L03347M03073K26277Q6465J45988K00738R7724l0688
$$ -185172 -285662 -264303 39044 442117 668394 754859 900847 1101585 1199309 1168621
34745A168621k4642R4213J94453J38716q2864j87901J58949P32647P65455o1265
$$ 1168621 1143979 1238192 1432645 1571361 1488497 1300596 1459545 2192192 2957647 2896382
34735B896382j036646j282526q01076j48855M62872J022169J090592K76644q23867
$$ 2896382 1859736 577210 -223866 -372721 90151 1112320 2202912 2479556 1655689
34726A655689j121307m99620P3619j4644l25523k65441J34998N62401Q14334O87314
$$ 1655689 534382 34762 108381 93737 -231786 -497227 -362229 200172 1014506 1701820
$$ [...]
##END NTUPLES=NMR SPECTRUM
##END=
