##TITLE=31Pdec_1-2025-Bay
 CDCl3, 24 sc
 10.12.2024
##JCAMPDX= 6.0         $$ Bruker NMR JCAMP-DX V2.0
##DATA TYPE= NMR SPECTRUM
##DATA CLASS= NTUPLES
##ORIGIN= UXNMR, Bruker Analytische Messtechnik GmbH
##OWNER= root
$$ XWIN-NMR		Version 3.5
$$ Fri Jan 10 14:25:17 2025 Russian Standard Time (UT+4h)  she@DPX200
##.OBSERVE FREQUENCY= 81.013821
##.OBSERVE NUCLEUS= ^31P
##.ACQUISITION MODE= SIMULTANEOUS
##.ACQUISITION SCHEME= undefined
##.AVERAGES= 24
##.DIGITISER RES= 17
##SPECTROMETER/DATA SYSTEM= spect
##.PULSE SEQUENCE= zgpg30
##.SOLVENT NAME= D2O
##.SHIFT REFERENCE= (INTERNAL, D2O, 0, 198.062)
##AUDIT TRAIL= $$ (NUMBER, WHEN, WHO, WHERE, WHAT)
$$ ##TITLE= Audit trail, XWIN-NMR		Version 3.5
$$ ##JCAMPDX= 5.01
$$ ##ORIGIN= Bruker BioSpin GmbH
$$ ##OWNER= she
$$ F:/spectra/data/she/nmr/P31/2/pdata/1/auditp.txt
$$ ##AUDIT TRAIL=  $$ (NUMBER, WHEN, WHO, WHERE, WHAT)
(   1,<2025-01-10 14:24:15.82 +0400>,<she>,<DPX200>,
      <created by zg, POWCHK disabled, PULCHK disabled
       configuration hash MD5:
       00 E9 B6 7A A2 85 ED C7 34 08 36 98 17 FE 4E 26
       data hash MD5: 32K
       4B A7 13 F5 97 48 59 9B D0 C8 FE 65 77 05 F4 89>)
(   2,<2025-01-10 14:24:18.09 +0400>,<she>,<DPX200>,
      <Start of raw data processing
       efp BC_mod = 2 LB = 1.5 FT_mod = 6 PKNL = 1 PHC0 = 2028.852 PHC1 = 326.0856 SI = 64K 
       data hash MD5: 64K
       24 BA 9F 04 75 D4 82 86 98 65 60 B7 DF 39 40 95>)
(   3,<2025-01-10 14:24:31.42 +0400>,<she>,<DPX200>,
      <pk PHC0 = -0.9478982 PHC1 = 0 
       data hash MD5: 64K
       2D 19 BE D7 26 98 79 47 A8 EA 13 0A 59 E3 02 6C>)
(   4,<2025-01-10 14:24:51.40 +0400>,<she>,<DPX200>,
      <pk PHC0 = 3.600001 PHC1 = 0 
       data hash MD5: 64K
       A7 13 4C CD 34 29 A3 08 F9 57 A6 EE 2B 03 A0 B9>)
(   5,<2025-01-10 14:24:54.56 +0400>,<she>,<DPX200>,
      <abs ABSG = 5 
       data hash MD5: 64K
       23 99 0A 1C C6 9D 88 D0 17 D3 41 A5 06 71 82 09>)
$$ ##END=
$$ 
$$ hash MD5
$$ AF 5C FE 47 16 8E 47 68 E5 A0 33 1F 0E FD 9F 3A
##$RELAX= 
##$RELAX= 
##$RELAX= 
##$RELAX= 
##$RELAX= 
##$RELAX= 
##$RELAX= 
##$RELAX= 
$$ Bruker specific parameters
$$ --------------------------
##$DU= <F:/spectra>
##$EXPNO= 2
##$NAME= <P31>
##$PROCNO= 1
##$TYPE= <nmr>
##$USER= <she>
##$AMP= (0..31)
100 100 100 100 100 100 100 100 100 100 100 100 100 100 100 100 100 100 
100 100 100 100 100 100 100 100 100 100 100 100 100 100 
##$AQSEQ= 0
##$AQ_mod= 1
##$AUNM= <au_zg>
##$AUTOPOS= <>
##$BF1= 81.014009
##$BF2= 200.13
##$BF3= 200.13
##$BF4= 200.13
##$BF5= 200.13
##$BF6= 200.13
##$BF7= 200.13
##$BF8= 200.13
##$BYTORDA= 1
##$CFDGTYP= 0
##$CFRGTYP= 5
##$CHEMSTR= <none>
##$CNST= (0..31)
1 1 145 1 1 1 1 1 1 1 1 1 1 1 1 1 1 1 1 1 1 1 1 1 1 1 1 1 1 1 1 1 
##$CPDPRG= <waltz16>
##$CPDPRG1= <>
##$CPDPRG2= <waltz16>
##$CPDPRG3= <>
##$CPDPRG4= <mlev>
##$CPDPRG5= <mlev>
##$CPDPRG6= <mlev>
##$CPDPRG7= <mlev>
##$CPDPRG8= <mlev>
##$CPDPRGB= <>
##$CPDPRGT= <>
##$D= (0..31)
0 1 0 0 0 0 0 0 0 0.06 0 0.03 2e-05 3e-06 0 0 0.0002 0 0 0 0 0 0 0 0 0 
$$ [...]
##$SUBNAM3= <"">
##$SUBNAM4= <"">
##$SUBNAM5= <"">
##$SUBNAM6= <"">
##$SUBNAM7= <"">
##$SUBNAM8= <"">
##$SUBNAM9= <"">
##$SW= 400.765351723535
##$SWIBOX= (0..15)
0 1 3 0 0 0 0 0 0 0 0 0 0 0 0 0 
##$SW_h= 32467.5324675325
##$TD= 32768
##$TD0= 1
##$TE= 0
##$TE2= 300
##$TE3= 300
##$TEG= 300
##$TL= (0..7)
0 120 53 12 22 120 120 120 
##$TP= (0..7)
150 150 150 150 150 150 150 150 
##$TP07= 0
##$TPNAME0= <>
##$TPNAME1= <>
##$TPNAME2= <>
##$TPNAME3= <>
##$TPNAME4= <>
##$TPNAME5= <>
##$TPNAME6= <>
##$TPNAME7= <>
##$TPOAL= (0..7)
0.5 0.5 0.5 0.5 0.5 0.5 0.5 0.5 
##$TPOFFS= (0..7)
0 0 0 0 0 0 0 0 
##$TUNHIN= 0
##$TUNHOUT= 0
##$TUNXOUT= 0
##$USERA1= <user>
##$USERA2= <user>
##$USERA3= <user>
##$USERA4= <user>
##$USERA5= <user>
##$V9= 5
##$VALIST= <valist>
##$VCLIST= <CCCCCCCCCCCCCCC>
##$VD= 0
##$VDLIST= <DDDDDDDDDDDDDDD>
##$VPLIST= <PPPPPPPPPPPPPPP>
##$VTLIST= <TTTTTTTTTTTTTTT>
##$WBST= 1024
##$WBSW= 4
##$XGAIN= (0..3)
0 0 0 0 
##$XL= 0
##$YL= 0
##$YMAX_a= 3734
##$YMIN_a= -6093
##$ZGOPTNS= <>
##$ZL1= 120
##$ZL2= 120
##$ZL3= 120
##$ZL4= 120
##$ABSF1= 198.0616
##$ABSF2= -202.7028
##$ABSG= 5
##$ABSL= 3
##$ALPHA= 0
##$AQORDER= 0
##$ASSFAC= 0
##$ASSFACI= 0
##$ASSFACX= 0
##$ASSWID= 0
##$AUNMP= <proc_1d>
##$AZFE= 0.1
##$AZFW= 0.5
##$BCFW= 0
##$BC_mod= 2
##$BYTORDP= 0
##$COROFFS= 0
##$CY= -3
##$DATMOD= 1
##$DC= 0
##$DFILT= <>
##$DTYPP= 0
##$F1P= 0
##$F2P= 0
##$FCOR= 1
##$FTSIZE= 65536
##$FT_mod= 6
##$GAMMA= 0
##$GB= 0
##$INTBC= 1
##$INTSCL= 9.790993e-09
##$ISEN= 30
##$LB= 1.5
##$LEV0= 0
##$LPBIN= 0
##$MAXI= 10000
##$MC2= 0
##$MEAN= 0
##$ME_mod= 0
##$MI= 50
##$NCOEF= 0
##$NC_proc= -8
##$NLEV= 6
##$NOISF1= 182.463
##$NOISF2= 159.3651
##$NSP= 0
##$NTH_PI= 0
##$NZP= 0
##$OFFSET= 198.0616
##$PC= 4
##$PHC0= 2031.504
##$PHC1= 326.0856
##$PH_mod= 1
##$PKNL= yes
##$PPARMOD= 0
##$PSCAL= 0
##$PSIGN= 0
##$REVERSE= no
##$SF= 81.0140089999434
##$SI= 65536
##$SIGF1= 159.3651
##$SIGF2= -187.1042
##$SINO= 113.3802
##$SIOLD= 16384
##$SREGLST= <1H.CDCl3>
##$SSB= 0
##$STSI= 65536
##$STSR= 0
##$SW_p= 32467.5324675325
##$SYMM= 0
##$S_DEV= 0
##$TDeff= 32768
##$TDoff= 0
##$TI= <>
##$TILT= no
##$TM1= 0
##$TM2= 0
##$TOPLEV= 0
##$USERP1= <user>
##$USERP2= <user>
##$USERP3= <user>
##$USERP4= <user>
##$USERP5= <user>
##$WDW= 1
##$XDIM= 65536
##$YMAX_p= 394514542
##$YMIN_p= -63579240
$$ End of Bruker specific parameters
$$ ---------------------------------
##NTUPLES= NMR SPECTRUM
##VAR_NAME=  FREQUENCY,     SPECTRUM/REAL,   SPECTRUM/IMAG
##SYMBOL=    X,             R,               I
##VAR_TYPE=  INDEPENDENT,   DEPENDENT,       DEPENDENT
##VAR_FORM=  AFFN,          ASDF,            ASDF
##VAR_DIM=   65536,         65536,           65536
##UNITS=     HZ,            ARBITRARY UNITS, ARBITRARY UNITS
##FACTOR=    0.49542278885378, 1,            1
##FIRST=     16045.7642231865, 0,            0
##LAST=      -16421.768244346, 0,            0
##MIN=       -16421.768244346, -63579240,    0
##MAX=       16045.7642231865, 394514542,    0
$$ Real data points
##PAGE= N=1
##DATA TABLE= (X++(R..R)), XYDATA
$$ [...]
44571 -1050223 675332 2240201 3198893 2589552 747653 -720512 -1024742 -994629 -1593978
44562 -1593978 -2798744 -4227246 -5787749 -7220782 -7796138 -6983410 -5059744 -2916139
44554 -2916139 -1570050 -1630555 -2653180 -3273092 -2698410 -1828368 -2078054 -3357451 -4210856
44545 -4210856 -3839160 -2928586 -2440715 -2590839 -3140091 -3757985 -3963085 -3582194 -3334746
44536 -3334746 -4052977 -5303271 -5768903 -4992651 -3628967 -2003859 160560 2346041 3074476
44527 3074476 1745403 -627357 -3052946 -5551715 -7837274 -8608427 -7374453 -5723303
44519 -5723303 -5361605 -5839944 -5635299 -4633397 -3894571 -3482277 -2287544 -7458 2190763
44510 2190763 3232502 3212984 2641098 1588494 -19429 -1915803 -3580868 -4448516 -4097440
44501 -4097440 -2707166 -1132050 12715 1025665 2233831 2901208 2046516 134026
44493 134026 -1178826 -1023464 -33574 973138 1911300 2798800 3334620 3540463 3818596
44484 3818596 3878358 2657833 52533 -2237251 -2593256 -1534804 -792509 -802262 -381468
44475 -381468 1202376 3128714 4330253 4828545 5110962 4979843 3962193 2492780 1655303
44466 1655303 1650393 1434258 324969 -778079 -570990 649942 1115371 -262806 -2715516
44457 -2715516 -4773363 -5713526 -5459575 -4006084 -1798128 -31462 434507 97345 -190164
44448 -190164 -806928 -2675538 -5140489 -6062031 -4458691 -1773101 122234 979383 1381374
44439 1381374 1076959 -508552 -2723059 -4103586 -4251677 -4159066 -4651870 -5484653 -5986076
44430 -5986076 -5629400 -3927160 -851618 2379590 3986263 3560487 2480654 2030413 2094323
44421 2094323 2230849 2838621 4201757 5281180 4804236 3098036 1544958 499809 -881728
44412 -881728 -2789378 -4172746 -4317208 -3724401 -2936919 -1685320 96526 1468918 1607551
44403 1607551 969307 513818 461575 609877 1065182 1677772 1584403 589739 261631 2002448
44393 2002448 4459871 4820332 2778619 1173033 2002513 3759938 3982327 2830053 2340652
44384 2340652 3117324 3765763 3339578 2496285 2007199 1683486 1301516 1295361 1767043 1794261
44374 1794261 637148 -979898 -1655805 -1004853 199914 1270495 2159289 2854952 3035985
44365 3035985 2528216 1567669 449905 -590025 -1004109 -37246 2363220 5059820 6529615
44356 6529615 6048341 4028881 1612854 92528 124821 1054795 1508100 1117245 1029845
44347 1029845 2082974 3360661 3743222 4070300 5874470 8189929 7923569 4092429 -387441
44338 -387441 -2386823 -2268246 -2313898 -3033620 -3203901 -2632797 -2522486 -3306353 -4146750 -4562927
44328 -4562927 -4756438 -4370918 -2825898 -978560 -463980 -1033085 -515302 2003797 4870023
44319 4870023 6412732 6878525 6911748 6064260 4110559 2161389 1058739 145534 -1007675
44310 -1007675 -1259620 70340 1371995 943708 -241602 -162141 871026 880192 -339840
44301 -339840 -987109 -365786 154727 -392968 -1222589 -1396195 -970936 -15272 1840124
44292 1840124 4195099 5645764 5426848 4141777 2487532 585253 -1036740 -1358809
44284 -1358809 -512177 -92617 -916030 -1721670 -1182519 -96627 -242436 -1723680 -2791227
44275 -2791227 -2117958 -210299 1514962 2350588 2748539 3402848 4118481 3914469 2492745
44266 2492745 1098604 1131146 2184036 2524347 1500738 316224 168727 755382 1041462
44257 1041462 470534 -1058715 -3332358 -5286763 -5366725 -3289346 -691053 780025 1274070
44248 1274070 1787479 2177768 1387957 -573791 -2072219 -1628756 313682 1820979 1585061
44239 1585061 388807 173627 1574525 2965168 2552513 870845 117856 1260094 3103440
44230 3103440 4288754 4749813 4757830 3977724 2348110 775809 -42308 -669971 -1883672
44221 -1883672 -3268084 -3781607 -3247749 -2511958 -2454377 -3337489 -4682208 -5433070 -4832842
44212 -4832842 -3429717 -2525560 -2444042 -2267184 -1429203 -313840 994841 2921745 4716446
44203 4716446 4414862 1750290 -523608 113553 2571114 3720927 2382090 48592
44195 48592 -1505926 -1592201 -272289 1536977 2110103 744845 -877932 -728690 746545
44186 746545 1515862 1001618 218000 -599881 -2128515 -3767457 -3725643 -1739911 383042
44177 383042 1493625 2409391 3857783 5064904 5346290 5428732 6138916 7175522 8128278
44168 8128278 9319270 10598160 10671266 8906747 6708206 5724464 5503028 4314942 1826765
44159 1826765 -386856 -905464 20504 1194974 2027978 2964178 4445535 5721918 5259483
44150 5259483 2748603 134994 -277844 1488578 3278854 3478042 2362535 911442
44142 911442 -350206 -1125435 -1251845 -1146666 -1228073 -808425 1069501 3609820 4779287
44133 4779287 4172504 3454393 3341881 2352671 -169286 -1882681 -289776 3638591 6691640
44124 6691640 7291463 6212893 4314394 1786181 -606639 -1615482 -1104588 -75820
44116 -75820 984538 2360239 3650824 3637449 2040223 99124 -1159705 -2116567 -3364717
44107 -3364717 -4346056 -4157911 -3170607 -2798824 -3648785 -4635436 -4250090 -2295667 34316
44098 34316 1543074 1892080 1142520 -595076 -2519661 -3097485 -1762761 -61485 187601
44089 187601 -608929 -738191 -235526 -918682 -3156722 -4880159 -4670429 -3766209 -3810989
44080 -3810989 -4536471 -5136207 -6084902 -7747496 -8716719 -7549990 -4955994 -2369235 327859
44071 327859 3538919 5786832 5475355 3907179 3728007 4887953 5003705 3444310 2032130
44062 2032130 1613195 1075013 274678 726559 2314466 2433178 91983 -1837381 -591862
44053 -591862 2427316 3849872 2877812 1279353 200111 -498659 -533491 654709 2227186
44044 2227186 2519831 1365230 122164 -641615 -1731159 -3281969 -3862920 -2485386 -327101
44035 -327101 627918 131624 -91901 1392658 3893755 5330867 4577585 2650276 1467567
44026 1467567 1897542 3415871 5114991 6148289 5565363 3118715 437952 -67529 1782232
44017 1782232 3234583 1898106 -1245746 -3278130 -2991753 -1729543 -1016488 -830703 -336135
44008 -336135 825620 2342225 3591878 3891066 2896734 1035118 -728332 -1643013 -1594174
43999 -1594174 -966511 -332147 -84440 -161895 -311437 -613198 -1213950 -1463865 -201793
43990 -201793 2569640 5074336 5609679 4451280 3134042 2374302 1668056 593326 -589342
43981 -589342 -1649451 -2791880 -4132209 -5343038 -5985956 -5861344 -5069921 -4002541 -3062502
43972 -3062502 -2146835 -831405 574392 808079 -818474 -3210356 -4634956 -4638854 -3969668
43963 -3969668 -3116586 -2110573 -1473456 -1950083 -3117004 -3492570 -2477029 -1241660 -1210987
43954 -1210987 -2406235 -3725798 -4194093 -3463447 -1649304 749770 2961495 4268710
43946 4268710 4208697 2685437 350354 -1364646 -1413324 -441297 -193369 -1403196 -2918172
43937 -2918172 -3138284 -1682123 616200 2682479 3799337 3831730 3357817 3245322 3762779
43928 3762779 4345939 4341357 3625869 2514518 1615724 1777086 3406947 5639030 6922639
43919 6922639 6755910 6127427 5952610 5943652 5517117 4877100 4354026 3406400 1357653 -1244819
43909 -1244819 -3060385 -3643399 -3749783 -3868148 -3349878 -1475869 1096811 2548755 1681454
43900 1681454 -657597 -2181100 -1448643 544767 1447795 169302 -2123194 -3606344
43892 -3606344 -3597449 -2554948 -1321041 -977607 -2435529 -5128121 -6857291 -6140212 -4159657
43883 -4159657 -3095190 -3063610 -2409799 -802016 71340 -606161 -1229306 -282414 1234132
43874 1234132 1434880 401213 -352313 -433140 -670713 -1111554 -998684 -795757 -2100849
43865 -2100849 -4917282 -6932851 -6569200 -5082456 -4250004 -3471274 -1130463 2070508 3449745
43856 3449745 1993079 -347169 -1442551 -1364264 -1237430 -1220430 -754659 131187 870521
43847 870521 1126998 682859 -784404 -2911285 -4263018 -3829836 -2525271 -2099218 -2771591
43838 -2771591 -3052601 -1924594 -195391 513716 -612220 -3034433 -5203631 -5494734 -3706592
43829 -3706592 -1734165 -1826823 -3968170 -5886645 -5890392 -4637764 -3657447 -3272554 -2895676
43820 -2895676 -2515471 -2684264 -3307143 -3434794 -2330321 -225802 1911385 3060359 2927583
43811 2927583 2403231 2758869 3942203 4316024 2806966 654573 -27725 998263 1996441
43802 1996441 1702867 532922 -738804 -2067191 -3370937 -3935519 -3468984 -2896631 -3202377
43793 -3202377 -4122875 -4865469 -5524133 -6734684 -8269803 -9051917 -8476933 -6802148 -4324042
43784 -4324042 -1246638 1512600 2571733 1763369 790019 1504322 3950737 6555933 7746209
43775 7746209 6908413 4404754 1467031 -269512 -30954 1248864 1891484 1229170 -21024
43766 -21024 -829811 -648914 567832 2239140 3153825 2580529 1461713 1479154 2712399
43757 2712399 3362131 2298394 735505 504666 1571973 2342202 1816361 361240 -1252219
43748 -1252219 -2495764 -2981351 -2655221 -1954836 -1051159 640831 3279433 5465689 5577423
43739 5577423 3904042 2066838 641233 -890673 -1963568 -1042669 1402416 2359687
43731 2359687 190537 -2772963 -3385894 -1884902 -653372 -4925 1843038 4783474
43723 4783474 5906766 3602947 192294 -1134332 -345558 250121 -253655 -446119 897081
43714 897081 3178610 5097423 6098398 6307446 6038986 5854518 6298265 7012937 6735500
43705 6735500 4741429 1810413 -753139 -2493739 -3521278 -3490519 -2052390 -151199
43697 -151199 505938 -322962 -936322 -185174 689691 -27940 -1570798 -1394501 1165298
43688 1165298 3657029 3625395 1655914 239802 425654 864884 -56479 -2246232 -4199694
43679 -4199694 -4464978 -2584421 750137 4019325 5708340 5354699 3853814 2543861
43671 2543861 1967483 1681334 1252706 1037202 1564015 2402511 2452437 1606864 1239686 2274523
43661 2274523 3486171 2959971 964137 -114664 970696 2461834 1767002 -1382318
43653 -1382318 -4753551 -5989664 -4491552 -1507359 925849 1525909 860813 599802 1359241
43644 1359241 1937318 1168549 -245479 -559941 886452 3115406 4646753 4589933 3169112
43635 3169112 1826809 2198802 4265817 6123940 6236216 5092758 3885871 2669296
43627 2669296 1093040 -36456 420719 2129022 3814700 5043676 5895250 5579120 3438234
43618 3438234 1003298 817855 3060262 5314872 5868421 5200903 4005526 2094008 -27263
43609 -27263 -780366 151794 1016380 643541 117340 641645 1559662 1853819 1882135 2121755
43599 2121755 1878807 967872 1059258 3287854 5770751 5684200 2961054 -89987 -2076853
43590 -2076853 -3399315 -4456408 -5045900 -5203190 -4814512 -2852469 1073811 4807874 5389909
43581 5389909 2665428 -689245 -2610197 -3233631 -3237307 -2790924 -2403355 -2799808 -3527283
43572 -3527283 -3406046 -2585479 -2306012 -2462749 -1581636 318476 1143317 -115926 -1778369
43563 -1778369 -2150787 -1818420 -1937031 -2095260 -1486267 -669888 -433873 -86400 1430394
43554 1430394 3654591 5383061 6498758 7497521 7904309 6707532 3962476 724901
43546 724901 -2162417 -4150503 -4498683 -2959654 -553926 1337810 2228648 2213394 1346010
43537 1346010 223802 1080 580110 58759 -2426653 -4613700 -3977046 -1644174 -930665
43528 -930665 -2550741 -4062583 -4037057 -3858782 -4694418 -5338513 -4368203 -2380666 -696829
43519 -696829 475555 1191694 599571 -1764517 -4538920 -5891076 -5651856 -4986634 -4691968
43510 -4691968 -4886160 -5585472 -6401097 -6324983 -4983260 -3547107 -3327969 -4076255 -4768785
43501 -4768785 -5352629 -6316164 -7109910 -6647349 -5183375 -4083212 -3704227 -3134170 -2267770
43492 -2267770 -2380913 -3872779 -4978369 -3968122 -1634217 -274439 -778114 -1970353
43484 -1970353 -2534346 -2330517 -1797433 -1200786 -791451 -776187 -689861 386743 2375663
43475 2375663 3654924 2787189 388807 -1587044 -2179633 -2083353 -2104963 -2164449 -2161584 -2629981
43465 -2629981 -3689534 -4226439 -3212935 -1370735 -441224 -1035280 -2225889 -3147563 -3936008
43456 -3936008 -4986198 -6222623 -7299096 -7768461 -7048566 -5119233 -3233035 -2814051 -3533615
43447 -3533615 -3746716 -3078594 -3017909 -4278347 -5244214 -4315536 -2418248 -1489720 -1412382
43438 -1412382 -410247 1853367 3490780 2941776 870344 -839868 -900334 769212 3156014
43429 3156014 4600283 4073133 2294586 828714 70362 -888242 -2396257 -3523053 -3537462
43420 -3537462 -2934602 -2481169 -2264419 -2206269 -2502578 -2956215 -2874810 -2322558 -2498489 -4048178
43410 -4048178 -5884262 -6593078 -6217932 -5678871 -5183575 -4352914 -3362343 -2773701 -2559415
43401 -2559415 -2304554 -2008054 -1703023 -809714 887549 2080452 1316974 -573584 -1095425
43392 -1095425 610441 2640407 2993693 1833318 330359 -1216875 -2849037 -3710414
43384 -3710414 -2985483 -1564840 -1270146 -2493096 -3796946 -3857136 -2698496 -975958 752137
43375 752137 1691638 928934 -1364632 -3610741 -4492819 -4407856 -4490021 -4710876 -4013669 -2195059
43365 -2195059 -521262 -166173 -946893 -2081969 -3326275 -4539721 -4835208 -3406248 -1070953
43356 -1070953 258313 -64771 -722709 -654052 -805548 -2523761 -4963621 -5659286 -3652406
43347 -3652406 -665666 1196363 1699052 1803369 1856728 1546461 1040513 971331 1369103
43338 1369103 1536633 1054461 186910 -758074 -1746063 -2571141 -2817028 -2494717 -2045762
43329 -2045762 -1449648 -107415 1896337 3189133 2578438 605668 -1277942 -2701120
43321 -2701120 -4397270 -6327052 -7127004 -5965851 -3899350 -2535208 -2034794 -1346842 27255
43312 27255 1462779 2182197 1878443 489490 -1640602 -3257271 -2867069 -358035 2765515
43303 2765515 5112315 6569805 7305407 6630932 3932059 219865 -2397574 -2757207 -1345133
43294 -1345133 869467 3272465 5173184 5660215 4550677 2885685 1867587 1630492
43286 1630492 1494687 1087514 712418 814385 1522162 2581363 3363255 3112389 1670551
43277 1670551 -64196 -861010 -445645 325247 744297 1255629 2690951 4701920 5658790
43268 5658790 4441439 1871596 -204900 -1057080 -1600901 -2764444 -4135811 -4666727 -4070719
43259 -4070719 -2911254 -1819409 -1332393 -1992190 -3613191 -4756431 -4089015 -2204301 -864665
43250 -864665 -369447 812315 3276462 5172862 4634403 2477643 967929 723346 538555
43241 538555 -166221 -566313 -157050 447223 818128 1277677 1588212 606710 -1784445
43232 -1784445 -3685623 -3394166 -1714929 -701183 -737098 -425022 842695 1823570 1306198
43223 1306198 -236462 -1568989 -2383548 -3240449 -4316277 -5075759 -5168474 -5034953 -5310440
43214 -5310440 -5768242 -5168570 -2502771 1522775 4682855 5374656 4280001 3281015 2984210
43205 2984210 2306129 609238 -958235 -980901 257173 1343155 1711637 1844071 1684151
43196 1684151 237083 -2711733 -5377010 -5323819 -1922229 2867822 6080998 6156721 4187184
43187 4187184 2879578 3905578 6211557 7331991 6250789 4233486 2815038 2037387
43179 2037387 1195622 320362 -41323 97667 309614 584042 1063158 1289929 782165
43170 782165 172867 668821 2382000 4253716 5633100 6738538 7433829 6953423 5362431
43161 5362431 3974434 3521861 3046378 1522451 -497563 -1975703 -3125031 -4641693
43153 -4641693 -5934709 -5752705 -4256450 -2878251 -2193234 -1500103 -641119 -584757 -1656637
43144 -1656637 -2642107 -2454214 -1535156 -759171 -21166 1058072 1918768 1760319 890892
43135 890892 223043 -199524 -1024132 -2133640 -2495886 -1516689 362478 2413353 4038309
43126 4038309 4467338 3248299 1448533 1250713 3507938 6346001 7031446 4882193 1651097
43117 1651097 -627985 -1371739 -1186306 -785420 -482262 -243156 122581 658779 1041677
43108 1041677 880343 306659 21348 634712 2083241 3646544 4327123 3410722 1230942
43099 1230942 -537514 -45021 2753566 5647891 6228391 4208591 1298116 -892868
43091 -892868 -2121890 -2812852 -2958135 -2112142 -77263 2651749 4878599 5229632 3342141
43082 3342141 680303 -618109 -185654 -30331 -2007961 -5268837 -7192854 -6600802 -4957131
43073 -4957131 -4301309 -5035882 -6161577 -6728587 -6263018 -4449967 -1564174 842079 798049
43064 798049 -1984703 -5482712 -7469358 -7879209 -8318763 -9442398 -9946051 -8612527 -6319990
43055 -6319990 -4939949 -4755827 -4269272 -2522630 -282365 1437514 2738816 3975640
43047 3975640 4604834 3926199 2233527 249337 -1866783 -3861102 -4534959 -3062431 -681607
43038 -681607 633319 1018200 2384955 5089457 6987219 6558409 5023137 4062842 3134994
43029 3134994 874954 -2017206 -3488714 -3309367 -3392093 -4732251 -5947496 -5646364 -4758758
43020 -4758758 -5282097 -7474417 -9493864 -9643819 -8082916 -6231467 -5148228 -4797067 -4555124
43011 -4555124 -4014396 -3218714 -2328179 -1297852 1142 1399973 2315757 2171444 1030962
43002 1030962 -274345 -890136 -813698 -688154 -687311 -263488 567921 485182 -1526422 -4177393
42992 -4177393 -4811202 -2487547 1023381 3533449 4405021 3808412 1666615 -1424113 -3468359
42983 -3468359 -2979023 -1090458 -226831 -931741 -1548755 -1022092 -364824 -776809 -1595583
42974 -1595583 -1104503 1172442 3749249 4634072 3211108 806760 -544704 -69792 1092747
42965 1092747 1390583 653627 -58987 -5712 584122 1195029 1560108 1560929 1330114 1422976
42955 1422976 2173685 2953820 2859388 2068349 1616683 1816595 1897818 1380574 775283 583141
42945 583141 553886 358154 119917 -158314 -808759 -1624701 -1690056 -757515 50758 -243297
42935 -243297 -949767 -636619 896133 2476808 3056992 2481332 1060625 -628191 -1525389
42926 -1525389 -631244 1821274 4183406 4702448 2932577 -48099 -2503198 -3200881 -2192364
42917 -2192364 -704048 -147091 -1017636 -2546232 -3265485 -2111902 586854 3134180 3852013
42908 3852013 2613268 760614 -420396 -638260 -54794 1290817 2982927 3804171 2684833
42899 2684833 52000 -2302292 -2839925 -1608568 -6425 660447 415997 360636 1090439
42890 1090439 1715257 997103 -726685 -1591784 -384937 2009400 3647319 3443061 1768495
42881 1768495 -258558 -1660139 -2193016 -2434625 -3060246 -4008143 -4753189 -5225716 -5691456
42872 -5691456 -5811359 -4885718 -3228788 -2166233 -2194561 -2156018 -807745 1672083 4193070
42863 4193070 5760924 5540439 3180013 -180547 -2443041 -2962061 -3227424 -4267216 -4865505
42854 -4865505 -3694908 -1754377 -854343 -773947 26651 1580905 2405003 1955975 1139994
42845 1139994 546363 153 -282399 63583 240829 -897877 -2718654 -3407985 -2787052
42836 -2787052 -2456558 -2831034 -2250966 163192 2779759 3685922 3047997 2136914 1379306
42827 1379306 526084 -326123 -911556 -1165236 -772234 679147 2598597 3617394 3400173
42818 3400173 2919641 2470917 1075406 -1379662 -3216559 -3339685 -2853729 -2959952 -2914155
42809 -2914155 -1802318 -851051 -1814668 -3982740 -4920115 -3698878 -1529190 416490 1941253
42800 1941253 2769219 2363958 1029134 -98561 -295743 409182 1846532 3632222 4922445
42791 4922445 5355738 5697423 6368576 6167972 4107504 1748405 1550281 3211496 3984398
42782 3984398 2730923 1233623 879518 456640 -1477717 -3957467 -4951108 -4086500 -2550505
42773 -2550505 -1188234 -76624 671529 959080 1201003 1806909 2479753 2702423 2396974
42764 2396974 1447994 -638247 -3585705 -5555930 -4912205 -2610571 -1460081 -2717104
42756 -2717104 -4558441 -4554451 -2807544 -1666884 -2586560 -4269956 -4334922 -2207375 385128
42747 385128 1642470 1538388 1133476 870163 363516 -497059 -1141193 -1031987 -173539
42738 -173539 1086947 2266541 2897040 3009918 3227258 3711712 3386119 1179109 -2141306
42729 -2141306 -4522105 -5038796 -4593817 -4116308 -3452996 -2478757 -1874903 -1940815 -1808407
42720 -1808407 -889345 -146361 -721959 -1988539 -2225209 -833956 1301974 3389438 5384596
42711 5384596 7032062 7450553 6204892 4135190 2610509 2180498 2171453 1491716 -175046
42702 -175046 -1902324 -2431233 -1639482 -680395 -410333 -322394 289737 694559 -538181
42693 -538181 -3105651 -4523781 -2917737 376985 2036496 576121 -1942540 -2502200
42685 -2502200 -748499 923737 704160 -436011 -370549 1424229 3691447 5166700 5261957
42676 5261957 3530497 62548 -3626032 -5694611 -6244255 -6999013 -8394762 -8711118 -6843966
42667 -6843966 -4191883 -2567993 -1757966 -670556 374058 318391 -551353 -1038781 -976129
42658 -976129 -988299 -830321 187121 1429816 1515334 565792 13661 184329 97249 -158720
42648 -158720 863899 3180069 4473922 3186057 673872 -1104252 -2425046 -4577238
42640 -4577238 -7030180 -7855756 -6525723 -4605002 -3727623 -4061079 -4632665 -4225972 -2263069
42631 -2263069 268069 1179793 -613998 -3604754 -5537441 -6116253 -6467101 -6559984 -5280533
42622 -5280533 -3145135 -2634210 -4799002 -7351796 -7622925 -6126200 -5417025 -6164243 -6346817
42613 -6346817 -4379418 -1287752 823137 1205309 589569 -193478 -753258 -842797 -522395
42604 -522395 -489210 -1456642 -3177985 -4673170 -5388389 -5513151 -5217514 -4441912 -3660681
42595 -3660681 -3908471 -5408862 -6867931 -6925818 -5807541 -4637890 -3542428 -1659034 934584
42586 934584 2584861 1920710 -534859 -3239766 -5341305 -6700476 -6901284 -5512358 -3319013
42577 -3319013 -2108612 -2661456 -3645871 -3207303 -1318733 187891 -81832 -1469663 -2276477
42568 -2276477 -1842169 -987806 -619617 -669787 -571914 -90994 711401 1765149 2696149 2701263
42558 2701263 1428772 -236572 -928905 -214001 1309039 3019936 4577548 5414882 5020182
42549 5020182 3909155 3339525 3698374 4036706 3598634 2889335 2638455 2605718 2267206
42540 2267206 1974018 2390613 3204420 3478662 3163149 3237086 4203488 5287071 5493245
42531 5493245 4907471 4504575 4917351 5775256 6277507 6148330 5702726 4962643 3331220
42522 3331220 781680 -1106233 -525854 2000895 3730315 2942000 890985 -318978
42514 -318978 -551106 -944274 -1419815 -812036 802459 1848529 1617258 1197735 1418466
42505 1418466 1332912 -230267 -2617888 -3989215 -3504907 -1937126 -338366 1060178 2501330
42496 2501330 3754034 3919616 2400394 8467 -1436069 -1014268 342674 1444291
42488 1444291 2596258 4512225 6109886 5360576 2435921 -115388 -1068812 -2290996
42480 -2290996 -5403675 -8580258 -8848740 -6461142 -4552527 -4832820 -5924324 -6116325 -5606948
42471 -5606948 -5345531 -5424646 -5566251 -5859880 -6066701 -5329430 -3576202 -2225144 -2377795
42462 -2377795 -3090336 -2631338 -908352 552067 645528 -524212 -2607225 -5267234 -7311036
42453 -7311036 -7064183 -4433141 -1658539 -1135321 -3022469 -5658995 -7654008 -8616134 -8349300
42444 -8349300 -6671560 -4170840 -2056900 -831654 140532 1365631 2308600 2318991 1793020
42435 1793020 1626636 1889204 1820984 1014098 -17422 -385793 431297 2134744 3521684
42426 3521684 3377319 2016776 1252976 1943414 2371952 515824 -2675812 -4268690 -3551175
42417 -3551175 -2920170 -3884541 -4599932 -2985158 -319584 537538 -681824 -1701410 -1365099
42408 -1365099 -845772 -1183601 -1831875 -2100123 -2151738 -1915978 -669150 1470832 3017972
42399 3017972 2973012 2072109 1389815 810259 -226770 -1478933 -2404632 -3114133 -3857918
42390 -3857918 -4223923 -3746428 -2791960 -2101607 -1964242 -2359583 -3139521 -3499764 -2311040
42381 -2311040 173212 1997796 1930928 1115708 1050515 1125513 -81245 -2037027 -2947108
42372 -2947108 -2672433 -2632536 -2957896 -2221126 -337215 759998 191320 -391452 404122
42363 404122 1503577 1404672 529238 -203681 -1399773 -3617326 -5198594 -4269615 -2098361
42354 -2098361 -1726724 -3458484 -4387930 -2732295 -78498 1492396 2188570 3122495 4045865
42345 4045865 4097833 3530994 3156999 3030698 3044307 3852329 5673585 7008049 6328610
42336 6328610 4582512 4126416 5217332 5431415 3035158 -637300 -2952152 -2972440 -1862759
42327 -1862759 -1158184 -1482854 -2460081 -3157208 -2861021 -1794963 -787360 -141419 558278
42318 558278 1403365 1847216 1846411 2319728 3700787 4883357 4605213 3242394 2114473
42309 2114473 1487514 548032 -845036 -1751794 -1651228 -1115685 -617277 205550 1481354
42300 1481354 2267697 1643372 86909 -1023341 -975374 -166324 747656 1516287 2202281
42291 2202281 2893585 3487066 3526762 2483791 503786 -1382844 -2174808 -1828547 -961320
42282 -961320 45782 1152066 2137037 2683366 3024740 3891203 5546177 7276927 8135130
42273 8135130 7929771 7188520 6289288 5016522 3111777 1000670 -415402 -763052 -625002
42264 -625002 -686452 -803136 -442202 196699 282862 -392630 -1106336 -1381234 -1593105 -1963275
42254 -1963275 -1885451 -989594 -14557 353643 748145 1999058 3363085 3398410 2299114
42245 2299114 1641196 1750898 1187091 -614056 -1987944 -1362587 581733 2325382 3696352
42236 3696352 5019033 5225012 2985946 -628290 -2766934 -2359030 -1261105 -1287420 -1730565
42227 -1730565 -825014 1536320 3756888 4552664 3996984 2964282 2391307 2809089 3850768
42218 3850768 4362578 3545959 1798612 21123 -1481148 -2818535 -3723089 -3831537 -3584411
42209 -3584411 -3959054 -5275267 -6983331 -8561922 -9724537 -9716562 -7647169 -4163759 -1796641
42200 -1796641 -2509653 -5227756 -6770745 -5260713 -1871911 891120 1913490 2040108
42192 2040108 2370965 2695487 1956068 106326 -1073277 320602 3742883 6100930 4878653
42183 4878653 987176 -2278797 -2992548 -2389797 -2715905 -4273296 -5432715 -5068768 -3883064
42174 -3883064 -3114126 -2798895 -2025053 -610466 295686 -399581 -2227891 -3574305 -3432683
42165 -3432683 -2206423 -803606 360657 1195537 1480333 1188896 800842 605926 67824
42156 67824 -1333408 -2929290 -3501275 -2966716 -2360804 -2128269 -1704470 -1099541 -1435142
42147 -1435142 -3003913 -4007650 -2559009 729783 3428375 4140171 3507926 2777700 2708007
42138 2708007 3741255 5776746 7489886 7144390 4635306 1871046 734270 1405893
42130 1405893 2849596 3902548 3572826 1516181 -1023889 -1814305 -148004 2050056
42122 2050056 2626771 1910004 1755405 2515593 2620822 1196661 -485798 -759729 394633
42113 394633 1832921 2931062 3852145 4595800 4765745 4282162 3619916 3200136 3041640
42104 3041640 3114107 3471928 3750617 3097442 1246945 -594361 -756818 819388 2208242
42095 2208242 1641022 -459613 -2151173 -2333585 -1730735 -1587940 -2099020 -2383356 -1650595
42086 -1650595 -161026 873573 421579 -1202410 -2606268 -3020918 -3196247 -4004842 -4789536
42077 -4789536 -4222977 -2495047 -1266101 -1362766 -1901475 -1996535 -1861811 -1624696 -592398
42068 -592398 1274710 2533707 2221093 1473171 1666018 2014867 968124 -723422 -643359
42059 -643359 1641508 3876260 4579794 5037051 6732953 8658212 8859174 7466466 6215837
42050 6215837 5414337 3392538 -580669 -4369971 -5070037 -2457859 646390 1456669 -77676
42041 -77676 -1884137 -2393131 -1836822 -1228334 -1054056 -1284069 -1846922 -2481542 -2723854 -2736595
42031 -2736595 -3589758 -5799810 -7984283 -8090874 -5933826 -3480953 -2465018 -2616914 -2504183
42022 -2504183 -1276422 765647 2622009 3248825 2358841 882209 124889 318030 621370
42013 621370 640403 1032062 2257923 3685991 4581870 5194933 5995079 6400235 5322091
42004 5322091 2850152 434908 -846093 -1526303 -2814556 -4809977 -6279444 -6280408 -5384597
41995 -5384597 -4736381 -4320121 -3213234 -1628493 -1335789 -3188960 -5332609 -5198605 -2613063
41986 -2613063 479784 2786688 4415589 5160133 4120331 1458430 -1199455 -2703771
41978 -2703771 -3251363 -2937954 -1273072 1105053 2131039 986017 -462468 -186110 1478759
41969 1478759 3169028 4758928 6454488 6967225 4878781 1204919 -1476656 -2148811
41961 -2148811 -1824316 -1307077 -475391 290138 -43274 -1523213 -2979268 -3749596 -4279987
41952 -4279987 -4765935 -4556720 -3260987 -1314850 738691 2427048 2810867 1151491 -1680904
41943 -1680904 -3804730 -4587399 -4979558 -5365604 -4655473 -2141102 1143675 3752050 5412057
41934 5412057 6501165 6921653 6349507 4906212 2936401 707946 -1304814 -2595491
41926 -2595491 -3373958 -4255039 -4961438 -4452964 -2720276 -1171829 -598188 -22687 1517789
41917 1517789 3157187 3263322 1572801 -653960 -1981897 -1642426 132699 1893230
41909 1893230 2003434 671270 -61258 826758 1788546 1251326 326648 1066804 2909798
41900 2909798 3175481 988030 -1480828 -2133167 -1447686 -1055592 -1342216 -1620833 -1694736
41891 -1694736 -1956277 -2308027 -2064211 -980630 328381 1215236 1788672 2525268 3288218
41882 3288218 3262807 2147161 1009430 1303945 3057100 4711890 4959070 4072028 3151022
41873 3151022 2747741 2693838 2673145 2444715 2015836 1983434 3014895 4574668 5135423 4371093
41863 4371093 4033019 5460126 7189037 6675362 3847902 1153945 223251 350582 516678
41854 516678 966171 1922477 2369407 1463695 180225 187409 1582806 2926017 3231072
41845 3231072 2781894 2015216 771896 -891364 -2013305 -1667778 -296947 658434 508047
41836 508047 159 -34304 -5590 -786030 -2092640 -2758402 -2544133 -2416980 -2703246 -2295759
41826 -2295759 -454444 1847458 3462077 4769449 6328627 6859434 4740468 1218964
41818 1218964 -240365 1641319 4212180 4520375 2992021 2129510 2846871 3841842 4026051
41809 4026051 3850769 4064292 4394215 3988674 2585211 840240 -324634 -598351 -566162
41800 -566162 -1001457 -1840275 -2229135 -1782002 -1285469 -1640277 -2406435 -2067813 184190
41791 184190 3384642 5719395 6305179 5854065 5628556 5963681 6015425 4858774 2435195
41782 2435195 -662778 -3747433 -5936853 -6128301 -4023627 -1035704 757923 691071 -177494
41773 -177494 -797119 -1195685 -1625531 -1757385 -1364274 -980759 -1133418 -1497030 -1490020 -1172388
41763 -1172388 -865831 -394780 534004 1639658 2570614 3694536 5417357 6958043 6927049
41754 6927049 5244971 3472592 2867472 2933253 2375566 797512 -1175292 -2901239 -4052343
41745 -4052343 -4232770 -3200925 -1596438 -643595 -729797 -903950 -356595 154791 -720158
41736 -720158 -2727470 -3907327 -3008574 -1037853 217836 418632 596451 1481563 2934864
41727 2934864 4687049 6520916 7776836 7716054 6522462 5136896 4063188 3156120 2495728
41718 2495728 2390566 2458886 1916442 997876 797128 1342188 1322540 409451 226135 1805036
41708 1805036 3539733 3368212 1962786 1766226 3365721 4868735 4879348 4182510 4076609
41699 4076609 4687919 5535408 6288262 6198895 4180712 572199 -2198232 -1982076 592988
41690 592988 3005431 3671508 2831959 1183978 -854833 -2497915 -2725708 -1731305 -1176294
41681 -1176294 -2138680 -3510655 -3425870 -1889054 -886137 -1847875 -4014606 -5679985 -6171089
41672 -6171089 -5866624 -4840490 -2575418 828553 3935447 5024420 3749703 1492722
41664 1492722 46270 28814 600850 636488 -69506 -905540 -1411412 -1592295 -1377050 -533804
41654 -533804 660778 1433320 1590565 1813686 2350537 2299894 1040797 -455590 -868781
41645 -868781 -424856 -286187 -651599 -999519 -1776954 -3950244 -6833590 -8270618 -7427612
41636 -7427612 -5726640 -4473285 -3256792 -1470032 195744 789983 373236 -562320 -1653209
41627 -1653209 -2000055 -585745 1734230 2420790 607407 -1517371 -2027735 -1955113 -2857169
41618 -2857169 -3787290 -3231611 -2356508 -3248689 -5036272 -5106326 -3669788 -3620408 -5651522
41609 -5651522 -6889487 -5283222 -2453484 -938030 -1026672 -1664663 -2385366 -2900852 -2508150
41600 -2508150 -1282119 -445992 -495781 -456451 58200 -150290 -1540886 -2321170 -934960
41591 -934960 1397271 2424596 1978055 1459460 1109345 -207398 -2794610 -5360536 -6453610
41582 -6453610 -5559983 -3004705 204115 2644871 3492077 3147607 2447121 1792676 1453358
41573 1453358 1746265 2246919 1883674 621539 -139097 213314 295652 -942976 -2175245
41564 -2175245 -1762103 -548172 -390677 -885506 -94487 1954068 3134770 2595418 1694360
41555 1694360 1195338 34023 -2260767 -4143376 -4275284 -3429024 -2936263 -2742444 -2300948
41546 -2300948 -2075309 -2671810 -3406757 -3177815 -2193855 -1609945 -1814289 -2080165 -1644494
41537 -1644494 -389496 1182077 2034079 1198889 -991036 -2796529 -2945202 -2104671 -1730010
41528 -1730010 -2045501 -2180604 -1865237 -1765880 -2176469 -2490121 -2235773 -1787948 -1647335 -1597004
41518 -1597004 -1029022 128867 1117638 1005404 -293289 -1622049 -1510829 260569 2348525
41509 2348525 3396412 3439436 3229818 2702301 1164681 -1036498 -2205145 -1211621 994117
41500 994117 2448873 2341891 1468435 783585 290051 -455485 -1295249 -1422834 -349223
41491 -349223 1339072 2326787 1718440 -125365 -1910051 -2614658 -2382788 -2182644 -2640143
41482 -2640143 -3356231 -3427210 -2473861 -969764 361463 1175723 1464302 1236514 606624
41473 606624 47888 82561 594489 829233 308406 -582531 -1216523 -1546243 -1728178 -1197967
41463 -1197967 926357 4248155 6779643 6925107 5226714 3366288 1949041 382687
41455 382687 -1331268 -2219199 -2158926 -2659450 -4825327 -7499155 -8565375 -7459537 -5272999
41446 -5272999 -2992297 -1024515 -91241 -920349 -2831719 -4047174 -3847704 -3266019 -3271352
41437 -3271352 -3534137 -3554267 -3721094 -4364109 -4811106 -4407052 -3647811 -3316396 -3226667 -2815200
41427 -2815200 -2275361 -2035633 -1776819 -1178196 -1077289 -2452975 -4457694 -4880989 -2789449
41418 -2789449 290420 1985921 1131074 -1658396 -4508308 -5412875 -3841988 -1412462
41410 -1412462 -229580 -555724 -869697 -88032 1265724 2116922 2031275 1173960 33072
41401 33072 -521593 294198 2290436 4340641 5335714 4711859 2522915 -136574 -1344301
41392 -1344301 -346992 968427 165940 -2344424 -3839482 -3247535 -2348329 -2452910 -2360925
41383 -2360925 -1017943 20815 -1094909 -3264819 -3863342 -2535683 -1307596 -1379894 -1979332
41374 -1979332 -2237246 -2125958 -1391421 481498 2822717 4030919 3795797 3461004 3591727
41365 3591727 2870218 343972 -2773187 -4793366 -5766614 -6531133 -6588562 -4770547 -1631771
41356 -1631771 618196 743067 -358699 -1347203 -1901277 -1994364 -1107896 793957 2415596
41347 2415596 2441363 1234871 210183 -63504 20569 515620 1879943 3353965 3056498
41338 3056498 560455 -1961222 -2360037 -1259899 -761285 -1205575 -1051900 281158 1426393
41329 1426393 1323028 731440 693364 942530 959924 1427373 3166963 5261675 5733607
41320 5733607 4039809 1727497 452563 278873 252197 -68040 -183107 497098 1768515
41311 1768515 2669833 2372286 990810 -565661 -1453555 -1401587 -544096 770130 2011318
41302 2011318 2820263 3355069 3758831 3391152 1479244 -1334341 -3147659 -2959108 -1711047
41293 -1711047 -663670 121189 794144 413061 -1844620 -4708276 -5607390 -3477198 271653
41284 271653 3476807 4896821 4351312 2485629 658881 46493 423739 440988 -740223
41275 -740223 -2655631 -4328964 -5140390 -4984556 -4414462 -4617914 -6276787 -8259681 -8377749
41266 -8377749 -5797184 -1987093 958571 2169819 1967756 959229 -241416 -1030437
41258 -1030437 -1162150 -804493 -106909 761267 1127618 307877 -1067392 -1207368 660091
41249 660091 3062924 4080730 3681606 3188915 2874851 1527050 -1295908 -3819827 -3887638
41240 -3887638 -1831146 -429966 -1668093 -4298346 -5470884 -4456148 -3503645 -4593304
41232 -4593304 -6615262 -7029162 -5560991 -4495690 -5258866 -6433995 -5872766 -3402093 -398986
41223 -398986 2281848 4650104 6469988 7262342 7388067 7901674 8971717 9330519 7839669
41214 7839669 5088133 2861756 2208515 2495900 2401270 1429457 186549 -576116 -633534
41205 -633534 56106 1644627 3756662 5076064 4536791 2854465 1880072 2208198 2405497
41196 2405497 1133060 -849826 -1648341 -640805 1032661 2153261 2611017 2769454 2504730
41187 2504730 1468625 -25446 -1022694 -1023754 -710996 -1138893 -2245296 -2764008 -1957723
41178 -1957723 -854406 -999763 -2269411 -2873829 -1622531 665288 2236750 2147134 714565
41169 714565 -930173 -1384829 80368 2521768 3892490 3180315 1482155 582926 1151458
41160 1151458 2725065 4504523 5420743 4388851 1639203 -832646 -1296109 -289767
41152 -289767 509548 815491 1610213 2795181 2828440 1159562 -540376 -480403 968252
41143 968252 2019036 1743711 638361 -592898 -1788140 -2911096 -3712459 -4092323 -4362411
41134 -4362411 -4788112 -5001213 -4269467 -2602234 -1300241 -1722831 -3363772 -4015642 -2557595
41125 -2557595 -876836 -1815449 -5408790 -8481168 -8265638 -5303836 -2267698 -948117
41117 -948117 -1175847 -1888200 -2220391 -1857832 -1140806 -755504 -908482 -1139731 -1325088 -2155528
41107 -2155528 -3777058 -4578987 -2685762 1367732 4748991 5500537 4508237 3719044 3463325
41098 3463325 2638681 961339 -299276 42161 1663675 3279639 3932877 3375744 1779355
41089 1779355 -280005 -1746429 -1620159 181947 2591330 4085483 3795378 2298537
41081 2298537 1418737 2763756 5996061 8724196 8537158 5177730 597054 -2828233
41073 -2828233 -3851805 -2685466 -637386 629664 309562 -803254 -1295289 -950339 -906350
41064 -906350 -1813379 -2711274 -2347826 -943518 188619 420164 342809 626991 1147112
41055 1147112 1392410 1147450 534171 -186504 -617337 -363366 567151 1681172 2500338
41046 2500338 2998593 3396944 3657756 3379177 2199074 230867 -1877183 -3268713 -3379797
41037 -3379797 -2361912 -1083744 -427423 -306614 324431 1927005 3070109 1704173 -1954819
41028 -1954819 -4980905 -5059332 -3254049 -2198317 -2456930 -2593205 -2356280 -3250421 -5396216
41019 -5396216 -6318629 -4330544 -1217440 321662 481572 1421789 3438726 4504366 3512210
41010 3512210 1750052 657739 -41171 -1062964 -1720216 -562838 2501031 5491621
41002 5491621 5979915 3532569 529202 -16780 2258473 4724441 5114265 4032296 3208520
40993 3208520 2762207 1970991 1513350 2465540 3655264 2746812 -14511 -1841406 -1543233
40984 -1543233 -828225 -743532 126927 2383444 3633463 1951619 -714778 -1300215 -135364
40975 -135364 171150 -783885 -943480 386013 1454000 1081815 187064 -310679 -863252
40966 -863252 -1697063 -1778858 -585958 477893 -266041 -2465171 -4091201 -3710494 -1793870
40957 -1793870 -66060 120403 -997920 -1980405 -2015770 -1910280 -2597183 -3320888 -2583139
40948 -2583139 -587412 780831 507315 -477733 -1056295 -1288687 -1511898 -1451614 -967914
40939 -967914 -549449 -354704 180777 1115244 1517655 1010131 667060 1417661 2574794
40930 2574794 2985047 2658344 2122049 1182314 -196378 -576003 1592022 5476183 8311316
40921 8311316 8454488 6757533 4829986 3233245 1769062 494053 -197988 -83910 547369
40912 547369 890325 308685 -533502 76470 2570982 4751127 4291231 2232916 2062164
40903 2062164 5008406 8140252 8023008 4776283 1360964 -18474 476502 1504921
40895 1504921 1990572 1628660 896434 501616 449224 118721 -471022 -411296 504884 1058529
40885 1058529 461971 -113299 775246 2432424 2903447 1809812 683770 641912 1265723
40876 1265723 1758375 1691758 538626 -1959641 -4683140 -5877499 -5358452 -4557935 -4135096
40867 -4135096 -3287783 -1949821 -1641216 -2962775 -4043370 -3097354 -1142411 -374942 -908261
40858 -908261 -1116880 -582216 -622137 -1971547 -3722862 -4797863 -5082900 -4890959 -4483884
40849 -4483884 -4296669 -4593272 -4842379 -4416219 -3756930 -3661931 -3594887 -2220359 271125
40840 271125 1982898 1913165 1262671 1514598 2591830 3711997 4730184 5549901 5325371
40831 5325371 3590725 1502148 680317 1189721 1743442 1577050 988592 158854 -1365272
40822 -1365272 -3691225 -5938211 -7083195 -6994264 -6176016 -4810878 -2702475 -287329 972567
40813 972567 -23373 -2393098 -4001100 -4046753 -3826624 -4316966 -4370610 -2704287 -511687
40804 -511687 -13373 -1011527 -1322334 -537529 -569595 -1833301 -1825314 947196 4226274 5389545
40794 5389545 5434390 6849067 9060901 9192279 6694876 4073923 2926232 2180608 908213
40785 908213 230280 1194921 2764225 3337941 2894380 2373489 2052930 1677903 1266176
40776 1266176 743532 -341933 -1689430 -1692031 681219 3950115 5410560 4288252 2501024
40767 2501024 2129850 3069945 3605562 2666608 894689 -340801 -422802 200439 808197
40758 808197 1038443 779196 17137 -895978 -1270182 -821897 -95243 275419 378038 598985
40748 598985 763350 375539 -502539 -1274886 -1559242 -1353862 -772216 -302507 -922516 -2938723
40738 -2938723 -4881580 -4686979 -2135381 803404 2211162 1939645 964917 11150 -770241
40729 -770241 -1454345 -2091560 -2462380 -2133977 -1251057 -912498 -1857705 -3088330 -2996683 -1703350
40719 -1703350 -841569 -972683 -866359 251478 1462048 1976244 2587381 4107262 5629895
40710 5629895 5748331 4634356 3584255 3113812 2694031 1888650 700107 -752377 -1938987
40701 -1938987 -1815915 2346 2439510 4248164 5537977 7004698 8271273 8299114 7099937
40692 7099937 5758057 4930196 4489315 4446986 4958320 5478549 5191125 4333108 3866890
40683 3866890 3782520 3137944 2062270 2120619 3837055 5197688 3951908 687473 -1767441
40674 -1767441 -1847261 -959185 -1425769 -3601763 -5660256 -5898774 -4602717 -3457606 -3518766
40665 -3518766 -4234496 -4448686 -3808980 -2793024 -1712132 -376967 1173482 2226811 2152455
40656 2152455 1405858 1279458 2465255 4134828 4769498 3798057 2009383 389832 -762865
40647 -762865 -1303094 -720175 954052 2345541 2092477 779243 213576 818274 1271872
40638 1271872 1046163 1569831 3903265 6655877 7536715 6104792 3814988 2085944 1416000
40629 1416000 1631444 1798404 571217 -2126625 -4405363 -4639326 -3641856 -3117030 -2721370
40620 -2721370 -696548 2842521 5460185 5633705 4572102 4144451 4547153 4821647 4414245
40611 4414245 3386950 2052318 1052829 894370 901854 -309815 -2717246 -4307330 -3416320
40602 -3416320 -820319 1228081 1282561 -572847 -3300130 -5304324 -5061294 -2464412 755713
40593 755713 2650056 2723412 1589806 -170321 -1944514 -2668183 -1745278 -146381 511208
40584 511208 -47886 -601953 -276563 387724 481956 74306 -43698 368868 535221 -379682
40574 -379682 -2077057 -3295501 -3358430 -3113550 -3726820 -4830927 -4877473 -3466004 -2185326
40565 -2185326 -2501976 -3769076 -4312495 -3843465 -3593649 -4252848 -4917591 -4308117 -2242112
40556 -2242112 373477 2442249 3322591 3068823 2385447 2119391 2541319 3119721 2940189
40547 2940189 1293082 -1806391 -5234446 -7094405 -6146988 -3169800 -443545 453731
40539 453731 37795 -218696 -17442 -474376 -2169873 -3829560 -3679705 -1735352 138693
40530 138693 420739 -676497 -2110480 -3226197 -3565909 -2601570 -714568 372064 -519599
40521 -519599 -2138168 -2184374 -341963 1543850 2262505 2535644 3173290 3639681 3289355
40512 3289355 2589973 2016793 899982 -1336387 -3611138 -4196192 -2851667 -882658 499485
40503 499485 849831 11889 -1774683 -3413310 -3723860 -2798882 -1810078 -1510816 -1736208
40494 -1736208 -2314916 -3487085 -5137589 -6395566 -6504792 -5759142 -5209736 -5503635 -6135641
40485 -6135641 -5927945 -4393692 -2515479 -1762698 -2367728 -3167553 -3169557 -2421772 -1163310
40476 -1163310 711861 2711477 3423925 2184722 223669 -881962 -1045087 -833733 144583
40467 144583 2308767 4246926 3855063 1275419 -1170206 -2141988 -2550416 -3296924 -3645519
40458 -3645519 -2731944 -1185684 -191823 -28894 -406460 -1171351 -1769420 -1086426 1042592
40449 1042592 2972779 3031979 1596993 404200 319233 766622 941586 649467 246842
40440 246842 487799 1993348 4147134 5107152 3823912 1510677 157155 202824 823892
40431 823892 1802564 3434095 4891584 4628511 2717519 1053821 651910 360765 -916809
40422 -916809 -2309817 -2478504 -1689993 -949544 -162484 1134256 2046256 1363226 -8895
40413 -8895 171740 2041156 3090344 1841167 121225 334833 1975959 2595073 1341443
40404 1341443 -271838 -786024 -309576 415814 1014989 1267204 1071259 967308 1694505
40395 1694505 2908416 3338180 2640509 2096739 2820002 4114964 4458106 3546458 2458020
40386 2458020 1977847 1592222 362678 -1597682 -2877559 -2186606 -10586 1592059 1261418
40377 1261418 2325 -106910 1455196 3249109 3917020 3478758 2534826 1460505 773052
40368 773052 1095106 2154859 2811699 2593055 2201944 2070195 1667778 879103 686929
40359 686929 1583817 2621001 3042437 3470848 4287290 4380245 3108680 2035826 2699005
40350 2699005 3883401 3412253 1689447 922685 1480960 1768747 1388768 1463293 1715156
40341 1715156 406776 -2054759 -2556958 218669 3389589 3801468 2156658 1148893
40333 1148893 1319806 1180648 274946 -333578 -187095 -24644 -303680 -586662 -324369
40324 -324369 814276 3032787 5739446 7231173 6260189 3681640 1504251 563139 104688
40315 104688 -630942 -1463062 -1785318 -1227474 5812 879644 171763 -1825838 -2893249
40306 -2893249 -1254887 2075027 4394119 4374026 2950494 1590849 952593 1043927 1409332
40297 1409332 1147463 -122556 -1342020 -1202468 -220778 -344568 -2307497 -4625415 -5582650
40288 -5582650 -5082876 -4105569 -3457537 -3660137 -4987109 -6706993 -7047120 -4930534 -1420011
40279 -1420011 1353995 2469190 2721348 3074982 3460178 3297356 2530436 1610925 735665
40270 735665 -309047 -1485799 -2262518 -2428112 -2707625 -3853400 -5299805 -5616085 -4421887
40261 -4421887 -2872080 -1809050 -479341 2014786 4803164 6059401 5426911 4386438
40253 4386438 4108197 4015075 2882453 619064 -1550530 -2311685 -1334336 675174 2790941
40244 2790941 4726793 6743795 8677397 9568552 8715608 6698425 4733659 3249730
40236 3249730 1748966 -74867 -1779965 -2720309 -2525050 -1023598 1648790 4655775
40228 4655775 6659689 6784498 5329479 3488329 2373606 2143554 2003565 1252598 238612
40219 238612 -189434 -65246 -280436 -1027612 -1347446 -728332 -40660 -76631 -218383 424620
40209 424620 1554557 2547051 3759524 5503105 6614972 5830807 3920515 2535642 1464471
40200 1464471 -731249 -3577188 -4774050 -3873316 -3346951 -4885026 -6729515 -6189992 -3266444
40191 -3266444 -214252 1395444 1727187 1595544 1658748 2212355 2782814 2342184 628990
40182 628990 -1306175 -2450409 -2970906 -3386919 -3491459 -2930375 -2080542 -1454244 -831132
40173 -831132 252016 1746923 3466791 5456786 7298353 7910176 6935635 5588139 5209605
40164 5209605 5649139 5895301 5558269 4820692 3695988 2349059 1477107 1425413 1649278
40155 1649278 1912678 2961233 4816293 5596189 3793002 891171 -271547 698136 1632775
40146 1632775 1313321 922702 1642457 2772565 3028525 2217110 819638 -872698 -2406111
40137 -2406111 -2918901 -2018681 -298625 1383595 2482625 2580981 1667891 764960 1072633
40128 1072633 2167261 2316533 1052017 51118 720844 2241719 3015628 2847904 2465767
40119 2465767 1927913 1025688 553509 1503823 3220560 3905908 3094020 2277925 2691682
40110 2691682 3563037 3169677 929261 -2122980 -4498757 -5438643 -5208782 -4616278 -4206373
40101 -4206373 -3843940 -3122808 -2040432 -1026620 -435087 -310339 -522476 -778545 -660915
40092 -660915 -102916 324106 158592 -28176 815396 2688661 4381027 5105456 5390130
40083 5390130 5787170 5613385 4017234 1729607 436847 489216 543074 -213530 -736920
40074 -736920 236751 2197558 3499028 3436923 2758247 2472009 3023346 4295158 5481390
40065 5481390 5274409 3306188 1262624 1328674 3472647 5564845 6338331 6651167 7251127
40056 7251127 7060207 5026103 2355956 1143683 1469500 1613113 826143 141572 376569
40047 376569 997732 1366090 1617920 1663337 665373 -1484846 -3175374 -2778666 -861368
40038 -861368 459311 253815 -145040 941329 3301371 5097484 5115312 4132257 3793135
40029 3793135 4533278 5260592 5075257 4428955 4050254 3526242 2036409 148022 -421664
40020 -421664 955778 2913616 3870336 3813666 3750084 4171523 4789116 5211907 5143317 4305497
40010 4305497 2849826 1484488 518794 -822678 -3242829 -5726015 -6125005 -3719577
40002 -3719577 -430077 1062945 73898 -1591125 -1663492 383007 3005595 4143723 3059228
39993 3059228 802564 -989186 -1565948 -1220507 -290811 1318176 3365808 4679061 4147430
39984 4147430 2238829 725296 641008 1189676 1073431 154457 -939912 -2149533 -3685034
39975 -3685034 -4742989 -4108848 -2339734 -1788620 -3610949 -6018266 -6615936 -5406033 -4126226
39966 -4126226 -3499451 -2780845 -1492363 145727 2227194 4726235 6092909 4421706
39958 4421706 574664 -1893610 -964638 1408577 2303261 1592562 1061838 1186353 998874
39949 998874 496711 903077 2463730 3888376 4391052 4716555 5557095 6254295 5808100
39940 5808100 4229876 2278310 691028 205991 1386422 3621888 5058442 4469065
39932 4469065 2762066 1814320 2184794 2829466 2773590 2079064 1212582 464923 223117
39923 223117 897206 2091244 2591086 1862741 1062873 1762412 3898011 5785456 6124087
39914 6124087 5196919 3976001 2918478 2098323 1772367 2056751 2456519 2476542 2461471
39905 2461471 3093838 4249660 5221745 6070407 7751645 10506736 12925054 13282468 11486760
39896 11486760 9254547 8559781 10045108 12499646 13677121 12214502 9153119 7046824
39888 7046824 7163557 8219265 8432192 7960794 8172858 9076555 9095611 7578241 6026259
39879 6026259 6052473 7194107 7797068 7380437 6911128 7000477 7129034 6937467 7153298 8433378
39869 8433378 9913235 9914306 8086531 6105209 5981754 8109460 11178509 13596575 14665043
39860 14665043 14683096 14379341 14248670 14224239 14048636 14057173 15280515 18373733 22552679
39851 22552679 26008274 27499274 27450029 27620380 29851931 34843010 41736096 48958537
39843 48958537 55675360 62239097 69184047 76524511 84609975 94896310 108877434 126957711
39835 126957711 149741732 179424053 216699408 255036726 280771806 282341220 259921185
39828 259921185 224708360 189047522 158700730 133899727 114351739 100722012 92473807
39821 92473807 87127792 82551755 78647128 75843731 72925872 67870715 60797043 54605499
39813 54605499 51883513 52094808 52932698 53858214 56750428 62867663 70605205 77165964
39805 77165964 81707417 85944430 91987878 100347028 110026940 120159130 131494031 146341081
39797 146341081 166893920 193844467 227085822 266936794 312398492 357032584 388377997
39790 388377997 394514542 372718605 331557491 284493422 241597512 206351317 178040466
39783 178040466 155343554 137569737 123816882 112502665 102368113 93344219 85623494
39776 85623494 78264266 69853250 60521906 51997658 45311481 39766706 34741488 31040032
39768 31040032 29396868 28913538 28301859 27585750 27074871 25719531 22467085 18645542 16796311
39759 16796311 17126874 17137687 15139357 12332966 10751517 10683796 11016837 10972737 10580862
39750 10580862 10163007 10068631 10457982 10977714 11065827 10595735 9656204 7977696 5539750
39741 5539750 3465969 2983284 3534474 3407235 2389678 2176664 3723862 5892236 7451409
39732 7451409 8776841 10498332 11934910 12200963 11731045 11351991 10775214 9393617 7834385
39723 7834385 7325521 8006350 9046909 9893718 10203414 9187448 6551786 3786036 2933673
39714 2933673 3980228 4827780 4130312 2916070 2907102 4262167 5715542 6327187 6338113
39705 6338113 6495042 7108513 7888645 8411221 8434686 7709575 5893082 3213205 1083977
39696 1083977 1206335 3649233 6395055 7290891 6128698 4500863 4040261 5130268 6870224
39687 6870224 7889810 7530531 6489467 5957308 6116195 6143622 5673889 5204822 4828422
39678 4828422 3838372 2193899 1073633 1077622 1134880 367642 -148281 1016204 3234391
39669 3234391 4710428 5069131 5204982 5004219 3338176 477132 -1430846 -917635 1159607
39660 1159607 3014171 3659902 2786696 374835 -2620959 -4230301 -3194811 -344584
39652 -344584 2310173 3406389 2820220 1172569 -628806 -1819836 -2328313 -2665628 -3029802
39643 -3029802 -2952994 -2155110 -1277434 -1259071 -2142063 -2851086 -2205158 -136689 2040260
39634 2040260 2734407 1629037 -72863 -1097949 -1334753 -1299370 -1064693 -475363 118779
39625 118779 322675 540373 1330685 2193671 2142488 1322898 813026 843884 606268 9804
39615 9804 114986 1232285 2010692 1406724 507301 1195968 3538796 5542852 5330602
39606 5330602 2844560 -434379 -2823847 -3495857 -2679409 -1116483 520096 1646599
39598 1646599 1686797 546947 -1027613 -2148594 -2651484 -2735207 -2199041 -928321 291430
39589 291430 634078 618730 1238165 1858856 706814 -2291440 -4908300 -5486571 -4801452
39580 -4801452 -4239825 -3701856 -2462020 -800560 532418 1489801 2150850 1880526 341059
39571 341059 -1342799 -1642706 -442107 987963 1205860 -735297 -4623457 -8146490 -8045302
39562 -8045302 -3797663 888885 2020075 -22517 -1582133 -814917 518246 263568
39554 263568 -1302197 -2485523 -2455130 -1706621 -1149585 -1258728 -1638576 -1407572 -459064
39545 -459064 167991 -63758 -22413 1269464 2444531 1354549 -1523216 -3426887 -3216148
39536 -3216148 -2731848 -3635980 -5019604 -5288140 -4648188 -4248328 -4139859 -3659172 -3009610
39527 -3009610 -2961579 -3375631 -3271449 -2266572 -1087371 -685130 -1332148 -2408679 -2799259
39518 -2799259 -1879208 -313633 665153 891742 1335780 2299314 2679802 1699454 335058
39509 335058 57777 883151 1654490 1713006 1346021 998387 900836 1156862 1524436 1555839
39499 1555839 1550925 2630541 4962522 6681170 5855283 3089749 823520 281536 544422
39490 544422 600158 708268 1254875 1712150 1695933 2067336 3814653 6283971 7612748
39481 7612748 6921754 5242691 4044604 3501395 2734023 1414149 353127 287929 731010
39472 731010 660039 3026 -408590 -304007 -403527 -1108277 -1732369 -1607322 -1094353 -775603
39462 -775603 -447597 168814 446959 -303992 -1588727 -2535230 -3445422 -5078963 -6699979
39453 -6699979 -6559931 -4465003 -2202430 -1019243 -310290 572106 908972 74243 -1074420
39444 -1074420 -1582842 -1910643 -2522673 -2116297 725619 4652711 6423625 4752280 1530498
39435 1530498 -962098 -2278393 -2806417 -2493147 -1699028 -1823503 -3523620 -5150799 -4510617
39426 -4510617 -1841003 319980 193057 -1479779 -2870787 -3209225 -3042410 -3084262 -3430222
39417 -3430222 -3722806 -3721444 -3614417 -3716127 -3900221 -3711389 -3227593 -3244539 -4067647 -4691092
39407 -4691092 -4099785 -3038487 -3272820 -5032411 -6441432 -5905930 -3905034 -1771532 110650
39398 110650 1804009 2515131 1423760 -458376 -847721 1067676 3620700 4828575 4527812
39389 4527812 3771270 3076654 2244079 1378025 1041412 1456249 2317674 3404306 4659594
39380 4659594 5578400 5321887 3911211 2723548 3069085 4450830 4954996 3508186 1176259
39371 1176259 -76427 532479 2139350 3406142 3562048 2586136 1170162 508523 1309802
39362 1309802 2768938 3222790 2121301 607792 -234065 -799364 -1931682 -3382630 -4382228
39353 -4382228 -5022086 -5652158 -5349233 -2802597 1076932 3263162 2205764 -87646 -704011
39344 -704011 543973 1543859 1175539 437305 340578 361678 -293730 -988193 -337098 1665884
39334 1665884 3156805 2423412 36535 -1583210 -789643 1634252 3836654 5323418
39326 5323418 7024597 9104126 10102391 8890270 6353306 4120755 2431825 467882
39318 467882 -1769288 -3343882 -3990311 -4426399 -4893963 -4642934 -3228330 -1230879 691983
39309 691983 2368083 3284862 2517560 394935 -908144 213423 2434108 2950874 1035924
39300 1035924 -1211044 -1722114 -811535 -229780 -804463 -1664747 -1374615 563719 3061139
39291 3061139 4200605 3108223 1148240 641752 2206312 4054872 4260253 2943941
39283 2943941 1623688 1119925 1071531 1130248 1470909 1978924 1889315 711966 -1012119
39274 -1012119 -2282270 -2635370 -2321117 -1843124 -1610795 -1743235 -1921044 -1646260 -864497
39265 -864497 -106686 138310 -103233 -567257 -1053301 -1201210 -499380 1026741 2580544
39256 2580544 3554754 4229615 4859699 4680273 2964170 784569 296542 1991730 3970423
39247 3970423 4504871 4077831 3990111 4150178 3697060 3075743 3670988 5345079 6011279
39238 6011279 4288730 1364010 -632955 -1217766 -1520941 -2251405 -2906674 -3061255 -3424918
39229 -3424918 -4991165 -7422487 -8817660 -7355084 -3225861 1174418 3216988 2297974
39221 2297974 8890 -1850062 -2938442 -3841981 -4485808 -3931101 -1826458 626515 1661930
39212 1661930 760198 -853987 -1552056 -983556 -354702 -1075947 -3212230 -5356387 -6028735
39203 -6028735 -5055581 -3478742 -2284966 -1508998 -627801 418904 902148 140284 -1417292
39194 -1417292 -2260843 -1292740 871299 2503710 2711157 2228468 2032624 1869949 843888
39185 843888 -1053933 -2978180 -4563926 -6099627 -7316569 -7280181 -5985222 -4890973 -5022737
39176 -5022737 -5465150 -4738995 -2906111 -1176737 -96650 531660 432943 -820791 -2418073
39167 -2418073 -2914102 -2406899 -2446035 -3367987 -3497150 -1851970 11152 123168 -1252070
39158 -1252070 -2516763 -3159621 -3642287 -3720649 -2740352 -1240199 -497169 -524569 -106722
39149 -106722 1090030 1958307 1770126 1179481 992038 1117364 1205368 1303376 1419789 1291802
39139 1291802 956454 809842 924438 1103288 1625512 2937960 4557460 5371465 5084506
39130 5084506 4220166 2803675 574294 -1513835 -1974479 -1373939 -2088952 -4639733 -6472693
39121 -6472693 -5733553 -4115902 -4091645 -5169241 -5215734 -4079249 -3294859 -3060409 -2188101
39112 -2188101 -750767 -240204 -957914 -1455944 -907167 -127237 108187 2994 -346423
39103 -346423 -1249652 -2178649 -1872388 -306764 830910 233006 -1619824 -3497783 -4666773
39094 -4666773 -4857391 -4309700 -4078173 -4913634 -5702109 -4626793 -2077777 -522924 -1063253
39085 -1063253 -2188886 -2665433 -3363818 -4937830 -5855796 -4601188 -2190401 -547051 303709
39076 303709 1407337 2374070 1920030 267280 -1101333 -1747233 -2411000 -3055490 -2693322
39067 -2693322 -1263326 37222 578047 987382 1684229 2033437 1425831 174939 -1076128
39058 -1076128 -2038879 -2597857 -2643384 -2258388 -1516584 -178051 1766711 3461561 3907595
39049 3907595 3187612 2209578 1466930 883759 566376 702746 973081 1092995 1583347
39040 1583347 2739245 3203865 1269794 -2320380 -4638684 -4138534 -2363429 -1389761 -1160680
39031 -1160680 -546044 220635 -190923 -1936745 -3377336 -2858039 -360850 2676432 4666398
39022 4666398 4950636 3959541 2516086 1103291 -83390 -721058 -603111 -200356 -274071
39013 -274071 -828818 -1079755 -580421 216325 592959 143977 -1223211 -3006407 -3804038
39004 -3804038 -2390260 539991 2695493 2755066 1707616 1129726 1179029 1151823 1132536
38995 1132536 1878610 3416944 4811972 5321010 5072142 4580860 4112238 3568775 2728149
38986 2728149 1629845 794999 768786 1338946 1616740 1058627 3703 -885131 -1199215
38977 -1199215 -786947 95652 557380 -96995 -1105619 -900029 585368 1492586 657401
38968 657401 -611348 -492875 677256 1138021 372059 -540276 -902935 -1203565 -1905275
38959 -1905275 -2708322 -3150047 -2924481 -1612781 835109 3335249 4512686 4425953 4330987
38950 4330987 4568856 3944462 1639175 -1447370 -3920628 -5419319 -6134474 -5774553 -4147933
38941 -4147933 -2229044 -1424766 -1846004 -2298790 -2126099 -2160007 -3388798 -5318136 -6412572
38932 -6412572 -6047481 -5303721 -5487177 -6327037 -6287521 -4600974 -2301761 -962532 -968963
38923 -968963 -1524871 -1923909 -2135493 -2312523 -2443161 -2598328 -2956155 -3337631 -3118407 -1919965
38913 -1919965 -182026 1279955 2279007 3499521 5431016 7178194 6963488 4236234
38905 4236234 762345 -1145035 -1120352 -481671 188615 1605716 3648813 4466340 2809882
38896 2809882 -58303 -2045441 -2702009 -2692721 -1992018 -404873 985762 961073 303164
38887 303164 723113 1935383 2063977 1000860 871710 2509023 3807758 2765802 223415
38878 223415 -1808760 -2923436 -3861651 -4560559 -4329775 -3233126 -1931268 -727324 169330
38869 169330 151400 -913385 -1981937 -2062521 -1513068 -1163103 -910752 -294858 239924 -179951
38859 -179951 -1675807 -3924043 -6912282 -10244346 -12476633 -12551950 -11352004 -10475277 -9992721
38850 -9992721 -8806864 -6727592 -4663339 -3097953 -1862983 -1075387 -761830 69759 2234242
38841 2234242 4497161 4829570 3520238 2991242 4207828 5315803 4490268 2236372 -24460
38832 -24460 -1902321 -3411394 -3824797 -2503766 -59943 2215733 3385431 2922467 910597
38823 910597 -1268397 -1800692 -758307 -207928 -1167964 -1946209 -657507 2013665 3953177
38814 3953177 4281281 3384539 1462984 -1170829 -3168485 -3350195 -2374850 -1666011 -1219284
38805 -1219284 -81758 1522975 2342931 2094598 1589106 1041779 -29527 -1309669 -1829104
38796 -1829104 -1618706 -1488266 -1117400 696416 3579258 5381790 5108033 4173167 3860072
38787 3860072 3350658 1546993 -710860 -1813452 -1704835 -1514974 -1599265 -1373013 -660392
38778 -660392 37532 383020 360346 -110309 -880966 -1256775 -818015 -256591 -588424 -1777049
38768 -1777049 -2840594 -3076160 -2593621 -1990200 -2043190 -3222695 -4884743 -5543850 -4678005
38759 -4678005 -3583501 -3545458 -3935286 -3361394 -2051871 -1501709 -2039552 -2482730 -2333296
38750 -2333296 -2565212 -3642407 -4312593 -3379885 -1582901 -609730 -938001 -1654967 -1954746
38741 -1954746 -1887541 -1868826 -2186154 -2815600 -3164934 -2311253 -161608 1908450 2406335
38732 2406335 1661959 1594360 3370926 6010809 7603423 7245557 5347250 2754682 460714
38723 460714 -228288 1466472 4424143 6131098 5348295 3581424 2942581 3139542 2031144
38714 2031144 -872000 -3163942 -2613032 -186448 1275633 692432 -337978 -30965 1458731
38705 1458731 2592056 2164123 154974 -2436318 -4271618 -4643928 -4026876 -3457572 -3455963
38696 -3455963 -3826356 -4184351 -4111913 -3109580 -1167687 789394 1827337 2218213 2851705
38687 2851705 3575075 3237941 1541903 -234913 -723368 198880 1825501 3424501 4252360
38678 4252360 3737164 2218784 785604 -51088 -811726 -1922569 -3054316 -3878944 -4372809
38669 -4372809 -3945835 -1635863 1987468 4406467 3839108 1389713 -618446 -1486569 -2008404
38660 -2008404 -2444588 -2321702 -1774236 -1449117 -1252679 -629269 69817 -60570 -806234
38651 -806234 -954314 -198661 437329 300732 -60082 -90903 -52060 -176719 -5011 933108
38641 933108 2436247 3829976 4208218 2651241 -760804 -4227386 -5735139 -5354910 -4799169
38632 -4799169 -4704530 -3986773 -2248107 -1008558 -1564187 -3027138 -3629955 -2932026 -1709990
38623 -1709990 -628917 -64522 -379656 -1314520 -1795699 -1259068 -440508 -47484 424338
38614 424338 1559553 2662870 2723667 1914939 886514 -589312 -2783411 -4530509 -4326377
38605 -4326377 -2589738 -1136975 -487856 615912 2796812 4748675 4969232 3672820
38597 3672820 2386994 2371690 3729968 5396699 5883905 4747186 3302938 3112122 3923000
38588 3923000 4176139 3468624 3189374 4378755 6129895 6689500 5370298 3000882 1151056
38579 1151056 1032367 2361123 3290633 2417741 751274 409662 1429415 1640841 132876
38570 132876 -1150532 -370641 1418440 2059095 1545734 1556402 2473722 2883113 1951849
38561 1951849 608624 55759 363955 926178 1354433 1489781 1144662 243081 -980136
38552 -980136 -1978591 -2089977 -1151813 -53598 78358 -395005 232317 2374371 3858891
38543 3858891 2641121 -155593 -1697966 -1293013 -632772 -404838 776274 3321884 4925967
38534 4925967 3513454 453553 -963713 484678 3027033 4529843 4637198 4307207
38526 4307207 4318477 4510426 4024498 2312211 143141 -804676 246424 2276229 3774351
38517 3774351 4193694 3495653 1265301 -2473630 -6200862 -8128551 -8272043 -7948351 -7425646
38508 -7425646 -5715784 -2863646 -636784 -154705 -326464 265214 1119159 743977 -1046669
38499 -1046669 -3152147 -4880197 -6139480 -6302921 -4567370 -1651718 351487 404390 -317383
38490 -317383 -323371 163386 -60449 -1200141 -2254043 -2374830 -1478347 276483 2617295
38481 2617295 4691056 5347404 4276457 2399276 885587 168742 64025 332003 764033
38472 764033 1066215 1068397 893692 676813 351864 -797 87620 866863 1671672 1469477
38462 1469477 237023 -782770 -528029 661567 1745220 2412906 2950041 2868231 945199
38453 945199 -2760926 -5954548 -6326481 -4315563 -2472235 -2273779 -2967923 -3690490 -4945626
38444 -4945626 -6981433 -8219595 -7062540 -4520984 -3161255 -3628587 -4101286 -3455457 -3031444
38435 -3031444 -4297664 -6296183 -6832829 -5356913 -3313450 -2086575 -1752667 -1608014 -924612
38426 -924612 639645 2498735 3196481 1871279 -502481 -2148395 -2501878 -2279180 -1893591
38417 -1893591 -1076253 11834 737818 1330765 2793176 4873603 5545508 3559013 433792
38408 433792 -1351733 -1432838 -1505030 -2657866 -4175054 -4964969 -4916719 -4506809 -3966385 -3230409
38398 -3230409 -2137698 -519526 1317663 2176358 901539 -1957103 -4221045 -4346962
38390 -4346962 -3019487 -1980770 -1906374 -2170706 -2210364 -2095114 -1800830 -897962 676646
38381 676646 2206607 3043717 3452252 4081009 4821799 4772493 3383060 1186798 -798496
38372 -798496 -2093689 -2969977 -3902464 -5125230 -6577199 -7921941 -8645210 -8493609 -7873117
38363 -7873117 -7448892 -7226311 -6439884 -4629498 -2448524 -980773 -540295 -666740 -1077082
38354 -1077082 -1879949 -2796465 -2974857 -2023926 -701650 -38174 -93286 -108100 335341 889199
38344 889199 1133740 1182405 1492416 2387962 3763618 4948269 5003988 3711002 2270605
38335 2270605 2368082 4261303 6342824 6937658 5993066 4537904 3084500 1396406 -469437
38326 -469437 -1873158 -2442339 -2406378 -1855309 -432837 1779080 3679207 4102499 3109918
38317 3109918 1818408 1079664 734382 105499 -1081210 -2239483 -2258017 -503128 2358297
38308 2358297 4839040 6110039 6560958 6650415 5945895 4051354 1874502 781737 637418
38299 637418 -19526 -1526465 -2044415 215310 4447487 7868140 8589009 7166565 5459822
38290 5459822 4625080 4336578 3592389 2085400 683824 328544 602350 100783 -1533038
38281 -1533038 -2748972 -1888776 793271 3677228 5737947 6905905 6922624 5308501 2670510
38272 2670510 710189 263926 246907 -735391 -2446994 -3502868 -3276060 -2433211 -1790604
38263 -1790604 -1457256 -1107225 -421157 823873 2476395 3619911 3064216 720999 -1802465
38254 -1802465 -2561396 -1304569 257334 441517 -491855 -899164 -80229 735607 107955
38245 107955 -1606657 -2811152 -2911525 -2954270 -3906924 -5315585 -6141358 -6103174 -5546763
38236 -5546763 -4675184 -3721593 -3348707 -3889511 -4462661 -3879585 -2416353 -1680618 -2514015
38227 -2514015 -3949720 -4628628 -4406284 -3998627 -3773751 -3675567 -3848242 -4433583 -4954052
38218 -4954052 -4798154 -4357494 -4793463 -6318739 -7430018 -6477290 -3639536 -740936 705349
38209 705349 657466 -158026 -1302622 -2603109 -3652246 -3989317 -3632169 -2930248 -1984360
38200 -1984360 -740013 371394 560565 -265771 -1121064 -1059249 -303755 259460 448056
38191 448056 985399 2317588 3806183 4343300 3433760 1460756 -812752 -2680407 -3583332
38182 -3583332 -3201161 -1718991 68930 1222861 1478279 1528297 2191063 3280958 3691752
38173 3691752 2768383 1177177 51806 -372401 -735473 -1359812 -1751424 -1430535 -737081
38164 -737081 -455664 -840086 -1314310 -1189026 -540581 -134676 -285906 -95681 1481260
38155 1481260 3761272 4504807 2613463 -162054 -1237753 -379374 384205 -215955 -1184832
38146 -1184832 -979401 589639 2641934 4286643 4841400 4047693 2759001 2509078 3705084
38137 3705084 5104897 5702788 6040150 6756793 7031882 5842939 3899256 2715285 2271748
38128 2271748 1260294 -545027 -1805774 -1607805 -460993 889943 2235542 3175192
38120 3175192 3070479 2301470 2285915 3527522 4759010 4781567 4068627 3610628 3163839
38111 3163839 1878706 55965 -1037421 -978155 -753646 -1367308 -2571245 -3199076 -2389794
38102 -2389794 -362990 1861795 3499556 4681269 5875273 6846431 6831159 5718935 4220031
38093 4220031 2682680 721089 -1524389 -2757168 -1984025 27115 1495951 1362051
38085 1362051 -216031 -2338672 -3712909 -3409299 -2158455 -2065310 -3989867 -5989406 -5558536
38076 -5558536 -2712831 433760 2365020 2829540 1588423 -1297857 -4081270 -4532179
38068 -4532179 -2964321 -1991981 -2681102 -3112802 -1783725 -208248 -418547 -1685267 -1933092
38059 -1933092 -1191104 -1127856 -1694886 -871811 1893366 4238048 3840231 1243972 -1318601
38050 -1318601 -2694237 -3179841 -3014028 -1985982 -411302 689951 701339 58137 -416499
38041 -416499 -329398 266842 1115705 1701670 1460784 579746 264623 1527435 3758564
38032 3758564 5194873 4933857 3801917 2987718 2624343 2276756 2053570 2310838 2719030
38023 2719030 2616008 2028686 1428675 817038 169803 433544 2518025 5279411 6297057
38014 6297057 5185446 4355031 5500491 7016317 6387822 3801271 1534124 660036 402480
38005 402480 349225 1183650 3009336 4760356 5776506 6455466 6767378 5615825 2664875
37996 2664875 -305097 -1107813 225399 1472046 699652 -1908742 -4561367 -5622238
37988 -5622238 -4806046 -2972479 -1058211 558572 1730434 2239120 2295022 2752371 3995482
37979 3995482 4990796 4434301 2586706 825698 -463455 -2127634 -4259715 -5630180
37971 -5630180 -5749462 -5913252 -7046648 -7779828 -6169362 -2563477 754693 2317514 2372804
37962 2372804 1318862 -1001046 -4009834 -5849230 -5128809 -2619679 -439957 171932
37954 171932 -244859 -451938 115242 1152722 2209141 3099659 3516437 2724541 299505
37945 299505 -2824014 -4732428 -4374968 -2655812 -1371580 -1460514 -2634634 -4186208 -5479970
37936 -5479970 -5949771 -5375235 -4202673 -3111075 -2273320 -1422849 -506766 209183 597184
37927 597184 735038 565050 3542 -555631 -337097 989353 2784248 3831363 3208975
37918 3208975 1013638 -1493974 -2714451 -2163817 -1047207 -971986 -2143744 -3285403 -3353498
37909 -3353498 -2827669 -3035594 -4453502 -5982982 -6000033 -4090444 -1589548 -194371 -149339
37900 -149339 -172700 871623 2729975 4183528 4094419 2040375 -1151092 -3276023 -2380302
37891 -2380302 752905 2858584 1985749 40949 181305 2503725 4102175 3099729
37883 3099729 780184 -522776 -112164 981490 1448642 796538 -203903 -103142 1361191
37874 1361191 2321311 999113 -1501048 -2454240 -1514084 -1184860 -2720841 -3921163 -2370857
37865 -2370857 1038576 3534803 3982862 3233260 2104346 892473 204605 557930 1449361
37856 1449361 1994752 1954169 1185514 -829208 -3544804 -4641105 -2639263 637505 2234372
37847 2234372 1962702 1900358 2614589 2606368 1553637 1292763 2772602 4393975 4480188 3476999
37837 3476999 2606171 2103138 1967082 2794785 4491166 5549509 5054440 4251583 4713087
37828 4713087 5931858 6154254 4798864 2697591 625070 -1099122 -2115369 -2388092
37820 -2388092 -2654151 -3480908 -4338355 -4462949 -3962028 -3189905 -1966479 -514134 -68868
37811 -68868 -1061944 -1724396 -378948 1684249 1826274 101803 -795656 253488 1146329
37802 1146329 -108663 -2543364 -3827129 -3043290 -796733 1885038 3530584 2554719
37794 2554719 -834766 -4028069 -4786568 -3909534 -3758825 -4792589 -5164670 -3553017 -886128
37785 -886128 972707 1208353 455242 -32232 612482 2180784 3579701 3952902 3428785
37776 3428785 2568880 1678525 1172019 1836349 3698404 5112619 4243661 1444654 -900549
37767 -900549 -1028688 573845 2215788 2707858 1864038 269162 -1056837 -1452035 -1370388
37758 -1370388 -1793080 -2840806 -3727315 -4087921 -4298660 -4260742 -3107009 -738946 1454911
37749 1454911 2295890 2345887 2776025 3474437 3419913 2409788 1191454 110632 -1207609
37740 -1207609 -2823871 -4126122 -4669401 -4682465 -4706546 -5276235 -6678285 -8240941 -8230024
37731 -8230024 -5628206 -1948032 14031 -545980 -1656580 -1450326 -476989 -307505 -957890
37722 -957890 -957421 484422 2443632 3357466 2570422 938273 129541 908352 2000418
37713 2000418 1504514 -300295 -830190 1286046 3887305 3957970 1666222 -149586 -57704
37704 -57704 502943 -23602 -1125757 -1520970 -995679 29738 1477178 3056184 3755903
37695 3755903 3091158 2188314 2513884 3950682 5094848 5113463 4414215 3722567 3309745
37686 3309745 3006234 2377237 1085492 -464722 -1272124 -1046850 -760507 -1158241 -1445743
37677 -1445743 -574864 735101 731542 -765461 -2018797 -1845538 -924902 -72350 1327983
37668 1327983 4043893 7132074 8737131 8415983 7480262 7052631 6868479 6341161 5915208
37659 5915208 6543675 8064169 8895829 7713264 5068804 2868217 2316848 2912401 3537252
37650 3537252 3806286 3819700 3254145 1722555 -105914 -795421 137977 1545919 2086319
37641 2086319 1773658 1673184 2522596 4145916 5913624 7242838 7688772 6930415 4868328
37632 4868328 1821859 -1322256 -3415450 -3910425 -3400235 -2974087 -3112771 -3533960 -3851476
37623 -3851476 -3816691 -3185289 -2154803 -1733106 -2619878 -3756622 -3270551 -1112476 650891
37614 650891 715970 165725 232633 40796 -1712281 -3956078 -4314479 -2620237 -1224457
37605 -1224457 -1542353 -2170697 -1147768 1373376 3602322 4239970 3316918 1689324 434963
37596 434963 169306 389252 -19499 -1305968 -2534991 -2976183 -2906427 -2673671 -2087845
37587 -2087845 -1398317 -1671581 -3146924 -4279432 -3744086 -2471090 -2054816 -1881018 35973
37578 35973 3502127 5769194 5327301 3942326 3748892 4215600 3762552 2925661 3542308
37569 3542308 5377644 6036854 4516712 2692583 2460532 3223953 3472663 3413736 4331570
37560 4331570 6098424 7093232 6489170 5151035 4071360 3166907 2056871 1049749 763343
37551 763343 1337066 2385802 3221446 2940990 1010987 -1885828 -4215045 -5124284 -4984266
37542 -4984266 -4217094 -2619739 -438810 1020081 1036968 993274 2790725 5968850 7801027
37533 7801027 6465435 2979915 -327836 -2171316 -2562232 -1732940 121371 2302373
37525 2302373 3708424 3723153 2711608 1535680 734819 270312 9680 225887 1262467
37516 1262467 2672209 3229900 2226937 374203 -1105947 -1931610 -2624694 -3219386 -3020409
37507 -3020409 -1645773 552311 3191197 6062267 8406763 9013327 7654663 5684050
37499 5684050 4505899 3999155 3150847 1770214 708507 549381 911371 1198903 1442365
37490 1442365 2032450 2865662 3149476 2269121 806480 365890 2055253 5247429 8147333
37481 8147333 9423846 8924557 7145432 4829151 3054076 2732536 3589620 4281775 3892968
37472 3892968 2731417 1379881 -231042 -2222518 -3927675 -4469141 -3882794 -3014599 -2452382
37463 -2452382 -2065846 -1538956 -999193 -1046335 -2103120 -3590795 -4093377 -2943388 -1345595
37454 -1345595 -990899 -1745778 -1974502 -1134286 -379497 -130405 1068740 4089020 7168641
37445 7168641 7849741 5869397 2732377 -430455 -2974820 -3881472 -2802606 -1232359
37437 -1232359 -675995 -347777 1228123 3114576 3130449 1782204 1948671 4190697 5424261
37428 5424261 3470779 253484 -1238065 -948871 -695073 -820582 -211494 1316429 2730447
37419 2730447 3428382 3544228 2992866 1652322 225961 -327453 -47958 287648 341371
37410 341371 257664 5233 -402251 -483957 51499 761358 1388746 2552523 4453718 5678232
37400 5678232 4662914 1881690 -717533 -2012556 -2156958 -1287204 556674 2375611
37392 2375611 2754633 1737838 879064 1180696 2094834 2728529 2942496 3058235 3415704
37383 3415704 4259953 5173939 4915046 3064690 1511559 2577903 5640135 7502928 6522044
37374 6522044 4395272 3119994 2244002 518497 -1487508 -2332306 -2143637 -2144947 -2347165
37365 -2347165 -1617934 115642 1457065 1496984 743929 -172331 -1371790 -2748954 -3269274
37356 -3269274 -2104127 156508 2183613 3425060 4257077 4826224 4491691 2673099 -143325
37347 -143325 -2624387 -3761977 -3589634 -2788896 -1993640 -1686395 -2313452 -3857578 -5381163
37338 -5381163 -5678307 -4615532 -3360043 -3044954 -3620421 -4245886 -4347479 -3932837 -3263694
37329 -3263694 -2678719 -2501769 -2691171 -2708889 -2113298 -1232190 -935580 -1683849 -2948905
37320 -2948905 -3653965 -3232287 -2263434 -1868365 -2335074 -2696242 -2065885 -974878 -592513
37311 -592513 -837461 -351362 1412355 3121349 3205185 1837785 591210 571719 1486691
37302 1486691 2217619 1843656 385364 -1148619 -1768497 -1640819 -1624997 -1662837 -715083
37293 -715083 1287774 2705426 2344243 1281440 1268299 2109338 2111124 699135 -945708
37284 -945708 -1783636 -2053630 -2348076 -2713259 -2955283 -2993522 -2793841 -2666734 -3410659 -5156323
37274 -5156323 -6323041 -5080978 -1919228 604175 918261 -71624 -810836 -894447 -489818
37265 -489818 438302 1325563 823179 -1258796 -2871778 -2088237 109048 880770 -938139
37256 -938139 -3706986 -5257548 -5042660 -3915166 -2896458 -2509718 -2525635 -2005219 -149605
37247 -149605 2630136 4904915 5622711 4945341 3690151 2429189 1282176 217062 -652655
37238 -652655 -958991 -354752 899270 1856107 1832567 1361203 1732193 3480890 5609123
37229 5609123 6426480 5110800 2522925 508584 171584 821754 973463 266362 -386251
37220 -386251 -637699 -1441796 -3185405 -4328037 -3405159 -1684814 -1974063 -4761805 -7254968
37211 -7254968 -6736002 -3512295 71082 2313376 3079925 3127391 3498402 4893612 6783067
37202 6783067 7666633 6878122 5514566 4936400 5100421 5160117 4880262 4405432 3401197
37193 3401197 1775138 702790 1363320 2851622 2968344 1194898 -705851 -1355281 -1342194
37184 -1342194 -1494667 -1293171 -209520 794385 696051 346081 1188109 2642376 2717532
37175 2717532 1133493 -134469 147816 729565 -10629 -1705046 -2955784 -3573082 -4482246
37166 -4482246 -5983469 -7328587 -7698739 -6647354 -4075600 -895931 786972 -355751
37158 -355751 -2840788 -3797419 -2555886 -1301619 -1831946 -3343846 -4239365 -4510542 -5009350
37149 -5009350 -5580453 -5506474 -5004043 -4659672 -3942785 -2005302 316751 1123263 190582
37140 190582 -620839 -68801 995687 1443628 1527371 1758713 1575242 476824 -522197
37131 -522197 -69893 1428567 2240285 1585712 382529 -111147 584920 2231823 4053405
37122 4053405 4892672 4062104 2127381 312661 -647040 -537234 790476 2832791 3899554
37113 3899554 2612957 -89063 -1766236 -1373688 -84310 792918 1162267 1157664 593666
37104 593666 127699 1229070 3808073 5388824 4156548 1630376 617576 1481710 2358453
37095 2358453 2372162 2371822 2563234 1736113 -485553 -2478493 -2704123 -1629487 -613087
37086 -613087 -8796 571174 1011304 878467 340939 -84045 -363628 -744633 -1088672 -1198832
37076 -1198832 -1457580 -2250718 -2926840 -2237295 73604 2784156 4454141 4662119 3865932
37067 3865932 2545362 837960 -1133293 -2871222 -3700493 -3568188 -3495321 -4654537 -6768142
37058 -6768142 -7973914 -6763747 -3698894 -738479 774413 925464 423815 -227611 -828182
37049 -828182 -1431386 -2292683 -3400156 -4070302 -3501864 -1771546 123570 1222865 1299237
37040 1299237 770771 312062 326681 353711 -660119 -2878226 -4779595 -4760824 -3240610
37031 -3240610 -2027017 -1707637 -1072032 613150 2277772 2792321 2782694 3581537 5204721
37022 5204721 6499835 6731670 5982227 4485484 2637387 1259909 754081 290041 -1081486
37013 -1081486 -2842582 -3775315 -4029783 -4833190 -6019593 -5637181 -2823506 382558 1305745
37004 1305745 -239367 -2293054 -3452890 -3811046 -3627238 -2755814 -1713838 -1923490 -4011082
36995 -4011082 -6562151 -7382460 -5724712 -2795676 -466832 -46842 -1825254 -4780878
36987 -4780878 -6739482 -5947929 -3062092 -780363 -778066 -1689304 -1109975 989572 2317366
36978 2317366 1615138 229522 -228531 -102950 -384131 -631592 12378 676085 -196214
36969 -196214 -1938723 -2114702 -257165 1058756 -115834 -2293594 -2899120 -1888780 -1131138
36960 -1131138 -1189321 -925720 -66315 -21117 -1614109 -3563728 -4089333 -3107721 -2067629
36951 -2067629 -2137502 -3132938 -3968301 -3886237 -3400738 -3885416 -5788406 -7561572 -7249283
36942 -7249283 -5089180 -3451451 -3888316 -5278523 -5473401 -3870528 -1551617 404295
36934 404295 1696119 2229761 1860965 894399 159240 252614 943214 1453857 1242804 541836
36924 541836 167175 654632 1600092 2160984 2180027 2292417 2837159 3355738 3461190 3432544
36914 3432544 3429348 2918799 1685232 697215 918272 1809393 2270301 2631809 4042479
36905 4042479 5831221 5414503 1731205 -2744824 -4761245 -4056432 -2918011 -2688697 -2501748
36896 -2501748 -1438992 -129374 548798 1096345 2632272 5097914 7170467 7717677 6617800
36887 6617800 4377343 1763392 -189064 -665267 27505 536315 -140882 -1594082 -2605482
36878 -2605482 -2492735 -1501726 -191565 1009845 1750345 1889598 1875052 2501020 3953434
36869 3953434 5343385 5485232 4011325 1551782 -957290 -2856820 -3830097 -3827771 -3131932
36860 -3131932 -2402051 -2465520 -3775413 -5785798 -6960304 -5907295 -2786485 683167 2833205
36851 2833205 3392786 3113307 2642773 2294602 2433310 3207062 3961854 3717034 2375233
36842 2375233 845832 -147035 -718471 -1131896 -1271051 -1262765 -1882825 -3552118 -5334831
36833 -5334831 -5809545 -4875716 -3914571 -3972672 -4436454 -3942388 -2211696 -369246 583795
36824 583795 1023294 1916325 3026398 2786375 439543 -2382933 -3231066 -1799054 -176919
36815 -176919 71002 -179471 616232 2102256 2588625 1654748 634940 425941 244593
36806 244593 -862203 -2392181 -3139075 -2869577 -2359978 -2177704 -2278814 -2561612 -2915980
36797 -2915980 -2723959 -1189411 1524878 4110654 5430863 5558611 5179427 4521276 3494119
36788 3494119 2515913 2345481 3029031 3706456 3713311 3347778 3264224 3583060 3922875 3860259
36778 3860259 3038510 1408012 -155259 -193511 1485792 2891197 2013684 -360846 -1472124
36769 -1472124 -336312 921179 99704 -2228238 -3999543 -4551721 -4764885 -5105896 -5145664
36760 -5145664 -4751754 -4353078 -4076223 -3785108 -3819521 -4447536 -4748858 -3528221 -1415587
36751 -1415587 -452955 -1214192 -1981767 -1510066 -971282 -1929899 -3686280 -4197978 -2873619
36742 -2873619 -919793 642851 1814609 2643512 2871449 2733060 2905329 3332205 3108291
36733 3108291 1946082 865530 835305 1369359 1142516 -308424 -2019568 -2581719 -1344633
36724 -1344633 1161947 3581445 4527631 3490457 1315449 -283621 -85510 1478624
36716 1478624 2700320 2445151 1437385 1206117 1951082 2340280 1594888 724787 1011519
36707 1011519 2120719 2732398 2503245 2230655 2251014 1840201 383760 -1756803 -3794478
36698 -3794478 -5221100 -5768221 -5354199 -4337700 -3298967 -2416426 -1551524 -920063 -950153
36689 -950153 -1387379 -1355115 -545944 411249 1018721 1470833 1742102 1061697 -921216 -3066970
36679 -3066970 -3675621 -2229544 288351 2420235 3121546 2198984 585701 -166318 656080
36670 656080 2175400 3034151 2779430 1646413 -273148 -2651957 -4274585 -4084085 -2791441
36661 -2791441 -2209806 -2860222 -3414580 -2788833 -1560259 -726109 -207003 469486 865534
36652 865534 256750 -778316 -603275 1441747 4019705 5106358 3922630 1473659 -441126
36643 -441126 -700089 220835 633525 -742413 -3387211 -5423773 -5507322 -4009545 -2288884
36634 -2288884 -1174783 -403732 715829 2367197 3839830 3941339 2038000 -1052967
36626 -1052967 -3417656 -3686622 -2321817 -996801 -754553 -1150141 -1227434 -799555 -378698
36617 -378698 -185482 150949 841203 1395521 1185738 317365 -471898 -792803 -1101504 -1995632
36607 -1995632 -3280655 -4132923 -4144931 -3779745 -3652749 -3785999 -3892051 -4016702 -4357222
36598 -4357222 -4632025 -4291909 -3419810 -2801598 -2876027 -3143324 -2918258 -2210821 -1549625 -1410435
36588 -1410435 -2154840 -3912680 -5935388 -6669298 -5380513 -3373592 -2578647 -3033197 -2868909
36579 -2868909 -962616 1558395 3016040 3373052 3744561 4290388 3823264 1701778 -765220
36570 -765220 -1475733 62150 2035706 2341968 1015083 8147 454398 1046288 -58089
36561 -58089 -2386771 -3574070 -2558806 -866023 -194155 -139641 609673 1871706 2240420
36552 2240420 1349158 426617 475861 1014053 972395 56480 -1176049 -2022403 -2042844 -1162452
36542 -1162452 258455 1586529 2290477 2097185 949323 -817431 -2283489 -2389859 -845144
36533 -845144 1496779 3250453 3537911 2605683 1500015 940421 510777 -645829 -2325048
36524 -2325048 -3191360 -2557582 -1405867 -924151 -806042 -92066 870977 753503 -572099
36515 -572099 -1657027 -1633538 -1405700 -1989691 -2750206 -2259272 -265957 2110402 3773634
36506 3773634 4423736 4181194 3276888 2232442 1810728 2501326 4115548 5885482 6986234
36497 6986234 7157116 6820187 6362784 5443120 3526541 1095165 -427352 -313525 503115
36488 503115 603552 -179793 -695398 148472 2394924 5198475 7493379 8545606 8182584
36479 8182584 6637800 4331942 2007975 752475 1150225 2393264 3029258 2786723 2788791
36470 2788791 3646777 4422063 4194978 3654483 4033435 5140668 5631702 4811889 3055072
36461 3055072 838187 -1387738 -2670832 -2374223 -1538644 -1952960 -3578835 -4335549 -2959432
36452 -2959432 -675400 739678 1198282 1507063 1532369 690144 -424494 -523720 470224
36443 470224 1483232 2249070 3707788 6062153 7817522 7590433 5962973 4664120 4506972
36434 4506972 4935119 5132122 4736189 3738006 2470407 1576454 1329706 1155075 504085
36425 504085 -33118 593901 2172898 3265284 3190246 2840834 2963553 2744882 1158955
36416 1158955 -1027666 -1917487 -942954 531495 1175646 1197080 1480380 2049009 2057802 1050732
36406 1050732 -220608 -310949 1482583 4035851 5056517 3327888 151865 -1918827
36398 -1918827 -1553506 685646 3631662 6351304 7867246 7474573 5811085 4522471
36390 4522471 4282638 4066236 2932398 1527948 1071414 1758309 3029179 4525525 5714363
36381 5714363 5361428 2781248 -678766 -2655669 -2268763 -684493 670134 1447121 1913190
36372 1913190 2128389 1914364 1135559 -75906 -1050914 -844310 646063 2123504 2169079
36363 2169079 862171 -539068 -1248145 -1536170 -1949237 -2739532 -3855406 -4781379 -4724073
36354 -4724073 -3686675 -2857901 -3109290 -3828542 -4307310 -5278819 -7371740 -8913778 -7659145
36345 -7659145 -4466034 -2692245 -3636953 -5149098 -5395859 -5219104 -5428143 -4512166 -1287452
36336 -1287452 2198052 2963510 1049080 -1131893 -2280090 -2621110 -1761964 1007950 4411246
36327 4411246 5827151 4671485 3019655 2450931 2313491 1670798 887542 325071 -690686
36318 -690686 -2311619 -3025247 -1496899 1448265 3973842 5469049 6260475 5862590 3301239
36309 3301239 -841866 -4300078 -5618126 -5749464 -6439494 -7712906 -7943083 -6282697 -4040576
36300 -4040576 -3141618 -3812852 -4619029 -4618058 -4491481 -5212233 -6456589 -7018776 -6273835 -4593346
36290 -4593346 -2770370 -1611397 -1490900 -1578047 -240269 2727361 4984425 4205388 1308101
36281 1308101 -582442 -240573 537093 159452 -581500 -501609 -185432 -568807 -864834
36272 -864834 138496 1608597 1581061 69957 -716669 405899 1783692 1079465 -1760655
36263 -1760655 -4457308 -4806696 -2661584 124172 1389285 522483 -1230849 -2413852
36255 -2413852 -2993356 -3831000 -4846884 -4738981 -2824110 -334079 735713 -301687 -2323724
36246 -2323724 -3632687 -3304151 -1672360 -43177 207917 -1172408 -2888720 -3227559 -1797984
36237 -1797984 77961 838476 283350 -540963 -839769 -999016 -1908809 -3706680 -5503099
36228 -5503099 -6268159 -5753929 -4539589 -3354244 -2464319 -1712008 -1057479 -837893 -1266735
36219 -1266735 -1879986 -1972094 -1591655 -1507540 -1984481 -2249600 -1592496 -366774 654519
36210 654519 1260024 1397030 503222 -1634091 -3814869 -4528482 -3932322 -3433580 -3449413
36201 -3449413 -3127185 -2373816 -2349254 -3331810 -3833822 -2907435 -1875201 -2430857 -4116634
36192 -4116634 -5084236 -4542187 -3126349 -1598743 -574777 -873662 -2552169 -3922716 -3065530
36183 -3065530 -281277 2207092 2917630 2329445 1635212 1566219 2414699 3915576 4938208
36174 4938208 4412164 2740791 1362879 920085 855246 708302 606354 463467 -45221
36165 -45221 -572565 -339584 601937 1503499 2295251 3468942 4592619 4584683 3729470 3682502
36155 3682502 4924537 5886516 5297867 3743584 2089035 141056 -1994674 -2946840 -1957821
36146 -1957821 -346881 394771 671142 1372167 1730469 552232 -1365106 -2117495 -1422889
36137 -1422889 -539440 33892 728926 1075279 -83507 -2297056 -3408428 -2352364 -525612
36128 -525612 249988 -131722 -546423 -206344 833756 1953647 2353949 1777264 970759
36119 970759 825447 1167094 1110018 333370 -831095 -2136033 -3191686 -3079501 -1591081
36110 -1591081 -339993 -946074 -2486628 -2688274 -1392458 -527758 -589435 154752 2268670
36101 2268670 3726775 3261299 2628548 3622848 4913775 4184909 1946118 781969 1702538
36092 1702538 3494223 5075500 6283702 6602557 5245840 2724348 708293 71443
36084 71443 282611 733931 1403850 2089976 2095600 932669 -1237979 -3635717 -4854152
36075 -4854152 -3679998 -876905 826357 -104590 -1801936 -1630291 -79261 229875 -1139833
36066 -1139833 -1822831 -522259 1170363 1611847 1347773 1286103 743482 -992784 -2679243
36057 -2679243 -2578828 -1107862 -377780 -1380623 -2823255 -2741446 -648220 1840311 2401839
36048 2401839 479574 -1768359 -1866660 -148669 929045 532605 486116 1962160 3320007
36039 3320007 2612056 449563 -1300664 -2185601 -2716032 -2600620 -1559484 -912113 -2063793
36030 -2063793 -3976188 -4372439 -3108851 -2087187 -1947136 -1253419 687927 2494260 2949215
36021 2949215 2639745 2430680 2012250 1066185 460493 1057583 2323273 3143659 3193609
36012 3193609 2691797 1729250 696770 476080 1297503 2218927 2586100 3095856 4389961
36003 4389961 5477049 4836995 2542739 77557 -1525831 -2212917 -2033472 -1091660 -198496
35994 -198496 -248139 -841297 -630950 850827 2722126 4134949 4983184 5111317 4177965
35985 4177965 2816712 2618630 4032092 5279691 4497978 2287651 910811 1302113 2148464
35976 2148464 1965513 915144 172807 369495 1198235 1971521 2043261 1119749 -308569
35967 -308569 -1121310 -632694 658255 1704593 2025925 1823019 1365004 878661 817900
35958 817900 1505036 2505420 3022642 2949091 2815211 2626546 1676181 -70328 -1287855
35949 -1287855 -790149 770167 1495930 339380 -1979771 -3926178 -4461857 -3610200 -2263561
35940 -2263561 -1345607 -861677 -100875 956635 1165635 -154560 -1849311 -2274792 -1499342
35931 -1499342 -859608 -649124 161923 1805007 2960855 2695770 1742931 1085437 521801
35922 521801 -388977 -1060553 -801714 -296156 -891031 -2692300 -4341662 -4515683 -2968643
35913 -2968643 -443182 1749121 2446020 1679112 695331 376864 187956 -665539 -1835934
35904 -1835934 -2603373 -3256489 -4317903 -4958362 -3880850 -1646748 -369884 -853188 -1702597
35895 -1702597 -1783378 -1859234 -2845351 -3942699 -3948632 -3453507 -4078212 -5797821 -6500427 -4563062
35885 -4563062 -1011007 1369608 821933 -1653757 -3338010 -2651395 -872118 -584928 -2540223
35876 -2540223 -4924006 -5957355 -6036060 -6404676 -6709576 -5388293 -2232450 939620 2500744
35867 2500744 2786583 3132376 3983407 4606190 4167401 2563040 535021 -672908 -254480
35858 -254480 1104273 1613832 457974 -963251 -735784 867955 1510936 -161875 -2677993
35849 -2677993 -3605642 -2439492 -652153 614679 1663540 3037308 4422893 5285714
35841 5285714 5737724 6065854 5953993 4929198 3290387 1923829 1327785 1310992 1438657
35832 1438657 1248467 286243 -1362033 -2628848 -2251618 -185807 2143573 3038039 1769384
35823 1769384 -977765 -3329942 -3307358 -647786 2515867 3714172 2874051 2031706 2352765
35814 2352765 2789390 2131242 972627 599481 904634 693879 -393795 -1458609 -1756571
35805 -1756571 -1651159 -2032051 -3257997 -4655699 -4864646 -3051280 -40735 2345474 3425569
35796 3425569 4273932 5572591 5942597 3753648 -36592 -2424048 -1665358 1250463 4378504
35787 4378504 6654377 7723423 7334194 5625877 3246717 727511 -1672374 -3418989
35779 -3418989 -3905024 -3369880 -2661582 -1907608 -529382 1188867 1926232 1308145 687745
35770 687745 1077284 1634722 1367691 1043122 1768648 2624064 1687184 -943116 -3114562
35761 -3114562 -3677875 -3681267 -4060392 -4005090 -2713365 -1331839 -1583407 -3129450 -3835251
35752 -3835251 -2613868 -738922 17649 -425996 -812771 -505191 -186221 -615850 -1485958
35743 -1485958 -1926423 -1641563 -968698 -128763 870446 1710164 1903349 1461943 647022
35734 647022 -857308 -3352456 -5567431 -5317346 -2588042 -400534 -1102793 -3055455 -2965056
35725 -2965056 -622905 1120935 873440 511863 1847944 3872948 4614928 3954104 3153795
35716 3153795 2940545 3408252 4619097 5908249 5714375 3590124 1356550 691860 634813
35707 634813 -627596 -2465560 -2721324 -1468641 -1117808 -2421282 -3047304 -1297918 941880
35698 941880 715293 -1930245 -4201760 -4221932 -2848648 -2029856 -2560017 -3609170 -3836292
35689 -3836292 -2930809 -2262540 -3592221 -6835280 -9697560 -9978648 -7630525 -4088594 -417371
35680 -417371 3032759 5808706 7320587 7454545 6479346 4628405 2456222 1139292 1455226
35671 1455226 2695189 3494480 3528940 3453083 3408974 2799035 1582393 562490 48461
35662 48461 -645766 -1843678 -2709027 -2624860 -2529826 -3744827 -5785796 -6475160 -4468405
35653 -4468405 -943369 1620031 1894754 468205 -1524078 -3620823 -5476434 -5911322
35645 -5911322 -3849143 -313795 1906599 1493639 465421 1504144 4145726 5387015
35637 5387015 3928780 1839448 1441275 2381285 2972433 2964094 3288526 3900027 3756418
35628 3756418 2843060 2558623 3685055 5179955 5549133 4580412 3173687 2094906 1470002
35619 1470002 1103395 768427 329673 -146742 -521501 -862031 -1297873 -1570656 -1179837
35610 -1179837 -149696 761707 836747 41270 -1195819 -2305892 -2492298 -1063476 1566281
35601 1566281 3774462 4358592 3876026 3644998 3911927 4045850 4110836 4668564 4921978
35592 4921978 2941470 -1290476 -4680169 -4503024 -2037669 -805014 -1801402 -2773220 -2249941
35583 -2249941 -1712789 -2694505 -3963747 -3486600 -1712157 -679101 -631329 93572 1845312
35574 1845312 2657045 1239848 -799046 -976200 874880 2646101 2636176 1121237 -548597
35565 -548597 -1510889 -1858585 -2038657 -2166007 -2060014 -1857938 -2095718 -2791954 -2967335 -1900147
35555 -1900147 -571845 -791721 -2856076 -5165638 -6360961 -6693877 -6925655 -7130884 -7295413
35546 -7295413 -7917963 -9003054 -9386344 -8216564 -6426062 -5533596 -5475649 -4860102 -3112521
35537 -3112521 -1163620 3867 492207 1039943 2138826 3618788 4587939 4028965 2076386
35528 2076386 322413 63232 662523 650005 35161 190290 1487522 2472510 1782540
35519 1782540 -216125 -2149993 -3064042 -2715714 -1376162 96902 707130 361562 -104654
35510 -104654 -250096 -582965 -1314292 -1384807 421757 3774984 6902284 8251661 7666652
35501 7666652 6169469 4974716 4548017 4345738 3546220 2026146 356751 -1036826 -2218191
35492 -2218191 -3331490 -4465854 -5835655 -7303999 -7792085 -6262683 -3526602 -1851555
35484 -1851555 -2164920 -2770818 -1728272 498625 1952345 2032399 1998228 2769118 3528764
35475 3528764 2906739 802685 -1397890 -2197433 -1490815 -782602 -1658655 -3881720 -5447401
35466 -5447401 -4829232 -2638018 -648564 177502 93471 -317969 -512095 101945 1631726
35457 1631726 3277864 4236621 4745535 5395963 5808595 5142081 3731504 2923155 3170797
35448 3170797 3565612 3549025 3760335 4536885 4798615 3494286 1384445 231282 583798
35439 583798 1419092 1839685 2086266 2663852 3332207 3493999 3103977 2593725 2067387 1181875
35429 1181875 -60224 -1003472 -1317059 -1850713 -3647467 -6120180 -7248494 -6061693 -3951683
35420 -3951683 -2644027 -1711459 549020 4201833 7253222 8258274 7776232 6730621
35412 6730621 4907913 2200489 150011 684090 3667395 6901122 8412052 7845686
35404 7845686 5914947 3654991 2288969 2727263 4690616 6792523 7670602 6763589 4319061
35395 4319061 1390219 -427052 -286745 852080 1425559 1425800 2021691 2920225 1973224
35386 1973224 -1623868 -5414938 -6528135 -5205483 -3661367 -2425289 -191587 3034148
35378 3034148 5256633 5454042 4902410 4640802 3797083 1807206 311570 893918 2363121
35369 2363121 2443926 1215930 642440 1286813 1846870 1787444 2093799 3144471 4018398
35360 4018398 4436639 5281410 6385012 5885492 3058829 72406 -589410 869260 2578245
35351 2578245 3779856 4876242 5643713 5351437 4368666 3988360 4577847 5101717 4530152
35342 4530152 2825077 672881 -925744 -1075655 115200 1311598 1405397 799211 477333
35333 477333 465130 275986 210111 837660 1675121 1894878 2085333 3724472 6894873 9925628
35323 9925628 11330994 10826971 8632646 5368555 2617297 1819281 2342596 2243192 1079263
35314 1079263 154786 -164824 -1030011 -2326206 -1904532 880279 3114223 1952392 -1302989
35305 -1302989 -3085266 -2422460 -1458145 -1674625 -2087103 -1378595 213547 1712354 2653587
35296 2653587 2997033 2867329 2763885 3146639 3608264 3304896 2304105 1588795 1574034
35287 1574034 1510718 576988 -1195302 -3185970 -4576676 -4421832 -2325107 603585 2304535
35278 2304535 1809515 260722 -421592 500024 2087486 2760081 1748890 -44302 -666258
35269 -666258 937056 3717578 5791836 6542787 6595158 6121097 4627213 2531171 1329705
35260 1329705 1484541 1517831 259349 -1136813 -776511 1105369 2365088 1797841 380099
35251 380099 -426298 -403913 -270699 -621154 -1698960 -3533567 -5692720 -7218170 -7271214
35242 -7271214 -5835576 -3787968 -2452074 -2796281 -4446556 -5606781 -4790576 -2734936
35234 -2734936 -1663036 -2375970 -3207236 -2526588 -1098346 -753012 -1642552 -2442544 -2795251
35225 -2795251 -3654746 -5107977 -5746697 -4847278 -3549532 -2968478 -2586665 -1642234 -771827
35216 -771827 -822482 -1071444 -266154 1253064 2096611 2012606 1942923 2272427 2633689 3137134
35206 3137134 4071447 4617828 3781078 2533851 2880809 4526317 4799302 2653182 467136
35197 467136 598946 2101582 2438769 915183 -1209274 -2717989 -2949204 -1484490 992518
35188 992518 2452837 1724527 126881 -513182 -475048 -1168893 -2548006 -3347197 -3116980
35179 -3116980 -2147992 -144034 2928647 5253947 4729420 1949855 -448465 -1239078 -1291470
35170 -1291470 -1077951 -37816 1375258 1631735 809054 952395 2819499 4470777 4223378
35161 4223378 2931444 1996184 1065626 -615864 -2166750 -2269738 -1421172 -1328040 -2676917
35152 -2676917 -4672885 -6073706 -5744571 -3200881 303584 2268451 1750313 728219
35144 728219 1462041 3505043 4703870 4154418 2565523 555347 -1573460 -2903801 -2682245
35135 -2682245 -1919800 -2474823 -4376190 -5544471 -4472756 -1938564 304491 1492006
35127 1492006 2069021 2665324 3243970 3032329 1443928 -699336 -1529299 -370134 1136488
35118 1136488 1120946 -22112 -488562 206922 916665 960069 865457 1004424 1118672 1451846
35108 1451846 2761007 4686190 5546935 4514457 2866532 2344746 3192309 4462624 5334973
35099 5334973 5383263 4386115 2766186 1692641 1964927 3080023 3874590 3728933 2826874
35090 2826874 1780702 1379469 2068982 3144820 3037668 1068578 -1446205 -2451053 -1294387
35081 -1294387 806892 2140842 1863232 247496 -1837104 -3583990 -4599940 -4751279
35073 -4751279 -3969653 -2610247 -1764857 -2399668 -3979824 -4703430 -3536581 -1454194 -218644
35064 -218644 -411148 -1101992 -1004156 485345 2908821 4882088 4993881 3105170 502176
35055 502176 -1540374 -2855657 -3711397 -3852009 -3023959 -1811610 -860539 334495 2582173
35046 2582173 5022920 5464809 3176345 135317 -1296167 -979541 -305118 240015 1281397
35037 1281397 2551601 2430434 262960 -2068021 -2153635 -162416 1347362 746979 -710604
35028 -710604 -712231 1299987 3888365 5485718 5498446 3955726 1345847 -970240 -1290584
35019 -1290584 747188 3534843 5142115 5234719 4830140 4581152 4139356 3159429 2078418
35010 2078418 1546154 1619305 1932855 2297403 2660129 2708733 2053407 812710 -360102
35001 -360102 -841840 -328059 1260399 3541192 5352610 5530309 4395175 3679356 4332892
34992 4332892 5157414 4568199 3078558 2704673 4160192 6115879 7321444 7885880 8000271
$$ [...]
##END NTUPLES=NMR SPECTRUM
##END=
