##TITLE=31Pdec_1-2021
 CDCl3, 24 sc
 13.1.2022
##JCAMPDX= 6.0         $$ Bruker NMR JCAMP-DX V2.0
##DATA TYPE= NMR SPECTRUM
##DATA CLASS= NTUPLES
##ORIGIN= UXNMR, Bruker Analytische Messtechnik GmbH
##OWNER= root
$$ XWIN-NMR		Version 3.5
$$ Thu Jan 13 11:21:20 2022 Russian Standard Time (UT+4h)  she@DPX200
##.OBSERVE FREQUENCY= 81.014109
##.OBSERVE NUCLEUS= ^31P
##.ACQUISITION MODE= SIMULTANEOUS
##.ACQUISITION SCHEME= undefined
##.AVERAGES= 24
##.DIGITISER RES= 16
##SPECTROMETER/DATA SYSTEM= spect
##.PULSE SEQUENCE= zgpg30
##.SOLVENT NAME= CDCl3
##.SHIFT REFERENCE= (INTERNAL, CDCl3, 0, 252.119)
##AUDIT TRAIL= $$ (NUMBER, WHEN, WHO, WHERE, WHAT)
$$ ##TITLE= Audit trail, XWIN-NMR		Version 3.5
$$ ##JCAMPDX= 5.01
$$ ##ORIGIN= Bruker BioSpin GmbH
$$ ##OWNER= she
$$ F:/spectra/data/she/nmr/P31/1/pdata/1/auditp.txt
$$ ##AUDIT TRAIL=  $$ (NUMBER, WHEN, WHO, WHERE, WHAT)
(   1,<2022-01-13 11:19:57.75 +0400>,<she>,<DPX200>,
      <created by zg, POWCHK disabled, PULCHK disabled
       configuration hash MD5:
       00 E9 B6 7A A2 85 ED C7 34 08 36 98 17 FE 4E 26
       data hash MD5: 32K
       B5 49 C5 13 C3 D0 15 A8 5F BC BC 3F 80 71 E6 61>)
(   2,<2022-01-13 11:20:06.14 +0400>,<she>,<DPX200>,
      <Start of raw data processing
       efp BC_mod = 2 LB = 1 FT_mod = 6 PKNL = 1 PHC0 = -9497.201 PHC1 = 649.6736 SI = 64K 
       data hash MD5: 64K
       71 0D 79 C9 94 09 8E F8 E5 07 78 3C 41 F9 E3 27>)
(   3,<2022-01-13 11:20:40.67 +0400>,<she>,<DPX200>,
      <pk PHC0 = 79.47235 PHC1 = -357.7999 
       data hash MD5: 64K
       95 69 EC A6 C2 E8 5F EA A6 CC CB 9A E5 6F D9 66>)
$$ ##END=
$$ 
$$ hash MD5
$$ C7 44 10 2D DB D8 05 3C BE 6E 8D 00 23 C7 1C 9F
##$RELAX= 
##$RELAX= 
##$RELAX= 
##$RELAX= 
##$RELAX= 
##$RELAX= 
##$RELAX= 
##$RELAX= 
$$ Bruker specific parameters
$$ --------------------------
##$DU= <F:/spectra>
##$EXPNO= 1
##$NAME= <P31>
##$PROCNO= 1
##$TYPE= <nmr>
##$USER= <she>
##$AMP= (0..31)
100 100 100 100 100 100 100 100 100 100 100 100 100 100 100 100 100 100 
100 100 100 100 100 100 100 100 100 100 100 100 100 100 
##$AQSEQ= 0
##$AQ_mod= 1
##$AUNM= <au_zg>
##$AUTOPOS= <>
##$BF1= 81.014009
##$BF2= 200.13
##$BF3= 200.13
##$BF4= 200.13
##$BF5= 200.13
##$BF6= 200.13
##$BF7= 200.13
##$BF8= 200.13
##$BYTORDA= 1
##$CFDGTYP= 0
##$CFRGTYP= 5
##$CHEMSTR= <none>
##$CNST= (0..31)
1 1 145 1 1 1 1 1 1 1 1 1 1 1 1 1 1 1 1 1 1 1 1 1 1 1 1 1 1 1 1 1 
##$CPDPRG= <waltz16>
##$CPDPRG1= <>
##$CPDPRG2= <waltz16>
##$CPDPRG3= <>
##$CPDPRG4= <mlev>
##$CPDPRG5= <mlev>
##$CPDPRG6= <mlev>
##$CPDPRG7= <mlev>
##$CPDPRG8= <mlev>
##$CPDPRGB= <>
##$CPDPRGT= <>
##$D= (0..31)
0 1 0 0 0 0 0 0 0 0 0 0.03 2e-05 3e-06 0 0 0 0 0 0 0 0 0 0 0 0 0 0 0 0 
0 0 
##$DATE= 1642058396
##$DBL= (0..7)
120 120 120 11 120 120 24 19 
##$DBP= (0..7)
150 150 150 150 150 150 150 150 
##$DBP07= 0
##$DBPNAM0= <>
##$DBPNAM1= <>
##$DBPNAM2= <>
##$DBPNAM3= <>
##$DBPNAM4= <>
##$DBPNAM5= <>
##$DBPNAM6= <>
##$DBPNAM7= <>
##$DBPOAL= (0..7)
0.5 0.5 0.5 0.5 0.5 0.5 0.5 0.5 
##$DBPOFFS= (0..7)
$$ [...]
##$SUBNAM2= <"">
##$SUBNAM3= <"">
##$SUBNAM4= <"">
##$SUBNAM5= <"">
##$SUBNAM6= <"">
##$SUBNAM7= <"">
##$SUBNAM8= <"">
##$SUBNAM9= <"">
##$SW= 501.769469612571
##$SWIBOX= (0..15)
0 1 3 0 0 0 0 0 0 0 0 0 0 0 0 0 
##$SW_h= 40650.406504065
##$TD= 32768
##$TD0= 1
##$TE= 0
##$TE2= 300
##$TE3= 300
##$TEG= 300
##$TL= (0..7)
0 120 53 12 22 120 120 120 
##$TP= (0..7)
150 150 150 150 150 150 150 150 
##$TP07= 0
##$TPNAME0= <>
##$TPNAME1= <>
##$TPNAME2= <>
##$TPNAME3= <>
##$TPNAME4= <>
##$TPNAME5= <>
##$TPNAME6= <>
##$TPNAME7= <>
##$TPOAL= (0..7)
0.5 0.5 0.5 0.5 0.5 0.5 0.5 0.5 
##$TPOFFS= (0..7)
0 0 0 0 0 0 0 0 
##$TUNHIN= 0
##$TUNHOUT= 0
##$TUNXOUT= 0
##$USERA1= <user>
##$USERA2= <user>
##$USERA3= <user>
##$USERA4= <user>
##$USERA5= <user>
##$V9= 5
##$VALIST= <valist>
##$VCLIST= <CCCCCCCCCCCCCCC>
##$VD= 0
##$VDLIST= <DDDDDDDDDDDDDDD>
##$VPLIST= <PPPPPPPPPPPPPPP>
##$VTLIST= <TTTTTTTTTTTTTTT>
##$WBST= 1024
##$WBSW= 4
##$XGAIN= (0..3)
0 0 0 0 
##$XL= 0
##$YL= 0
##$YMAX_a= 3253
##$YMIN_a= -2362
##$ZGOPTNS= <>
##$ZL1= 120
##$ZL2= 120
##$ZL3= 120
##$ZL4= 120
##$ABSF1= 0
##$ABSF2= 0
##$ABSG= 0
##$ABSL= 0
##$ALPHA= 0
##$AQORDER= 0
##$ASSFAC= 0
##$ASSFACI= 0
##$ASSFACX= 0
##$ASSWID= 0
##$AUNMP= <proc_1d>
##$AZFE= 0.1
##$AZFW= 0.5
##$BCFW= 0
##$BC_mod= 2
##$BYTORDP= 0
##$COROFFS= 0
##$CY= -3
##$DATMOD= 1
##$DC= 0
##$DFILT= <>
##$DTYPP= 0
##$F1P= 0
##$F2P= 0
##$FCOR= 1
##$FTSIZE= 65536
##$FT_mod= 6
##$GAMMA= 0
##$GB= 0
##$INTBC= 1
##$INTSCL= 5.30512e-09
##$ISEN= 30
##$LB= 1
##$LEV0= 0
##$LPBIN= 0
##$MAXI= 10000
##$MC2= 0
##$MEAN= 0
##$ME_mod= 0
##$MI= 50
##$NCOEF= 0
##$NC_proc= -9
##$NLEV= 6
##$NOISF1= 182.463
##$NOISF2= 159.3651
##$NSP= 0
##$NTH_PI= 0
##$NZP= 0
##$OFFSET= 252.1194
##$PC= 4
##$PHC0= -9417.729
##$PHC1= 291.8737
##$PH_mod= 1
##$PKNL= yes
##$PPARMOD= 0
##$PSCAL= 0
##$PSIGN= 0
##$REVERSE= no
##$SF= 81.014009
##$SI= 65536
##$SIGF1= 159.3651
##$SIGF2= -187.1042
##$SINO= 113.3802
##$SIOLD= 16384
##$SREGLST= <1H.CDCl3>
##$SSB= 0
##$STSI= 65536
##$STSR= 0
##$SW_p= 40650.406504065
##$SYMM= 0
##$S_DEV= 0
##$TDeff= 32768
##$TDoff= 0
##$TI= <>
##$TILT= no
##$TM1= 0
##$TM2= 0
##$TOPLEV= 0
##$USERP1= <user>
##$USERP2= <user>
##$USERP3= <user>
##$USERP4= <user>
##$USERP5= <user>
##$WDW= 1
##$XDIM= 65536
##$YMAX_p= 467241018
##$YMIN_p= -10699889
$$ End of Bruker specific parameters
$$ ---------------------------------
##NTUPLES= NMR SPECTRUM
##VAR_NAME=  FREQUENCY,     SPECTRUM/REAL,   SPECTRUM/IMAG
##SYMBOL=    X,             R,               I
##VAR_TYPE=  INDEPENDENT,   DEPENDENT,       DEPENDENT
##VAR_FORM=  AFFN,          ASDF,            ASDF
##VAR_DIM=   65536,         65536,           65536
##UNITS=     HZ,            ARBITRARY UNITS, ARBITRARY UNITS
##FACTOR=    0.620285442955139, 1,           1
##FIRST=     20425.2033426525, 0,            0
##LAST=      -20225.2031614125, 0,           0
##MIN=       -20225.2031614125, -10699889,   0
##MAX=       20425.2033426525, 467241018,    0
$$ Real data points
##PAGE= N=1
##DATA TABLE= (X++(R..R)), XYDATA
$$ [...]
##PAGE= N=2
##DATA TABLE= (X++(I..I)), XYDATA
42616 1651468 548677 4003 -1264046 -3194072 -4048904 -3078872 -1485254 -458707 35077
42607 35077 211713 -205521 -1087065 -1581099 -1313623 -1011099 -1412983 -2272906 -2887509 -3028158
42597 -3028158 -2897251 -2586809 -2038845 -1370862 -933206 -1059494 -1838874 -3040607 -4155988
42588 -4155988 -4558407 -3852792 -2365726 -1227399 -1373907 -2146895 -1570061 1221122 4386241
42579 4386241 5318137 3831513 2041911 1183179 342867 -1125509 -1876852 -696732 1009107
42570 1009107 770069 -1416247 -2953964 -2174661 -429117 -35471 -1219984 -2018201 -813532
42561 -813532 1789548 3660251 3284069 1052980 -1337241 -2448497 -2034443 -811605 301962
42552 301962 812970 887137 1025476 1379061 1523589 1041774 -16664 -1477941 -3256618
42543 -3256618 -4728877 -4646492 -2668270 -456604 -7326 -1119362 -1791495 -996248 349046
42534 349046 1187742 1529404 1558092 1106321 537853 657926 1137609 578675 -1116007 -2135070
42524 -2135070 -1546962 -890704 -1473421 -1822916 -22185 2615080 2821326 7465 -2831478
42515 -2831478 -3131710 -1571471 -212381 326001 720897 1268537 1677023 1911060 2089995
42506 2089995 1775031 368962 -1639316 -2669200 -1851903 -404865 -391640 -2087717 -3492774
42497 -3492774 -2926508 -1164716 -41547 209896 707562 1527032 1504656 512557 -52483
42488 -52483 466819 1148181 1530832 2370198 3381224 2578776 -484113 -2981929 -2456404
42479 -2456404 -349296 495054 125664 400291 1034322 205881 -1564147 -1761896 -152687
42470 -152687 776097 134443 -41028 1237886 1980482 903143 593 1178110 2731601
42461 2731601 1781997 -1435978 -4229244 -5230242 -5174668 -4740402 -3915075 -3126006 -2969995
42452 -2969995 -2923822 -1968292 -375526 586895 568005 348239 325918 216985 144791 532056
42442 532056 847155 -20710 -1784783 -2532183 -1091575 1389111 2850931 2521718 1156718
42433 1156718 -202735 -1039342 -1323458 -1226632 -793136 191195 1706747 2956046 2982166
42424 2982166 2016907 1464280 2052857 2663634 1803350 -123033 -1065998 -36744 1421141
42415 1421141 1212239 -424146 -1122676 424348 2585790 2803036 775221 -1375194 -1831314
42406 -1831314 -845781 356502 1300819 2189556 2799353 2397422 754446 -1321062 -2710161
42397 -2710161 -3163245 -3590776 -4892399 -6407316 -6124343 -3086965 868422 2829231 2141172
42388 2141172 837105 648156 1053627 893920 413756 462690 720077 222162 -872825
42379 -872825 -1446929 -1099468 -458501 -62945 -143516 -1245139 -3597701 -5847119 -5961453
42370 -5961453 -3774822 -1242799 255518 1312574 2474017 2627459 975848 -736963
42362 -736963 -162877 2007671 2635076 575474 -1670677 -1658609 -399080 -461252 -2070064
42353 -2070064 -3213818 -3065989 -3020194 -4017629 -4873820 -4254223 -2820256 -2092809 -2150201
42344 -2150201 -1875554 -971133 -324654 -474534 -902515 -990985 -763878 -496868 -327740 -406577
42334 -406577 -826555 -1331069 -1607138 -1777047 -2028305 -2001572 -1324551 -526569 -480135 -1076484
42324 -1076484 -1494472 -1678866 -2324350 -3319956 -3548243 -2570881 -1297631 -607288 -494050
42315 -494050 -872730 -1785903 -2346453 -1143897 1448110 3021098 2330126 1136347 1415670
42306 1415670 2323730 1901125 523200 204780 1053375 957061 -999631 -2963476 -2830063
42297 -2830063 -827674 1079293 1318886 -199987 -2274089 -3393395 -3168319 -2712238 -3012895
42288 -3012895 -3458607 -2963592 -1858677 -1208626 -835307 137274 1096892 462539 -1492339
42279 -1492339 -2556650 -1820568 -815752 -649206 -272519 1108440 2052345 1180541 -222559
42270 -222559 -113240 919819 508788 -1781119 -3903965 -4518893 -4554481 -4983507 -4880969
42261 -4880969 -2949146 67189 1894861 1446592 -65371 -952885 -1120944 -1586159 -2386305
42252 -2386305 -2192184 -405302 1454910 1494286 -89156 -1505896 -1885867 -1810423 -1534885
42243 -1534885 -463620 1243798 2225341 1812826 998423 770553 845782 879067 1486898
42234 1486898 2924192 4020914 3774244 2980369 2926220 3315053 2866427 1317152 -433468
42225 -433468 -1588027 -1763692 -737007 992735 2042142 1567873 140001 -1552118 -3573933
42216 -3573933 -5301486 -4900728 -2069690 378861 69137 -1236485 -368920 1965469 2168834
42207 2168834 -393617 -2400434 -1966338 -1236720 -2205417 -3383254 -2816499 -1685700 -2231055
42198 -2231055 -3906459 -4250609 -2574589 -541273 310649 -179928 -1467110 -2639224 -2540751
42189 -2540751 -919382 913375 1587791 1247776 694795 -117000 -1477985 -2641280 -2626874
42180 -2626874 -1868002 -1776259 -2955351 -4789172 -6302021 -6576511 -5114257 -2816197 -1693733
42171 -1693733 -2386842 -2979456 -1762856 -58727 -264323 -1936868 -2361423 -825539 360434
42162 360434 -331965 -1291381 -424927 1745647 3200739 3318525 2984253 2529797 1198751
42153 1198751 -1364164 -4236906 -6094662 -6370130 -5426415 -4035225 -2853024 -2113877 -1563119
42144 -1563119 -705240 665726 2020272 2380750 1416705 68636 -522845 -541773 -961070
42135 -961070 -1476048 -509303 2027548 3659079 2552369 464875 395633 2120494 2612397
42126 2612397 818918 -730629 48207 1606386 1297859 -578635 -1410634 -227332 1052629
42117 1052629 500516 -1301621 -2427667 -2420152 -2785423 -4568433 -6376916 -5860674 -3066327
42108 -3066327 -992473 -1977174 -4567161 -5381695 -3505467 -1273900 -709609 -1068658 -619576
42099 -619576 718978 1705770 1782935 1531053 1515531 1590941 1245731 174370 -1320237 -2335792
42089 -2335792 -2191307 -1306780 -666214 -418153 74329 708855 464016 -721657 -1247029
42080 -1247029 -78137 1411429 1238305 -232515 -733532 656143 2307890 2517682 1850482
42071 1850482 2039094 3277100 3855865 2557933 360051 -906695 -959084 -1112721 -2107728
42062 -2107728 -3107295 -3226660 -2857283 -2660732 -2302211 -1330191 -466365 -649230 -1411245
42053 -1411245 -1640994 -1404658 -1453526 -1514528 -962628 -703483 -2058238 -3885609 -3424494
42044 -3424494 -403240 2317410 2935391 2811657 3233280 2937654 799593 -1464316 -1698680
42035 -1698680 -605063 -228536 -650553 -620887 -214666 -346837 -618633 -131852 317451
42026 317451 -695752 -2541291 -3247174 -2415317 -1237338 -223059 762925 894428 -512125
42017 -512125 -1753648 -485233 2434879 3765179 2588331 1150714 737877 29598 -1635664
42008 -1635664 -2687074 -2359012 -2208529 -2926064 -2618021 -392627 1145064 -323645 -2875953
41999 -2875953 -3272524 -2087120 -2492482 -4946352 -6676659 -6327441 -5664807 -5908437 -5416029
41990 -5416029 -2676580 527544 1099192 -1171244 -3327645 -3087371 -1394672 -561208 -953627
41981 -953627 -800050 856350 2444448 1980045 -41301 -1253855 -561228 851140 1639832
41972 1639832 1799443 1667243 1120453 527281 903038 2072032 2193337 460527 -1155458
41963 -1155458 -575638 1180118 1556214 423974 31198 1150301 1865711 908036 -94386
41954 -94386 814111 2661657 2794929 756311 -998035 -510325 1103144 1453449 307917
41945 307917 -285896 717784 1567320 237546 -2309156 -3075897 -1049472 1483644 2113642
41936 2113642 1234495 816104 1480135 2152123 1957746 1144807 383789 211714 962875
41927 962875 2263392 2747234 1289465 -1427846 -3434611 -3643952 -2741376 -1846545 -1187119
41918 -1187119 -477984 140918 258228 8683 66403 691448 1219187 842413 -316396
41909 -316396 -1393699 -1990697 -2507496 -3057534 -2927079 -1802763 -733316 -803654 -1455999
41900 -1455999 -1416278 -809816 -797486 -1409481 -1598155 -1439189 -2162566 -3574354 -3710260 -2015463
41890 -2015463 -715572 -1618686 -3458440 -4098202 -3668212 -3513978 -3424545 -2205118 -196923
41881 -196923 956665 686406 -148064 -940113 -1805332 -2720080 -3517761 -4200570 -4112685 -1907195
41871 -1907195 2075892 4690282 3455085 179972 -1342237 -524082 -114821 -1548042
41863 -1548042 -3178972 -3390847 -2613516 -1645695 -548195 57253 -942141 -2873702 -3379599
41854 -3379599 -1784169 -174449 -123728 -584453 -204912 539243 936592 1516363 2260145
41845 2260145 1538728 -1072195 -2855663 -1336610 1789110 2700164 518955 -2182258
41837 -2182258 -3354467 -3378962 -3098397 -2425953 -1463913 -1051649 -1376516 -1450189 -785786 -491394
41827 -491394 -1739938 -3792158 -4544203 -3056747 -874469 -337346 -1718684 -2799235 -1768398
41818 -1768398 265107 847037 -266250 -914252 8377 923501 188782 -1513632 -2624455
41809 -2624455 -2924318 -2850219 -2076110 -541679 299584 -768510 -2561947 -3028686 -2251941
41800 -2251941 -1881146 -2095661 -1422714 474934 2064878 2371425 2198066 2388831 2609119
41791 2609119 2522877 2587731 2832554 2204409 115488 -2354176 -3672597 -3543688 -2809541
41782 -2809541 -2460159 -3151180 -4682426 -5448284 -3638223 178163 2894631 2509869 874724
41773 874724 1222988 3702779 5364076 4494218 2791702 2485692 3245133 3478352 3293550
41764 3293550 3990188 5119426 4468856 1489277 -1356611 -1837675 -901776 -859280 -1973058
41755 -1973058 -2824022 -3179786 -4150192 -5628399 -5819524 -3743106 -447524 2599867 4628480
41746 4628480 4925727 3229605 1258173 1515899 3669777 4488683 2601845 737084 1406843
41737 1406843 2947159 2446361 456422 -399789 -1390 -402886 -1733430 -1981343 -777393
41728 -777393 -54642 -545976 -668253 404968 1321295 1078931 463365 7676 -1065651
41719 -1065651 -2782684 -3650459 -3226450 -3184947 -4312539 -4662244 -2657304 -142588 19449
41710 19449 -1852552 -2857374 -1626969 424017 1789432 2733261 3991949 5059354 4582939
41701 4582939 2009323 -1519002 -3872766 -3774465 -2058691 -665926 -292832 193564 1704886
41692 1704886 3238234 2958252 404990 -2991237 -5180549 -4912994 -2500200 337777
41684 337777 1825388 1689127 1027906 670927 398886 -163115 -818867 -1236477 -1333318 -1081988
41674 -1081988 -687799 -835983 -1739544 -2175337 -865766 1303517 2118167 1134642 93694
41665 93694 85004 445751 858726 2025085 3346709 2598757 -528131 -2953999 -2218139
41656 -2218139 83520 901468 -189880 -1773619 -3513694 -5525240 -6323985 -4519091
41648 -4519091 -1776679 -1168079 -2916439 -4385839 -4011415 -2709188 -1562596 -674873 -422648
41639 -422648 -1413333 -2827598 -2931894 -1659732 -835713 -1523946 -2857848 -3645871 -3420108
41630 -3420108 -1879903 801788 3003276 2967933 1411408 962841 2617426 4481239 4473119
41621 4473119 2693383 697316 -231709 129618 729950 56297 -1670017 -2032880 79814
41612 79814 1847279 154594 -3237370 -3797406 -1042219 945359 154161 -729221 358414
41603 358414 1417317 565765 -406987 325036 929565 -669490 -2598411 -2084432 -397206
41594 -397206 -667957 -2429918 -2567881 -803334 -46654 -1419556 -2764512 -2542516 -1843264
41585 -1843264 -1722736 -1461054 -560262 -105398 -902293 -1962784 -1854961 -337402 1885514
41576 1885514 3847047 4495028 3467588 1919613 1380880 1720568 1426211 -240558 -2681653
41567 -2681653 -5212765 -7219137 -7359447 -4709074 -924468 760341 -692361 -3024672
41559 -3024672 -3877118 -3343832 -2621876 -1861412 -568910 1028356 2201799 2633803 2372317
41550 2372317 1536938 597291 229779 452322 601451 456554 538527 989814 1127698 577026
41540 577026 -67177 -299373 -647822 -1844230 -3510951 -4342126 -3538106 -1758435 -493878
41531 -493878 -330628 -89966 1488241 3255095 2453495 -1188222 -4030818 -2999967 57109
41522 57109 998891 -689773 -1695239 -289249 1409673 1199676 -275303 -1577018 -2775865
41513 -2775865 -4144870 -4785652 -4234557 -3616165 -3706318 -3658381 -3087673 -3343484 -4869927
41504 -4869927 -5403697 -3254582 -706080 -1278879 -4605808 -6926806 -6222678 -4036996 -2220316
41495 -2220316 -698325 838985 1492520 712718 -349409 -414523 71212 -75043 -632790
41486 -632790 -174484 1686986 3410789 3418791 2189177 1525232 1854369 1510584 -603028
41477 -603028 -2855688 -2920543 -1232593 -390101 -1271157 -2065715 -1597399 -1120639 -1678382
41468 -1678382 -2012172 -861092 541438 284153 -1351379 -2786404 -3565256 -3865956 -2960727
41459 -2960727 -520386 1634872 1589445 300674 6286 513170 -54474 -1396450 -1228066
41450 -1228066 595230 1463203 231983 -988656 -391051 930513 1350354 1250003 1535997
41441 1535997 1677570 983232 166469 -27772 -280246 -1215388 -1929383 -1634475 -1332150
41432 -1332150 -2024234 -2607678 -1670384 -281820 -540649 -1939238 -1812689 480073 2313642
41423 2313642 1508316 -760472 -1990016 -1756503 -1513924 -1859132 -1772849 -603903 651666
41414 651666 690411 -360236 -1309459 -1432657 -781118 533548 2130013 2650478 949035
41405 949035 -1594860 -1811011 1050717 3563448 2389760 -1096361 -2822874 -1707211
41397 -1707211 -455461 -908195 -1725167 -1424156 -874942 -1364324 -2407733 -3040035 -3470067
41388 -3470067 -3929408 -3525590 -1852322 -324967 -328796 -1301021 -2124959 -3057326 -4604593
41379 -4604593 -5777369 -5349953 -3902655 -2888390 -2582711 -2533424 -2869236 -3354211 -2448819
41370 -2448819 413186 2694586 1520866 -2062352 -4259070 -3615890 -2266424 -2164989
41362 -2164989 -2844631 -3296861 -3493570 -3349401 -2423899 -1353897 -1484743 -2450137 -2275911
41353 -2275911 -576495 621045 106190 -813359 -970485 -1312000 -2679512 -3838162 -3609017
41344 -3609017 -3070908 -3577388 -4205569 -3374698 -1666514 -791421 -849230 -837467 -836589 -1299564
41334 -1299564 -1104804 959720 3337657 3271237 1147486 243038 1658900 2558237 627393
41325 627393 -2472573 -3896769 -3584267 -3206030 -2864828 -1523550 104726 -125045 -2378141
41316 -2378141 -4041106 -3207964 -1330546 -1154330 -2969450 -4337062 -3372952 -1034079 392094
41307 392094 236472 -182582 12822 -178868 -1806282 -3669977 -3430852 -897991 1384920
41298 1384920 1326971 -319409 -1554269 -1821926 -1890384 -2063227 -2074911 -2212455 -2928421 -3562458
41288 -3562458 -3033311 -1764973 -1266738 -1623549 -1224421 453484 1704111 1332490 727796
41279 727796 1465365 2233320 486018 -3340352 -5637963 -4030305 -137130 2736558 3223585
41270 3223585 2324371 1320385 420192 -838511 -2585659 -4101965 -4328360 -3175127 -2034599
41261 -2034599 -2272936 -3428934 -3879546 -3164414 -2416481 -2401131 -2554229 -2369239 -2282623 -2498966
41251 -2498966 -2327912 -1541324 -1011026 -990779 -247790 1730404 3128053 2249730 438554
41242 438554 395836 2326024 4053750 4559394 4862224 5275344 4407841 1765732 -826167
41233 -826167 -1620541 -1131297 -754097 -644047 -222401 403901 832830 1255594 1795449 1829283
41223 1829283 1096284 598040 1142497 1784407 1103615 -572039 -1664273 -1616322 -1174265
41214 -1174265 -702655 140195 1035264 993634 115112 -189855 565644 918530 -249636
41205 -249636 -1575806 -942776 1217967 2101047 194361 -2755985 -4159695 -3721857 -2999086
41196 -2999086 -2694230 -2086630 -1036660 -703525 -1507497 -1891387 -484443 1430521 1243989
41187 1243989 -1491386 -4397463 -5124233 -3553108 -1058120 1009819 1678084 541211
41179 541211 -1581823 -3043601 -3119991 -2708327 -2833352 -3292472 -3346370 -2933024 -2505960 -2299850
41169 -2299850 -2341085 -2606237 -2739296 -2289937 -1572876 -1427903 -1776480 -1505436 -287926
41160 -287926 711813 626388 33788 -525283 -1622613 -3281161 -3831706 -2207118 -63789
41151 -63789 459996 17278 692575 2179769 2171696 448482 -404729 935432 2406853
41142 2406853 1787062 -107175 -1050557 -618295 496 305672 797141 1491061 1715883
41133 1715883 1331690 931711 692063 12580 -1297003 -2160484 -1289825 962091 2515903
41124 2515903 1907162 312404 211330 2009954 3381876 2588682 934965 599748 1335920
41115 1335920 1219772 -148503 -1330725 -1562845 -1452059 -1248187 -504168 426562 550332
41106 550332 25604 -200930 -545846 -2212680 -4317645 -4367828 -2236710 -767190 -1373470
41097 -1373470 -2030130 -1129683 -269208 -1045987 -1912750 -944378 599126 434512 -932586
41088 -932586 -1579080 -1665031 -2392548 -2937267 -1823568 -223374 -351909 -1450789 -1072307
41079 -1072307 272659 -187052 -2241136 -2427225 340978 2962994 3178221 2564445 2858826
41070 2858826 2908391 1516623 212527 587524 1319210 406428 -1632280 -3163759 -4167505
41061 -4167505 -5195949 -5384384 -3995695 -2422810 -2156942 -2175065 -911233 568468 250474
41052 250474 -1095872 -1077164 59218 -318652 -2670800 -4208380 -3027919 -554402 1067173
41043 1067173 1606996 1684858 1207063 196828 -480584 -498301 -824682 -2014931 -3085513
41034 -3085513 -3234747 -3379135 -4585511 -5995225 -5847462 -3976380 -1853198 -449659 576252
41025 576252 1517477 1631511 46656 -2852268 -5380011 -5912582 -4357216 -2331321 -1720542
41016 -1720542 -2989336 -5022664 -6383904 -6257164 -4480467 -1711588 263619 -387428
41008 -387428 -3331323 -5761605 -5323362 -2858989 -1194234 -1519846 -2257566 -1648956 -157256
40999 -157256 473968 -316409 -1470111 -1997207 -1941064 -1492102 -277487 1660655 2902119
40990 2902119 1896890 -820127 -2750016 -2191578 -86414 1414192 1466816 835454 269240
40981 269240 -302381 -1017865 -1534861 -1580259 -1466612 -1718126 -2461836 -3319382 -3680390 -3141298
40971 -3141298 -2007835 -1283255 -1736958 -2975116 -3781702 -3360517 -1963060 -468544 251577
40962 251577 -242151 -1604991 -2820234 -3118798 -2729101 -2371344 -2287508 -2251016 -2146873 -1864945
40952 -1864945 -1019720 376212 1377686 1310105 1083467 1884020 2824727 1792277 -1070097
40943 -1070097 -2759175 -1251814 1774958 3305405 2528604 572194 -1738129 -3802841
40935 -3802841 -4111399 -1755352 1295910 1962594 237318 -847254 77196 666605 -1215485
40926 -1215485 -3955229 -4679560 -3571025 -3116907 -3945635 -4144200 -2674114 -916217 -209908
40917 -209908 -55876 225359 -9622 -1128411 -1676915 -229512 2209798 3455159 3076296
40908 3076296 2237895 1217321 -611419 -2363429 -1805722 1165755 3411081 2377263
40900 2377263 -574845 -2253103 -1683833 -305280 729573 1274147 847663 -1067297 -3332458
40891 -3332458 -3875441 -2539113 -1378222 -1567908 -1875782 -1122839 -373661 -1197693 -3034499
40882 -3034499 -4006648 -3601734 -2818353 -2029364 -561279 1356246 1934306 52770 -2916602
40873 -2916602 -4614783 -4436404 -3630166 -2980714 -1856064 40456 1422052 1156420 330055
40864 330055 855888 2313960 2172716 -431099 -3130119 -3568080 -2378853 -1445675 -905403
40855 -905403 37193 704747 -11891 -1012296 -257450 1585004 1754338 -148468 -1417137
40846 -1417137 -627173 441274 517839 1184080 3408882 4745978 2911473 -102958 -774728
40837 -774728 687722 1282651 355010 51488 875212 572661 -1762185 -3727509 -3196669
40828 -3196669 -1379159 -667464 -1297501 -1835416 -1650789 -1276325 -1121513 -1173462 -1460292
40819 -1460292 -1776168 -1353684 316188 2529264 3770442 2974487 366237 -2477591 -3498299
40810 -3498299 -1955732 495994 1415210 416188 -606411 -313052 326163 -211211 -1701926
40801 -1701926 -2758876 -2948309 -3081082 -3636885 -3946698 -3087488 -1016538 1283839 2502198
40792 2502198 1955877 211282 -1275619 -1400795 -388266 445960 -147049 -2257390 -4610760
40783 -4610760 -5523593 -4329989 -1861580 481108 1747011 1488702 -277080 -2484048
40775 -2484048 -3260069 -1942323 -349246 -716903 -2649339 -3607895 -2426760 -725904 -416939
40766 -416939 -1332944 -2158564 -2505888 -2964684 -3726984 -4117593 -3329281 -1227782 1319824
40757 1319824 2829524 2418679 744938 -740981 -1350659 -1333389 -853430 129520 1116738
40748 1116738 1430433 1301930 1376361 1264899 127678 -1349848 -1471630 -294403 252857
40739 252857 -337252 -69401 2080033 3858257 2856164 217712 -1050214 -374264 126094
40730 126094 -807438 -1935254 -1590463 165984 1839058 2169008 1418955 1193279 2398272
40721 2398272 3395656 1653632 -2350827 -4929126 -4001939 -1891190 -1489942 -1937439 -825822
40712 -825822 1142583 1164985 -943573 -2562628 -2491931 -1985213 -1542011 -132636 1818647
40703 1818647 2012613 -117240 -2321224 -3174112 -3903403 -5275633 -5655180 -4036983 -2313412
40694 -2313412 -2250036 -2470247 -917210 1548040 2580554 1935177 1132472 750947 466690
40685 466690 696672 1727224 2163380 828537 -596481 396718 3015198 4027747 2631493
40676 2631493 1401851 2008426 3011412 2882607 2437977 2770928 3056027 2200419 975472
40667 975472 747590 1399794 2096128 2866219 3783454 3745864 2005889 96511 181244 1882452
40657 1882452 2768119 1919442 968807 1216125 1691878 1056672 -150634 -555662 -241254
40648 -241254 -420621 -1192681 -1198627 168707 1450153 838286 -1414570 -3205807 -3029351
40639 -3029351 -1399104 254929 1259511 1752460 1698174 712141 -1240128 -3616143 -5707826
40630 -5707826 -6725282 -5762806 -2720065 655556 1851962 328740 -1753953 -2236625
40622 -2236625 -1446408 -1017610 -1170111 -714044 582456 1331579 587063 -731988 -1123725
40613 -1123725 -392333 307295 -209383 -2090225 -4201034 -4875913 -3591171 -1895236 -1783554
40604 -1783554 -3134582 -3939718 -3260454 -2435774 -2672910 -3008061 -1943974 58060 1242681
40595 1242681 961886 -45717 -1171135 -2217491 -2599101 -1840215 -716231 -453128 -876911
40586 -876911 -731117 285391 1251395 1699849 1976276 1909281 865243 -629850 -1120120
40577 -1120120 -529677 -447097 -1477929 -2179089 -1527977 -574223 -405272 -269977 668483
40568 668483 1291903 216372 -1567888 -1794439 -61475 1925754 2819208 2692076 2005013
40559 2005013 1093846 478527 334510 -40006 -1022317 -1552941 -682635 474212 117544
40550 117544 -1495594 -2696473 -3269516 -4233478 -4932025 -3227079 702090 3416210 2417581
40541 2417581 -755773 -3003414 -3356450 -2662636 -1341698 528774 1984320 2004925 1042480
40532 1042480 206672 -499184 -1676467 -2832217 -2785515 -1550648 -371924 91945 377840
40523 377840 976144 1593447 1814402 1630073 1180821 637354 303312 234565 -38370 -754160
40513 -754160 -1242922 -864356 -288815 -757153 -2174684 -3077552 -2611066 -1480027 -693602
40504 -693602 -410873 -481384 -1193254 -2759304 -4590918 -5724910 -5718121 -4749995 -3164606
40495 -3164606 -1303539 437165 1738127 2461960 2506983 1784520 507794 -713198 -1268692
40486 -1268692 -967686 -64334 896839 1209755 293226 -1862061 -4503099 -6442954 -6743244
40477 -6743244 -5405603 -3541048 -2511556 -2580943 -2726191 -2173577 -1659686 -2377550 -3927745
40468 -3927745 -4444672 -3044497 -1114868 -475757 -1019482 -1156377 -244420 527790 -140016
40459 -140016 -1883382 -3061529 -2491749 -460192 1623418 2228581 773800 -1696580 -3066107
40450 -3066107 -2067837 220055 1383157 387767 -1332585 -1869821 -1169244 -578652 -690529
40441 -690529 -889998 -912206 -1383862 -2348704 -2588817 -1355886 227704 651955 119191
40432 119191 -216389 -516944 -1955861 -4112469 -4609205 -2220905 1085725 2435595 1452101
40423 1452101 132604 -37299 572443 1087092 1403077 1726460 1814656 1290577 298379
40414 298379 -505426 -420838 806675 2596769 3776033 3757883 3310495 3411692 3557466
40405 3557466 2383529 74432 -1337952 -792830 114496 -481683 -1842648 -1908489 -742277
40396 -742277 -551637 -2256268 -4118822 -4371749 -3334564 -1993801 -280020 1770439 2638277
40387 2638277 1165943 -975289 -874725 1538104 2991298 1072134 -2605609 -4414380
40379 -4414380 -2919720 -43026 1480224 848347 -567311 -1071376 -381969 451914 594764
40370 594764 312972 42475 -686380 -2435018 -4352434 -4774891 -3447637 -1894101 -1173375
40361 -1173375 -554314 818487 2185844 2384585 1964768 2513911 4122174 5102857 4501857
40352 4501857 3487338 3542653 4335221 4388937 3280871 2044581 1453136 880765 -720565
40343 -720565 -3216912 -5135100 -5044918 -2955693 -403652 879300 571933 -29109 306991
40334 306991 1047745 565853 -1446319 -3229831 -3221314 -2107727 -1551317 -1643617 -1205952 -265397
40324 -265397 -261416 -1487253 -2349755 -2039080 -1925734 -2834066 -2852774 -183338 3150948 3382102
40314 3382102 442896 -1674121 -538448 1553505 1364792 -718110 -1967840 -1587042
40306 -1587042 -1261176 -1971656 -2481399 -1351615 1034418 3087648 3799976 3389923 2654253
40297 2654253 2111960 1661587 933577 -32587 -646547 -473185 96700 124858 -939668
40288 -939668 -2613219 -3555721 -2584799 67961 2585746 3179255 1914588 441526 -35789
40279 -35789 194776 360215 321202 304614 309320 300480 400586 439173 -75805 -1039571 -1399340
40268 -1399340 -346452 1517697 2723022 2377381 794036 -926078 -1702398 -1354421 -895706
40259 -895706 -1412305 -2533832 -2786593 -1633495 -151809 699446 1311824 2195334 2660350
40250 2660350 1873970 454441 -228649 77450 448442 341022 219184 682412 1673025
40241 1673025 2481340 2154901 313646 -2008618 -2959541 -1910054 -248251 514852 596351
40232 596351 980011 1476054 1083269 -200734 -1339224 -1882489 -2354253 -2920847 -2762939
40223 -2762939 -1110655 1686237 4257900 5126194 3859470 1670639 273987 -258376
40215 -258376 -1538787 -4080152 -5780243 -4561823 -1453564 710354 904279 338698 -81336
40206 -81336 -495318 -559991 360876 1233209 9298 -3054469 -5006540 -4150425 -2268882
40197 -2268882 -1605476 -1723943 -1241475 -880159 -2187938 -4083285 -3480848 326368 4118896
40188 4118896 4541277 2037039 -98279 209350 1805565 2169321 372999 -2113047 -3164755
40179 -3164755 -2178445 -533167 -94496 -1334387 -2876937 -2917283 -1141887 909915 1584923
40170 1584923 949164 396442 652175 1030896 795607 276760 189838 707053 1716476
40161 1716476 3077121 4043505 3578645 2063535 1370870 2034702 1829832 -974323 -4250586
40152 -4250586 -4438121 -1629332 604182 364431 -605217 -630000 -664426 -1720109 -2452694
40143 -2452694 -1437795 137106 424801 176834 1531664 4253614 5653468 4291482
40135 4291482 1732414 193143 30217 220487 154997 45688 81356 -6189 -465784 -1004320
40125 -1004320 -1081258 -753363 -756894 -1312120 -1367189 3995 1724764 1607015 -650336 -2773839
40115 -2773839 -2864164 -1703700 -1163558 -1524567 -1757703 -1650807 -2015482 -2925149 -3177123
40106 -3177123 -1900533 133025 1253479 621305 -1017788 -2231544 -2468422 -2480559 -2940236
40097 -2940236 -3146010 -1992698 39266 1141844 586124 -430896 -709094 -433424 -73160
40088 -73160 593346 1407583 1211009 -440360 -2117495 -2415831 -1941376 -1979345 -2269740 -1851873
40078 -1851873 -1257174 -1842913 -3349339 -4080641 -3446079 -2588514 -2486490 -3036875 -3947505
40069 -3947505 -4815217 -4369854 -1690616 1472588 1741490 -1600724 -5188808 -5636493 -3459654
40060 -3459654 -1559189 -1197856 -1356933 -1303628 -1702454 -3004614 -4286822 -4342419 -3167224
40051 -3167224 -1888661 -1579551 -2321725 -3189450 -3157014 -2197093 -1244555 -859363 -482208
40042 -482208 397319 962935 80426 -1684320 -2457353 -1663055 -725960 -510693 264307
40033 264307 2560260 4356046 2858366 -1052161 -3280174 -1966144 102845 -159404
40025 -159404 -1800950 -2042669 -944100 -872361 -2175747 -2571481 -954446 1088655 2215290
40016 2215290 3093688 4148185 4059343 2199940 548491 1144347 3028310 3708534 2647653
40007 2647653 1347842 724232 351883 -72310 -336438 -666714 -1507547 -2324857 -1947853
39998 -1947853 -194813 1840616 3021527 2834464 1293519 -695588 -1398304 -133085
39990 -133085 1193342 17842 -3390028 -5899532 -5240241 -2383145 156573 1082057 793443
39981 793443 200338 -134139 -203731 -422604 -1007533 -1504947 -1427978 -1140962 -1307302 -1670406
39971 -1670406 -1466075 -1022086 -1676625 -3747681 -5706970 -5947939 -4526689 -2630321 -1118361
39962 -1118361 -173356 304787 629043 1180564 1801003 1770427 871170 -21788 -35417 401943
39952 401943 132364 -976698 -1704383 -1213319 -392579 -682807 -1862980 -2118569 -636263
39943 -636263 1048483 1284866 852234 1543637 2738283 1767798 -1833430 -4855352 -4574319
39934 -4574319 -2436562 -1700583 -2891662 -3838803 -3283779 -2049985 -985020 -41232 489984
39925 489984 -154042 -1701685 -2779218 -2683861 -1937026 -1025751 -5924 630482 227786
39916 227786 -771829 -1296956 -1391861 -1913434 -2527759 -1899096 -103135 1106755 900759
39907 900759 339237 227175 21606 -412197 -68579 1167298 1819783 1362139 1349403 2488556
39897 2488556 2742868 506818 -2148945 -2077915 244665 1450085 192276 -1479273 -1763542
39888 -1763542 -1402738 -1492388 -1306385 153526 1896333 2008568 438532 -859743 -692065
39879 -692065 -272618 -1375790 -3587899 -4618755 -3387948 -1485874 -795205 -874624 -224698
39870 -224698 696487 -19149 -2210926 -3150561 -1510701 416863 68655 -1688342 -2290327
39861 -2290327 -1510153 -1227743 -1878325 -1866209 -678485 -62892 -1201318 -2676314 -2575131
39852 -2575131 -1289565 -748420 -1598798 -2623176 -2808376 -2677722 -3123626 -3804243 -3570907
39843 -3570907 -2258223 -1122899 -1148239 -1654051 -1350324 -257073 536016 820490 1540947
39834 1540947 2776840 2956882 1068164 -1491485 -2553323 -1942088 -1262100 -1368511 -1467930
39825 -1467930 -698767 639066 1671340 1858846 1118843 -191751 -1225492 -1242667 -438915
39816 -438915 348608 761687 1104630 1398167 1048752 -250166 -1898323 -3006370 -3195796
39807 -3195796 -2568072 -1411586 -306033 -39626 -840983 -1876235 -2074126 -1482736 -1278989
39798 -1278989 -2183445 -3352775 -3413807 -2335615 -1472106 -1705436 -2505098 -3193341 -3998628
39789 -3998628 -4932865 -4720656 -2433954 414493 1322509 273866 -244912 904975 1752923
39780 1752923 391732 -1872163 -2177680 123305 2904859 3893736 2616389 180204
39772 180204 -1807681 -2377517 -1963840 -1706356 -1779761 -1392549 -697353 -1037552 -2426545
39763 -2426545 -2682738 -665997 1336785 571680 -2187973 -4000641 -4043550 -3844510 -3934378
39754 -3934378 -3273682 -1913408 -1225979 -1101404 222870 2835509 4446865 4035595 3498554
39745 3498554 4304779 5118420 4490582 3418870 3033549 2030127 -835677 -3531486 -3279383
39736 -3279383 -1182119 -825840 -2610438 -3059531 -334365 2947554 3836252 3162189 3420583
39727 3420583 4607842 4713010 3271493 1901471 1537963 1301944 403837 -623346 -1221278
39718 -1221278 -1896376 -3097309 -4011461 -3549079 -2007257 -791083 -686614 -1194382 -1504157
39709 -1504157 -1432893 -1297224 -1369295 -1620726 -1731334 -1365842 -698894 -479616 -1155516 -2124583
39699 -2124583 -2408807 -1911067 -1329513 -964635 -522423 -143689 -490853 -1366228 -1369346 202775
39689 202775 1971184 2080630 647689 -561921 -619328 -345968 -649323 -1110855 -747666
39680 -747666 573711 2095043 3164202 3768536 4173763 4363194 3982121 2901054 1745854
39671 1745854 1473615 2190587 2798411 2256444 871357 -201074 -431948 -209586 128456
39662 128456 680104 1347485 1702805 1758872 2030172 2337055 1404562 -1367642 -4178284
39653 -4178284 -4172648 -855648 2862621 3820318 2155766 667024 986643 1851004 1484047
39644 1484047 148071 -783132 -1123356 -1659953 -2296474 -2193980 -1581979 -1624176 -2331131
39635 -2331131 -2407890 -1578916 -1198026 -1820284 -2069472 -1097983 -456031 -1934594 -4808104
39626 -4808104 -6804551 -6835958 -5346228 -2995633 -554916 838089 932732 1076865 2239144
39617 2239144 3375906 3355305 3155210 4007850 4645158 3126779 547498 -177131 1099631
39608 1099631 1608667 259884 -945139 -840085 -1163672 -3240113 -5349995 -5264965 -3333339
39599 -3333339 -1332449 -24896 563550 96983 -1235414 -2220723 -2292015 -2316766 -2676684
39590 -2676684 -2329071 -974541 -133652 -549227 -633707 651721 1553313 447631 -1088279
39581 -1088279 -893777 -41733 -789997 -2213876 -1642988 373076 593131 -1430848 -2451650
39572 -2451650 -924444 506324 -466383 -2070209 -1502642 679311 1690013 534354
39564 534354 -1306607 -2275787 -2033887 -1025984 -185939 -495696 -1728718 -2302915 -1336446
39555 -1336446 -6715 135003 -737459 -1459125 -1775248 -2136887 -2321004 -1758218 -862202
39546 -862202 -661236 -1267965 -1834182 -1815551 -1246723 -80785 1569232 2751656 2502925
39537 2502925 1360878 904762 1687102 2664044 2772389 2007791 776813 -696608 -1928859
39528 -1928859 -2134293 -1196789 -31432 431255 80339 -732521 -1666081 -2276422 -2203648
39519 -2203648 -1788691 -1805270 -2347266 -2761361 -2835272 -3010977 -3147853 -2397528 -929251 -345637
39509 -345637 -1337299 -2314197 -1851975 -1256884 -2671299 -5378531 -6362359 -4520160 -2054213
39500 -2054213 -1180015 -1499877 -1516946 -945566 -295190 397679 1010329 576246 -1419956
39491 -1419956 -3637388 -4141417 -2733981 -928326 65882 279559 176124 -5265 -69760
39482 -69760 178311 703936 1362848 2035786 2290236 1416795 -611029 -2652981 -3462537
39473 -3462537 -2848834 -1428087 78617 897958 605259 157372 1300509 3976702 5722567
39464 5722567 5014162 3639126 3752386 4132031 2258869 -839740 -1397045 1346160 3782872
39455 3782872 3287764 1584048 1142303 1285396 254793 -1264553 -1465921 -574723 92552
39446 92552 900007 2788234 4337612 3192502 210771 -1098803 191586 941682 -990104
39437 -990104 -3092155 -1936559 1423061 2732487 464745 -2469856 -3280078 -2924514 -3813257
39428 -3813257 -5791641 -6531959 -5095288 -2915682 -1333923 -312947 -60053 -1609304
39420 -1609304 -4420136 -5419281 -2640865 1460850 2836678 1248068 118226 1186847
39412 1186847 2319260 1296987 -979033 -2336761 -2133436 -842330 1135543 2783426
39404 2783426 2477917 253088 -1655660 -1943103 -1911231 -2450853 -1870423 810084 2828259
39395 2828259 1332340 -1682711 -1966817 482011 1650480 -48520 -1877908 -1890603 -1731993
39386 -1731993 -2852499 -3632961 -2433055 -562720 75087 -117905 -139934 -712694 -2375271
39377 -2375271 -3237960 -1558700 790009 451740 -2526502 -4828129 -4668718 -3682581 -3639056
39368 -3639056 -3774509 -2480674 -531 1787014 1517619 -453767 -2541163 -3268078 -2445852
39359 -2445852 -1085983 -26201 798601 1315450 609948 -1528103 -3222305 -2486157 -305223
39350 -305223 255542 -1657758 -3254841 -1905166 1249846 2948076 2068719 569687 421285
39341 421285 1135436 845552 -1024754 -2930394 -2954241 -979372 1133243 1525517 203991
39332 203991 -1336004 -2003766 -1938386 -1487389 -366238 1509960 3018679 2692107 565075
39323 565075 -1687261 -2722015 -2952053 -3503316 -4275878 -3905632 -1719950 1000761 2220858
39314 2220858 1349278 -214566 -705836 181505 1191297 1011402 -311671 -1554011 -1905412
39305 -1905412 -2045787 -3092059 -4585241 -4569340 -2275250 275899 603777 -880926 -1460826
39296 -1460826 90941 2134153 2932433 2786456 2412178 1226944 -922539 -1949225 16584
39287 16584 3155900 3719782 1258815 -619622 611839 3038047 3379593 1312368 -1048845
39278 -1048845 -2377431 -2812622 -2443055 -1215993 53553 368993 62524 140682 433237
39269 433237 -11702 -934103 -1081915 -499996 -723254 -2196425 -3202989 -2149825 454202
39260 454202 3040072 4646665 4732676 2777022 -661583 -3537840 -4321192 -3741984 -3467008
39251 -3467008 -3798766 -3863301 -3339126 -2627818 -1829321 -942097 -691406 -1691830 -2983782
39242 -2983782 -2913337 -1535304 -712270 -1528784 -2873753 -3059510 -1833865 -293112 408306
39233 408306 -153785 -1514755 -2614974 -2729193 -2185838 -1708821 -1311127 -606987 116727
39224 116727 235231 856 180564 548006 123869 -973232 -1393835 -597418 405524
39215 405524 752522 720339 573592 21262 -541968 50238 1676813 2474707 1575172 592012
39205 592012 947733 1407464 182007 -1904209 -2604708 -1703286 -934512 -950769 -731043
39196 -731043 56827 394785 -17514 -66780 718886 1134766 237859 -1004611 -1061797 -1688
39186 -1688 674131 -4203 -1370288 -1963698 -1212120 -115703 21949 -544740 -246823 1385188
39176 1385188 2726728 2374079 1293050 1269048 2160852 2417833 1651942 743559 -218021
39167 -218021 -1934180 -3801856 -3994028 -2153868 -171774 365977 -94024 -488369 -694543
39158 -694543 -926935 -966720 -759701 -644203 -490293 174309 882539 583021 -357209 -272284
39148 -272284 1069424 1733805 530304 -1182065 -1698975 -1197701 -536260 316228 1129447
39139 1129447 518899 -1878656 -3835473 -3173168 -733125 1249909 2387926 3494203
39131 3494203 4034245 3047147 1794092 2411772 4149810 4019991 1436462 -833794 -1050388
39122 -1050388 -809282 -1673905 -2328883 -1157703 519662 315202 -1414979 -2155520 -1080030
39113 -1080030 -10546 -480795 -1764563 -2328190 -1856247 -1170255 -1008088 -1437067 -1912001
39104 -1912001 -1577238 -63501 1692825 1991902 242444 -2047789 -2718617 -1317023 478817
39095 478817 876253 -73162 -890857 -695944 -98228 49244 7209 550207 1407416 1330991
39085 1330991 -71567 -1484908 -1512844 -550587 -116810 -560924 -554488 804908 2368351
39076 2368351 2249640 248112 -1978704 -2948284 -2571277 -1351709 438892 2286860 3158751
39067 3158751 2590153 1480349 1001246 1170972 1243620 977175 615192 71264 -856944
39058 -856944 -1802996 -2345358 -2791697 -3351526 -3057352 -987078 1775657 3100797 2623682
39049 2623682 1799261 1181658 -167685 -2136954 -2775896 -1107923 1250179 2462942 2656324
39040 2656324 2579919 2107141 1516377 2167273 4039846 4636248 2582360 376896 852675
39031 852675 2683400 2684225 1177057 1167366 2825459 3068704 1048212 -96321 1677083
39022 1677083 4052285 4100408 2325731 773697 -405828 -1964101 -2971419 -1966875
39014 -1966875 238533 1236842 137214 -1641565 -2316448 -1219992 1132484 3314826
39006 3314826 3864577 2815363 1717880 1467885 1204265 200750 -590194 -214862 433937
38997 433937 155829 -305490 495482 2059733 2679358 2347096 2711623 4133827 4879351
38988 4879351 3670078 1302453 -870287 -2586869 -4019423 -4605821 -3562387 -1183140
38980 -1183140 994224 1393055 -140329 -2024928 -2572087 -2075289 -2352750 -3817229 -4507743
38971 -4507743 -3205483 -1868308 -2833216 -4779997 -4316619 -1233421 912180 -11461 -1888659
38962 -1888659 -2035211 -1137961 -1531111 -3330089 -4520158 -3962376 -2379128 -858967 24702
38953 24702 -51444 -943056 -1765137 -1866204 -1704785 -1823371 -1589309 -209539 1495248 1776010
38943 1776010 264888 -1693505 -2926388 -3350589 -3041318 -1871963 -461948 -140757 -1243020
38934 -1243020 -2389428 -2199678 -1001923 -137501 -170887 -566513 -759158 -749007 -704054 -584284
38924 -584284 -311147 -40406 -148329 -917305 -2079220 -2725311 -2080976 -533165 518478
38915 518478 135303 -1137935 -2006259 -1830969 -913658 265274 1455386 2376200 2702435
38906 2702435 2481358 2104683 1687063 913456 -247207 -1118565 -1025228 -158101 666342
38897 666342 895211 520526 -191832 -659564 32967 2172988 4362502 4438705 1962679
38888 1962679 -996409 -2229049 -1896216 -1895574 -3278489 -5296244 -6712119 -6965489 -6029488
38879 -6029488 -4143341 -1970836 -309760 563994 737423 9541 -1706000 -3403011 -3588497
38870 -3588497 -2143445 -495898 361178 794363 1053372 417528 -1185897 -2118689 -1058162
38861 -1058162 891641 1683618 1186277 887791 1290758 1486469 1168319 1147627 1630960
38852 1630960 1788403 1543034 2094301 3864294 5400628 5298897 3969629 2468342 779533
38843 779533 -1417302 -3212493 -3257619 -1696580 36216 1147083 1985715 2682691 2529930
38834 2529930 1061897 -1079984 -2715328 -3055011 -2003899 -174863 1258511 1359573
38826 1359573 382222 -456621 -302049 616547 1592625 2177682 2133911 1318206 90339
38817 90339 -631465 -342717 236295 -56925 -1269246 -2177722 -1840623 -687262 306733
38808 306733 931101 1524155 1859631 1307445 149109 -403506 29285 302624 -338686
38799 -338686 -677547 774619 3140176 3987388 2733320 1420474 1574640 2000901 842414
38790 842414 -1425805 -2546363 -1425112 817329 2507962 2978617 2473010 1510627 624138
38781 624138 132331 -69882 -240447 -382032 -397723 -462260 -854083 -1543358 -2228776 -2608292
38771 -2608292 -2461540 -1847928 -1396741 -1814177 -2804581 -3211468 -2671115 -2216572 -2512983
38762 -2512983 -2520828 -1117469 802317 1457210 952347 1083897 2344449 3034007 1985637
38753 1985637 506543 481123 1699623 2373508 1660723 423361 -310812 -566294 -940071
38744 -940071 -1580820 -1957026 -1482753 -326379 489878 163749 -706699 -711171 278648 495648
38734 495648 -1322693 -3596977 -3478109 -784382 1319767 448358 -1650307 -1498277 1208259
38725 1208259 3292591 2688726 934152 191813 166437 -177389 99278 2117528 4037484
38716 4037484 3171783 780721 887727 3822037 5107850 2450025 -333443 640191 2978597
38707 2978597 2008313 -1414354 -2219417 776665 3341283 2697345 989034 577949 410268
38698 410268 -658504 -755018 1775760 4821448 5325900 3626808 1975812 513735 -1908949
38689 -1908949 -4045241 -3098237 703621 3566387 2913803 265960 -1536821 -1819237 -1504635
38680 -1504635 -780015 892309 3124479 4525891 4337972 3202950 2111759 1293785 530762
38671 530762 -13585 -63459 -111087 -914801 -1822633 -960421 1865683 3786262 2282537
38662 2282537 -868333 -1566536 881188 2922685 2267731 1078397 1950332 3573545 3129742
38653 3129742 1004765 -99197 341612 339538 -767358 -1292299 -402676 417801 -9529
38644 -9529 -725098 -498182 302970 855714 1381234 2297006 3080374 3153153 2930155 2895636
38634 2895636 2553542 1523781 921240 2116579 4325736 4940848 2720885 -417002 -1631126
38625 -1631126 -630602 171726 -906811 -2391724 -1675224 1170763 3245872 2760993 1452917
38616 1452917 1973765 4207372 5874854 6033290 5938115 6479526 6785266 6020563 4936405
38607 4936405 4554077 4431996 3455179 1705835 372651 44273 121935 -16601 -135692
38598 -135692 208458 700225 547659 -368416 -1196332 -1221895 -817955 -701472 -510768 901451
38588 901451 3474287 5208508 4276081 1380685 -865717 -762459 1008836 2625600 3056057
38579 3056057 2576451 1970215 1665676 1574261 1487920 1352679 1058444 366098 -491852 -567077
38569 -567077 556566 1523823 480255 -2276135 -4253232 -3783121 -1763671 80214 1127379
38560 1127379 1340270 579319 -407967 -50950 1531580 1852860 -304442 -2449478 -1983597
38551 -1983597 -446690 -986812 -2909257 -2657416 173692 2037930 1292826 704438 2437411
38542 2437411 4254291 3299159 839110 173166 1622742 2613051 1745997 119980 -921230
38533 -921230 -1099573 -490255 644217 1460944 1497314 1724091 3166231 4840004 4673020
38524 4673020 2342295 -290728 -1520920 -1198200 116221 1869633 3188293 3202268 2142531
38515 2142531 1144974 751003 579019 546555 1125798 1998055 1797897 70960 -1494781
38506 -1494781 -914722 1477378 3294979 2891095 1056264 -189327 187018 1571033 2788957
38497 2788957 3277274 3234412 3145562 3379315 3860878 3833881 2406441 -56294 -1489926
38488 -1489926 -136717 2954560 4594725 3105864 244509 -1270154 -1047581 -593540
38480 -593540 -478076 193146 1610156 2554524 2515642 2794675 4269237 5361746 3961773
38471 3961773 763271 -1178169 -319951 1561732 1955109 610798 -878781 -1354418 -815549
38462 -815549 351426 1613602 2145831 1577964 663845 230897 -160228 -1321567 -2581365
38453 -2581365 -2395185 -805793 386599 218964 -375033 -626504 -1185301 -2331915 -2761454
38444 -2761454 -1619468 -213794 15612 -133171 698628 1556812 469890 -1979503 -3051161
38435 -3051161 -1857882 -413833 -157932 99691 1659614 3500047 3992059 3556288 3780246
38426 3780246 4699661 4713376 3011381 688080 -726467 -858190 -334008 240118 702926
38417 702926 1121036 1666561 2696147 4447502 6289191 6674811 4688196 1696274 479244
38408 479244 2155127 4722629 5358063 3522748 1028099 -344250 -290999 550575 1560957
38399 1560957 2544460 3686887 4963452 5530454 4522914 2680036 1899983 2618195 3199547
38390 3199547 2820679 2964998 4457114 5130995 2982797 -15328 -367728 1730267 3019975
38381 3019975 2475518 2275765 3325335 3632946 2253906 1417974 2920136 5051969 5137872
38372 5137872 3214562 1408960 1135740 2325780 4072988 4886369 3652128 1320935
38364 1320935 277265 1307404 2770546 3362156 3687851 4242280 4069434 2785213 1923089
38355 1923089 2686688 3992282 4170899 3124036 1636434 250628 -67355 1833216 4976913
38346 4976913 6229801 4196606 1204464 -198613 -493293 -955483 -566102 2026077 5172315
38337 5172315 5942680 4286657 2799429 2959150 3955282 4690127 4716071 3631346 1589982
38328 1589982 60069 311590 1564628 2107751 1512910 292701 -1528550 -3699656 -4680466
38319 -4680466 -3307462 -677889 1432765 2941417 4310128 4426125 2234935 -461051
38311 -461051 -676273 1617441 3505258 3089293 1254239 -222754 -249615 1476688 3903662
38302 3903662 4727275 3123555 1556438 2560746 4776711 5037630 3431148 2786577 3599697
38293 3599697 3410109 1560740 625499 1993862 3619955 3711455 3376715 3657246 2944802
38284 2944802 -63699 -3074721 -2683956 1084358 5053737 6808467 6313301 4436233
38276 4436233 2007111 170008 -113568 796808 1633038 1848839 1987627 2457748 2879365
38267 2879365 2929443 3092087 3948643 5019742 5088871 3882006 2646480 2394193 2341399
38258 2341399 1328898 151698 549026 2071362 2460806 1628634 2334374 5526198 7991077
38249 7991077 6961113 4411555 3809717 4869391 5079468 4586578 5379229 6719931 5916966
38240 5916966 3449775 2880323 5140507 7089645 6748811 5974438 6451440 6814896 5831625
38231 5831625 5164589 6460892 8218534 8071554 6266951 4575130 3386236 2127349
38223 2127349 1264845 1690798 2849720 3218505 2232083 678616 -177428 810266 3871617
38214 3871617 7323244 8541485 6873079 4609685 4289220 5940184 7581069 7512121 5722235
38205 5722235 3981430 4576377 7713852 10393399 9571662 6221532 4074032 4455447 5120914
38196 5120914 4514812 3969242 4545536 4850174 3849535 3158245 4296906 5844006 5621169
38187 5621169 3972921 2700826 2291633 2303179 3010855 4456492 5110847 3704490 1449712
38178 1449712 464663 913572 1585484 2280249 3521983 4700731 4682886 3865469 3668566
38169 3668566 4210575 4242622 3315057 2468698 2673909 3719528 4702486 4866770 4153438
38160 4153438 3441320 3727722 4652318 4737789 3627538 2859079 3562074 4690097 4721869
38151 4721869 3973084 3864494 4776356 5906327 6516815 6237850 4950758 3405338 3069594
38142 3069594 4350040 5859274 6320672 6067984 5796316 5340837 4897787 5774242 8234523
38133 8234523 10134463 9727643 8533453 9125920 11090843 11732858 10227242 8412946 7538416
38124 7538416 6868652 6048185 6433343 8867994 11778588 12841955 11671070 9806901 8628646
38115 8628646 8169690 7715900 6805782 5548656 4373252 3697447 3723666 4291156 4862265
38106 4862265 4947920 4713069 4767939 5134106 5101074 4615062 4856634 6392766 7687732 7031247
38096 7031247 5297617 4873848 6151502 7184422 6881335 6382794 6868889 8011745 9142427
38087 9142427 10066567 10188872 8727641 6383490 4959600 4872928 5001210 5265202 6885183
38078 6885183 9501658 10824842 10214714 9862192 11039164 11927093 10913040 9392801 9187026
38069 9187026 9572519 9247284 9107279 10425702 11938545 11459579 9335635 7946390 8516798
38060 8516798 10238690 11706244 11758822 10024119 7959698 7952214 10058873 11350015 9967741
38051 9967741 7883856 7818504 9428726 10725338 11383792 12136503 12435766 11435813 10292081
38042 10292081 10969314 13316930 15279513 15495753 14308803 13033377 13228794 15377873
38034 15377873 17485955 16981040 14860542 15103124 18471091 20357140 17439408 13165679
38026 13165679 12931917 16359071 18542744 17287833 14845000 13367266 12700960 12502468
38018 12502468 13047370 13693497 13233723 11922450 11117965 11267775 12092750 13937587 16885316
38009 16885316 19408605 19982882 19230588 18664494 18407556 17920943 17608995 17825323 17763134
38000 17763134 17160032 17399189 19063819 20362623 19956489 19191798 19479018 19902627 19698829
37991 19698829 20414114 22989319 25401611 25978340 26282662 27837690 28992975 28224188 27456644
37982 27456644 28629879 29993843 29444172 28523956 29439892 31169338 32139110 33431139 35706797
37973 35706797 36714088 35660119 35899245 39297596 42612013 43634190 45378353 49392134
37965 49392134 51399213 49522253 49801671 56299584 62946980 63664793 63200259 68220762
37957 68220762 75161997 77999620 80562186 88632792 97355259 100365434 103479927 113530360
37949 113530360 122364611 120914746 120053637 134290877 153940294 162915375 175367206 212415042
37941 212415042 240106708 182528857 22851798 -149799866 -231861680 -216555320 -176487301
37934 -176487301 -160105768 -153925019 -137289175 -121022883 -119294458 -122283378 -116493827
37927 -116493827 -107054970 -102857399 -98959333 -89210186 -80643493 -80744936 -82851715 -77485389
37919 -77485389 -68043658 -63134258 -61909215 -58435710 -53633938 -52103147 -52388660 -50080434
37911 -50080434 -46599522 -46512258 -49232957 -50497350 -49376995 -47813478 -45761595 -42099981
37903 -42099981 -38109952 -35664421 -34130614 -32407832 -31344356 -31263863 -30282428 -27832918
37895 -27832918 -26427162 -27302745 -28007626 -26857746 -25811185 -26264713 -26221161 -24569269 -23912512
37886 -23912512 -25869719 -27594116 -26362025 -23867698 -22669976 -22084960 -20880160 -20307500
37878 -20307500 -21060154 -20865657 -18575734 -17069746 -18532939 -20371317 -19536966 -17522592
37870 -17522592 -17198254 -17912494 -17724706 -17448953 -18333445 -18547006 -16289096 -13923740 -14645269
37861 -14645269 -17099660 -17591174 -15847057 -14407552 -13861676 -12931687 -12189001 -13592980 -16831231
37852 -16831231 -19516463 -20566926 -20581732 -19687217 -17797552 -16167575 -16030223 -16506743 -16184318
37843 -16184318 -15605535 -15857728 -16130556 -15280016 -14408611 -15107749 -16408019 -16345332 -15463164
37834 -15463164 -15867104 -17650450 -18990885 -19061468 -18325252 -16758428 -14305451 -12340608 -12195965
37825 -12195965 -12869168 -12460504 -11184136 -10783482 -11714168 -12981848 -13950740 -14381161 -13726193
37816 -13726193 -12336169 -12073355 -13646837 -14812969 -13551770 -11455565 -11299200 -12743124
37808 -12743124 -13390936 -12780282 -12187965 -11651030 -10530260 -10072850 -11856647 -14297669 -14313913
37799 -14313913 -12160408 -11026247 -11936815 -12767950 -12556568 -12927324 -14336515 -14509673 -12143897
37790 -12143897 -9259565 -8233764 -8795712 -9396494 -9530300 -9375216 -8898835 -8468755 -8807727
37781 -8807727 -9545119 -9437749 -8584461 -8482284 -9274162 -9217525 -7877904 -7442871 -9268244
37772 -9268244 -11242493 -10670265 -8249218 -6945398 -7854661 -9368881 -10035549 -10166204 -10395466
37763 -10395466 -10310343 -9245470 -7556942 -6385884 -6419716 -7274196 -8042086 -8225668 -8021937
37754 -8021937 -7817362 -7718999 -7639568 -7427648 -6759089 -5491396 -4447342 -5051388 -7504485
37745 -7504485 -10068472 -11062337 -10807454 -10403819 -9393255 -6554554 -2915006 -1796591 -4851126
37736 -4851126 -9427756 -11233990 -9113344 -6111316 -5827484 -8461838 -10850360 -10178370
37728 -10178370 -7073350 -4557538 -4346897 -5315964 -5821879 -6069409 -7059691 -8350121 -8621485
37719 -8621485 -8060271 -8338520 -9970742 -11242291 -10455775 -8181713 -6474573 -6460339 -7410000
37710 -7410000 -7928944 -7483437 -6648858 -6096049 -5729084 -5175425 -4797177 -5286399 -6183204
37701 -6183204 -6047691 -4698357 -3955418 -5063559 -6598239 -6482810 -5116440 -4589892 -5416961
37692 -5416961 -6222202 -6477623 -7187617 -8508608 -9026021 -8258745 -7721722 -8231955 -8165148
37683 -8165148 -6176819 -4005155 -4275638 -6528363 -7931985 -7535577 -7140880 -7660993 -7401917
37674 -7401917 -5314661 -3623740 -4919729 -7929649 -8788505 -6251221 -3202741 -2534137
37666 -2534137 -3683555 -4330243 -3788722 -3226821 -3623845 -4998823 -6924352 -8459013 -8261078
37657 -8261078 -6214192 -4380988 -4792687 -6676979 -7486316 -6424193 -5229416 -5472424 -6777384
37648 -6777384 -7909813 -8058397 -6890874 -4956682 -4140369 -5867680 -8603886 -9158074 -6942096
37639 -6942096 -4762668 -4677881 -5462705 -5359995 -4870310 -4984148 -4845523 -3565935 -2738832
37630 -2738832 -4463947 -7750078 -9443406 -8444270 -6825033 -6742745 -8033658 -9083397 -8768905
37621 -8768905 -7313983 -5956501 -5627056 -5647911 -4616083 -2927112 -2746908 -4520784 -5630559
37612 -5630559 -4359371 -3084687 -4773519 -7931229 -8509912 -6057508 -4199185 -4883675
37604 -4883675 -5913231 -5258974 -4451654 -5736875 -8302934 -9532949 -8500032 -6376110
37596 -6376110 -4515032 -3742034 -4559569 -6440803 -7550502 -6605653 -4645671 -3794734 -4587155
37587 -4587155 -5573006 -5350023 -4002099 -2576029 -1960065 -2361512 -3270525 -3812630 -3591758
37578 -3591758 -3304273 -4116083 -6190192 -8106409 -8169310 -6355491 -4564532 -4595786 -6148922
37569 -6148922 -7331083 -6925592 -5430953 -3960719 -3126679 -3227537 -4431257 -6153852 -7130118
37560 -7130118 -6785669 -5875895 -5327684 -5325603 -5928157 -7311399 -8703825 -8556412 -6881083
37551 -6881083 -5933594 -7095469 -8556016 -8060399 -6659165 -7140865 -9406344 -10308587 -8335443
37542 -8335443 -5795038 -5382813 -6628172 -7083362 -5729947 -3879669 -3292164 -4316215 -5693884
37533 -5693884 -5818724 -4322052 -2395248 -1399233 -1587261 -2500276 -3799985 -5014336 -5373236
37524 -5373236 -4888387 -4695511 -5219976 -5122519 -3568396 -2346478 -3600289 -6217851 -6905434
37515 -6905434 -4660087 -1868375 -826397 -1302393 -1923009 -2107368 -2138540 -2754436 -4817834
37506 -4817834 -8034232 -10269572 -9833452 -8080104 -7740357 -8996066 -9527151 -8316806 -6858732
37497 -6858732 -6401546 -6514673 -6711763 -7028197 -6719923 -4991814 -3205308 -3407461 -4445614
37488 -4445614 -3086591 377744 1750128 -447018 -2359223 -1239175 -174423 -2758889
37480 -2758889 -6694034 -7279618 -4785289 -3430682 -4423453 -4924769 -3573045 -2424540 -2841202
37471 -2841202 -3372329 -2781366 -1985955 -1830573 -1655238 -1291867 -2067276 -4420425 -6478355
37462 -6478355 -6440313 -4886967 -3448038 -2481173 -1428280 -535447 -768549 -2243832 -3752260
37453 -3752260 -4078059 -3462771 -3469168 -5115087 -7246182 -7492729 -5088819 -1824392 249420
37444 249420 873521 619004 -569203 -2418500 -3300756 -2159406 -578292 -830220 -2477735
37435 -2477735 -3105076 -2039312 -1025571 -1281601 -2219102 -3321986 -5006231 -7031265 -8078401
37426 -8078401 -7662128 -6815127 -6310144 -5789816 -5087246 -4720071 -4622869 -4083374 -3299729 -3163424
37416 -3163424 -3217531 -2048395 -191654 -84337 -2167043 -3668832 -2663232 -743097 61471
37407 61471 344631 1015294 539024 -2410854 -5506431 -5458967 -2930372 -1300258 -1434243
37398 -1434243 -1376691 -832983 -1915857 -4875256 -6831400 -6014997 -4119807 -3048731 -2308708
37389 -2308708 -1321676 -1408901 -3201024 -4530992 -3568728 -2156456 -3164421 -5898989 -7143809
37380 -7143809 -5996879 -4687389 -4747642 -5151714 -4641007 -3562281 -2734244 -2343544 -2599275
37371 -2599275 -3858438 -5446774 -5763121 -4200136 -1825715 191485 1572007 2109410
37363 2109410 1444550 194504 -253866 187923 -37991 -1558820 -2766213 -2344925 -1603938
37354 -1603938 -2538125 -4591134 -5356408 -4129378 -2837616 -3201305 -4506488 -4816816 -3392875
37345 -3392875 -1217112 308551 522875 -415314 -1949982 -3307161 -3567341 -2282344 -306842
37336 -306842 679017 116445 -655610 -518383 -612026 -2583971 -5344395 -5903735 -3674785
37327 -3674785 -1469647 -1337851 -1868401 -1147108 -136163 -933528 -3313620 -5356206 -6373287
37318 -6373287 -6916499 -6788720 -5408726 -3561709 -2534591 -1960288 -732420 323281 -930159
37309 -930159 -4621264 -8258450 -9564155 -8210146 -5040596 -1599529 -99346 -1442718
37301 -1442718 -3237872 -2183097 1381992 3731217 2829870 544874 -799776 -1340604
37293 -1340604 -2018208 -2456844 -2052455 -1405238 -1308623 -1662812 -2232172 -3026021 -3419476 -2660965
37283 -2660965 -1623648 -1903965 -2822726 -2007477 376540 1125899 -1005134 -3102391 -2765257
37274 -2765257 -1708288 -2193800 -2981329 -2015842 -526605 -840215 -2176597 -2404775 -2329469
37265 -2329469 -4223776 -7223081 -8238366 -6815272 -5166327 -3862286 -1631691 677923
37257 677923 393605 -2083428 -2988883 -1103101 88585 -2002403 -4988463 -5436518 -3762288
37248 -3762288 -2427737 -1737350 -435414 1218740 1862874 1473641 986179 335485 -1005366
37239 -1005366 -2369425 -2807684 -2895764 -3681092 -4584644 -4361908 -3444969 -3147048 -3072467 -1709714
37229 -1709714 585122 1712474 1225898 1157927 2670445 4092393 3516286 1538564 -51900
37220 -51900 -891970 -1734407 -2569570 -2781661 -2589350 -2716189 -2941394 -2491845 -1722463 -1877408
37210 -1877408 -3086131 -4068562 -4103469 -3814332 -3540762 -2540484 -748082 154582 -1141052
37201 -1141052 -3404296 -4402448 -3917449 -3554533 -3956677 -4047799 -3084650 -1690190 -454730
37192 -454730 867372 2100903 2048280 132185 -2367562 -3671177 -3436060 -2683456 -2452905
37183 -2452905 -3051776 -3973128 -4200989 -3360828 -2677241 -3608882 -5406515 -5739449 -4238698
37174 -4238698 -3279740 -4119093 -4629772 -2929104 -1087983 -2194538 -5106138 -5755300 -3353291
37165 -3353291 -1535159 -2632550 -4410147 -4234945 -3376712 -4386855 -6253298 -5552407 -1843001
37156 -1843001 1252302 958328 -1119541 -1702452 -383954 415418 -634137 -1948141 -1636662
37147 -1636662 -412660 -580919 -2732003 -4886203 -5061020 -3509804 -1939603 -1469164 -2031484
37138 -2031484 -3011921 -3623321 -3150939 -1676287 -323458 -178408 -1184278 -2450718 -3150681
37129 -3150681 -2762816 -1247653 386238 569589 -947044 -2594111 -3293617 -4118984 -6200591
37120 -6200591 -8067364 -7213145 -3918037 -1285558 -1264914 -2607525 -3250590 -2878533 -2306712
37111 -2306712 -1911043 -1759979 -2179400 -3127737 -3788247 -3656843 -3401589 -3867430 -4711711
37102 -4711711 -4722757 -3290594 -1224349 -230519 -1418871 -3897871 -5265764 -4318667 -2777592
37093 -2777592 -3075553 -4893635 -5721266 -4776434 -4051197 -4752324 -5076498 -3161638 -442228
37084 -442228 121556 -1778641 -3518710 -3126332 -1314843 98463 232019 -719856 -2126224
37075 -2126224 -3166912 -3251293 -2658521 -2265747 -2378107 -2289596 -1290716 202246 865890
37066 865890 -129496 -2033529 -3119048 -2666511 -2006676 -2825384 -4589251 -4916093 -2968229
37057 -2968229 -1134823 -2126506 -5241153 -7067666 -5700262 -2791371 -1171640 -1698212
37049 -1698212 -3084257 -3899928 -3799052 -3148955 -2359152 -1731111 -1456614 -1464425 -1453810 -1292484
37039 -1292484 -1257922 -1638677 -2199750 -2459923 -2533499 -3073543 -4034063 -4234454 -2993215 -1603099
37029 -1603099 -1869013 -3345919 -3625769 -1770595 177776 97362 -1259749 -1730533 -1088561
37020 -1088561 -960883 -1829576 -2230718 -1218241 245797 1016997 1232780 1181525 345912
37011 345912 -1126805 -1511023 97016 1602945 449992 -2294712 -3138291 -1549433 -1049854
37002 -1049854 -3707666 -6502458 -5602963 -2105406 -357183 -1731901 -3519203 -3768802
36994 -3768802 -3678100 -4360201 -4490317 -2874358 -862793 -169502 -148618 687213 1936503
36985 1936503 2231433 1717074 1466219 1329927 501319 -506358 -588520 -158773 -334310
36976 -334310 -530899 699790 2672618 3031544 1405802 -12926 -111018 -426309 -1991746
36967 -1991746 -3095140 -1937590 315569 1104765 -78683 -1610655 -2270086 -2153840 -1528513
36958 -1528513 -349803 1069338 2014662 2155052 1822327 1594318 1915385 2790861 3590890
36949 3590890 3648790 3253106 3327280 3874650 3703952 2211574 447674 -349071 -413126 -754699
36939 -754699 -1508102 -1952308 -1690060 -879383 368621 1971489 3469732 4359613 4696845
36930 4696845 4845267 4838751 4448651 3605780 2308429 406564 -2086526 -4735318 -7074333
36921 -7074333 -8919696 -10003792 -9821838 -8355582 -6571656 -5636169 -5780115 -6280049 -6369839
36912 -6369839 -5920248 -5438311 -5582343 -6451448 -7275664 -7108312 -5872461 -4445745 -3814522
36903 -3814522 -4464296 -6239386 -8163609 -8781918 -7617620 -6074474 -5878249 -6817806 -7190825
36894 -7190825 -6298135 -5056918 -4148591 -3228690 -2300758 -2160517 -2824017 -3098738 -2521909
36885 -2521909 -2230362 -3000268 -3893168 -3895132 -3469555 -3281518 -2782175 -1522955 -667260 -1507504
36875 -1507504 -3287389 -4117026 -3552705 -2901167 -3358669 -4908492 -6506619 -6479590 -3711162
36866 -3711162 409555 2374856 492547 -2561263 -3014033 -994796 34138 -1529397
36858 -1529397 -3428634 -3260253 -1840322 -1578043 -3045072 -4663214 -5019317 -4158245 -2846087
36849 -2846087 -1666317 -1052411 -1457127 -2870213 -4300384 -4362243 -2734602 -641427 562254
36840 562254 774914 428883 -809015 -3104709 -4717885 -3453422 -232773 1144558 -1088075
36831 -1088075 -4179171 -4855271 -3698039 -3340664 -4103961 -4313845 -3918798 -4591951 -6333474
36822 -6333474 -6943632 -5457473 -3590718 -2852808 -2402800 -1041791 454361 665081 112610
36813 112610 734370 2952595 4681146 3768700 746607 -1634301 -1636753 -548689 -818238
36804 -818238 -2781329 -4514247 -4778549 -4444058 -4581283 -4908750 -4992707 -5232480 -5460082
36795 -5460082 -4326489 -1626853 469597 324945 -734550 -950890 -1173636 -2631543 -3574450
36786 -3574450 -1888265 162363 -1668034 -6507803 -8382849 -4573065 325981 907899
36778 907899 -2050550 -3984881 -3200388 -1745291 -1198363 -961919 -411853 -87343 -393522
36769 -393522 -811780 -799838 -535571 -629755 -1561284 -3123415 -4184420 -3738015 -2523013
36760 -2523013 -2504260 -4090441 -5063976 -3350523 55761 2126875 1186698 -1780959 -4709384
36751 -4709384 -6219160 -5985622 -4360192 -2031048 122828 1061911 -1366 -2611532
36743 -2611532 -4846157 -5031885 -3563582 -2087017 -1199437 -302854 507786 244644 -1013861
36734 -1013861 -1783765 -1389323 -848476 -911037 -978449 -811608 -1441855 -3125795 -4039262 -2524588
36724 -2524588 567485 3070409 3848514 2826600 184614 -2962738 -4469173 -3529215
36716 -3529215 -2115435 -2390108 -3736934 -4101278 -3179206 -2252232 -1777708 -1382033 -1564240
36707 -1564240 -2953530 -4180006 -3060608 -112619 1574708 629641 -667529 191599
36699 191599 2444964 3452190 2376307 911511 784480 1758811 2237469 1263264 -330877
36690 -330877 -835725 241855 1434123 1113471 -434010 -1496529 -1106538 254923 1855847
36681 1855847 3405159 4460870 4300037 2796103 688706 -1239754 -2587509 -2951106
36673 -2951106 -2084954 -665127 8465 -582483 -1771622 -2858609 -3788745 -4485367 -4549779
36664 -4549779 -4086859 -3858041 -4036697 -3776811 -2761818 -2207814 -3256047 -5123515 -6148787
36655 -6148787 -6196006 -6533789 -7466815 -7775791 -6943383 -6312184 -7017914 -8091990 -8054542 -7409892
36645 -7409892 -7694859 -8558747 -8080705 -6247630 -5661634 -7588524 -9489595 -8493846 -5687192
36636 -5687192 -4349878 -4893256 -4625803 -2546965 -1195730 -2640487 -5269340 -6305118
36628 -6305118 -5568667 -4766197 -4417374 -3633105 -2282197 -1479995 -2011014 -3453620 -4664504
36619 -4664504 -4438853 -2486395 -576755 -1458202 -5270690 -8337678 -7451035 -4283540 -3146186
36610 -3146186 -5056238 -6906713 -6550406 -5614074 -6224680 -7611646 -7735850 -6446825 -5123136
36601 -5123136 -4409911 -4105780 -4410703 -5515519 -6445201 -5935138 -4304448 -3154467 -3300744
36592 -3300744 -4110851 -4728648 -4822489 -4244662 -3159212 -2533007 -3262642 -4613886 -4770521
36583 -4770521 -3327964 -1990405 -2124808 -2836562 -2536229 -1463068 -1252286 -2464203 -3987016
36574 -3987016 -4827232 -5121910 -5133786 -4552294 -3424126 -2749666 -3267581 -4227466 -4187316 -2779248
36564 -2779248 -1150824 -830338 -2358713 -4648982 -5633680 -4267107 -2014693 -1355761 -2585335
36555 -2585335 -3527165 -3000775 -2702144 -4237431 -6116432 -5940854 -4259423 -3511225 -3915303
36546 -3915303 -3494574 -2002482 -1496587 -2480021 -2812667 -1643798 -1194306 -2811459 -4268446
36537 -4268446 -3430149 -1959335 -2387357 -3684089 -3274278 -1935536 -2694574 -5397091 -6439738
36528 -6439738 -4407070 -2330280 -3077168 -5498884 -6814370 -6392741 -5266808 -3811683
36520 -3811683 -2052974 -1041047 -1791994 -3411352 -3991706 -3107253 -2022163 -1641375 -1625361
36511 -1625361 -1580166 -1846585 -2679286 -3551000 -3854455 -3738077 -3647914 -3398465 -2457976 -1177053
36501 -1177053 -905231 -2321219 -4202991 -4763263 -3997624 -3612384 -4519236 -5695277 -6085949
36492 -6085949 -6292763 -7255254 -8353415 -8348570 -7527251 -7181601 -7225568 -6167782 -3710133
36483 -3710133 -1665578 -1550757 -2561663 -2878798 -2075290 -1211066 -1051248 -1224876 -1184648
36474 -1184648 -1296105 -2495329 -4842613 -6787209 -6493456 -4044455 -1602885 -910994 -1409372
36465 -1409372 -1596410 -1380357 -1792256 -2933090 -3798839 -4023088 -4212330 -4407459 -3807377
36456 -3807377 -2470629 -1776961 -2431367 -3265940 -2934142 -1796820 -1191836 -1637417 -2688936
36447 -2688936 -3924697 -5123277 -5868871 -5787271 -4954424 -3626577 -2020369 -760353 -799851
36438 -799851 -2158470 -3364358 -3072092 -1826483 -1275635 -1925792 -2745952 -2955764 -3031612
36429 -3031612 -3518304 -3852461 -3273151 -2396308 -2742510 -4533277 -5956659 -5346137 -3469050
36420 -3469050 -2595934 -3495519 -4620481 -4556097 -3900902 -3822757 -3944201 -3132139 -1714339
36411 -1714339 -1208131 -1959698 -2678464 -2560252 -2338837 -2668171 -2884939 -2340057 -1882262
36402 -1882262 -2783940 -4710305 -5901159 -5311637 -3779174 -2968532 -3637240 -5025945 -5678180
36393 -5678180 -4829286 -3162699 -2212418 -2932759 -4817431 -6371370 -6461793 -5374837 -4534746
36384 -4534746 -4880614 -5592625 -5071521 -3268790 -2042114 -2670363 -4107165 -4656768 -4336796
36375 -4336796 -4198048 -4172496 -3417298 -2377348 -2528921 -4010955 -5340110 -5730645 -5901156
36366 -5901156 -6146781 -5457508 -3382612 -1231903 -474809 -1122286 -2369448 -3580715 -4063452
36357 -4063452 -3358498 -2463438 -3118731 -4980046 -5338949 -2963246 -376108 -516720 -2710259
36348 -2710259 -4113226 -3932692 -3741355 -4313503 -4735285 -4559434 -4473168 -4530087 -3789087 -2198805
36338 -2198805 -1013114 -761081 -511052 170977 222372 -994853 -2281856 -2362239 -1894047
36329 -1894047 -2338285 -3626995 -4402973 -4125304 -3506490 -2998499 -2282367 -1539129 -1879917
36320 -1879917 -3665218 -5262613 -4646673 -2047565 51377 -173690 -1808905 -2600929 -1821006
36311 -1821006 -862265 -1183321 -2619338 -3990689 -4616503 -4692143 -4618361 -4536557 -4396596 -4129739
36301 -4129739 -3829114 -3866476 -4510591 -5246583 -4962150 -3291394 -1430410 -967605 -1986245
36292 -1986245 -2988805 -2875009 -2382067 -3031890 -4942972 -6446225 -6113354 -4529864 -3395975
36283 -3395975 -3229632 -2938360 -1731371 -356678 85254 -420455 -1340149 -2664925 -4364069
36274 -4364069 -5489570 -5139423 -3872258 -2883528 -2245814 -1424749 -993383 -1840768 -2868541
36265 -2868541 -1877897 799039 2032396 342660 -1731196 -1417447 145820 -146212 -2607550
36256 -2607550 -4497940 -3990567 -2069972 -490528 129358 -117011 -1026919 -1946354 -2146369
36247 -2146369 -1998605 -2623209 -3969233 -4445216 -3083678 -1041983 -141611 -670408 -1525814
36238 -1525814 -2045223 -2671825 -3805637 -4854722 -4878393 -3786655 -2402120 -1453022 -1068139
36229 -1068139 -1363972 -2751394 -4986514 -6497458 -5810486 -3630215 -2363234 -3247343 -4974339
36220 -4974339 -5649462 -5085705 -4359475 -3972829 -3589905 -3183180 -3307647 -4158057 -5091630
36211 -5091630 -5294023 -4592545 -3592476 -3204427 -3892607 -5148738 -5785722 -4884697 -2471109
36202 -2471109 517467 2689735 2983647 1530987 -473152 -2174386 -3788693 -5335285
36194 -5335285 -5640506 -3967153 -1817868 -1227682 -1743512 -1318235 10775 18793 -1777674
36185 -1777674 -2988026 -2194537 -1160797 -1645672 -2612345 -2607654 -2529475 -3554196 -4315009
36176 -4315009 -3008911 -929447 -977040 -3414005 -5678409 -5866957 -4148900 -1407459 1202667
36167 1202667 1979633 353573 -1613777 -1657145 -653252 -1133365 -3068470 -3967794 -3026350
36158 -3026350 -2257938 -3072892 -4287182 -4242849 -2874742 -1114458 35456 -365702 -2231749
36149 -2231749 -3665973 -3032630 -1533541 -1514445 -2633505 -2535286 -1202045 -1262131 -3346556
36140 -3346556 -4570323 -3052625 -952273 -1145610 -3294909 -5130941 -5648396 -5187979 -4046113
36131 -4046113 -2715976 -2056929 -1846635 -744342 1086776 1291869 -1154139 -3724108 -3653891
36122 -3653891 -1801311 -972336 -1756232 -2433243 -2150483 -1797299 -2030876 -2435208 -2634017
36113 -2634017 -2754464 -2828185 -2813919 -2922793 -3002537 -2190904 -244039 1402424 1072487 -1050425
36103 -1050425 -3198187 -3934108 -3049580 -1247831 228268 359038 -468938 -780663 -101653
36094 -101653 385125 -31330 -323022 219032 236961 -1598935 -3949871 -4346753 -2670339
36085 -2670339 -1037356 -571231 -318719 564371 1390055 1158657 -130424 -1876351 -3644949
36076 -3644949 -5150274 -6122119 -6472989 -6296006 -5780750 -5335541 -5344571 -5485853 -4949241 -3780171
36066 -3780171 -3174112 -3755670 -4412889 -3742258 -1967903 -491728 -69912 -267017 -248702
36057 -248702 535374 1895238 2623465 1478524 -1008258 -2676858 -2332013 -1145202 -799712
36048 -799712 -1465743 -2445021 -3477066 -4325274 -4316122 -3411262 -2544798 -1958356 -761286 765084
36038 765084 426194 -2606353 -5697888 -6116192 -4810308 -4381797 -4856091 -4379781 -2956484
36029 -2956484 -2260459 -2312543 -1578052 -297332 -604488 -2900572 -4819277 -4486189 -2630812
36020 -2630812 -936042 -208608 -494226 -1209597 -1125313 11606 313220 -1525283 -3060683
36011 -3060683 -867757 3681024 5164413 1462834 -3275904 -4540301 -2993035 -2040896
36003 -2040896 -2802580 -4104803 -5314737 -6457778 -6935044 -6459112 -6115555 -6511181 -6153806
35994 -6153806 -3788276 -1160671 -1105625 -3607577 -5972853 -6441931 -5560295 -4303495 -2963819
35985 -2963819 -1976337 -1990716 -2758874 -3349821 -3686840 -4521707 -5628376 -5461233 -3323749
35976 -3323749 -852861 -419992 -2481813 -5225433 -6663896 -6438143 -5410009 -4102168
35968 -4102168 -2323691 -313678 765021 207452 -1009180 -1336263 -564866 364415 977301
35959 977301 1398660 1255443 82640 -1230071 -1146057 142008 789738 96542 -656534
35950 -656534 -713752 -1141918 -2672390 -4231308 -4880611 -5362545 -6234625 -6276777 -4557030
35941 -4557030 -2476465 -1734947 -1683699 -941841 -361288 -1709040 -4185392 -5140677 -4116599
35932 -4116599 -3424428 -4410518 -5768506 -6283836 -6779562 -8033203 -8750087 -7326495 -4429979
35923 -4429979 -2231966 -1742352 -2184542 -2518182 -2388054 -1810962 -1008529 -607491 -1188707
35914 -1188707 -2436513 -3312436 -3332627 -3230269 -3937780 -5158933 -5582409 -4678708 -3613774
35905 -3613774 -3739997 -4713680 -5222502 -5340932 -6495520 -8583617 -9014795 -6190948 -2570616
35896 -2570616 -1988844 -4431554 -5963880 -4159731 -1137400 -77183 -925641 -1526067 -1464109
35887 -1464109 -2158216 -3628908 -3951144 -2485317 -1220083 -1594383 -2023614 -572808 1426697
35878 1426697 1088346 -1359869 -2638414 -1508329 -766773 -2760897 -5573419 -5959853 -4130850
35869 -4130850 -2824722 -2831607 -2488854 -1174681 -243517 -256786 -115189 384465 -258241 -2474863
35859 -2474863 -4378098 -4523401 -3855639 -3601519 -3240389 -2111564 -1180919 -1458491 -2259132
35850 -2259132 -2765358 -3673073 -5318278 -5835343 -3699477 -911734 -870089 -3646497 -6059864
35841 -6059864 -6216060 -5297846 -4656882 -3813720 -2237018 -902296 -727920 -918996 -228898
35832 -228898 991450 1223181 -56863 -1545504 -1616646 -308801 597707 -220744 -1783984
35823 -1783984 -2145806 -1406034 -1691915 -3603830 -4727519 -3147447 -612095 -92968 -1608969
35814 -1608969 -2954170 -3500041 -4380002 -5391069 -4795370 -2440593 -324556 452040 777602
35805 777602 1034734 127199 -2090020 -3858011 -4166565 -4184138 -4832279 -5045279 -3810233
35796 -3810233 -1976107 -622685 443775 1125441 92469 -2729627 -4762210 -4145164
35788 -4145164 -2761798 -3331993 -5013627 -4939649 -3118235 -2340597 -3367427 -3721144 -2063589
35779 -2063589 -609705 -1546460 -3519494 -3887759 -2895309 -3139045 -5442493 -7532776 -7175301
35770 -7175301 -4949315 -3060952 -2466561 -2319206 -1837953 -1430086 -1611839 -1846150 -1367722
35761 -1367722 -638095 -847310 -2032749 -2839242 -2434567 -1595277 -1353689 -1538328 -1413286
35752 -1413286 -953920 -593232 -332073 -27909 -43098 -659482 -1332617 -1541811 -1888514 -3101159
35742 -3101159 -4290010 -3728694 -1480359 281714 90139 -1029149 -1390412 -1099868 -1514464
35733 -1514464 -3013428 -4625474 -5562152 -5861620 -5541275 -4389212 -2928859 -2388654 -2998680
35724 -2998680 -3310842 -2214441 -826524 -1023365 -2568023 -3396116 -2793745 -2372819 -3172858
35715 -3172858 -3705257 -2396325 -505469 -526872 -2453087 -3847061 -3424024 -2373666 -1936352
35706 -1936352 -1873269 -1977454 -2948559 -4601485 -5053037 -3228400 -797214 -52620 -1020955
35697 -1020955 -2259888 -3340545 -4517808 -4776726 -2664212 922555 3002418 2146389
35689 2146389 120384 -799988 -591428 -559280 -929763 -784888 98059 615224 -283622
35680 -283622 -2220305 -3657991 -3411228 -1825949 -381268 -37847 -267925 -81750 362176
35671 362176 -22352 -1459019 -2683969 -2518512 -1360654 -517655 -511278 -729851 -590981
35662 -590981 -355110 -562926 -1073994 -1098527 -213720 966513 1420147 886141 -11923 -839874
35652 -839874 -1962159 -3696781 -5369678 -5907604 -5211635 -4276047 -3910274 -3910140 -3612937 -2769446
35642 -2769446 -1651703 -669143 -116525 -92699 -525532 -1361938 -2603335 -3893484 -4342661
35633 -4342661 -3427387 -2102717 -2212112 -4263705 -6305268 -5789377 -2521687 924597 2019152
35624 2019152 1003245 244926 1092286 2274010 1901651 300396 -315923 1054764 2696044
35615 2696044 2403599 273786 -1731103 -2414224 -2339008 -2375429 -2519487 -2473601 -2393846 -2494928
35605 -2494928 -2588798 -2577294 -2886449 -3825941 -4862363 -5079040 -4176889 -2650746 -1238604
35596 -1238604 -564423 -958116 -2057230 -2807925 -2483397 -1620326 -1368828 -2005522 -2788034
35587 -2788034 -3274983 -3879217 -4776103 -5179080 -4439674 -3231333 -2749362 -3141131 -3664487
35578 -3664487 -4060011 -4599843 -4916261 -4224728 -3004672 -2927070 -4323961 -5183006 -3940624
35569 -3940624 -2054824 -2040455 -3738781 -4677454 -3966484 -3519141 -4768645 -6251931 -5799007
35560 -5799007 -3709178 -2195120 -2467227 -3789027 -4928743 -5188390 -4222984 -2170685 -135210
35551 -135210 480940 -526489 -1977024 -2833378 -3307505 -4107913 -5027765 -4802688 -2472307
35542 -2472307 1248110 4175718 4515241 2548599 240781 -833761 -828832 -904284 -1704028
35533 -1704028 -2786873 -3198456 -2431294 -1097465 -562269 -1418519 -2553150 -2566223 -1873659
35524 -1873659 -2057338 -3063497 -2867922 -734803 1008756 18282 -2582625 -3733619 -2734124
35515 -2734124 -1929790 -3165697 -5366199 -6093644 -4368431 -1599967 -374532 -2120063
35507 -2120063 -5251999 -6247837 -3624341 -37884 1041156 -217521 -1026335 -647607 -958256
35498 -958256 -2227779 -1854341 1219092 3882443 2991955 -154999 -2159959 -2574421 -3487226
35489 -3487226 -5112197 -5291517 -3505363 -2203830 -3207302 -5281592 -6491380 -6821299
35481 -6821299 -6970293 -6403495 -4580057 -2900852 -3237430 -4955865 -5400573 -3450523 -930526
35472 -930526 -59305 -870622 -1853235 -2087413 -1840116 -1649259 -1712411 -2019988 -2505004 -3043670
35462 -3043670 -3487428 -3526042 -2576108 -448349 1659724 1720967 -816695 -3888782 -4932592
35453 -4932592 -3801691 -2537698 -2433360 -2621260 -1925444 -908620 -1110979 -2766372 -4261993
35444 -4261993 -4007131 -2307873 -1011292 -1340136 -2457162 -2579800 -1315336 -57157 131981
35435 131981 -100201 69161 -152391 -1955631 -4583147 -5923534 -5226473 -3563676 -1769962
35426 -1769962 143728 1492815 1084770 -593259 -1579957 -1614251 -2737166 -5555414 -7452469
35417 -7452469 -6416779 -4358092 -4160254 -5319350 -5396585 -4437931 -4711700 -6629299 -8051923
35408 -8051923 -7719961 -6698874 -6147521 -5982797 -6028924 -6312010 -5961301 -3954546 -1239272
35399 -1239272 -25743 -700514 -1541003 -1701041 -2148458 -3230546 -3748150 -3167476 -2495853
35390 -2495853 -2258357 -1861755 -1536461 -2265727 -3024324 -1219529 2698429 4357586 1449117
35381 1449117 -2429619 -2865198 -967418 -977948 -3405702 -4770625 -3527122 -2046816 -2200425
35372 -2200425 -2598632 -1568009 -105930 -140347 -1658895 -3159379 -3739805 -3398943 -2186053
35363 -2186053 -355607 1121168 1291091 344828 -683208 -1238921 -1687751 -2409208 -3036292
35354 -3036292 -3028354 -2730219 -3096890 -4089583 -4192763 -2413677 -139297 326251 -1191300
35345 -1191300 -2683190 -2899360 -2514963 -2100061 -1120167 151026 -21980 -2043219 -3573835
35336 -3573835 -2903064 -1901984 -3121420 -5463707 -5857203 -4394804 -4222666 -6097159 -6629600
35327 -6629600 -3386372 1104849 2634269 794432 -1189360 -1202003 -404718 -584110 -1437304
35318 -1437304 -1613233 -1287478 -2052745 -4233183 -5826049 -5087412 -3152921 -2496789 -3216331
35309 -3216331 -2915192 -665212 1120932 87139 -2563362 -3796893 -2779258 -1194521
35301 -1194521 -363966 -194157 -632727 -1968212 -3438831 -3422858 -1657882 56316 28973
35292 28973 -1334147 -2230913 -1610779 -317824 -247319 -2176055 -4446070 -4687308 -3071587
35283 -3071587 -2357040 -3892928 -5440492 -4590061 -2541242 -2071127 -3111072 -3294603 -2146880
35274 -2146880 -1530900 -2080916 -2447373 -2480818 -3938386 -7019705 -9111233 -8384137 -6191726
35265 -6191726 -4478483 -3178539 -1815282 -1386095 -2567993 -3852603 -3652137 -2863347 -3208985
35256 -3208985 -4258632 -4404704 -3923357 -4561445 -6286364 -6771786 -4570907 -1086580 1271159
35247 1271159 1683214 1024478 297554 -148529 -147587 659937 2230582 3397937 2625978 32717
35237 32717 -2040741 -1532168 641077 1640562 326078 -1636436 -2437276 -2304920 -2432348
35228 -2432348 -3132997 -3962332 -4655949 -5085734 -5010453 -4495117 -3946068 -3404931 -2584280 -1763743
35218 -1763743 -1651402 -2208039 -2735736 -3191226 -4032234 -4723139 -4156857 -2844226 -2694738
35209 -2694738 -4028679 -4880296 -4112060 -3055274 -2927152 -2881330 -2187668 -2154039 -3812613
35200 -3812613 -5492499 -5001258 -2909557 -1470428 -1372349 -1658068 -1819808 -1853693 -1208795
35191 -1208795 128960 390465 -1845018 -4967646 -6098912 -5014546 -4024642 -4356369 -5006329
35182 -5006329 -5025757 -4675667 -4236034 -3637123 -3281584 -3467344 -3304629 -2137347 -1491750
35173 -1491750 -3173493 -5783779 -6002105 -3485616 -1481127 -1895129 -2785184 -2047816 -794801
35164 -794801 -1093779 -2481639 -2971306 -2172915 -1315195 -960383 -512986 359591 1155302
35155 1155302 1182292 1062 -2251385 -4295821 -4254071 -1696712 1425631 2756620 1961219
35146 1961219 483926 -481002 -867484 -1025309 -1136956 -1350850 -1840679 -2579055 -3298745
35137 -3298745 -3717964 -3804208 -3914469 -4477145 -5252278 -5255250 -3955480 -2197570 -1211002 -1050917
35127 -1050917 -904069 -594228 -660422 -1124749 -1411108 -1477115 -1818706 -2302578 -2214023 -1564645
35117 -1564645 -1164912 -1354807 -1880317 -2892714 -4543582 -5718490 -5109923 -3678274 -3784816
35108 -3784816 -5352634 -5445343 -2859562 -551456 -1450185 -3983703 -4472874 -2640943 -1705442
35099 -1705442 -3317539 -5286277 -4977720 -2815872 -1267809 -1641088 -3044724 -3972209 -4010273
35090 -4010273 -3928857 -4420154 -5041696 -4718647 -3225865 -1560262 -664366 -516133 -837887
35081 -837887 -1829014 -3511737 -5101437 -5879779 -6139787 -6429834 -6371504 -5182255 -3102979
35072 -3102979 -1430609 -1142619 -1975404 -2733542 -2287682 -720414 297196 -993016 -4169663
35063 -4169663 -6705293 -6782896 -5066610 -3133746 -1495566 -205080 -5568 -1179594 -2211082
35054 -2211082 -1505404 78714 293862 -1227061 -2731434 -3275241 -3739366 -4558922 -4605780
35045 -4605780 -3293635 -1963551 -1839530 -2046502 -1249854 -200676 -734785 -2632847 -3443959
35036 -3443959 -1844472 379965 605316 -1402287 -3647159 -4685211 -4875585 -4907139 -4584293
35027 -4584293 -3780300 -3355693 -3863660 -4140515 -2797127 -791462 -661092 -2916775 -5031398
35018 -5031398 -4816746 -3164069 -2248084 -2442730 -2593828 -2309088 -2162518 -2147881 -1676753
35009 -1676753 -980574 -1000251 -1838491 -2606520 -2852460 -2931757 -2891127 -2210512 -920849 43458
34999 43458 -59093 -1035934 -2207059 -2927130 -2755779 -1847927 -1039246 -872213 -904979 -731119
34989 -731119 -983239 -2170803 -3280116 -3112328 -2398798 -2675115 -3494408 -3057192 -1533622
34980 -1533622 -1159033 -2549296 -3550867 -2701206 -1258609 -448474 707648 2840296 3853629
34971 3853629 1740158 -1828973 -3512752 -2897588 -2389427 -3172061 -4025477 -4019089 -3803684
34962 -3803684 -3963124 -4244795 -4673503 -5424716 -5490968 -3701206 -1304391 -1052457 -3090649
34953 -3090649 -4372080 -3249313 -1938588 -2606917 -3546797 -1979345 1072607 1989375 19340
34944 19340 -1672268 -806100 927562 734402 -1401068 -3285179 -3714900 -3411582 -3200724
34935 -3200724 -2763710 -1527009 84946 966587 785110 569934 1439632 2972192 3556005
34926 3556005 2484626 824296 -283180 -1176440 -2527846 -3490827 -2530716 147281 2515128
34917 2515128 3153343 2409943 1030256 -814190 -2676722 -3541067 -3191070 -2674145 -2628758
34908 -2628758 -2351095 -1379292 -721638 -1316711 -2314577 -2207904 -913061 465333 1207934
34899 1207934 1189673 358244 -759773 -904514 222337 1037433 316074 -759905 -619773
34890 -619773 -137577 -984007 -2147537 -1228601 1173584 1873443 234200 -791099 147330
34881 147330 325442 -2218693 -4761829 -3867738 -797179 508553 -769022 -2077678 -2140619
34872 -2140619 -2292682 -3275881 -3946013 -3697998 -3463765 -3515319 -2636591 -533312 875006
34863 875006 -165451 -2893177 -5109519 -5567493 -4423211 -2303220 -8797 1308812
34855 1308812 654336 -1836220 -4518891 -5161831 -2978802 66101 1044656 -280014 -984541
34846 -984541 756927 2709940 1910143 -621884 -1499181 -468942 -699742 -3357188 -5549844
34837 -5549844 -4934582 -3157402 -2795953 -3512498 -3546663 -2985331 -3033880 -3445975 -3143107 -2509464
34827 -2509464 -2838124 -4037780 -4829456 -4813872 -4609138 -4294388 -3379278 -2130554 -1468303
34818 -1468303 -1629107 -2058502 -2360664 -2374348 -1854787 -1142153 -1393565 -2892294 -4025085
34809 -4025085 -3545946 -2953653 -4492204 -7292536 -7983802 -5376869 -2246663 -1683912 -3517708
34800 -3517708 -5326407 -5511744 -4279148 -2671763 -1737738 -1991505 -2853343 -3075525 -2258009
34791 -2258009 -1442398 -1782137 -3155638 -4498753 -5012238 -4626592 -3637349 -2266869 -539995
34782 -539995 1366113 2602126 2045028 -220117 -2371010 -2682314 -1512553 -562641 -649154
34773 -649154 -1389245 -2601909 -4387660 -5880386 -5661457 -3820451 -2140246 -1759997 -2004863
34764 -2004863 -1992372 -1943783 -2217100 -2412113 -2292700 -2398926 -2860902 -2736577 -1500255 -192292
34754 -192292 -82788 -1022513 -2026751 -2678168 -3051871 -3013859 -2459219 -1587490 -354211
34745 -354211 1417389 2837504 2234365 -403516 -2672885 -2716707 -1609951 -1337389 -1827776
34736 -1827776 -1918712 -1944106 -2847670 -3539647 -2021562 928146 2042176 111870 -2305765
34727 -2305765 -2703457 -1836660 -1712249 -2297588 -2086304 -753520 574327 1138275 1182338
34718 1182338 1058047 800127 410553 -212003 -1324403 -2680889 -3302815 -2653376 -1595474
34709 -1595474 -1388244 -2123504 -2965667 -3540335 -4099418 -4511385 -4166748 -3029168 -1862438
34700 -1862438 -1070239 -68861 1623036 3151707 2924948 469010 -2814471 -4982639
34692 -4982639 -5338568 -4590725 -3577402 -2563579 -1851099 -2111222 -3380345 -4359904 -3735071
34683 -3735071 -1948573 -661230 -549273 -739751 -538715 -510852 -1352983 -2694586 -3658192
34674 -3658192 -3845729 -3218621 -1831632 -381455 -214100 -1829347 -3834832 -4261255 -2696207
34665 -2696207 -528756 595065 67910 -1424048 -2345768 -1518914 484660 1655110 833725
34656 833725 -955215 -2084315 -2306332 -2193009 -1669664 -685831 -551204 -2518610 -5205483
34647 -5205483 -5639981 -3319527 -1122531 -1236744 -2149309 -1255086 1078215 2183795 1141349
34638 1141349 -69340 365305 1737195 2288081 1688899 948289 610018 251134 -403476
34629 -403476 -926063 -981590 -891025 -959279 -846732 -269161 59976 -918258 -2961449 -4367449
34619 -4367449 -3876759 -2202736 -1225869 -2018441 -3989465 -5564680 -5357692 -3178043 -421343
34610 -421343 935759 291245 -966076 -1275102 -785321 -668322 -1107490 -1154627 -480064
34601 -480064 -51725 -719282 -1992297 -2692626 -2278075 -1174001 -217922 -60778 -808616
34592 -808616 -2014379 -3095877 -3716582 -3740192 -3215298 -2605622 -2452802 -2482749 -1862776 -862380
34582 -862380 -1077369 -2935217 -4267870 -3168628 -1300405 -1960353 -5159515 -7243153 -5790328
34573 -5790328 -2401476 244081 1746450 3013673 3873031 3432019 1720678 -380221
34565 -380221 -2030748 -2521143 -1707026 -985986 -2169528 -4569212 -5240469 -3294609 -1610539
34556 -1610539 -2485136 -4082521 -3813225 -2950711 -4328778 -6924183 -6864898 -3543558 -733948
34547 -733948 -980198 -2413024 -2430412 -1560377 -1847500 -3488579 -4890209 -4828457 -3310866
34538 -3310866 -1279869 -154742 -556278 -1120586 18355 2318020 3171337 1574115 -555627
34529 -555627 -1416389 -1566716 -2088687 -2580984 -2422466 -2304112 -2964626 -3807496 -4115588 -4205660
34519 -4205660 -4118479 -2843996 -398103 1020588 -164552 -2396658 -3257318 -2887714 -2970115
34510 -2970115 -3551666 -3411569 -2762869 -2942455 -3759351 -3656360 -2488307 -1865482 -2590531
34501 -2590531 -3795352 -4762785 -5630558 -6106750 -5431447 -3912284 -2752543 -2213604 -1700982
34492 -1700982 -1544562 -2502256 -3513944 -2598332 -413864 -55121 -2348528 -4284145 -3613612
34483 -3613612 -2050709 -1757102 -1527279 448193 2306186 866997 -2933371 -5023063
34475 -5023063 -4369953 -4144487 -6027406 -7245466 -5093358 -1284802 667595 199343 -773152
34466 -773152 -1407451 -2179974 -2571382 -1518060 -23409 -518245 -3118413 -4940377 -4044737
34457 -4044737 -2010403 -1456587 -2788667 -4701382 -6250723 -6812571 -5440949 -2289150
34449 -2289150 286231 143902 -1670524 -2352486 -1227629 -29949 329823 657775 977070
34440 977070 -53008 -2348956 -3641708 -2820687 -1675414 -1742135 -1786223 -477085 688635
34431 688635 -150634 -1610073 -1083711 740731 798609 -1344633 -2819410 -2032142 -734127
34422 -734127 -781349 -1704513 -2548040 -3503196 -4399119 -3922547 -1862133 -106027 112930
34413 112930 36589 857992 1383631 277511 -1041282 -210465 2340269 3801656 2655867
34404 2655867 -17515 -2508304 -3934305 -4022069 -3148823 -2524503 -2949583 -3581056 -3134713
34395 -3134713 -1861202 -1027682 -1027692 -1464713 -2397861 -3723250 -4003959 -2131488 184356
34386 184356 18099 -2615755 -4708990 -4758801 -4658641 -6092450 -7616424 -7099977 -5155465
34377 -5155465 -4084137 -4591399 -5406544 -5363672 -4243392 -2214603 33631 1113600 309546
34368 309546 -1236545 -1906989 -1714542 -1831816 -2572914 -3256525 -3686140 -4232277 -4580455
34359 -4580455 -3914120 -2432317 -1296898 -907720 -591426 -228944 -698125 -2140214 -3184785
34350 -3184785 -2777303 -1667755 -1099730 -963189 -422388 307235 201793 -736522 -1221326
34341 -1221326 -593397 -2885 -1005762 -3424451 -5280042 -4879281 -2571550 -256084 591211
34332 591211 32781 -1069584 -2202743 -3134090 -3260221 -2043345 -171681 663111 -351358
34323 -351358 -2090756 -2849659 -2300018 -1551132 -1642649 -2623216 -3924547 -4999453 -5556461
34314 -5556461 -5590124 -5224762 -4364205 -2803003 -1019952 -322843 -1361593 -2760684 -2374646
34305 -2374646 -162477 1267261 -311089 -3932193 -6610465 -6860000 -5889206 -5332118 -5155031
34296 -5155031 -4567669 -3982538 -4599274 -6128845 -6411999 -4088797 -721841 862350 -76673
34287 -76673 -1718994 -2463162 -2732843 -3458580 -4079459 -3306135 -1255580 472337 750424
34278 750424 -70496 -1105658 -1885065 -2196818 -1971074 -1765872 -2590490 -4628633 -6605257
34269 -6605257 -7018079 -5800028 -4337853 -3921383 -4442975 -4675497 -3830695 -2751246 -3102848
34260 -3102848 -5114506 -6823772 -6407524 -4674587 -3909390 -4519021 -4611596 -3223504 -1974823
34251 -1974823 -2386114 -3274732 -2617932 -891321 -436390 -1910785 -3448206 -3547571 -2978907
34242 -2978907 -3177900 -4156046 -4875014 -4750136 -3930148 -2694196 -1342276 -381544 -240766
34233 -240766 -836621 -1594743 -1802858 -1070591 208752 1012024 786084 218060 316472 950392
34223 950392 1112456 517581 -23028 92333 533206 820715 878162 494641 -756941 -2507673
34213 -2507673 -3351171 -2381143 -504520 408523 -548456 -2586056 -4162795 -4440996 -3961776
34204 -3961776 -3823647 -4090954 -3649085 -2210369 -1471821 -2849002 -4783669 -4377078 -1580883
34195 -1580883 519687 -35490 -1905936 -3259571 -4178409 -4894243 -4166715 -1526152 897376
34186 897376 1127264 215567 -34746 -409222 -2333164 -4119983 -2903162 354026 1670134
34177 1670134 -73909 -1896865 -1938936 -1979096 -3337788 -4023253 -2282248 34160 386323
34168 386323 -507921 -497760 90656 -554356 -2059781 -2316158 -1064547 -187510 -510129
34159 -510129 -860929 -527473 -359709 -954368 -1683519 -2096231 -2609184 -3235222 -3192112 -2436895
34149 -2436895 -2127814 -2736948 -3006754 -1827198 -150565 181477 -1000092 -1965908 -1391260
34140 -1391260 10514 518176 -404202 -1574837 -1879833 -1925864 -3073997 -5113980 -6248690
34131 -6248690 -5727592 -4960435 -5062851 -4880099 -3149130 -1330288 -1878035 -4245385 -5244923
34122 -5244923 -3544381 -1248330 -362232 -200916 456705 938980 247388 -686702 -432273
34113 -432273 372885 -28954 -1697527 -3125654 -3790568 -4613657 -5902652 -6630888 -6078147
34104 -6078147 -4771156 -3465370 -2401857 -1834605 -2089470 -2734352 -2781595 -2109717 -1672820
34095 -1672820 -1898034 -1895795 -805542 939042 2234304 2458624 1572155 -124968 -1855183
34086 -1855183 -2790806 -3114672 -3822678 -5003976 -5398496 -4418597 -3431196 -3809741 -4653289
34077 -4653289 -3972525 -1574973 841594 2156033 2679056 2626367 1646177 267263 -91938
34068 -91938 530648 16561 -2741649 -5560095 -5599850 -3367549 -1992977 -2837234 -4053057
34059 -4053057 -3930341 -3536271 -4715715 -6894873 -7652794 -6025992 -3684932 -2663910 -3099592
34050 -3099592 -3710943 -3679471 -3251133 -2773015 -1984573 -606675 779171 1021355 -314093
34041 -314093 -2297447 -3517736 -3392507 -2388711 -1282775 -654970 -853369 -1762648 -2571523
34032 -2571523 -2415680 -1425459 -564472 -266848 71472 926187 1750081 1876028 1683307
34023 1683307 2001883 2705953 2826601 1984720 839271 -15489 -800794 -1850264 -2760434
34014 -2760434 -2777348 -1804232 -616610 -100569 -496035 -1391278 -2271007 -2901664 -3214987
34005 -3214987 -3153019 -2947042 -3272199 -4471120 -5636640 -5293385 -3310419 -1320719 -679693
33996 -679693 -797223 -321102 722940 1115543 396732 -602809 -1175414 -1560623 -2106615
33987 -2106615 -2479689 -2077374 -758830 915329 1829052 1064997 -832522 -1864204 -860678
33978 -860678 693900 415322 -1734641 -3482154 -3350556 -2004193 -506569 727845 949780
33969 949780 -634791 -2764667 -2665102 -9818 1912746 710124 -1652456 -2126356 -1200653
33960 -1200653 -1304860 -2261474 -1972238 -828140 -1435781 -3724517 -4261502 -1642033 965012
33951 965012 607295 -1080670 -863990 943727 1300427 -811140 -3336372 -4413363 -4134150
33942 -4134150 -3016449 -1023006 1327847 2671419 2448037 1624149 1081504 397470 -953206
33933 -953206 -2160818 -2051293 -1103770 -1240400 -3311769 -5702540 -6161874 -4574955 -2975810
33924 -2975810 -2790354 -3146269 -2538716 -1227842 -768835 -1604403 -2574819 -2895293 -3177259
33915 -3177259 -3968064 -4545077 -4013278 -2677873 -1438855 -549191 172034 576152 564578
33906 564578 643836 1118862 1231031 164877 -1447212 -2152286 -1649179 -1066733 -1303926
33897 -1303926 -2091498 -2752664 -2932104 -2441524 -1328485 -338230 -406104 -1341055 -1857937
33888 -1857937 -1391255 -1082841 -2248366 -4388079 -5581861 -4785479 -3070189 -2368620 -3305978
33879 -3305978 -4537437 -4233801 -2077803 406384 1525569 1101530 248753 -162601 -227042
33870 -227042 -276220 -184621 213823 486333 -30261 -1262340 -2226374 -1987151 -614933 914021
33860 914021 1600061 1054834 -497007 -2367877 -3508859 -3078025 -1418664 -124079 -472943
33851 -472943 -1909492 -2716940 -2176596 -1365208 -1687057 -3271031 -5033055 -5762242 -4989531
33842 -4989531 -3353313 -2164319 -1925472 -1373572 918710 3922620 4679960 2130525 -1108147
33833 -1108147 -1984338 -752674 81989 -459298 -1093117 -915762 -714458 -1290002 -2072071
33824 -2072071 -2089650 -1315975 -489218 -267619 -877284 -2008760 -2866109 -2800057 -1942221 -884681
33814 -884681 -71485 15365 -1237651 -3505196 -4956108 -4064757 -1699077 -116927 -137970
33805 -137970 -705351 -1016691 -1383305 -1840198 -1633378 -627339 172397 60989 -536759
33796 -536759 -1005436 -1130627 -593263 730459 1790984 1285783 -198843 -784988 -389936
33787 -389936 -1032288 -3303681 -4952503 -4370291 -3178478 -3398204 -4074557 -3171779 -1289891
33778 -1289891 -683060 -1444345 -1555082 -552013 -429039 -2416334 -5074805 -6409670 -6240565
33769 -6240565 -5600609 -4973168 -4034992 -2578127 -1135844 -810824 -2260351 -4484995 -5255918
33760 -5255918 -3591420 -1252339 -740675 -2300032 -4047387 -4604295 -4224451 -3550921 -2692675
33751 -2692675 -1678729 -784179 -293295 -555738 -1844141 -3413896 -3568332 -1851353 -227563
33742 -227563 -507084 -1583457 -1313590 -305360 -1111671 -3833670 -5470868 -4245213 -1901482
33733 -1901482 -691654 -483403 -226999 -204238 -1123156 -2430836 -3040088 -2679742 -1500117
33724 -1500117 407671 2162891 2246357 631675 -652749 -238178 784088 969871 740829
33715 740829 933173 787266 -592410 -2046646 -1838994 -485489 20102 -769309 -1537892
33706 -1537892 -1615797 -1626414 -1879167 -1887509 -1476525 -916290 -106141 1061250 1907030 1886700
33696 1886700 1698221 1951297 1574441 -445898 -2494015 -2020453 465747 1791428 676026
33687 676026 -798978 -784207 -12116 337518 452386 267902 -1422264 -4480600 -6274477
33678 -6274477 -5081559 -2823017 -2225005 -2887259 -2638534 -1496329 -1465134 -3027304 -4566375
33669 -4566375 -5143289 -5335850 -5219834 -4025380 -2321862 -2158899 -4012657 -5564656 -4772694
33660 -4772694 -2559054 -1106346 -888533 -1000218 -1369433 -2724155 -4713262 -5820213 -5356793
33651 -5356793 -4259555 -3604764 -3423154 -3400926 -3720840 -4428829 -4634059 -3341149 -1007490
33642 -1007490 506097 -174871 -2452886 -4377776 -4516443 -3015857 -1050566 382705
33634 382705 1040712 1112982 698356 -214457 -1303311 -1741837 -859444 892163 1953320
33625 1953320 1078200 -1223680 -3009416 -2844729 -1231506 66478 -69343 -1169979 -2097988
33616 -2097988 -2492881 -2903095 -3578769 -3807139 -2992418 -1947013 -2066216 -3163954 -3424184
33607 -3424184 -2161834 -1237953 -2275249 -3618482 -2414730 606847 1315545 -1983050
33599 -1983050 -5619426 -5399956 -2239282 -355243 -1314273 -3009659 -3902668 -4758143 -5754230
33590 -5754230 -5325114 -3324587 -2378139 -3932975 -5328441 -3452685 411220 2388316
33582 2388316 1587166 632923 982054 1115234 -21634 -1001389 -794555 -993628 -3123193
33573 -3123193 -5703226 -6283734 -5030158 -3920851 -3360637 -2178149 -556873 -219036 -1350792
33564 -1350792 -1872366 -719732 311435 -587919 -2285337 -2414168 -903743 202612 -21691
33555 -21691 -319090 412578 1402454 1344011 325764 -491562 -606189 -787608 -1979534 -3947453
33545 -3947453 -5169964 -4311378 -2044327 -979763 -2972199 -6579506 -8244700 -6360620
33537 -6360620 -3148111 -1776342 -2573267 -3351014 -2925239 -2531063 -3367463 -4389746 -3840468
33528 -3840468 -2087922 -1293026 -2288881 -3328364 -2577196 -689557 195447 -612073 -1698768
33519 -1698768 -1732512 -1103133 -1041220 -1998523 -3362252 -4073639 -3139382 -379960 2702732
33510 2702732 3682867 1812348 -807242 -1772405 -1425979 -1809672 -3028277 -2871825 -528519
33501 -528519 1596656 1229629 -345824 -288077 1407591 1962379 101848 -2141082 -2568744
33492 -2568744 -1681177 -1164450 -1174799 -855758 -508033 -1195017 -2461440 -2470989 -881635 123545
33482 123545 -1288836 -3873983 -4795142 -3250443 -1223398 -698640 -1470881 -2143090 -2169682
33473 -2169682 -1988004 -1725233 -900071 491537 1367872 488415 -2162155 -5066411 -6279132
33464 -6279132 -5092754 -2838118 -1747429 -2636708 -4002836 -3928175 -2511648 -1557459 -2051654
33455 -2051654 -3106696 -3607188 -3683090 -3969378 -4499434 -5113290 -5900106 -6235932 -4531889
33446 -4531889 -501138 3136314 3185209 20901 -2809542 -3143112 -2373134 -2601430 -3742186
33437 -3742186 -4612278 -5097243 -5604462 -5650534 -4758117 -3866285 -4063325 -4554807 -3753831 -2000852
33427 -2000852 -1186916 -1668202 -1629251 -35729 1687727 1912662 1195935 1125786 1858479
33418 1858479 2209165 1601760 632523 -45082 -294093 -71531 541823 815946 -183071
33409 -183071 -2279350 -3992884 -4105889 -3000875 -1996888 -1680342 -1519788 -1113837 -1056656
33400 -1056656 -2001101 -3323258 -3688232 -3030412 -2926230 -4376604 -6077120 -5899484 -3579948
33391 -3579948 -826029 899178 1401566 731206 -1223988 -3627456 -4624903 -3374614 -1289791
33382 -1289791 -397073 -1106126 -2309224 -2986285 -2887043 -2179292 -1286228 -797860 -951311
33373 -951311 -1425797 -1863092 -2044625 -1512217 -82655 1018213 35327 -2592811 -4063717
33364 -4063717 -2962126 -1455933 -2008093 -3583675 -3574097 -2175909 -1762616 -2530703 -2260179
33355 -2260179 -651123 -336138 -2395295 -4083728 -2915129 -341084 900537 844968 1023504
33346 1023504 869900 -1420679 -5149078 -7224531 -6156445 -3630500 -1839894 -1235583
33338 -1235583 -1292130 -1674212 -2007112 -1886626 -1675703 -2159791 -3085887 -3244538 -2326509 -1427073
33328 -1427073 -1255815 -1129328 -420343 150530 -383863 -1593992 -2053250 -1104956 330753
33319 330753 629298 -906784 -3028687 -3495793 -1709209 144279 -227905 -1933956 -2182489
33310 -2182489 -741509 -546215 -2970536 -5160842 -4111699 -1312022 -550532 -2329486
33302 -2329486 -3591531 -2662129 -1308083 -1395790 -2412976 -3414166 -4801205 -6506632 -6680887
33293 -6680887 -4410120 -2037626 -2226282 -3862618 -3685755 -1368112 132895 -612234 -1632042
33284 -1632042 -1512727 -2004092 -4516358 -6618487 -5132926 -1265247 722646 -494725
33276 -494725 -1970765 -1515529 -805441 -2066254 -4310878 -5050114 -4067523 -3166240 -3013965
33267 -3013965 -2429384 -678889 1205096 1637483 29759 -2847065 -5301180 -5807442 -4422483
$$ [...]
##END NTUPLES=NMR SPECTRUM
##END=
