##TITLE=31Pdec_08-2025-Bay
 DMSO-d6, 64 sc
 14.1.2025
##JCAMPDX= 6.0         $$ Bruker NMR JCAMP-DX V2.0
##DATA TYPE= NMR SPECTRUM
##DATA CLASS= NTUPLES
##ORIGIN= UXNMR, Bruker Analytische Messtechnik GmbH
##OWNER= root
$$ XWIN-NMR		Version 3.5
$$ Wed Jan 15 14:17:39 2025 Russian Standard Time (UT+4h)  she@DPX200
##.OBSERVE FREQUENCY= 81.013821
##.OBSERVE NUCLEUS= ^31P
##.ACQUISITION MODE= SIMULTANEOUS
##.ACQUISITION SCHEME= undefined
##.AVERAGES= 64
##.DIGITISER RES= 17
##SPECTROMETER/DATA SYSTEM= spect
##.PULSE SEQUENCE= zgpg30
##.SOLVENT NAME= CDCl3
##.SHIFT REFERENCE= (INTERNAL, CDCl3, 0, 198.062)
##AUDIT TRAIL= $$ (NUMBER, WHEN, WHO, WHERE, WHAT)
$$ ##TITLE= Audit trail, XWIN-NMR		Version 3.5
$$ ##JCAMPDX= 5.01
$$ ##ORIGIN= Bruker BioSpin GmbH
$$ ##OWNER= she
$$ F:/spectra/data/she/nmr/P31/2/pdata/1/auditp.txt
$$ ##AUDIT TRAIL=  $$ (NUMBER, WHEN, WHO, WHERE, WHAT)
(   1,<2025-01-15 14:16:47.42 +0400>,<she>,<DPX200>,
      <continue with go, POWCHK disabled, PULCHK disabled
       configuration hash MD5:
       00 E9 B6 7A A2 85 ED C7 34 08 36 98 17 FE 4E 26
       data hash MD5: 32K
       8D DB F9 49 20 EF F4 C9 B3 B4 67 95 A6 A0 EF 96>)
(   2,<2025-01-15 14:16:50.28 +0400>,<she>,<DPX200>,
      <Start of raw data processing
       efp BC_mod = 2 LB = 1.5 FT_mod = 6 PKNL = 1 PHC0 = 2074.112 PHC1 = 146.4856 SI = 64K 
       data hash MD5: 64K
       F5 3B EC D7 9C 1D D2 C4 8F 86 DE 2F BC 2C EC 60>)
(   3,<2025-01-15 14:17:07.96 +0400>,<she>,<DPX200>,
      <pk PHC0 = 79.21428 PHC1 = -65.8 
       data hash MD5: 64K
       4B 0C 67 96 6D A9 99 1D 97 4F CD 9E CF A4 59 E7>)
(   4,<2025-01-15 14:17:12.65 +0400>,<she>,<DPX200>,
      <abs ABSG = 5 
       data hash MD5: 64K
       10 F9 F0 E0 78 44 51 52 D8 9D 85 E4 C2 75 3A 86>)
$$ ##END=
$$ 
$$ hash MD5
$$ 19 78 D2 F5 FA 23 F3 12 5F 93 D2 ED FE 54 8E A6
##$RELAX= 
##$RELAX= 
##$RELAX= 
##$RELAX= 
##$RELAX= 
##$RELAX= 
##$RELAX= 
##$RELAX= 
$$ Bruker specific parameters
$$ --------------------------
##$DU= <F:/spectra>
##$EXPNO= 2
##$NAME= <P31>
##$PROCNO= 1
##$TYPE= <nmr>
##$USER= <she>
##$AMP= (0..31)
100 100 100 100 100 100 100 100 100 100 100 100 100 100 100 100 100 100 
100 100 100 100 100 100 100 100 100 100 100 100 100 100 
##$AQSEQ= 0
##$AQ_mod= 1
##$AUNM= <au_zg>
##$AUTOPOS= <>
##$BF1= 81.014009
##$BF2= 200.13
##$BF3= 200.13
##$BF4= 200.13
##$BF5= 200.13
##$BF6= 200.13
##$BF7= 200.13
##$BF8= 200.13
##$BYTORDA= 1
##$CFDGTYP= 0
##$CFRGTYP= 5
##$CHEMSTR= <none>
##$CNST= (0..31)
1 1 145 1 1 1 1 1 1 1 1 1 1 1 1 1 1 1 1 1 1 1 1 1 1 1 1 1 1 1 1 1 
##$CPDPRG= <waltz16>
##$CPDPRG1= <>
##$CPDPRG2= <waltz16>
##$CPDPRG3= <>
##$CPDPRG4= <mlev>
##$CPDPRG5= <mlev>
##$CPDPRG6= <mlev>
##$CPDPRG7= <mlev>
##$CPDPRG8= <mlev>
##$CPDPRGB= <>
##$CPDPRGT= <>
##$D= (0..31)
0 1 0 0 0 0 0 0 0 0.06 0 0.03 2e-05 3e-06 0 0 0.0002 0 0 0 0 0 0 0 0 0 
0 0 0 0 0 0 
##$DATE= 1736936096
##$DBL= (0..7)
120 120 120 11 120 120 24 19 
##$DBP= (0..7)
150 150 150 150 150 150 150 150 
##$DBP07= 0
##$DBPNAM0= <>
##$DBPNAM1= <>
$$ [...]
##$SUBNAM3= <"">
##$SUBNAM4= <"">
##$SUBNAM5= <"">
##$SUBNAM6= <"">
##$SUBNAM7= <"">
##$SUBNAM8= <"">
##$SUBNAM9= <"">
##$SW= 400.765351723535
##$SWIBOX= (0..15)
0 1 3 0 0 0 0 0 0 0 0 0 0 0 0 0 
##$SW_h= 32467.5324675325
##$TD= 32768
##$TD0= 1
##$TE= 0
##$TE2= 300
##$TE3= 300
##$TEG= 300
##$TL= (0..7)
0 120 53 12 22 120 120 120 
##$TP= (0..7)
150 150 150 150 150 150 150 150 
##$TP07= 0
##$TPNAME0= <>
##$TPNAME1= <>
##$TPNAME2= <>
##$TPNAME3= <>
##$TPNAME4= <>
##$TPNAME5= <>
##$TPNAME6= <>
##$TPNAME7= <>
##$TPOAL= (0..7)
0.5 0.5 0.5 0.5 0.5 0.5 0.5 0.5 
##$TPOFFS= (0..7)
0 0 0 0 0 0 0 0 
##$TUNHIN= 0
##$TUNHOUT= 0
##$TUNXOUT= 0
##$USERA1= <user>
##$USERA2= <user>
##$USERA3= <user>
##$USERA4= <user>
##$USERA5= <user>
##$V9= 5
##$VALIST= <valist>
##$VCLIST= <CCCCCCCCCCCCCCC>
##$VD= 0
##$VDLIST= <DDDDDDDDDDDDDDD>
##$VPLIST= <PPPPPPPPPPPPPPP>
##$VTLIST= <TTTTTTTTTTTTTTT>
##$WBST= 1024
##$WBSW= 4
##$XGAIN= (0..3)
0 0 0 0 
##$XL= 0
##$YL= 0
##$YMAX_a= 3029
##$YMIN_a= -7735
##$ZGOPTNS= <>
##$ZL1= 120
##$ZL2= 120
##$ZL3= 120
##$ZL4= 120
##$ABSF1= 198.0616
##$ABSF2= -202.7028
##$ABSG= 5
##$ABSL= 3
##$ALPHA= 0
##$AQORDER= 0
##$ASSFAC= 0
##$ASSFACI= 0
##$ASSFACX= 0
##$ASSWID= 0
##$AUNMP= <proc_1d>
##$AZFE= 0.1
##$AZFW= 0.5
##$BCFW= 0
##$BC_mod= 2
##$BYTORDP= 0
##$COROFFS= 0
##$CY= -3
##$DATMOD= 1
##$DC= 0
##$DFILT= <>
##$DTYPP= 0
##$F1P= 0
##$F2P= 0
##$FCOR= 1
##$FTSIZE= 65536
##$FT_mod= 6
##$GAMMA= 0
##$GB= 0
##$INTBC= 1
##$INTSCL= 9.790993e-09
##$ISEN= 30
##$LB= 1.5
##$LEV0= 0
##$LPBIN= 0
##$MAXI= 10000
##$MC2= 0
##$MEAN= 0
##$ME_mod= 0
##$MI= 50
##$NCOEF= 0
##$NC_proc= -9
##$NLEV= 6
##$NOISF1= 182.463
##$NOISF2= 159.3651
##$NSP= 0
##$NTH_PI= 0
##$NZP= 0
##$OFFSET= 198.0616
##$PC= 4
##$PHC0= 2153.326
##$PHC1= 80.68559
##$PH_mod= 1
##$PKNL= yes
##$PPARMOD= 0
##$PSCAL= 0
##$PSIGN= 0
##$REVERSE= no
##$SF= 81.0140089999434
##$SI= 65536
##$SIGF1= 159.3651
##$SIGF2= -187.1042
##$SINO= 113.3802
##$SIOLD= 16384
##$SREGLST= <1H.CDCl3>
##$SSB= 0
##$STSI= 65536
##$STSR= 0
##$SW_p= 32467.5324675325
##$SYMM= 0
##$S_DEV= 0
##$TDeff= 32768
##$TDoff= 0
##$TI= <>
##$TILT= no
##$TM1= 0
##$TM2= 0
##$TOPLEV= 0
##$USERP1= <user>
##$USERP2= <user>
##$USERP3= <user>
##$USERP4= <user>
##$USERP5= <user>
##$WDW= 1
##$XDIM= 65536
##$YMAX_p= 508555696
##$YMIN_p= -43001929
$$ End of Bruker specific parameters
$$ ---------------------------------
##NTUPLES= NMR SPECTRUM
##VAR_NAME=  FREQUENCY,     SPECTRUM/REAL,   SPECTRUM/IMAG
##SYMBOL=    X,             R,               I
##VAR_TYPE=  INDEPENDENT,   DEPENDENT,       DEPENDENT
##VAR_FORM=  AFFN,          ASDF,            ASDF
##VAR_DIM=   65536,         65536,           65536
##UNITS=     HZ,            ARBITRARY UNITS, ARBITRARY UNITS
##FACTOR=    0.49542278885378, 1,            1
##FIRST=     16045.7642231865, 0,            0
##LAST=      -16421.768244346, 0,            0
##MIN=       -16421.768244346, -43001929,    0
##MAX=       16045.7642231865, 508555696,    0
$$ Real data points
##PAGE= N=1
##DATA TABLE= (X++(R..R)), XYDATA
$$ [...]
##PAGE= N=2
##DATA TABLE= (X++(I..I)), XYDATA
$$ plain form
7365 18536676 7191215 -2631460 -4939211 -2983403 -1740478 -2458101 -4688839 -7840490
7357 -7840490 -9601264 -7464098 -2765919 615944 1527295 1190088 -1637111 -9108100 -17438727
7348 -17438727 -18351705 -9664303 1395396 8092992 11680480 15772184 19158895 19024206
7340 19024206 16610385 14317641 10752986 4146340 -2089146 -2956381 463517 2115034
7332 2115034 -975602 -6046628 -9349043 -9631089 -7384337 -4159038 -2355431 -2975205 -4406351
7323 -4406351 -5689993 -8886775 -15046122 -20426846 -21248719 -20123577 -22217585 -26041430
7315 -26041430 -24222151 -14086683 -1952123 4682541 4630347 1178654 -2633838 -4575796
7307 -4575796 -3036523 714158 2732436 1341900 -467715 123706 880359 -2525569 -9763921
$$ packed form
7365A8536676j1345461r822675k307751J955808J242925p17623k230738l151651
7357g840490j760774K137166M698179L381863R11351l37207k827199p470989q330627
7348a7438727r12978Q687402J1059699O697596L587488M091704L386711j34689
7340A9024206k413821k292744l564655o606646o235486q67235L419898J651517
7332B115034l090636n071026l302415k82046K246752L225299J803607o19774j431146
7323d406351j283642l196782o159347n380724q21873J125142k094008l823845
7315b6041430J819279J0135468J2134560O634664n2194l451693l812492j941958
7307d575796J539273L750681K018278j390536j809615N91421P56653l405928p238352
$$ plain form
7298 -9763921 -14827081 -12048939 -1968177 8900699 13764108 11304768 5973204 2720615
7290 2720615 2509108 3465902 4246048 4064810 1232532 -5029011 -12001000 -15741977 -15432689
7281 -15432689 -12676463 -7757864 -557739 5719246 6697525 2981303 -598289 -2262612
7273 -2262612 -4434836 -6722121 -4283193 3816635 10652934 10410015 6612778 6377617 10364606
7264 10364606 14108343 16315783 19319680 22495253 21615511 15491770 8403431 4594417
7256 4594417 3770057 3090637 926243 -2139896 -3883481 -1671790 4931076 12718171 17640367
7247 17640367 18612979 16989747 13601789 8873627 4761373 3395531 4134626 4740441 4948219
7238 4948219 5861666 6400090 4102556 -227833 -2361934 -244358 3233103 4342316 2901385
$$ packed form
7298i763921n063160K778142J0080762J0868876M863409k459340n331564l252589
7290B720615k11507R56794P80146j81238k832278o261543o971989l740977L09288
7281a5432689K756226M918599P200125O276985R78279l716222l579592j664323
7273b262612k172224k287285K438928Q099828O836299k42919l797237k35161L986989
7264A0364606L743737K207440L003897L175573q79742o123741p088339l809014
7256D594417q24360o79420k164394l066139j743585K211691O602866P787095M922196
7247A7640367R72612j623232l387958m728162m112254j365842P39095O05815K07778
7238D948219R13447N38424k297534m330389k134101K117576L477461J109213j440931
$$ plain form
7229 2901385 1221870 746861 1096605 1109334 25561 -1450010 -1548323 -272512 -730653
7220 -730653 -5090281 -10244231 -11066218 -7454884 -3847347 -1703274 2158414 8185225 10850991
7211 10850991 6619509 668911 561409 5820280 9036089 6232273 1259748 -286532
7203 -286532 2451699 6117881 7438667 6213634 5712074 9880373 18175091 23805387 19928544
7194 19928544 7695686 -4524852 -10252176 -10524173 -9962252 -10547035 -11297420 -11636896 -12048434
7185 -12048434 -12119123 -10581519 -7748737 -6137009 -7648405 -10961217 -12758968 -11265632
7177 -11265632 -7402410 -2256447 4872709 14195237 22324896 24479081 20330922 14684760
7169 14684760 10796700 6205553 -1768538 -9248389 -9649592 -3638363 388933 -2578790
$$ packed form
7229B901385j679515m75009L49744J2729j083773j475571r8313J275811m58141
7220g30653m359628n153950q21987L611334L607537K144073L861688O026811K665766
7211A0850991m231482n950598j07502N258871L215809k803816m972525j546280
7203b86532K738231L666182J320786j225033n01560M168299Q294718N630296l876843
7194A9928544j2232858j2220538n727324k71997N61921n84783p50385l39476m11538
7185a2048434p0689J537604K832782J611728j511396l312812j797751J493336
7177a1265632L863222N145963P129156R322528Q129659K154185m148159n646162
7169A4684760l888060m591147p974091p479851m01203O011229M027296k967723
$$ plain form
7161 -2578790 -7499174 -7057141 -2255717 -189690 -2865563 -4009791 1496616 9382226
7153 9382226 10813642 3857009 -3671547 -3624758 2911872 7797954 6337721 2235092 1132793
7144 1132793 2514766 1429298 -3161963 -6185113 -3616502 1718117 3800515 599646
7136 599646 -4868214 -9100973 -11170646 -12039982 -13049396 -14698371 -15503110 -13170475 -8473407
7127 -8473407 -5980921 -8111777 -10339962 -6501920 2066464 7833317 7904141 7748985 11721361
7118 11721361 15511772 12829448 5639226 1575698 2751707 3292945 -1597140 -9403807
7110 -9403807 -14645012 -15127530 -11789779 -6068729 -453674 866380 -4541190 -13772432
7102 -13772432 -20646036 -21264185 -16721644 -11316619 -9012919 -10385685 -11931727 -9585022
$$ packed form
7161b578790m920384M42033M801424K066027k675873j144228N506407P885610
7153I382226J431416o956633p528556M6789O536630M886082j460233m102629j102299
7144A132793J381973j085468m591261l023150K568611N334619K082398l200869
7136E99646n467860m232759k069673q69336j009414j648975q04739K332635M697068
7127h473407K492486k130856k228185L838042Q568384N766853P0824j55156L972376
7118A1721361L790411k682324p190222m063528J176009N41238m890085p806667
7110i403807n241205m82518L337751N721050N615055J320054n407570r231242
7102a3772432o873604o18149M542541N405025K303700j372766j546042K346705
$$ plain form
7094 -9585022 -3708001 1197646 2668325 3381805 5865727 7047114 2236440 -6778304
7086 -6778304 -12358255 -10267141 -4381494 -963209 -1722006 -4430026 -7312741 -9870440
7078 -9870440 -10986155 -9246859 -5164270 -1507485 -1289268 -5689632 -12946247 -18778262
7070 -18778262 -19394881 -15124073 -9876436 -6411289 -4082202 -2204985 -2666009 -6396303
7062 -6396303 -9494674 -6886865 624549 6561851 6338310 1585565 -3437084 -6397569
7054 -6397569 -6660920 -3761751 1417422 5738280 6401215 3660592 -437923 -4920354 -9948933
7045 -9948933 -14872064 -17737281 -16535465 -10432523 -715776 9022468 15175533 17430661
7037 17430661 18158931 17862937 14030209 6388695 90900 -144743 2947036 2663005 -1927594
$$ packed form
7094i585022N877021M905647J470679P13480K483922J181387m810674r014744
7086f778304n579951K091114N885647L418285p58797k708020k882715k557699
7078i870440j115715J739296M082589L656785K18217m400364p256615n832015
7070a8778262o16619M270808N247637L465147K329087J877217m61024l730294
7062f396303l098371K607809P511414N937302k23541m752745n022649k960485
7054f397569k63351K899169N179173M320858O62935k740623m098515m482431n028579
7045i948933m923131k865217J201816O102942R716747R738244O153065K255128
7037A7430661P28270k95994l832728p641514o297795k35643L091779k84031m590599
$$ plain form
7028 -1927594 -4815375 -2251059 2058639 3289503 2737743 5160409 11593576 18400491
7020 18400491 21888733 20969339 16859482 13089305 13969301 19325284 22168621 16165099
7012 16165099 5014741 -693254 3024401 8223099 5655099 -3660647 -11106404 -11270398
7004 -11270398 -5665630 1797191 7600092 7880564 998974 -7828551 -9685219 -2524170
6996 -2524170 5359572 5699410 764566 -585322 5185341 13348800 18673300 20411047
6988 20411047 18862724 12610107 2108639 -7855433 -12808361 -13271890 -11933502 -8884626
6980 -8884626 -3493897 1229662 1174966 -2519475 -4561499 -3537111 -4143475 -9704070 -16672403
6971 -16672403 -19317874 -16582022 -11107434 -4241813 3874268 10697120 12341907 8951530
$$ packed form
7028a927594k887781K564316M309698J230864n51760K422666O433167O806915
7020A8400491L488242r19394m109857l770177Q79996N355983K843337o003522
7012A6165099j1150358n707995L717655N198698k568000r315746p445757j63994
7004a1270398N604768P462821N802901K80472o881590q827525j856668P161049
6996b524170P883742L39838m934844j349888N770663Q163459N324500J737747
6988B0411047j548323o252617j0501468r964072m952928m63529J338388L048876
6980h884626N390729M723559n4696l694441k042024J024388o06364n560595o968333
6971a6672403k645471K735852N474588O865621Q116081O822852J644787l390377
$$ plain form
6963 8951530 5798105 7484392 12571297 15048868 10522211 732606 -7516795 -8360288
6955 -8360288 -2726097 2321196 1162462 -4198762 -7015004 -4049298 1302204 4178037
6947 4178037 4185624 4984238 9178593 14843179 16990563 12347112 3010121 -4957148 -7275365
6938 -7275365 -5414093 -4010244 -5091714 -6451701 -5488726 -2746125 -1034018 -2319466
6930 -2319466 -6190608 -10622571 -13710720 -14950355 -14846537 -13205022 -8752237 -1307088
6922 -1307088 6696620 12317444 15026848 15997877 15352752 12274532 7470359 3178708 560703
6913 560703 -898716 -1284991 312156 3889247 7944152 11080155 12510084 11334271 7812950
6904 7812950 5170670 6918215 11770444 14394088 12102224 7457230 3113850 -1752991
$$ packed form
6963H951530l153425J686287N086905K477571m526657r789605q249401q43493
6955h360288N634191N047293j158734n361224k816242K965706N351502K875833
6947D178037P587P98614M194355N664586K147384m643451r336991p967269k318217
6938g275365J861272J403849j081470j359987R62975K742601J712107j285448
6930b319466l871142m431963l088149j239635J03818J641515M452785P445149
6922a307088Q003708N620824K709404R71029o45125l078220m804173m291651k618005
6913E60703j459419l86275J597147L577091M054905L136003J429929j175813l521321
6904G812950k642280J747545M852229K623644k291864m644994m343380m866841
$$ plain form
6896 -1752991 -7390201 -9953507 -6325995 -25724 2234072 -1140385 -5714335 -7763350
6888 -7763350 -7788715 -7099207 -5060281 -1514858 941037 -466979 -4974663 -8810640 -8933605
6879 -8933605 -5205875 584612 6440942 10438846 10412851 5294531 -2301856 -6283575 -2205757
6870 -2205757 7645395 16060697 18050792 14541239 9156014 4120813 235821 -1938802
6862 -1938802 -2802138 -3729771 -4745265 -3923292 -482327 3573428 6355949 8274153 9565340
6853 9565340 8377678 3929251 -687047 -1795120 407396 3126146 4650455 4101967
6845 4101967 30164 -7010035 -12302373 -11487919 -6346068 -2541840 -2508437 -3908361 -4072839
6836 -4072839 -2403171 676766 3575469 3300594 -1064365 -5769911 -6901828 -5893425
$$ packed form
6896a752991n637210k563306L627512O300271K259796l374457m573950k049015
6888g763350k5365O89508K038926L545423K455895j408016m507684l835977j22965
6879h933605L727730N790487N856330L997904k5995n118320p596387l981719M077818
6870b205757R851152Q415302J990095l509553n385225n035201l884992k174623
6862a938802q63336r27633j015494Q21973L440965M055755K782521J918204J291187
6853I565340j187662m448427m616298j108073K202516K718750J524309n48488
6845D101967m071803p040199n292338Q14454N141851L804228L3403j399924j64478
6836d072839J669668L079937K898703k74875m364959m705546j131917J008403
$$ plain form
6828 -5893425 -6407682 -7775286 -7006546 -5718853 -8242043 -12964004 -12755954 -5512019 2226476
6819 2226476 4383549 2247895 -167725 -1992567 -3712606 -4638654 -5386169 -8310105 -12541181
6810 -12541181 -13419939 -10029558 -8061448 -11153521 -14533246 -12391871 -7066430 -4774027
6802 -4774027 -5480656 -3658671 2421388 8343466 10316648 9295558 7976301 7623848 8403873
6793 8403873 9835448 10451834 9147301 6916186 5782962 6545441 8663100 11211361 12957621
6784 12957621 12945580 11475252 8464239 1365499 -11138455 -23357312 -26631557 -21060973
6776 -21060973 -16510181 -18518980 -20488665 -15212556 -6706525 -2719280 -1908519 1569569
6768 1569569 5371745 2406355 -5292785 -8265544 -5401940 -6014779 -13756442 -20109388
$$ packed form
6828e893425n14257j367604P68740J287693k523190m721961K08050P243935P738495
6819B226476K157073k135654k415620j824842j720039r26048p47515k923936m231076
6810a2541181q78758L390381J968110l092073l379725K141375N325441K292403
6802d774027p06629J821985O080059N922078J973182j021090j319257l52453P80025
6793H403873J431575O16386j304533k231115j133224P62479K117659K548261J746260
6784A2957621j2041j470328l011013p098740j2503954j2218857l274245N570584
6776b1060973M550792k008799j969685N276109Q506031L987245Q10761L478088
6768A569569L802176k965390p699140k972759K863604o12839p741663o352946
$$ plain form
6760 -20109388 -18770181 -16054386 -19785686 -26070915 -25808409 -18944578 -13357961 -12389151
6752 -12389151 -11817482 -8615172 -5400229 -4722074 -4260894 -431441 6016457 10566583 10397263
6743 10397263 7691831 6994867 9804694 12974435 12802067 8960203 3247634 -3022010
6735 -3022010 -7771765 -7030018 451578 9022541 11803354 9856278 10104254 14418333 17570288
6726 17570288 17150954 17957235 23110355 27732885 26714981 23263410 23261019 24852447 20897582
6717 20897582 10619662 2178301 2450010 8762787 12871234 10776288 6458574 5979972
6709 5979972 9017746 8181696 -1764145 -15864610 -23658327 -21182863 -14013687 -8303049
6701 -8303049 -4012129 1418621 7709687 12690435 14784264 12754089 7190111 3466877
$$ packed form
6760b0109388J339207K715795l731300o285229K62506O863831N586617R68810
6752a2389151N71669L202310L214943O78155M61180L829453O447898M550126j69320
6743A0397263k705432o96964K809827L169741j72368l841864n712569o269644
6735c022010m749755P41747P481596Q570963K780813j947076K47976M314079L151955
6726A7570288m19334Q06281N153120M622530j017904l451571k391J591428l954865
6717B0897582j0277920q441361K71709O312777M108447k094946m317714m78602
6709E979972L037774q36050r945841j4100465p793717K475464P169176N710638
6701h303049M290920N430750O291066M980748K093829k030175n563978l723234
$$ plain form
6693 3466877 7419387 15925110 18591807 12375184 7125221 11183130 18805541 19473155
6685 19473155 13524210 9463224 10281831 12253486 14194231 17545360 18812495 12584791
6677 12584791 2326697 -1956132 1848750 5555013 4732960 5051050 10582957 15380262
6669 15380262 13054227 7343953 5900293 8818043 10598299 9829713 9606869 10119304 7675633
6660 7675633 1488960 -3600689 -2769659 2876898 7056532 4266872 -4654657 -12744856
6652 -12744856 -14093433 -10841829 -10673127 -17180901 -26070089 -31698657 -33272701 -32560216
6644 -32560216 -29598388 -23980659 -17341429 -11181553 -4833720 1101698 2249075 -3992186
6636 -3992186 -12121638 -12954293 -4571954 5319403 8939062 6856218 5134286 6728045
$$ packed form
6693C466877L952510Q505723K666697o216623n249963M057909P622411O67614
6685A9473155n948945m060986Q18607J971655J940745L351129J267135o227704
6677A2584791j0258094m282829L804882L706263q22053L18090N531907M797305
6669A5380262k326035n710274j443660K917750J780256p68586k22844N12435k443671
6660G675633o186673n089649Q31030N646557M179634k789660q921529q090199
6652a2744856j348577L251604J68702o507774q889188n628568j574044P12485
6644c2560216K961828N617729O639230O159876O347833N935418J147377o241261
6636c992186q129452q32655Q382339R891357L619659k082844j721932J593759
$$ plain form
6628 6728045 8651368 7262215 3689382 2142626 3554768 3607395 -1337283 -8265162 -10405287
6619 -10405287 -5655238 755966 2385072 -2003904 -8462206 -12013210 -10434807 -5970686
6611 -5970686 -3333883 -4192190 -4798647 -1959763 685946 -2492054 -9125959 -10585902 -4573671
6602 -4573671 1279348 889329 -2488695 -3885757 -4735948 -7401998 -7884791 -1783213 6545201
6593 6545201 8780162 4262316 -546532 -2556591 -4656519 -8470263 -11427161 -11451012 -9031984
6584 -9031984 -4745906 177045 1848997 -1760420 -5348400 -2149966 5239530 7483108
6576 7483108 2231205 -3000278 -3186339 -2407320 -4976957 -8346587 -9695621 -12127608 -18049650
6567 -18049650 -22345578 -19149365 -11225805 -5895194 -4895489 -4832664 -4884583 -6899696 -9284775
$$ packed form
6628F728045J923323j389153l572833j546756J412142N2627m944678o927879k140125
6619a0405287M750049O411204J629106m388976o458302l551004J578403M464121
6611e970686K636803q58307o06457K838884K645709l178000o633905j459943O012231
6602d573671N853019l90019l378024j397062q50191k666050m82793O101578Q328414
6593F545201K234961m517846m808848k010059k099928l813744k956898k3851K419028
6584i031984M286078M922951J671952l609417l587980L198434P389496K243578
6576G483108n251903n231483j86061P79019k569637l369630j349034k431987n922042
6567a8049650m295928L196213P923560N330611R99705O2825n1919k015113k385079
$$ plain form
6558 -9284775 -8004374 -3935251 -2934789 -7089459 -10762252 -7424126 2674727 13059417
6550 13059417 17074815 12945959 5004816 55744 671691 2572761 475570 -4983260
6542 -4983260 -9109165 -10314969 -11059529 -11987982 -9980242 -3513701 3716562 6659156 4160432
6533 4160432 -1107108 -6044647 -9173331 -10793985 -12131259 -13481957 -13394604 -11094563 -8875458
6524 -8875458 -9462604 -11320203 -9710431 -2833621 6022963 12918879 16616827 16806912 12840144
6515 12840144 6200484 918940 -1172350 -3247722 -9062678 -17763703 -25429868 -29604840
6507 -29604840 -29668267 -25026564 -16616645 -8928802 -6645516 -9332549 -12435216 -13280283 -13039533
6498 -13039533 -13010617 -12746479 -12744508 -15283729 -20424536 -23854198 -21449685 -14554641 -8234165
$$ packed form
6558i284775J280401M069123J000462m154670l672793L338126J0098853J0384690
6550A3059417M015398m128856p941143m949072O15947J901070k097191n458830
6542d983260m125905j205804p44560r28453K007740O466541P230263K942594k498724
6533D160432n267540m937539l128684j620654j337274j350698Q7353K300041K219105
6524h875458n87146j857599J609772O876810Q856584O895916L697948J90085l966768
6515A2840144o639660n281544k091290k075372n814956q701025p666165m174972
6507b9604840o3427M641703Q409919P687843K283286k687033l102667q45067K40750
6498a3039533K8916K64138J971k539221n140807l429662K404513O895044O320476
$$ plain form
6489 -8234165 -5075410 -3075982 440638 4875776 6912470 4015317 -2711638 -8335471
6481 -8335471 -7350127 1074525 11012968 14972807 11878376 7849168 7916015 9683244 8078346
6472 8078346 4079175 3545706 7099319 6925956 -2808230 -16250098 -21647705 -15385563
6464 -15385563 -5374451 -575680 -1904896 -4751572 -6077050 -5972068 -4687797 -1434859
6456 -1434859 4292645 11869432 19690326 25597976 28154042 27919183 26359442 23649835
6448 23649835 19393666 14978361 12081746 8936726 2469259 -4823621 -5569792 1785061
6440 1785061 8241444 5387245 -2743686 -5444987 -471683 3982180 1901045 -3469919
6432 -3469919 -6727638 -7856774 -9445928 -11277227 -11531269 -10418541 -9530167 -9589589 -10821506
$$ packed form
6489h234165L158755J999428L516620M435138K036694k897153o726955n623833
6481h335471R85344Q424652R938443L959839l094431m029208O6847J767229j604898
6472H078346l999171n33469L553613j73363r734186j3441868n397607O262142
6464a5385563J0011112M798771j329216k846676j325478J04982J284271L252938
6456a434859N727504P576787P820894N907650K556066k34859j559741k709607
6448B3649835m256169m415305k896615l145020o467467p292880p46171P354853
6440A785061O456383k854199q130931k701301M973304M453863k081135n370964
6432c469919l257719j129136j589154j831299k54042J112728Q88374n9422j231917
$$ plain form
6423 -10821506 -13420234 -16121783 -16508854 -13817728 -9125956 -2647148 5337481 10453968
6415 10453968 6665192 -4773068 -13958561 -13705298 -7901202 -4453990 -4419703 -3638610 -1543483
6406 -1543483 -1584222 -4462865 -7176367 -8224678 -8275209 -6179001 -152659 6693546 7619312
6397 7619312 474995 -9695015 -17264308 -20990714 -21566458 -19032520 -14540786 -10686822
6389 -10686822 -8035652 -4584043 -115677 2512420 2006975 864509 1182389 1955127 2467629
6380 2467629 4418729 8199670 10963170 11350443 12319494 15683680 17387728 12640442 3202003
6371 3202003 -4827407 -8450507 -8718048 -6238016 -739435 5797356 10308771 12594912
6363 12594912 13836194 11875577 3250932 -9598873 -18593612 -19382025 -15870988 -13071026
$$ packed form
6423a0821506k598728k701549l87071K691126M691772O478808P984629N116487
6415A0453968l788776j1438260r185493K53263N804096L447212L4287P81093K095127
6406a543483m0739k878643k713502j048311n0531K096208O026342O846205R25766
6397G619312p144317j0170010p569293l726406n75744K533938M491734L853964
6389a0686822K651170L451609M468366K628097n05445j142466L17880P72738N12502
6380B467629J951100L780941K763500L87273R69051L364186J704048m747286r438439
6371C202003q029410l623100k67541K480032N498581O536791M511415K286141
6363A2594912J241282j960617q624645j2849805q994739p88413L511037K799962
$$ plain form
6355 -13071026 -10046048 -3823895 3288703 5567953 1802344 -3480858 -6848363 -9588160
6347 -9588160 -13138139 -14907275 -11736888 -5116820 729719 4882139 9815380 15333702
6339 15333702 17002710 12930495 8323643 9423106 15242064 19700951 20509885 20885989
6331 20885989 22785209 23924569 22548240 19806322 15561456 7478085 -2502550 -6399329
6323 -6399329 -57569 9412379 12020082 7753472 4624935 5851637 6318724 1975612
6315 1975612 -4131736 -7171533 -6502906 -3862524 301230 6108571 12698291 19089678
6307 19089678 24083808 24702157 18388727 8024450 843331 249903 2065004 1128489
6299 1128489 -1663761 -1750157 2267350 7217938 9226088 6738834 1203266 -3428012 -3443780
$$ packed form
6355a3071026L024978O222153P112598K279250l765609n283202l367505k739797
6347i588160l549979j769136L170387O620068N846539M152420M933241N518322
6339A5333702J669008m072215m606852J099463N818958M458887Q08934L76104
6331B0885989J899220J139360j376329k741918m244866q083371r980635l896779
6323f399329O341760R469948K607703m266610l128537J226702M67087m343112
6315A975612o107348l039797O68627K640382M163754N807341O589720O391387
6307A9089678M994130O18349o313430j0364277p181119n93428J815101r36515
6299A128489k792250q6396M017507M950588K008150k487254n535568m631278j5768
$$ plain form
6290 -3443780 692081 4539043 4818789 2557659 670545 1285700 6024213 14764833 22412383
6281 22412383 21662209 12317518 3659342 3461384 8521509 10818578 8954786 6910369
6273 6910369 4542242 -2112143 -11285084 -14772995 -9303161 -1792033 385939 -1050652
6265 -1050652 248573 5546236 10769237 13296980 13856723 12689905 8592849 2359440
6257 2359440 -2388404 -3331212 -2432293 -3372910 -7034346 -10791890 -12068678 -11518399 -11968696
6248 -11968696 -14553284 -17151485 -17302271 -15450756 -13861503 -13103343 -11500631 -7825292
6240 -7825292 -2617766 3135338 8475898 11170360 8212876 -815060 -11778735 -18399387
6232 -18399387 -16666296 -7705612 2322143 6057627 1323058 -6040005 -7976675 -3096122
$$ packed form
6290c443780M135861L846962K79746k261130j887114O15155M738513Q740620P647550
6281B2412383p50174r344691q658176j97958N060125K297069j863792k044417
6273F910369k368127o654385r172941l487911N469834P511128K177972j436591
6265a050652J299225N297663N223001K527743N59743j166818m097056o233409
6257B359440m747844r42808Q98919r40617l661436l757544j276788N50279m50297
6248a1968696k584588k598201j50786J851515J589253P58160J602712L675339
6240g825292N207526N753104N340560K694462k957484r027936j0963675o620652
6232a8399387J733091Q960684J0027755L735484m734569p363063j936670M880553
$$ plain form
6224 -3096122 2707023 4530033 3822528 4398500 6944441 9904447 12541384 13891360 11229256
6215 11229256 3397419 -5739969 -10694938 -10429501 -8170171 -6366889 -5144451 -4657109
6207 -4657109 -4925029 -3532067 2342155 10791661 15666704 13450564 6935082 1362913
6199 1362913 -78456 3519570 10894799 17183417 16526607 9269104 3520422 6086227
6191 6086227 14146658 19297459 17470674 10819772 2101557 -7061554 -12836240 -10585536
6183 -10585536 -2020049 3770719 -44330 -9999277 -16728291 -15142936 -7597995 622078
6175 622078 5336489 4571484 -78781 -3174000 -232620 6284677 8738247 3142907 -6421710
6166 -6421710 -13536570 -16759417 -18843321 -20764170 -19984356 -14646673 -6979111 -1522544
$$ packed form
6224c096122N803145J823010p07505N75972K545941K960006K636937J349976k662104
6215A1229256p831837r137388m954969K65437K259330J803282J222438M87342
6207d657109k67920J392962N874222Q449506M875043k216140o515482n572169
6199A362913j441369L598026P375229O288618o56810p257503n748682K565805
6191F086227Q060431N150801j826785o650902q718215r163111n774686K250704
6183a0585536Q565487N790768l815049r954947o729014J585355P544941Q220073
6175F22078M714411p65005m650265l095219K941380O517297K453570n595340r564617
6166f421710p114860l222847k083904j920849P79814N337683P667562N456567
$$ plain form
6158 -1522544 -826777 -3224519 -4491907 -1982625 2681863 5941970 7402956 10247152
6150 10247152 14980802 15745762 7111519 -6536304 -13703297 -9270761 -648165 2306935
6142 2306935 -595052 -2218753 344614 2606071 938070 -1728093 -759053 3527303
6134 3527303 7044440 7277422 4425114 -999707 -8108000 -13493621 -12652058 -5075754 3783759
6125 3783759 7276578 3863435 -2159483 -5803591 -6190378 -5986067 -7101874 -8458364 -8375072
6116 -8375072 -7642363 -8525059 -11297591 -13845020 -14884176 -15416176 -16250654 -16436279 -15639393
6107 -15639393 -15694191 -17263594 -16942285 -11380889 -3546750 -584288 -4436559 -8386930 -5302173
6098 -5302173 3258624 9062137 7076327 742893 -2200482 2794637 13507592 23063641
$$ packed form
6158a522544O95767k397742j267388K509282M664488L260107J460986K844196
6150A0247152M733650P64960q634243j3647823p166993M432536Q622596K955100
6142B306935k901987j623701K563367K261457j668001k666163R69040M286356
6134C527303L517137K32982k852308n424821p108293n385621Q41563P576304Q859513
6125C783759L492819l413143o022918l644108l86787K04311j115807j356490Q3292
6116h375072P32709q82696k772532k547429j039156n32000q34478j85625P96886
6107a5639393n4798j569403L21309N561396P834139K962462l852271l950371L084757
6098e302173Q560797N803513j985810o333434k943375M995119J0712955R556049
$$ plain form
6090 23063641 25482866 20373806 12472304 6465078 3323388 2208851 3618538 7975720
6082 7975720 12338499 12116514 6732777 945064 -525278 2285249 5997703 7781486
6074 7781486 6610113 2887693 -1220821 -2704439 -1021191 757454 184812 -494653 2768340
6065 2768340 9615452 15107035 15993867 14215409 13288752 13949483 14784450 14652070 12407747
6056 12407747 6388578 -2982885 -11302487 -13983272 -11806828 -10131409 -12486716 -17343429
6048 -17343429 -21279917 -22390950 -19804609 -13186546 -4912410 -73347 -1230847 -4644976
6040 -4644976 -4759188 -1441672 459586 -1781133 -5738251 -8153977 -8530393 -7308437 -4274476
6031 -4274476 -1049217 -1814088 -8144095 -15269416 -17190394 -14294263 -12109188 -13005434 -13212316
$$ packed form
6090B3063641K419225n109060p901502o007226l141690j114537J409687M357182
6082G975720M362779k21985n383737n787713j470342K810527L712454J783783
6074G781486j171373l722420m108514j483618J683248J778645n72642o79465L262993
6065B768340O847112N491583Q86832j778458r26657O60731Q34967j32380k244323
6056A2407747o019169r371463q319602k680785K176444J675419k355307m856713
6048a7343429l936488j111033K586341O618063Q274136M839063j157500l414129
6040d644976j14212L317516J901258k240719l957118k415726l76416J221956L033961
6031d274476L225259p64871o330007p125321j920978K896131K185075q96246k06882
$$ plain form
6022 -13212316 -8860116 -1410972 4749387 7708892 9010377 10685403 13073671 14971880
6014 14971880 14967293 13095092 11358928 11621672 13048398 13210789 11729065 10609627 10404412
6005 10404412 8514721 2658072 -6030579 -14698669 -21315422 -23833433 -19579085 -8777030
5997 -8777030 2702241 7653710 4735841 -794870 -3173692 -885545 3853498 7503888
5989 7503888 7123874 2618188 -2474566 -4673341 -5187138 -8220176 -14151351 -17515499 -13638754
5980 -13638754 -5212329 -36977 -2956788 -11308408 -17706320 -16523257 -8453067 438582
5972 438582 4403514 2668968 -1959595 -7553141 -13522051 -17538560 -16406372 -11613539
5964 -11613539 -10190737 -16741626 -26738812 -31103665 -26453328 -17951682 -12682106 -13002083
$$ packed form
6022a3212316M352200P449144O160359K959505J301485J675026K388268J898209
6014A4971880m587j872201j736164K62744J426726J62391j481724j119438k05215
6005A0404412j889691n856649q688651q668090o616753k518011M254348J0802055
5997h777030J1479271M951469k917869n530711k378822K288147M739043L650390
5989G503888l80014m505686n092754k198775n13797l033038n931175l364148L876745
5980a3638754Q426425N175352k919811q351620o397912J183063Q070190Q891649
5972D38582L964932j734546m628563n593546n968910m016509J132188M792833
5964a1613539J422802o550889r997186m364853M650337Q501646N269576l19977
$$ plain form
5956 -13002083 -16299629 -18597493 -17554525 -13503073 -8593463 -4938926 -3814586 -6006478
5948 -6006478 -10736987 -13884316 -10600048 -1796480 5073659 4763158 748424 -1006686
5940 -1006686 -1592828 -6341830 -14404349 -19025604 -18845089 -20621939 -27402270 -31643643 -26031080
5931 -26031080 -15463307 -10906272 -14556129 -18607293 -17222090 -12103670 -5972560 1859375
5923 1859375 10748922 15681536 13248307 7033501 3070477 2281652 1027477 -2547708
5915 -2547708 -6485792 -8760281 -9678166 -10145194 -10247662 -10593912 -12866662 -17058475 -19188898
5906 -19188898 -14406004 -3308427 6669591 8380445 2954615 -1742967 -787133 2751048
5898 2751048 3786127 2766930 3811855 7598637 10631387 10911855 9821635 8009989
$$ packed form
5956a3002083l297546k297864J042968M051452M909610L654537J124340k191892
5948f006478m730509l147329L284268Q803568O870139l10501m014734j755110
5940a006686n86142m749002q062519m621255J80515j776850o780331m241373N612563
5931b6031080J0567773M557035l649857m051164J385203N118420O131110P831935
5923A859375Q889547M932614k433229o214806l963024p88825j254175l575185
5915b547708l938084k274489r17885m67028j02468l46250k272750m191813k130423
5906a9188898M782894J1097577R978018J710854n425830m697582R55834L538181
5898B751048J035079j019197J044925L786782L032750K80468j090220j811646
$$ plain form
5890 8009989 3858144 -2587947 -8162285 -11182480 -14201654 -19703259 -25705479 -28141183
5882 -28141183 -25461704 -18728278 -9517992 -300312 5253426 5335493 2163964 -1109466
5874 -1109466 -4114545 -7791190 -11124800 -11989060 -9933529 -6143174 -2392960 -1645276 -6503147
5865 -6503147 -14233876 -16870852 -10512541 -1537792 1321088 -1766513 -4248153 -4208560 -5127233
5856 -5127233 -6744484 -4148996 2484831 5747979 2033318 -2673430 -2573364 -1072429
5848 -1072429 -4305744 -10936864 -15036225 -15567740 -16246949 -17903122 -17343445 -13319225 -8403669
5839 -8403669 -4809033 -2319734 -329636 1255293 2540774 2254278 -2624766 -12395747
5831 -12395747 -21603393 -24727628 -23354081 -22791289 -22889260 -18435383 -8987843 -1855220 -2927711
$$ packed form
5890H009989m151845o446091n574338l020195l019174n501605o002220k435704
5882b8141183K679479O733426R210286R217680N553738Q2067l171529l273430
5874a109466l005079l676645l333610q64260K055531L790355L750214P47684m857871
5865f503147p730729k636976O358311Q974749K858880l087601k481640L9593r18673
5856e127233j617251K595488O633827L263148l714661m706748J00066J500935
5848a072429l233315o631120m099361n31515o79209j656173N59677M024220M915556
5839h403669L594636K489299J990098J584929J285481k86496m879044r770981
5831a2395747r207646l124235J373547N62792r7971M453877R447540P132623j072491
$$ plain form
5822 -2927711 -9551482 -15290035 -17490941 -16945606 -13869405 -8546331 -3952623 -3545094 -6647598
5813 -6647598 -8735617 -6453740 -846051 4140127 5281290 2746831 48491 665653
5805 665653 4059394 6081168 4196538 1046919 1274311 5361873 8367269 5466583 -1963285
5796 -1963285 -6997641 -4620570 2270122 6235082 4770730 3418954 7466025 13589046
5788 13589046 13973039 7412866 1258500 1680070 6740872 11156290 13666448 16093116
5780 16093116 17927884 16570850 12635278 11020927 15092193 21892466 25202697 22729302
5772 22729302 18157781 15449868 13394851 8576427 2569110 1456272 6594493 10571723
5764 10571723 6410163 -2511622 -6801000 -3151612 3474763 8234714 10390707 9192401
$$ packed form
5822b927711o623771n738553k200906N45335L076201N323074M593708M07529l102504
5813f647598k088019K281877N607689M986178J141163k534459k698340O17162
5805F65653L393741K021774j884630l149619K27392M087562L005396k900686p429868
5796a963285n034356K377071O890692L964960j464352j351776M047071O123021
5788A3589046L83993o560173o154366M21570N060802M415418K510158K426668
5780A6093116J834768j357034l935572j614351M071266O800273L310231k473395
5772B2729302m571521k707913k055017m818424o007317j112838N138221L977230
5764A0571723m161560q921785m289378L649388O626375M759951K155993j198306
$$ plain form
5756 9192401 3094075 -5247306 -9944804 -10519623 -13334971 -21258567 -28302631 -28872063 -26160867
5747 -26160867 -25698116 -26007972 -22575865 -16900248 -13983202 -13590151 -11779782 -9460844 -11411231
5738 -11411231 -17028442 -19795285 -17036423 -13320858 -12421604 -12144117 -9432942 -5036190
5730 -5036190 -520037 4266381 8019472 7296257 2503610 205055 5226648 13538542
5722 13538542 17047493 13226212 6257551 435103 -3706470 -7346956 -10521395 -11439205
5714 -11439205 -7408673 2541902 14868846 23116238 23913542 19796546 14953508 10795728
5706 10795728 7649606 7618182 12039537 17916496 20762891 20191997 19223393 18707985 16231712
5697 16231712 10744106 4740989 942097 -382402 26863 1591846 2334028 -928116
$$ packed form
5756I192401o098326q341381m697498n74819k815348p923596p044064n69432K711196
5747b6160867M62751l09856L432107N675617K917046L93051J810369K318938j950387
5738a1411231n617211k766843K758862L715565Q99254K77487K711175M396752
5730e036190M516153M786418L753091p23215m792647k298555N021593Q311894
5722A3538542L508951l821281o968661n822448m141573l640486l174439r17810
5714a1439205M030532R950575J2326944Q247392P97304m116996m843038m157780
5706A0795728l146122l1424M421355N876959K846395n70894r68604n15408k476273
5697A6231712n487606o003117l798892j324499M09265J564983P42182l262144
$$ plain form
5689 -928116 -8399921 -15134334 -15730098 -10622603 -5542411 -4842079 -7211042 -8200295 -5200716
5680 -5200716 867919 7258409 11201951 10774562 6022653 -240029 -4294353 -5322700
5672 -5322700 -6438811 -10692702 -16839983 -20701241 -20203916 -16952855 -12778114 -7447382
5664 -7447382 -1168500 3009597 1949305 -3290157 -8369651 -10680022 -11117455 -10652288 -7940791
5655 -7940791 -2200904 3444443 4622047 1871879 1309131 7249120 15882066 19201898
5647 19201898 14971129 9389419 8449413 10010419 7953866 2085588 -1234539 1392636
5639 1392636 5493648 5774423 3713670 4012766 6479480 6808788 4524321 4638429 10246185
5630 10246185 17818664 21800204 20435698 15019291 6978736 -1079388 -4357341 -319170
$$ packed form
5689i28116p471805o734413n95764N107495N080192P00332k368963r89253K999579
5680e200716O068635O390490L943542m27389m751909o262682m054324j028347
5672e322700j116111m253891o147281l861258M97325L251061M174741N330732
5664g447382O278882M178097j060292n239462n079494k310371m37433M65167K711497
5655g940791N739887N645347J177604k750168n62748N939989Q632946L319832
5647A9201898m230769n581710r40006J561006k056553n868278l320127K627175
5639A392636M101012K80775k060753K99096K466714L29308k284467J14108N607756
5630A0246185P572479L981540j364506n416407q040555q058124l277953M038171
$$ plain form
5622 -319170 6871296 10159186 7357795 1650275 -4900331 -13581596 -23844567 -30641127
5614 -30641127 -29841576 -23346013 -16034146 -10062822 -5018939 -1435378 -649477 -2466335
5606 -2466335 -5978068 -11207109 -16737341 -17834499 -11807104 -4100824 -2942246 -7208714
5598 -7208714 -6124269 6037098 20722392 25445619 19376096 12810770 13211431 17889286
5590 17889286 20558793 19562830 17542053 16661612 16946005 17694100 18357954 18428471 17655687
5581 17655687 16474753 15853950 16483756 17875042 18654878 18550979 19243067 21193337 20400040
5572 20400040 12181950 -1026264 -10322988 -11325327 -9769092 -11930447 -14144449 -8575437
5564 -8575437 3511880 12542485 14355478 14796604 18802523 22864486 22401093 20067596
$$ packed form
5622c19170P190466L287890k801391n707520o550606q681265j0262971o796560
5614c0641127P99551O495563P311867N971324N043883L583561P85901j816858
5606b466335l511733n229041n530232j097158O027395P706280J158578m266468
5598g208714J084445J2161367J4685294M723227o069523o565326M00661M677855
5590A7889286K669507r95963k020777q80441K84393P48095O63854P0517p72784
5581A7655687j180934o20803O29806J391286P79836j03899O92088J950270p93297
5572B0400040q218090j3208214r296724j002339J556235k161355k214002N569012
5564h575437J2087317R030605J812993M41126M005919M061963m63393k333497
$$ plain form
5556 20067596 21066247 24460635 24876151 20307450 13300886 6320358 541440 -2305115
5548 -2305115 -1521828 -89118 -1641312 -5437129 -8149169 -9736075 -12937486 -17092179
5540 -17092179 -17622761 -13150106 -8683406 -9214178 -13405203 -16358058 -16021595 -13783826 -10641699
5531 -10641699 -6373336 -1886949 910802 1965422 3252459 5510546 7078854 6859106
5523 6859106 6145210 6002469 4913541 1329950 -2891462 -4463298 -3529952 -3670027 -6949915
5514 -6949915 -11688931 -15411326 -17057318 -15738917 -10850564 -4750628 -1553230 -1155249
5506 -1155249 1420116 7489007 9843772 1641626 -12779736 -21977145 -20731781 -13468673
5498 -13468673 -5885476 -377743 286634 -6917314 -18494006 -24504402 -19724231 -10058461
$$ packed form
5556B0067596R98651L394388M15516m568701p006564o980528n778918k846555
5548b305115P83287J432710j552194l795817k712040j586906l201411m154693
5540a7092179n30582M472655M466700n30772m191025k952855L36463K237769L142127
5531a0641699M268363M486387K797751J054620J287037K258087J568308k19748
5523F859106p13896j42741j088928l583591m221412j571836R33346j40075l279888
5514f949915m739016l722395j645992J318401M888353O099936L197398L97981
5506a155249K575365O068891K354765q202146j4421362r197409J245364P263108
5498a3468673P583197N507733O64377p203948j1576692o010396M780171R665770
$$ plain form
5490 -10058461 -4208448 -3539595 -4161322 -4408989 -4937598 -4604328 -1992816 416821 -1442180
5481 -1442180 -7107721 -11453398 -10539460 -5180309 608250 2868405 784979 -1872048
5473 -1872048 -398261 4401221 6670943 4328267 2837511 6340489 9691704 5407944
5465 5407944 -4575820 -11265728 -11499041 -11128684 -14609016 -18156548 -15961237 -8431339 -1094977
5456 -1094977 1942888 1143588 -34152 1547884 5685432 8916975 9076832 8876243 12338870
5447 12338870 18439094 21680470 18991542 12864325 7605277 5690329 7716294 12029873
5439 12029873 13755056 8260484 -2690210 -11428669 -12815083 -9575691 -7685865 -9194375
5431 -9194375 -11782102 -13209141 -13453896 -13307361 -13133091 -13233308 -14229395 -16408905 -18706579
$$ packed form
5490a0058461N850013O68853o21727k47667n28609L33270K611512K409637j859001
5481a442180n665541m345677R13938N359151N788559K260155k083426k657027
5473a872048J473787M799482K269722k342676j490756L502978L351215m283760
5465E407944r983764o689908k33313L70357l480332l547532K195311P529898P336362
5456a094977L037865p99300j177740J582036M137548L231543J59857k00589L462627
5447A2338870O100224L241376k688928o127217n259048j914948K025965M313579
5439A2029873J725183n494572j0950694q738459j386414L239392J889826j508510
5431i194375k587727j427039k44755J46535J74270j00217r96087k179510k297674
$$ plain form
5422 -18706579 -18901850 -15859089 -11502907 -8897992 -8012003 -5681393 -646618 4322901
5414 4322901 6876327 8111576 8736741 6450698 1211684 -1097406 3845540 10844483
5406 10844483 11695914 7509777 6557459 10630493 12434585 7932139 2569443 1784459 2815922
5397 2815922 646379 -3852550 -6803028 -7798616 -8636722 -9130527 -8512264 -7945058 -7888623
5388 -7888623 -6107803 -1848128 1486165 1774493 2814941 8850353 17250157 21589065
5380 21589065 20016709 15733934 10714089 4126319 -3301861 -7993768 -7545981 -3273216
5372 -3273216 1637042 4547805 4382010 2306408 1055653 1915368 2964039 1606152 -2085611
5363 -2085611 -5531280 -5791423 -1090400 7336693 14174677 14246848 9356789 7019458 10181778
$$ packed form
5422a8706579j95271L042761M356182K604915Q85989K330610N034775M969519
5414D322901K553426J235249O25165k286043n239014k309090M942946O998943
5406A0844483Q51431m186137r52318M073034J804092m502446n362696p84984J031463
5397B815922k169543m498929k950478r95588q38106m93805O18263N67206N6435
5388g888623J780820M259675L334293K88328J040448O035412Q399804M338908
5380B1589065j572356m282775n019845o587770p428180m691907M47787M272765
5372c273216M910258K910763j65795k075602j250755Q59715J048671j357887l691763
5363b085611l445669k60143M701023Q427093O837984P2171m890059k337331L162320
$$ plain form
5354 10181778 12934008 10139026 6281201 8669967 15431442 17835972 13312189 8396573
5346 8396573 7829490 7895489 3609911 -3084181 -6729155 -6666402 -7273210 -10890888 -14425098
5337 -14425098 -13847724 -9691415 -6203398 -5708819 -5936867 -3834447 -61927 2702538 4571353
5328 4571353 7728774 10931329 9391621 2013491 -5466078 -7499538 -5345064 -3334316
5320 -3334316 -2086637 24243 1305669 -1889804 -9075164 -15669997 -19096127 -20852191
5312 -20852191 -22350256 -22334524 -19166620 -13085136 -5810229 194039 2494601 756876
5304 756876 -2626614 -5698259 -9167425 -13300527 -14901166 -10957853 -3659825 2201014
5296 2201014 5753006 9912883 15475623 19619485 20337862 18582775 15810768 12802946
$$ packed form
5354A0181778K752230k794982l857825K388766O761475K404530m523783m915616
5346H396573n67083O5999m285578o694092l644974O2753o06808l617678l534210
5337a4425098N77374M156309L488017M94579k28048K102420L772520K764465J868815
5328D571353L157421L202555j539708p378130p479569k033460K154474K010748
5320c334316J247679K110880J281426l195473p185360o594833l426130j756064
5312b0852191j498065J5732L167904O081484P274907O004268K300562j737725
5304G56876l383490l071645l469166m133102j600639L943313P298028N860839
5296B201014L551992M159877N562740M143862P18377j755087k772007l007822
$$ plain form
5288 12802946 11015743 11765937 13774715 14296952 12584638 9795818 6520210 3426092
5280 3426092 2828107 5566671 7524620 3876557 -3795234 -9180910 -9382247 -6591832 -2676638
5271 -2676638 1861371 3841419 -505039 -8000022 -10081266 -4508654 1059017 534544
5263 534544 -2289012 -1981551 -1942484 -9083760 -21038058 -26573403 -19406985 -6158633 1354875
5254 1354875 -1261720 -7776387 -9267596 -3676346 3091359 5208943 3822259 3532555
5246 3532555 3937027 -334485 -10643536 -20665615 -24109890 -21789104 -17989474 -13901806
5238 -13901806 -8738072 -4105946 -2318448 -2003847 128875 4087753 7110317 8499734
5230 8499734 9808738 10595079 8459874 4025324 1697853 3670234 6520718 6253910 4132091
$$ packed form
5288A2802946j787203P50194K008778N22237j712314k788820l275608l094118
5280C426092n97985K738564J957949l648063p671791n385676k01337K790415L915194
5271b676638M538009J980048m346458p494983k081244N572612N567671n24473
5263E34544k823556L07461L9067p141276j1954298n535345P166418J3248352P513508
5254A354875k616595o514667j491209N591250O767705K117584j386684k89704
5246C532555M04472m271512j0309051j0022079l444275K320786L799630M087668
5238a3901806N163734M632126J787498L14601K132722L958878L022564J389417
5230H499734J309004P86341k135205m434550k327471J972381K850484k66808k121819
$$ plain form
5221 4132091 4219010 6521416 6572061 2515064 -960738 1573376 8505153 12790270 11148207
5212 11148207 7932064 8414436 11540289 12260851 8979584 5150259 4136055 5602818
5204 5602818 7131631 6955889 4709423 1202906 -2212547 -4825565 -6391282 -5340623
5196 -5340623 375957 8865988 13691109 10971661 4709669 1322192 1360579 1226552 575347
5187 575347 1911283 4252568 4098588 2604848 4707402 10007466 11504035 5700118 -2282852
5178 -2282852 -6491792 -7362550 -8103086 -9228427 -10219446 -11951304 -13987463 -13632011 -10706926
5169 -10706926 -8881137 -9250905 -7399338 -379782 8092837 13312594 15818156 17704827
5161 17704827 17263889 12349139 5482770 639756 -2237932 -5363245 -8705648 -11070085
$$ packed form
5221D132091Q6919K302406N0645m056997l475802K534114O931777M285117j642063
5212A1148207l216143M82372L125853P20562l281267l829325j014204J466763
5204E602818J528813j75742k246466l506517l415453k613018j565717J050659
5196e340623N716580Q490031M825121k719448o261992l387477L8387j34027o51205
5187E75347J335936K341285j53980j493740K102554N300064J496569n803917p982970
5178b282852m208940q70758p40536j125341r91019j731858k036159L55452K925085
5169a0706926J825789l69768J851567P019556Q472619N219757K505562J886671
5161A7704827m40938m914750o866369m843014k877688l125313l342403k364437
$$ plain form
5153 -11070085 -12072327 -9830455 -1525906 9679609 14089231 7669338 -594499 -517913
5145 -517913 5066988 6128422 1262858 -2020772 -606372 785362 -623729 -1850379
5137 -1850379 -1469014 -2414506 -5151844 -5024391 921354 9872228 17681836 22233569 21626092
5128 21626092 15117849 7265668 4847058 7542103 7607813 1264528 -5461166 -5330198 1142542
5119 1142542 8885747 15313865 19711079 19745679 13988162 6000924 1455708 1662286 2695419
5110 2695419 496774 -4720813 -8317716 -4786810 6716546 19502467 24139343 17548770
5102 17548770 5940966 -1958376 -2924716 -233755 936675 -1921351 -6951744 -9955026
5094 -9955026 -8942128 -6116726 -4084254 -1990982 1618220 3901757 189507 -8978428
$$ packed form
5153a1070085j002242K241872Q304549J1205515M409622o419893q263837P6586
5145e17913N584901J061434m865564l283630J414400J391734j409091j226650
5137a850379L81365r45492k737338J27453N945745Q950874P809608M551733o07477
5128B1626092o508243p852181k418610K695045O5710o343285o725694J30968O472740
5119A142542P743205O428118M397214L4600n757517p987238m545216K06578J033133
5110B695419k198645n217587l596903L530906J1503356J2785921M636876o590573
5102A7548770j1607804p899342r66340K690961J170430k858026n030393l003282
5094i955026J012898K825402K032472K093272L609202K283537l712250r167935
$$ plain form
5086 -8978428 -17546729 -20794853 -18555300 -11947519 -1891297 8470825 14855728 16874264
5078 16874264 17931730 19230957 18458478 15427108 13691310 14478440 14023500 9577925 3597092
5069 3597092 -670385 -3377593 -5255233 -5264568 -4164490 -5702727 -10489758 -13093413 -9471642
5060 -9471642 -3287455 -337000 -557662 -571219 -531877 -2571641 -5111174 -4894459 -3018590
5051 -3018590 -3001510 -4119558 -2840032 -304714 -1953220 -9114391 -16954386 -21918761 -25234309
5042 -25234309 -27080278 -23603490 -13772753 -4210826 -1754843 -4014381 -2722807 5012459
5034 5012459 14282568 20912090 26505453 32981544 37293780 35896732 31358517 29290593
5026 29290593 29811857 27592657 21019517 15549127 14998762 14488256 7221063 -4624097
$$ packed form
5086h978428q568301l248124K239553O607781J0056222J0362122O384903K018536
5078A6874264J057466J299227p72479l031370j735798P87130m54940m445575n980833
5069C597092m267477k707208j877640r335J100078j538237m787031k603655L621771
5060i471642O184187K950455k20662j3557L9342k039764k539533K16715J875869
5051c018590J7080j118048J279526K535318j648506p161171p839995m964375l315548
5042b5234309j845969L476788R830737R561927K455983k259538J291574P735266
5034E012459R270109O629522N593363O476091M312236j397048m538215k067924
5026B9290593N21264k219200o573140n470390n50365n10506p267193j1845160
$$ plain form
5018 -4624097 -11912271 -10835780 -7199357 -7087002 -8385355 -4701519 5374838 16232652
5010 16232652 21285346 19006506 13676513 11268158 13849056 17630497 17567371 13573559
5002 13573559 10108154 9718930 10070613 8435352 5985041 5126710 4562685 284466 -8344115
4993 -8344115 -15743548 -15017721 -5780347 4156838 6579008 2087392 -1104769 1745621
4985 1745621 5980875 5526148 2589323 3666377 8235775 8809286 2736897 -3087264 -1984540
4976 -1984540 3604079 6535982 4224501 -21782 -1699501 2116110 11736064 22914202
4968 22914202 27994996 22756883 11503594 2978405 1907770 6145451 10726176 12477631
4960 12477631 11182290 8096575 3950725 -1416094 -7081229 -9883599 -7308150 -1145108
$$ packed form
5018d624097p288174J076491L636423J12355j298353L683836J0076357J0857814
5010A6232652N052694k278840n329993k408355K580898L781441o3126l993812
5002A3573559l465405l89224L51683j635261k450311q58331n64025m278219q628581
4993h344115p399433P25827R237374R937185K422170m491616l192161K850390
4985A745621M235254m54727k936825J077054M569398N73511o072389n824161J102724
4976a984540N588619K931903k311481m246283j677719L815611R619954J1178138
4968B2914202N080794n238113j1253289q525189j070635M237681M580725J751455
4960A2477631j295341l085715m145850n366819n665135k802370K575449O163042
$$ plain form
4952 -1145108 3959854 5505784 4654081 3314209 2348261 2447371 4214049 7420560 11920980
4943 11920980 17822095 22432796 19928458 8491616 -4547179 -10180160 -8562430 -6378878
4935 -6378878 -5395967 -1613816 4641487 6870559 2714055 -1817075 -1297146 2913530 8170186
4926 8170186 15043046 22724217 26687308 25321741 23388994 24812211 26921610 25452986
4918 25452986 20650621 15233535 10601732 7547030 6613900 6371740 5687296 7516363 14658394
4909 14658394 22922977 26258926 27169961 32087873 37748959 34918032 25935754 23789048
4901 23789048 31124468 35832012 32004974 28934318 32864489 36669218 36003058 38697499
4893 38697499 48027004 53559704 49879584 47167400 51155505 51381221 43322479 41668554
$$ packed form
4952a145108N104962J545930q51703j339872r65948R9110J766678L206511M500420
4943A1920980N901115M610701k504338j1436842j3038795n632981J617730K183552
4935f378878R82911L782151O255303K229072m156504m531130N19929M210676N256656
4926H170186O872860P681171L963091j365567j932747J423217K109399j468624
4918B5452986m802365n417086m631803l054702r33130k42160o84444J829067P142031
4909A4658394Q264583L335949R11035M917912N661086k830927q982278k146706
4901B3789048P335420M707544l827038l070656L930171L804729o66160K694441
4893C8697499R329505N532700l680120k712184L988105K25716q058742j653925
$$ plain form
4885 41668554 54464559 65431875 62177218 59615428 71834239 84899881 86100161 93921562
4877 93921562 123359461 150019995 155717152 179747860 255635134 312331274 227660044
4870 227660044 -77 -214359299 -277816044 -221102591 -166708930 -162782382 -163747675
4863 -163747675 -137343686 -107620509 -95946933 -88210533 -73152915 -63115764 -62381786
4856 -62381786 -54631267 -35641339 -24965948 -32040289 -40094750 -36211031 -30266967 -31159821
4848 -31159821 -29561823 -18972324 -11814741 -19043695 -31961904 -38627234 -41782791 -46582764
4840 -46582764 -46207401 -34978670 -22981379 -22321704 -28488645 -29031949 -22552905 -16480372
4832 -16480372 -13112339 -9959750 -8546762 -12031814 -17951594 -21810059 -23846842 -25475795
$$ packed form
4885D1668554J2796005J0967316l254657k561790J2218811J3065642J200280P821401
4877I3921562K9437899K6660534N697157K4030708P5887274N6696140q4671230
4870B27660044k27660121k14359222o3456745N6713453N4393661L926548r65293
4863a63747675K6403989K9723177J1673576P736400J5057618J0037151P33978
4856f2381786P750519J8989928J0675391p074341q054461L883719N944064q92854
4848c1159821J597998J0589499P157583p228954j2918209o665330l155557m799973
4840d6582764L75363J1228731J1997291O59675o166941n43304O479044O072533
4832a6480372L368033L152589J412988l485052n919780l858465k036783j628953
$$ plain form
4824 -25475795 -24360007 -19952959 -18223687 -23384756 -29912534 -29972303 -24187086 -18307388
4816 -18307388 -13817592 -8715984 -3594896 -428922 1332266 2249384 566055 -2920264
4808 -2920264 -3075546 888804 875581 -8867385 -21183174 -24730849 -19312014 -14200339 -14147153
4799 -14147153 -15667993 -15807968 -16255612 -18413131 -21133749 -24166951 -28431723 -32164332
4791 -32164332 -31414658 -25194623 -16756016 -9682165 -5537466 -4539612 -5358364 -5059898 -2312864
4782 -2312864 184268 -849960 -4636935 -7712398 -8331037 -6871737 -3855360 -569353
4774 -569353 331547 -1976559 -4659684 -5644473 -7254087 -11561465 -14785706 -11523673 -3272115
4765 -3272115 2518735 1793043 -2250003 -4979134 -5891821 -7311372 -10592857 -14774285 -17218829
$$ packed form
4824b5475795J115788M407048J729272n161069o527778n9769N785217N879698
4816a8307388M489796N101608N121088L165974J761188R17118j683329l486319
4808b920264j55282L964350j3223r742966j2315789l547675N418835N111675N3186
4799a4147153j520840j39975m47644k157519k720618l033202m264772l732609
4791c2164332P49674O220035Q438607P073851M144699R97854q18752K98466K747034
4782b312864K497132j034228l786975l075463o18639J459300L016377L286007
4774e69353R00900k308106k683125r84789j609614m307378l224241L262033Q251558
4765c272115N790850p25692m043046k729131r12687j419551l281485m181428k444544
$$ plain form
4756 -17218829 -15460651 -10123629 -5674099 -6548298 -12986602 -21854756 -29972014 -34849485
4748 -34849485 -34364683 -28736261 -21471455 -15649001 -10787740 -5992654 -3656022 -5844174
4740 -5844174 -8942297 -7234724 -1395665 1876238 -714350 -5150024 -7248074 -8813348
4732 -8813348 -13455573 -19766371 -22795882 -21000199 -18102576 -17802313 -19185385 -18640103 -15085392
4723 -15085392 -11436927 -10448547 -10830377 -9654423 -7843248 -9634351 -15299276 -18198773
4715 -18198773 -12582912 -1941870 4682600 3521352 -1339245 -5794259 -10714230 -17342326
4707 -17342326 -22455077 -21832905 -16085177 -9489039 -4337885 262521 4462562 5891342
4699 5891342 2905802 -2381847 -5897891 -5966957 -5103007 -7470440 -14590071 -23329711 -28413703
$$ packed form
4756a7218829J758178N337022M449530q74199o438304q868154q117258m877471
4748c4849485M84802N628422P264806N822454M861261M795086K336632k188152
4740e844174l098123J707573N839059L271903k590588m435674k098050j565274
4732h813348m642225o310798l029511J795683K897623L00263j383072N45282L554711
4723a5085392L648465R88380l81830J175954J811175j791103n664925k899497
4715a8198773N615861J0641042O624470j161248m860597m455014m919971o628096
4707a7342326n112751O22172N747728O596138N151154M600406M200041J428780
4699E891342k985540n287649l516044o9066Q63950k367433p119631q739640n083992
$$ plain form
4690 -28413703 -27435905 -22976143 -18883067 -15162814 -8686142 770125 8237854 9679095
4682 9679095 8063591 9389063 13575482 14341159 9164194 4054236 5092200 9547767
4674 9547767 10276133 6036884 1687579 -501798 -3570782 -9600511 -16332484 -21381089
4666 -21381089 -24965098 -26807373 -24980621 -20000059 -15727048 -13698948 -10731321 -5055254
4658 -5055254 -665375 -1771565 -6388913 -9603389 -10364617 -10671657 -10394069 -7691204 -3203131
4649 -3203131 581237 3145579 5104247 4741309 -33632 -6880396 -10987120 -11984403 -14093503
4640 -14093503 -18417307 -19892268 -14306240 -4713205 2125839 3395685 1540071 -458494
4632 -458494 -2063227 -3645596 -4450079 -3291491 -529474 1769668 2005789 682668 -1099830
$$ packed form
4690b8413703R77798M459762M093076L720253O476672R456267P467729J441241
4682I679095j615504J325472M186419P65677n176965n109958J037964M455567
4674I547767P28366m239249m349305k189377l068984o029729o731973n048605
4666b1381089l584009j842275J826752M980562M273011K028100K967627N676067
4658e055254M389879j106190m617348l214476p61228l07040K77588K702865M488073
4649c203131L784368K564342J958668l62938m774941o846764m106724r97283k109100
4640a4093503m323804j474961N586028R593035O839044J269846j855614j998565
4632d58494j604733j582369q04483J158588K762017K299142K36121j323121j782498
$$ plain form
4623 -1099830 -4187829 -10265144 -17800010 -21895272 -20147632 -16335022 -15360119 -16239248 -13900447
4614 -13900447 -7324603 -1620640 -964988 -3044961 -2620208 1728932 6684852 8657683
4606 8657683 7076315 3819935 1068459 -292573 -1148437 -3077081 -6230964 -8552775
4598 -8552775 -7871182 -4774234 -2524349 -3474049 -6006004 -6111867 -2205535 2954830 6077300
4589 6077300 7579971 9921473 12720181 12944703 10510876 9992285 14370643 19786032 19922571
4580 19922571 14346040 8894173 7744044 8392515 5916802 64120 -4075685 -2097344
4572 -2097344 4584746 10220703 10550845 6059729 -273535 -6378119 -10996674 -12296489
4564 -12296489 -9551441 -5475525 -3672842 -3768242 -2328907 1142514 3017219 1429113
$$ packed form
4623a099830l087999o077315p534866m095262J747640L812610R74903q79129K338801
4614a3900447O575844N703963O55652k079973M24753M349140M955920J972831
4606H657683j581368l256380k751476j361032q55864j928644l153883k321811
4598h552775O81593L096948K249885r49700k531955j05863L906332N160365L122470
4589F077300J502671K341502K798708K24522k433827n18591M378358N415389J36539
4580A9922571n576531n451867j150129O48471k475713n852682m139805J978341
4572b097344O682090N635957L30142m491116o333264o104584m618555j299815
4564a2296489K745048M075916J802683r5400J439335L471421J874705j588106
$$ plain form
4556 1429113 -707569 -627855 81048 -1157059 -3777888 -6300789 -9275875 -12376895 -11833032
4547 -11833032 -5503622 1680569 2447828 -3613120 -10145567 -12627106 -12228975 -11145845
4539 -11145845 -8861904 -4474433 695797 4544875 6354849 6726864 6735658 7141084 7191665
4530 7191665 4995111 499913 -3378769 -4530835 -4649130 -6008148 -7558558 -7602867 -8077323
4521 -8077323 -11721198 -16475083 -17563478 -14500400 -11303807 -10033224 -8811795 -6322840
4513 -6322840 -3671212 -1496627 322659 -91056 -4942603 -11834628 -15183881 -13141750
4505 -13141750 -8542509 -3021882 3960919 9748009 9369391 4372312 3776287 11803212
4497 11803212 20310488 18704349 7192425 -5063635 -11619643 -13211121 -13036455 -13098214
$$ packed form
4556A429113k136682P9714P08903j238107k620829k522901k975086l101020N43863
4547a1833032O329410P184191P67259o060948o532447k481539L98131J083130
4539a1145845K283941M387471N170230L849078J809974L72015Q794M05426N0581
4530G191665k196554m495198l878682j152066j18295j359018j550410m4309m74456
4521h077323l643875m753885j088395L063078L196593J270583J221429K488955
4513f322840K651628K174585J819286m13715m851547o892025l349253K042131
4505a3141750M599241N520627O982801N787090l78618m997079n96025Q026925
4497A1803212Q507276j606139j1511924j2256060o556008j591478J74666o1759
$$ plain form
4489 -13098214 -14363276 -16217749 -16008731 -11990035 -5928805 -756755 2437940 2880420
4481 2880420 -1402676 -9939001 -17176889 -17885356 -13699050 -10225673 -9136958 -7692221
4473 -7692221 -5110948 -4134259 -5625921 -6242198 -3315814 908702 1527772 -4296071 -15230587
4464 -15230587 -26265040 -31293236 -28014348 -20946853 -17129754 -18243302 -19616264 -17716458
4456 -17716458 -15203824 -16318418 -19994943 -21123072 -17834750 -14114447 -14313993 -17406226
4448 -17406226 -18348430 -14075140 -6411851 760868 5538019 8420007 9881911 9069508
4440 9069508 5168425 -674968 -5357004 -6070654 -3056278 -76472 -1154409 -6257596
4432 -6257596 -11045032 -11513900 -7930325 -3487067 -507832 688157 506073 -437256 -1226706
$$ packed form
4489a3098214j265062j854473K09018M018696O061230N172050L194695M42480
4481B880420m283096q536325p237888p08467M186306L473377J088715J444737
4473g692221K581273R76689j491662o16277K926384M224516O19070n823843j0934516
4464a5230587j1034453n028196L278888P067495L817099j113548j372962J899806
4456a7716458K512634j114594l676525j128129L288322L720303j99546l092233
4448a7406226r42204M273290P663289P172719M777151K881988J461904q12403
4440I069508l901083n843393m682036p13650L014376K979806j077937n103187
4432f257596m787436m68868L583575M443258K979235J195989j82084r43329p89450
$$ plain form
4423 -1226706 -1475330 -1366779 136980 5125869 12831504 18205523 17475519 13278844 10818394
4414 10818394 10835359 10725806 10806293 13556414 16908295 14731229 5689847 -3761424 -7478444
4405 -7478444 -6147158 -3597967 -1346667 318511 27451 -2442767 -4666928 -5038794 -4831130
4396 -4831130 -4647578 -2388817 2625152 7000338 7602556 5405697 2585749 -553858 -3115251
4387 -3115251 -2230082 2530042 7445871 10857413 16425180 25631240 31839920 28277052
4379 28277052 18749258 13544972 16272159 21097062 22137407 19501912 16096217 13979278
4371 13979278 14523483 17697882 20497554 19508674 15040356 9849098 5025109 733198
4363 733198 -773269 2190041 6017882 5029925 -518420 -4369519 -2550669 2585608 6858794
$$ packed form
4423a226706k48624J08551J503759M988889P705635N374019p30004m196675k460450
4414A0818394J6965j09553Q0487K750121L351881k177066r041382r451271l717020
4405g478444J331286K549191K251300J665178k91060k470218k224161l71866K07664
4396d831130J83552K258761N013969M375186O02218k196859k819948l139607k561393
4387c115251Q85169M760124M915829L411542N567767R206060O208680l562868
4379B8277052r527794n204286K727187M824903J040345k635495l405695k116939
4371A3979278N44205L174399K799672r88880m468318n191258m823989m291911
4363G33198j506467K963310L827841r87957n548345l851099J818850N136277M273186
$$ plain form
4354 6858794 8375776 6483125 875322 -6750477 -13005545 -15663803 -14329498 -9132521
4346 -9132521 -1687017 3744623 3780818 194146 -2461815 -2434403 -804048 2032331 5581048
4337 5581048 6870876 3884027 -272462 -1908239 -3423642 -9060650 -15885076 -16823967
4329 -16823967 -11854767 -7500786 -4916485 1904796 13807234 21948419 19935723 12356115
4321 12356115 6275631 1639093 -4319633 -9940055 -12877850 -15427319 -19578876 -21487600
4313 -21487600 -17378286 -10780690 -7231620 -5440590 -698631 5855132 8720307 7202645
4305 7202645 6284451 8907543 13103827 16334454 17623853 15972654 11297638 6157973
4297 6157973 2335258 -2640107 -10766187 -17594235 -17234542 -11941773 -9517135 -11222834
$$ packed form
4354F858794J516982j892651n607803p625799o255068k658258J334305N196977
4346i132521P445504N431640L6195l586672k655961K7412J630355K836379L548717
4337E581048J289828k986849m156489j635777j515403n637008o824426r38891
4329a6823967M969200M353981K584301O821281J1902438Q141185k012696p579608
4321A2356115o080484m636538n958726n620422k937795k549469m151557j908724
4313b1487600M109314O597596L549070J791030M741959O553763K865175j517662
4305G202645r18194K623092M196284L230627J289399j651199m675016n139665
4297F157973l822715m975365q126080o828048L59693N292769K424638j705699
$$ plain form
4289 -11222834 -9949750 -2122815 5937453 7108935 2947556 -478571 -1703043 -3481497
4281 -3481497 -5859378 -4961601 1511966 11238109 20165758 26076025 28692376 28004989 23814622
4272 23814622 16911082 9910252 5715686 4704596 4730949 4774113 6558655 10507987 12471668
4263 12471668 8505143 1716511 -761812 2078850 3745173 1057811 192212 7001334
4255 7001334 16052899 16649732 8066750 875146 1870525 5188987 2540740 -3696570 -4324400
4246 -4324400 2531717 8484799 6523475 -647549 -6167876 -7885422 -7989689 -7299993 -4626143
4237 -4626143 -688923 1338669 -422715 -4688515 -9105773 -12452386 -14658305 -15968693
4229 -15968693 -16260669 -14991616 -12756710 -12631916 -17224236 -23629993 -25057772 -19606772
$$ packed form
4289a1222834J273084P826935Q060268J171482m161379l426127j224472j778454
4281c481497k377881Q97777O473567R726143Q927649N910267K616351o87387m190367
4272B3814622o903540p000830m194566j011090K6353M3164J784542L949332J963681
4263A2471668l966525o788632k478323K840662J666323k687362q65599O809122
4255G001334R051565N96833q582982p191604R95379L318462k648247o237310o27830
4246d324400O856117N953082j961324p171024n520327j717546j04267O89696K673850
4237d626143L937220K027592j761384m265800m417258l346613k205919j310388
4229a5968693k91976J269053K234906J24794m592320o405757j427779N451000
$$ plain form
4221 -19606772 -13409871 -11736090 -11345236 -6734349 48500 2705417 1031336 -35134
4213 -35134 -299736 -4270918 -10695339 -11433771 -3724240 4477425 5452045 1318830 -1416094
4204 -1416094 -746116 1744651 5009821 7296739 5938699 2454898 2409658 6290486 7110317
4195 7110317 2136969 -244781 7469931 19448228 24660137 22473709 20709393 21691218
4187 21691218 20233471 13912380 5893121 -2070660 -10730437 -17209545 -16156891 -8399158
4179 -8399158 -1393613 390782 -445342 -440535 614818 2631207 6312607 10138644 11376264
4170 11376264 10591493 10267169 9519288 6068281 2774750 5209014 12426394 17166925 16089474
4161 16089474 13097503 11617811 10438521 8447303 6835140 5253120 2058626 -848556
$$ packed form
4221a9606772O196901J673781L90854M610887O782849K656917j674081j066470
4213c5134k64602l971182o424421p38432P709531Q201665R74620m133215k734924
4204a416094O69978K490767L265170K286918j358040l483801m5240L880828Q19831
4195G110317m973348k381750P714712J1978297N211909k186428j764316R81825
4187B1691218j457747o321091q019259p963781q659777o479108J052654P757733
4179h399158P005545J784395q36124M807J055353K016389L681400L826037J237620
4170A1376264p84771l24324p47881l451007l293531K434264P217380M740531j077451
4161A6089474k991971j479692j179290j991218j612163j582020l194494k907182
$$ plain form
4153 -848556 55730 3015290 3209706 1551884 2909101 6073032 5632068 3915122 9042969
4144 9042969 19366859 23053622 16825709 11457208 13437162 15510609 12453441 11204672
4136 11204672 15995898 18734307 15859502 19205001 35977301 54428340 67059413 88962110
4128 88962110 125783238 139268983 84117405 -21347928 -100346830 -105321317 -68288947
4121 -68288947 -47309900 -53390216 -56789668 -42890033 -27125086 -22135104 -21721482 -20091324
4113 -20091324 -22694151 -31143915 -35757445 -31447040 -27224140 -31177911 -36626021 -32556310
4105 -32556310 -20686745 -12874668 -15028905 -21177755 -22494195 -16733676 -8319489 -2529455
4097 -2529455 -1073915 -2628878 -6383276 -12947353 -20778978 -24615036 -20864147 -12897009
$$ packed form
4153h48556R04286K959560J94416j657822J357217L163931m40964j716946N127847
4144I042969J0323890L686763o227913n368501J979954K073447l057168j248769
4136A1204672M791226K738409k874805L345499J6772300J8451039J2631073K1902697
4128H8962110L6821128J3485745n5151578j05465333p8998902m974487L7032370
4121f8288947K0979047o080316l399452J3899635J5764947M989982M13622J630158
4113b0091324k602827q449764m613530M310405M222900l953771n448110M069711
4105c2556310J1869565P812077k154237o148850j316440N760519Q414187N790034
4097b529455J455540j554963l754398o564077p831625l836058L750889P967138
$$ plain form
4089 -12897009 -7108255 -4936586 -3141788 -1008148 -1740827 -6124551 -10249079 -11541756
4081 -11541756 -12564341 -16176448 -20386552 -20792249 -15794410 -7358626 1143166 6116215
4073 6116215 5185080 -420400 -6397618 -9490304 -9601814 -7754733 -4855531 -3016490 -4489147
4064 -4489147 -7956013 -9517100 -8934111 -10727662 -16682890 -21702345 -20682184 -15499671
4056 -15499671 -10858673 -6989446 -1940838 1875119 29741 -6257188 -11073950 -12079205
4048 -12079205 -11809188 -10828608 -6331411 977819 5114755 2861537 -1718377 -4069693
4040 -4069693 -5702752 -10219767 -16891160 -22292921 -24922305 -24093207 -17668173 -5863362
4032 -5863362 5301293 9857236 9699562 11123793 14462627 13152222 3814789 -8261440
$$ packed form
4089a2897009N788754K171669J794798K133640p32679m383724m124528j292677
4081a1541756j022585l612107m210104m05697M997839Q435784Q501792M973049
4073F116215r31135n605480n977218l092686j11510J847081K899202J839041j472657
4064d489147l466866j561087N82989j793551n955228n019455J020161N182513
4056a5499671M640998L869227N048608L815957j845378o286929m816762j005255
4048a2079205K70017R80580M497197P309230M136936k253218m579914k351316
4040d069693j633059m517015o671393n401761k629384Q29098O425034J1804811
4032e863362J1164655M555943j57674J424231L338834j310405r337433j2076229
$$ plain form
4024 -8261440 -15796940 -17410424 -16333580 -14650838 -11953891 -7912130 -3468343 -13918
4016 -13918 1348854 512839 -1001503 -1366786 -949837 -1842436 -4145389 -4780551 -1688829
4007 -1688829 2229046 1557088 -5388917 -14157781 -18276689 -15232885 -8396387 -3379439
3999 -3379439 -2573326 -3344580 -1631066 3226917 7730696 7899460 3328775 -1850275 -1906880
3990 -1906880 5282319 15252160 20603362 18523188 12966953 8567048 5353746 1624038
3982 1624038 -1474961 -2244574 -2558045 -4552105 -5108053 253262 8772219 12635416 10417748
3973 10417748 9213355 13292825 17846622 17712302 15512402 15681498 15986581 11595356 3740859
3964 3740859 -2329727 -5310856 -7263195 -7418921 -3652514 1076839 1166863 -2449369 -2534162
$$ packed form
4024h261440p535500j613484J076844J682742K696947M041761M443787L454425
4016a3918J362772q36015j514342l65283M16949q92599k302953o35162L091722
4007a688829L917875o71958o946005q768864m118908L043804O836498N016948
3999c379439Q06113p71254J713514M857983M503779J68764m570685n179050n6605
3990a906880P189199R969841N351202k080174n556235m399905l213302l729708
3982A624038l098999p69613l13471j994060n55948N361315Q518957L863197k217668
3973A0417748j204393M079470M553797j34320k199900J69096L05083m391225p854497
3964C740859o070586k981129j952339j55726L766407M729353R0024l616232q4793
$$ plain form
3955 -2534162 3619344 9869645 9971224 5067568 -323752 -4744044 -8600289 -10631267
3947 -10631267 -9810174 -8242042 -8384864 -9158681 -8188560 -6471273 -7296327 -11009667 -13904177
3938 -13904177 -12623819 -7566073 -1610306 2807372 4902055 5287336 5401378 6411377
3930 6411377 7697575 6623440 1018565 -7350022 -12757967 -10719806 -3111989 3748867
3922 3748867 6109472 5202453 2465095 -3144426 -10448042 -13342372 -8073607 -259534
3914 -259534 1686571 -1480713 -1643908 3243969 5965917 2469281 -1139312 714865 2608115
3905 2608115 -3742030 -15007221 -18660188 -9177978 5378825 13767365 12677250 6199413
3897 6199413 -259579 -2803762 194252 6748416 12480344 15258201 17032923 19663267
$$ packed form
3955b534162O153506O250301J01579m903656n391320m420292l856245k030978
3947a0631267Q21093J568132j42822p73817R70121J717287q25054l713340k894510
3938a3904177J280358N057746N955767M417678K094683L85281J14042J009999
3930F411377J286198j074135n604875q368587n407945K038161P607817O860856
3922C748867K360605r07019k737358n609521p303616k894330N268765P814073
3914b59534J946105l167284j63195M887877K721948l496636l608593J854177J893250
3905B608115o350145j1265191l652967R482210J4556803Q388540j090115o477837
3897F199413o458992k544183K998014O554164N731928K777857J774722K630344
$$ plain form
3889 19663267 21095637 17938610 10461369 2678077 -2015025 -3341645 -2566085 -560124
3881 -560124 1745947 2509735 367161 -3264838 -4738454 -2119343 2114231 3787003 2296910
3872 2296910 1353563 3900167 8287318 10970637 11313979 11412341 12107845 11982223 10396931
3863 10396931 8798353 7886149 5655875 214309 -6464652 -9649037 -6963637 -1227707
3855 -1227707 2364999 1381824 -2012721 -4026827 -3192046 -947404 857670 1603562 1007417
3846 1007417 -1563576 -5562120 -8242902 -7122112 -3156924 407132 2479959 5349419
3838 5349419 10577717 15633801 16547522 12975832 8555004 6491503 6908940 8687390 11270749
3829 11270749 13298113 12056290 7194984 3388838 5342780 10253320 9678543 595394
$$ packed form
3889A9663267J432370l157027p477241p783292m693102j326620P75560K005961
3881e60124K306071P63788k142574l631999j473616K619111M233574J672772j490093
3872B296910r43347K546604M387151K683319L43342R8362O95504j25622j585292
3863A0396931j598578r12204k230274n441566o678961l184385K685400N735930
3855a227707L592706r83175l394545k014106Q34781K244642J805074P45892n96145
3846A007417k570993l998544k680782J120790L965188L564056K072827K869460
3838E349419N228298N056084R13721l571690m420828k063501M17437J778450K583359
3829A1270749K027364j241823m861306l806146J953942M910540n74777r083149
$$ plain form
3821 595394 -9438444 -11214281 -4743319 2639614 6251171 6983582 5903420 2292437
3813 2292437 -2297062 -3936275 -2251623 -1379466 -2706080 -2037234 2514337 5269837 986754
3804 986754 -6253871 -9047234 -8856077 -14165867 -26579139 -36657038 -36097257 -27754870
3796 -27754870 -19895347 -15511092 -12119782 -8803920 -7716167 -9092340 -9381696 -5690747
3788 -5690747 411795 4945541 6097005 5463285 5145183 4943627 3352411 775957 -48480
3779 -48480 2350301 5742415 6855016 5148515 2175906 -1280743 -4857848 -6761239 -5682864
3770 -5682864 -3816468 -4150020 -5171604 -2826496 2011045 3493541 -79997 -2824204
3762 -2824204 -309316 3330658 2391191 -706897 529292 5238578 5328571 -2543013 -11495471
$$ packed form
3821E95394j0033838j775837O470962P382933L611557P32411j080162l610983
3813B292437m589499j639213J684652Q72157j326614O68846M551571K755500m283083
3804I86754p240625k793363J91157n309790j2413272j0077899N59781Q342387
3796b7754870P859523M384255L391310L315862J087753j376173k89356L690949
3788e690747O102542M533746J151464o33720l18102k01556j591216k576454q24437
3779d8480K398781L392114J112601j706501k972609l456649l577105j903391J078375
3770e682864J866396l33552j021584K345108M837541J482496l573538k744207
3762b824204K514888L639974r39467l098088J236189M709286Q9993p871584q952458
$$ plain form
3753 -11495471 -13066655 -6849686 718602 3792564 1330846 -3239730 -4551712 264877
3745 264877 7968626 11941614 9755920 5840919 5412339 8335094 10810975 10515859 7269867
3736 7269867 529253 -10025282 -21271037 -26973763 -23131250 -12582213 -3416416 -2054883
3728 -2054883 -7358769 -12120500 -11297567 -7761406 -7819967 -11975410 -13972400 -9970789 -4579806
3719 -4579806 -4802154 -10788761 -16391525 -17405491 -15278170 -12898941 -10578424 -7505240
3711 -7505240 -4662138 -4391876 -7737173 -13042397 -17046156 -17563433 -15579181 -14317190 -15930203
3702 -15930203 -19938821 -24907251 -29407745 -30330367 -23406223 -8655215 6457935 13034149
3694 13034149 9469289 1488299 -5169373 -8366096 -7222776 -1720209 4468471 5867299
$$ packed form
3753a1495471j571184O216969P568288L073962k461718m570576j311982M816589
3745B64877P703749L972988k185694l915001m28580K922755K475881k95116l245992
3736G269867o740614j0554535j1245755n702726L842513J0549037R165797J361533
3728b054883n303886m761731Q22933L536161n8561m155443j996990M001611N390983
3719d579806k22348n986607n602764j013966K127321K379229K320517L073184
3711g505240K843102K70262l345297n305224m003759n17277J984252J261991j613013
3702a5930203m008618m968430m500494r22622O924144J4751008J5113150O576214
3694A3034149l564860p980990o657672l196723J143320N502567O188680J398828
$$ plain form
3686 5867299 2119687 -1036260 114191 2395549 1912292 776436 3201470 7988831
3678 7988831 10184224 8651734 6745945 5875151 3583031 -1060958 -4729305 -4506415 -1911130
3669 -1911130 77803 1423949 3683182 5784061 4264916 -2006413 -9360202 -12701243
3661 -12701243 -10824093 -7474998 -6853422 -8629720 -8317266 -2564969 6969634 15233134
3653 15233134 17952048 13827787 4598462 -5513971 -11964202 -13564645 -13106190 -12615577
3645 -12615577 -9656911 -1399687 8623534 12088848 5449833 -5247908 -11093351 -9595700
3637 -9595700 -5095347 -1872949 -166301 1105714 1008740 -1795212 -5406732 -5587528 -1293882
3628 -1293882 2827547 1833780 -2743043 -4849483 -2768833 -1902908 -6577719 -12903510 -13950772
$$ packed form
3686E867299l747612l155947J150451K281358m83257j135856K425034M787361
3678G988831K195393j532490j905789q70794k292120m643989l668347K22890K595285
3669a911130J988933J346146K259233K100879j519145o271329p353789l341041
3661a2701243J877150L349095O21576j776298L12454N752297R534603Q263500
3653A5233134K718914m124261r229325j0112433o450231j600443M58455M90613
3645a2615577K958666Q257224J0023221L465314o639015j0697741n845443J497651
3637i595700M500353L222398J706648J272015r6974k803952l611520j80796M293646
3628a293882M121429r93767m576823k106440K080650Q65925m674811o325791j047262
$$ plain form
3619 -13950772 -9861311 -7832221 -12217089 -19078647 -21699968 -18285797 -12857232 -10756241
3611 -10756241 -14221877 -20691746 -25072395 -25028020 -23216765 -22316069 -19813810 -11862967 -1075023
3602 -1075023 5196329 4917938 3976274 6942256 10955591 11826829 10761627 10550880 9546852
3593 9546852 4897316 -1266597 -4609988 -5865425 -9808820 -17419604 -23791416 -24206085
3585 -24206085 -18853317 -11538810 -6642810 -6865777 -10997035 -14394563 -14216783 -12912604
3577 -12912604 -13666098 -14518240 -11372380 -5255727 -1257743 -728566 -88920 2202997 3174931
3568 3174931 1219886 -916872 -1193530 -1358447 -2220859 -506622 5823211 12764464 14916658
3559 14916658 12462159 9689816 8449558 6777190 2897985 -2551584 -7583230 -9878983
$$ packed form
3619a3950772M089461K029090m384868o861558k621321L414171N428565K100991
3611a0756241l465636o469869m380649M4375J811255R00696K502259P950843J0787944
3602a075023O271352k78391r41664K965982M013335Q71238j065202k10747j004028
3593I546852m649536o163913l343391j255437l943395p610784o371812m14669
3585b4206085N352768P314507M896000k22967m131258l397528J77780J304179
3577a2912604p53494q52142L145860O116653L997984N29177O39646K291917R71934
3568C174931j955045k136758k76658j64917q62412J714237O329833O941253K152194
3559A4916658k454499k772343j240258j672368l879205n449569n031646k295753
$$ plain form
3551 -9878983 -7963916 -3537493 -1182982 -3541408 -8417071 -12816023 -17325132 -23092922
3543 -23092922 -26836479 -23771538 -14908159 -6716219 -3034079 -1422041 1478351 4866489
3535 4866489 5904883 4007735 1039533 -788064 206977 4548541 10560344 15476163
3527 15476163 18355802 20241195 21234670 20041088 17041625 14735451 13898399 12524833
3519 12524833 10131309 9272980 10215789 8229884 325576 -8721892 -12185702 -10568080
3511 -10568080 -9026125 -7608130 -1420590 9521373 18314381 20904697 20719559 20751539
3503 20751539 18161628 11195769 4929965 4285540 6715486 8016123 9880107 13990499
3495 13990499 14031476 4078354 -8269403 -9426812 -309714 3572714 -4689826 -13090442
$$ packed form
3551i878983J915067M426423K354511k358426m875663m398952m509109n767790
3543b3092922l743557L064941Q863379Q191940L682140J612038K900392L388138
3535D866489J038394j897148k968202j827597R95041M341564O011803M915819
3527A5476163K879639J885393R93475j193582k999463k306174q37052j373566
3519A2524833k393524q58329R42809j985905p904308r047468l463810J617622
3511a0568080J541955J417995O187540J0941963Q793008K590316j85138L1980
3503B0751539k589911o965859o265804o44425K429946J300637J863984M110392
3495A3990499M0977r953122j2347757j157409R117098L882428q262540q400616
$$ plain form
3487 -13090442 -9921180 -1456403 -428429 -5777664 -6461221 -749046 1283207 -6008810
3479 -6008810 -16368012 -22279236 -23890123 -24189382 -22794528 -18748123 -14247904 -11505822
3471 -11505822 -9329455 -5950050 -2534924 -1317928 -2178669 -2768428 -611637 5134408
3463 5134408 11877613 14138317 9291304 2412838 1223582 6100825 9892537 8297279
3455 8297279 4910839 4094900 4467916 2830627 -168042 -2267327 -3661465 -4803718 -3675397
3446 -3675397 244440 2276603 -2053534 -9692520 -13067052 -9498983 -3306185 624365
3438 624365 914895 -2135341 -7543794 -11946628 -11133508 -5101862 1193121 3515033 2429226
3429 2429226 776498 -78556 323849 3321881 9367619 15363576 16640765 12249373 6499603
$$ packed form
3487a3090442L169262Q464777J027974n349235o83557N712175K032253p292017
3479f008810j0359202n911224j610887k99259J394854M046405M500219K742082
3471a1505822K176367L379405L415126J216996q60741n89759K156791N746045
3463E134408O743205K260704m847013o878466j189256M877243L791712j595258
3455H297279l386440q15939L73016j637289k998669k099285j394138j142253J128321
3446c675397L919837K032163m330137p638986l374532L568069O192798L930550
3438F24365K90530l050236n408453m402834Q13120O031646O294983K321912j085807
3429B429226j652728q55054M02405K998032O045738N995957J277189m391392n749770
$$ plain form
3420 6499603 4160413 5303837 6439540 6020125 6263739 8674302 10322338 7097974 -669264
3411 -669264 -8638349 -13728142 -15910159 -15295388 -11372363 -5737924 -1579617 1088427 5949553
3402 5949553 14092163 20821645 21556332 17738770 13642189 10120005 5335006 -437224
3394 -437224 -4840900 -7127375 -8366986 -9113300 -10003798 -13107108 -18935015 -23448645 -22197344
3385 -22197344 -16580680 -11719371 -8759813 -4125125 3468841 10356625 13527882 14315889
3377 14315889 14655242 13819266 11294190 9231141 9022643 8321742 4832815 1048739 1539275
3368 1539275 6116688 8765192 3968739 -7328078 -18256729 -21787820 -16436008 -7234629
3360 -7234629 -1056723 -708364 -3793135 -6709801 -8203202 -8957546 -9676157 -10518439 -11073176
$$ packed form
3420F499603k339190J143424J135703m19415K43614K410563J648036l224364p767238
3411f69264p969085n089793k182017O14771L923025N634439M158307K668044M861126
3402E949553Q142610O729482P34687l817562m096581l522184m784999n772230
3394d37224m403676k286475j239611p46314q90498l103310n827907m513630J251301
3385b2197344N616664M861309K959558M634688P593966O887784L171257P88007
3377A4315889L39353q35976k525076k063049k08498p00901l488927l784076M90536
3368A539275M577413K648504m796453j1296817j0928651l531091N351812R201379
3360g234629O177906L48359l084771k916666j493401p54344p18611q42282n54737
$$ plain form
3351 -11073176 -10051843 -6356150 -1382352 1128240 -1069429 -5780321 -8379370 -6288380
3343 -6288380 -876355 4074066 4804608 -380081 -9571006 -17628820 -19706046 -15527864
3335 -15527864 -9788647 -7439245 -8628667 -9243058 -6630800 -3140934 -2465865 -4048347
3327 -4048347 -4377839 -3613710 -6537572 -14796166 -21993825 -20392775 -10477685 -138340
3319 -138340 4062756 985719 -7738661 -18757073 -25441529 -21431577 -8307340 4250636
3311 4250636 8395766 5177799 158116 -3953716 -7534737 -10679393 -13426136 -16809801
3303 -16809801 -20011458 -18824348 -11244996 -2875966 -1835349 -8726525 -16381942 -19691681
3295 -19691681 -20456992 -21011302 -18614281 -10328552 221100 6317517 7008904 7399784 10212508
$$ packed form
3351a1073176J021333L695693M973798K510592k197669m710892k599049K090990
3343f288380N412025M950421P30542n184689r190925q057814k077226M178182
3335a5527864N739217K349402j189422o14391K612258L489866O75069j582482
3327d048347l29492P64129k923862q258594p197659J601050R915090J0339345
3319a38340M201096l077037q724380j1018412o684456M009952J3124237J2557976
3311D250636M145130l217967n019683m111832l581021l144656k746743l383665
3303a6809801l201657J187110P579352Q369030J040617o891176p655417l309739
3295a9691681p65311n54310K397021Q285729J0549652O096417O91387L90880K812724
$$ plain form
3286 10212508 12292407 10875308 8055825 5790877 1220677 -7762359 -15688379 -15258370
3278 -15258370 -8681709 -5443501 -7865724 -7413205 899286 8766929 6348903 -2442610
3270 -2442610 -5667463 -1082543 1904404 -2435258 -8707404 -10412274 -8674545 -6934784
3262 -6934784 -4063298 1970194 8696994 12704974 14835189 17028989 17316620 12972325
3254 12972325 6158910 1375536 -1171433 -5007838 -11089730 -16114901 -16701660 -12223973
3246 -12223973 -4641969 1348072 -161995 -10043591 -20048617 -19812227 -8755947 2871902
3238 2871902 5859003 1200712 -4252082 -7600856 -11753291 -18938906 -26312037 -29325853
3230 -29325853 -27349967 -23596362 -20011020 -15195348 -8607777 -3656524 -3176216 -3980689
$$ packed form
3286A0212508K079899j417099k819483k264948m570200q983036p926020M30009
3278a5258370O576661L238208k422223M52519Q312491P867643k418026q791513
3270b442610l224853M584920K986947m339662o272146j704870J737729J739761
3262f934784K871486O033492O726800M007980K130215K193800K87631m344295
3254A2972325o813415m783374k546969l836405o081892n025171n86759M477687
3246a2223973P582004N990041j510067r881596j0005026K36390J1056280J1627849
3238B871902K987101m658291n452794l348774m152435p185615p373131l013816
3230b9325853J975886L753605L585342M815672O587571M951253M80308q04473
$$ plain form
3222 -3980689 -924346 4296805 4426026 -2232950 -8484717 -8958379 -7681716 -10026257 -12882124
3213 -12882124 -9841617 -2277951 2534531 2305784 1090759 805693 -842914 -3864755
3205 -3864755 -5116525 -4979233 -7338455 -11067653 -9390429 -1023059 5673703 4538132
3197 4538132 809278 2343109 7419120 8827213 5987576 4590910 6240302 6997100
3189 6997100 6070963 7591867 11816956 12051338 4262741 -5640555 -8739002 -3918796 2324681
3180 2324681 4346936 1651232 -3399253 -7959346 -9314081 -6629474 -2476515 -480872
3172 -480872 -1567267 -4117428 -6739442 -8563641 -8073009 -4890227 -2043047 -2866484 -5983999
3163 -5983999 -7391201 -7378937 -10143801 -15417338 -16654798 -10915308 -4844712 -5610231 -10387004
$$ packed form
3222c980689L056343N221151J29221o658976o251767m73662J276663k344541k855867
3213a2882124L040507P563666M812482k28747j215025k85066j648607l021841
3205c864755j251770J37292k359222l729198J677224Q367370O696762j135571
3197D538132l728854J533831N076011J408093k839637j396666J649392P56798
3189F997100r26137J520904M225089K34382p788597r903296l098447M820206O243477
3180B324681K022255k695704n050485m560093j354735K684607M152959J995643
3172d80872j086395k550161k622014j824199M90632L182782K847180q23437l117515
3163e983999j407202J2264k764864n273537j237460N739490O070596p65519m776773
$$ plain form
3154 -10387004 -11128845 -6290230 -595774 4217139 9785881 13162927 8265863 -2610197
3146 -2610197 -7703686 -426103 12085098 19464783 20227246 18104401 13412463 5883298
3138 5883298 1125867 5218542 14697704 19643761 16062949 8740257 2573062 -2276022
3130 -2276022 -6488547 -9159839 -10422808 -11680091 -12488558 -11375077 -9590387 -9369242 -8749253
3121 -8749253 -3538640 5150578 10826426 10157795 6536308 3894940 1983967 -541243
3113 -541243 -2973164 -4473368 -5394192 -5473328 -4421275 -4585103 -8313645 -12548302 -11999287
3104 -11999287 -8337139 -8888685 -14087647 -14548297 -5387875 4122934 2322928 -8710507
3096 -8710507 -16629550 -15401624 -10890933 -10958914 -16412750 -21980563 -21627563 -12910000 178216
$$ packed form
3154a0387004p41841M838615N694456M812913N568742L377046m897064j0876060
3146b610197n093489P277583J2511201P379685P62463k122845m691938p529165
3138E883298m757431M092675R479162M946057l580812p322692o167195m849084
3130b276022m212525k671292j262969j257283q08467J113481J784690K21145O19989
3121h749253N210613Q689218N675848o68631l621487k641368j910973k525210
3113e41243k431921j500204r20824p9136J052053j63828l728542m234657N49015
3104a1999287L662148n51546n198962m60650R160422R510809j800006j1033435
3096h710507p919043J227926M510691o7981n453836n567813L53000Q717563J3088216
$$ plain form
3087 178216 8953344 7838813 83544 -6407070 -7292595 -3633109 1540509 4801351 3049717
3078 3049717 -2963332 -7643716 -7037753 -4060277 -2993620 -1797678 4091612 12570395
3070 12570395 16903639 16458704 17607225 22557303 24861925 19482414 11084860 7403958
3062 7403958 8421643 7343655 430085 -8517180 -13069519 -10758295 -4840345 -1053044
3054 -1053044 -2194791 -5034404 -3525096 4076353 12368608 13968882 6725919 -4591258
3046 -4591258 -12560328 -12485691 -4992665 5129764 12468072 14099693 10609897 5696162
3038 5696162 4406479 8877113 14665082 14329734 6639766 -1200388 -3448696 -3715847 -7691139
3029 -7691139 -11712171 -6686472 7342235 18997084 19628145 12113695 3194722 -5023800
$$ packed form
3087A78216Q775128j114531p755269o490614q85525L659486N173618L260842j751634
3078C049717o013049m680384O05963K977476J066657J195942N889290Q478783
3070A2570395M333244m44935J148521M950078K304622n379511q397554l680902
3062G403958J017685j077988o913570q947265m552339K311224N917950L787301
3054a053044j141747k839613J509308P601449Q292255J600274p242963j1317177
3046d591258p969070P4637P493026J0122429P338308J631621l489796m913735
3038E696162j289683M470634N787969l35348p689968p840154k248308k67151l975292
3029g691139m021032N025699J4028707J1654849O31061p514450q918973q218522
$$ plain form
3021 -5023800 -11297563 -10427876 222742 13603401 19935336 18816783 17769818 20032627
3013 20032627 20709479 15641300 8155710 4901712 8666708 16762457 23692756 24779689
3005 24779689 20088901 15250752 15458414 18478194 17113989 9008531 -267033 -5358707
2997 -5358707 -7898464 -12114265 -17356754 -19421514 -17499297 -15234557 -14967750 -14758810 -11976621
2988 -11976621 -6789348 -758364 5463320 11085196 13790381 12041980 8036642 5778461
2980 5778461 6153373 6420544 5289296 5672912 10110613 15427493 15492475 9149630 2013484
2971 2013484 -699259 -106142 -379261 -2055526 -1865865 1849432 6990086 11124791 14042148
2962 14042148 15943701 15712495 12639428 8038672 3416971 -1426450 -6563046 -9747512
$$ packed form
3021e023800o273763Q69687J0650618J3380659O331935j118553j046965K262809
3013B0032627O76852n068179p485590l253998L764996Q095749O930299J086933
3005B4779689m690788m838149K07662L019780j364205q105458r275564n091674
2997e358707k539757m215801n242489k064760J922217K264740K66807K08940K782189
2988a1976621N187273O030984O221684N621876K705185j748401m005338k258181
2980E778461L74912K67171j131248L83616M437701N316880O4982o342845p136146
2971B013484k712743N93117k73119j676265J89661L715297N140654M134705K917357
2962A4042148J901553k31206l073067m600756m621701m843421n136596l184466
$$ plain form
2954 -9747512 -8924340 -6349333 -6909388 -11501282 -14931811 -12209151 -4851158 1334270 3289118
2945 3289118 2798871 2270060 1625862 114036 -1420633 -1621096 -367907 1933703 5408544
2936 5408544 9483920 11761605 10080575 5402545 1164194 -112691 1418153 3866760
2928 3866760 4857083 2489784 -2890525 -7850570 -8872619 -6832608 -6530510 -10512049 -15001604
2919 -15001604 -14024912 -6921783 528864 2972051 1491643 1198256 4031594 6574048
2911 6574048 5393473 1769266 -1037655 -3159321 -7086255 -11662481 -11548103 -4717939
2903 -4717939 2789251 2899518 -5239113 -14898045 -19669739 -18963021 -16240203 -14730210 -15332671
2894 -15332671 -16881259 -18049323 -19614872 -23541246 -28479278 -28646291 -20561095 -9316624
$$ packed form
2954i747512Q23172K575007n60055m591894l430529K722660P357993O185428J954848
2945C289118m90247n28811o44198j511826j534669k00463J253189K301610L474841
2936E408544M075376K277685j681030m678030m238351j276885J530844K448607
2928C866760R90323k367299n380309m960045j022049K040011L02098l981539m489555
2919a5001604R76692P103129P450647K443187j480408k93387K833338K542454
2911F574048j180575l624207k806921k121666l926934m576226J14378O830164
2903d717939P507190J10267q138631r658932m771694P06718K722818J509993o02461
2894a5332671j548588j168064j565549l926374m938032j67013Q085196J1244471
$$ plain form
2886 -9316624 -3869225 -6585775 -11887187 -15181013 -17787079 -21455132 -23280050 -19640536
2878 -19640536 -11989647 -5379501 -3119630 -4894225 -7735903 -7132004 -323502 9319209
2870 9319209 14638943 13795823 12816833 15766438 17524479 11989065 2987016 -716720 1508014
2861 1508014 3171657 3958133 11560289 27395655 40038211 38858732 27443264 16857957
2853 16857957 10913244 5640619 -349858 -3652508 -3293996 -2428446 -2118949 -146216 2546738
2844 2546738 711713 -6992892 -14012071 -13972209 -8903443 -5627675 -7062488 -10902775 -14223911
2835 -14223911 -15228827 -12513217 -7066260 -3694988 -5962896 -10404152 -10244112 -4600405
2827 -4600405 693175 1645396 317838 -818038 -3340388 -8557796 -12851764 -11321112
$$ packed form
2886i316624N447399k716550n301412l293826k606066l668053j824918L639514
2878a9640536P650889O610146K259871j774595k841678O03899O808502R642711
2870I319209N319734q43120r78990K949605J758041n535414r002049l703736K224734
2861A508014J663643P86476P602156J5835366J2642556j179479j1415468j0585307
2853A6857957n944713n272625n990477l302650L58512Q65550L09497J972733K692954
2844B546738j835025p704605p019179L9862N068766L275768j434813l840287l321136
2835a4223911j004916K715610N446957L371272k267908m441256J60040N643707
2827d600405N293580R52221j327558j135876k522350n217408m293968J530652
$$ plain form
2819 -11321112 -3776950 5984152 14787985 21300688 25076307 27397023 30849840 35153759
2811 35153759 35952152 30995492 24523186 21355638 19753396 15491321 10149590 8442255
2803 8442255 9042303 6141578 -30985 -3095995 -2579524 -6694750 -18730420 -29254586
2795 -29254586 -28658098 -20740002 -15630166 -14043183 -8051316 4481127 15715452 19062444
2787 19062444 16941487 14897042 13769859 10924315 5508562 -551283 -4989150 -7009846
2779 -7009846 -7802338 -9443596 -12013745 -12729952 -9896783 -6070203 -4376683 -3676782 -1531487
2770 -1531487 -69421 -3117630 -8135387 -7787505 -932088 4367736 1651353 -5506506
2762 -5506506 -9293607 -7265196 -2443960 1958423 3693317 998889 -4303318 -6025295
$$ packed form
2819a1321112P544162R761102Q803833O512703L775619K320716L452817M303919
2811C5153759P98393m956660o472306l167548j602242m262075n341731j707335
2803H442255O00048k900725o172563l065010N16471m115226j2035670j0524166
2795b9254586N96488P918096N109836J586983N991867J2532443J1234325L346992
2787A9062444k120957k044445j127183k845544n415753o059845m437867k020696
2779g009846p92492j641258k570149p16207K833169L826580J693520O99901K145295
2770a531487J462066l048209n017757L47882O855417N299824k716383p157859
2762e506506l787101K028411M821236M402383J734894k694428n302207j721977
$$ plain form
2754 -6025295 -720414 6570759 8393523 4783687 1986047 2674073 3251401 870248 -2649969
2745 -2649969 -5389703 -8829435 -14125617 -18415383 -17923248 -12963103 -7570621 -5169385
2737 -5169385 -5925950 -7436196 -7252969 -5645347 -5751206 -9241637 -12193379 -8475784 1699005
2728 1699005 9842807 8179108 -1698058 -11785140 -17303871 -19754023 -21169371 -19875132
2720 -19875132 -13962352 -6115187 -1591578 -1698380 -2052467 1442723 6679486 7619453 2060884
2711 2060884 -5349715 -8741033 -7448651 -4962860 -3168716 -525243 4411468 10423990
2703 10423990 14992804 16060006 12369912 4847742 -1699265 -1516426 5413198 11929040
2695 11929040 11191047 3930536 -3697784 -7438546 -7577660 -6201260 -5196106 -6060882 -8483926
$$ packed form
2754f025295N304881P291173J822764l609836k797640O88026N77328k381153l520217
2745b649969k739734l439732n296182m289766M92135M960145N392482K401236
2737e169385p56565j510246J83227J607622j05859l490431k951742L717595J0174789
2728A699005Q143802j663699r877166j0087082n518731k450152j415348J294239
2720a9875132N912780P847165M523609j06802l54087L495190N236763R39967n558569
2711B060884p410599l391318J292382K485791J794144K643473M936711O012522
2703A0423990M568814J067202l690094p522170o547007J82839O929624O515842
2695A1929040p37993p260511p628320l740762j39114J376400J005154q64776k423044
$$ plain form
2686 -8483926 -9555961 -7310782 -4454404 -5364172 -9926449 -14099475 -16308777 -18679455
2678 -18679455 -21257665 -20244426 -14300189 -7842180 -4638474 -2361856 1951950 4631197
2670 4631197 -238741 -10456299 -16007857 -10699416 1211646 11332382 15855312 15924434
2662 15924434 13071391 7890098 1867178 -2593015 -4485966 -5343106 -7464956 -10974626
2654 -10974626 -12898434 -10204525 -4137588 209461 -26574 -1870979 -1321087 342284
2646 342284 -1267543 -6511950 -11330153 -13672975 -15398685 -17019016 -15661340 -10233323
2638 -10233323 -4057143 155591 3687376 7285017 7740001 3187506 -1919529 -2304472
2630 -2304472 97988 -1015237 -6756472 -11685628 -11814700 -9042616 -6819667 -5526811
$$ packed form
2686h483926j072035K245179K856378r09768m562277m173026k209302k370678
2678a8679455k578210J013239N944237O458009L203706K276618M313806K679247
2670D631197m869938j0217558n551558N308441J1911062J0120736M522930O9122
2662A5924434k853043n181293o022920m460193j892951q57140k121850l509670
2654a0974626j923808K693909O066937M347049k36035j844405N49892J663371
2646C42284j609827n244407m818203k342822j725710j620331J357676N428017
2638a0233323O176180M212734L531785L597641M54984m552495n107035l84943
2630b304472K402460j113225n741235m929156j29072K772084K222949J292856
$$ plain form
2622 -5526811 -3632395 -526901 3164398 6302144 7872874 8474594 10427406 13976613
2614 13976613 14476443 7178144 -5171393 -13675854 -13460032 -8799882 -6169975 -5645165
2606 -5645165 -2586913 4040994 9154473 8000386 2294920 -2323886 -4050371 -7070263
2598 -7070263 -14465154 -21757559 -21784463 -15308212 -11217445 -14394641 -19041338 -17966576 -13222358
2589 -13222358 -11380323 -12221045 -10126287 -5185630 -4467964 -11189440 -19691425 -23070057
2581 -23070057 -19913600 -12093062 -2334417 3918151 1020744 -8931956 -16328843 -15631128
2573 -15631128 -11220215 -8433393 -5538868 115050 4286562 1433176 -5973602 -10751339
2565 -10751339 -10552804 -7524765 -1683026 7588370 15345333 14716716 6887038 370016
$$ packed form
2622e526811J894416L105494L691299L137746J570730O01720J952812L549207
2614A3976613M99830p298299j2349537q504461K15822M660150K629907N24810
2606e645165L058252O627907N113479j154087n705466m618806j726485l019892
2598g070263p394891p292405k6904O476251M090767l177196m646697J074762M744218
2589a3222358J842035q40722K094758M940657P17666o721476q501985l378632
2581b3070057L156457P820538R758645O252568k897407r952700p396887O97715
2573a5631128M410913K786822K894525N653918M171512k853386p406778m777737
2565a0751339J98535L028039N841739R271396P756963o28617p829678o517022
$$ plain form
2557 370016 -308111 1203248 802388 -821851 -2221276 -4222653 -6519213 -6423279 -3421980
2548 -3421980 -457164 1203850 3497954 5996704 4376979 -2339427 -8281946 -8705946
2540 -8705946 -6889684 -8013457 -10071376 -7291912 -634995 1948018 -3723219 -12517448
2532 -12517448 -17001139 -15907516 -13206678 -11757723 -11252654 -11409304 -13697375 -18479362
2524 -18479362 -22418375 -21576914 -17333416 -16263211 -21872131 -28507469 -27083896 -16193061
2516 -16193061 -3539117 3917206 6668565 7911627 6991327 1627140 -6291446 -11738975
2508 -11738975 -12251434 -8911150 -2685053 6202718 15383088 20735268 20700469 17609611 14141310
2499 14141310 11023109 8796450 8914004 11539396 14307373 14788210 12747474 9022970
$$ packed form
2557C70016o78127J511359m00860j624239j399425k001377k296560R5934L001299
2548c421980K964816J661014K294104K498750j619725o716406n942519m24000
2540h705946J816262j123773k057919K779464O656917K583013n671237q794229
2532a2517448m483691J093623K700838J448955N05069j56650k288071m781987
2524a8479362l939013Q41461M243498J070205n608920o635338J423573J0890835
2516a6193061J2653944P456323K751359J243062r20300n364187p918586n447529
2508a1738975n12459L340284O226097Q887771R180370N352180l4799l090858l468301
2499A4141310l118201k226659J17554K625392K767977M80837k040736l724504
$$ plain form
2491 9022970 4052995 -1061565 -3796817 -2559706 987464 3579489 3877430 3275617 3911673
2482 3911673 6921665 11754232 15956616 16540738 12953629 7809879 3333703 -1446894
2474 -1446894 -7785810 -13200225 -14110749 -11937500 -11937045 -14962222 -15292762 -9442674 -2564202
2465 -2564202 -1506622 -4954711 -6429346 -5034527 -5890822 -9647628 -9558167 -2435341 4179401
2456 4179401 1589472 -7519418 -12562120 -8967823 -2289902 976637 494345 -977327
2448 -977327 -2184718 -2497283 -690889 2217909 1782627 -4920746 -14639782 -20881919 -20578521
2439 -20578521 -15860760 -10375367 -6225427 -4070832 -3850732 -4819407 -6143081 -7856241
2431 -7856241 -10425403 -13354290 -15278110 -15843693 -16573161 -18829624 -21074411 -19509149 -12732848
$$ packed form
2491I022970m969975n114560k735252J237111L547170K592025K97941o01813O36056
2482C911673L009992M832567M202384N84122l587109n143750m476176m780597
2474a446894o338916n414415r10524K173249M55l025177l30540N850088O878472
2465b564202J057580l448089j474635J394819q56295l756806Q9461P122826O614742
2456D179401k589929r108890n042702L594297O677921L266539m82292j471672
2448i77327j207391l12565J806394K908798m35282o703373r719036o242137L03398
2439b0578521M717761N485393M149940K154595K20100r68675j323674j713160
2431g856241k569162k928887j923820n65583p29468k256463k244787J565262O776301
$$ plain form
2422 -12732848 -5339729 -4843759 -13740593 -25620537 -30587051 -24228103 -10609685 2291444
2414 2291444 8643240 7748047 3696578 1764351 2862550 1915395 -5691515 -16486861
2406 -16486861 -21317700 -16050063 -6138563 1094766 4832949 8297298 11239749 9906967
2398 9906967 3682095 -3069239 -7002567 -10098098 -15780947 -22968552 -26699965 -24050386
2390 -24050386 -17078976 -9625602 -3356753 1495557 3030193 -1508387 -10856611 -18211620
2382 -18211620 -17252551 -9051481 -707044 2769115 2938316 4048293 7200410 9956491
$$ packed form
2422a2732848P393119M95970q896834j1879944m966514O358948J3618418J2901129
2414B291444O351796q95193m051469j932227J098199r47155p606910j0795346
2406a6486861m830839N267637R911500P233329L738183L464349K942451j332782
2398I906967o224872o751334l933328l095531n682849p187605l731413K649579
2390b4050386O971410P453374O268849M852310J534636m538580r348224p355009
2382a8211620R59069Q201070Q344437L476159J69201J109977L152117K756081
$$ [...]
##END NTUPLES=NMR SPECTRUM
##END=
