##TITLE=31Pdec_-33-2023
 CDCl3, 24 sc
 19.5.2023
##JCAMPDX= 6.0         $$ Bruker NMR JCAMP-DX V2.0
##DATA TYPE= NMR SPECTRUM
##DATA CLASS= NTUPLES
##ORIGIN= UXNMR, Bruker Analytische Messtechnik GmbH
##OWNER= root
$$ XWIN-NMR		Version 3.5
$$ Fri May 19 14:09:25 2023 Russian Standard Time (UT+4h)  she@DPX200
##.OBSERVE FREQUENCY= 81.013821
##.OBSERVE NUCLEUS= ^31P
##.ACQUISITION MODE= SIMULTANEOUS
##.ACQUISITION SCHEME= undefined
##.AVERAGES= 24
##.DIGITISER RES= 16
##SPECTROMETER/DATA SYSTEM= spect
##.PULSE SEQUENCE= zgpg30
##.SOLVENT NAME= CDCl3
##.SHIFT REFERENCE= (INTERNAL, CDCl3, 0, 248.564)
##AUDIT TRAIL= $$ (NUMBER, WHEN, WHO, WHERE, WHAT)
$$ ##TITLE= Audit trail, XWIN-NMR		Version 3.5
$$ ##JCAMPDX= 5.01
$$ ##ORIGIN= Bruker BioSpin GmbH
$$ ##OWNER= she
$$ F:/spectra/data/she/nmr/P31/1/pdata/1/auditp.txt
$$ ##AUDIT TRAIL=  $$ (NUMBER, WHEN, WHO, WHERE, WHAT)
(   1,<2023-05-19 14:08:01.95 +0400>,<she>,<DPX200>,
      <created by zg, POWCHK disabled, PULCHK disabled
       configuration hash MD5:
       00 E9 B6 7A A2 85 ED C7 34 08 36 98 17 FE 4E 26
       data hash MD5: 32K
       E2 4A 61 96 35 EF DC 29 F6 7B E7 A0 BF 0F FF 2D>)
(   2,<2023-05-19 14:08:05.60 +0400>,<she>,<DPX200>,
      <Start of raw data processing
       efp BC_mod = 2 LB = 1 FT_mod = 6 PKNL = 1 PHC0 = -10871.07 PHC1 = 470.0849 SI = 64K 
       data hash MD5: 64K
       74 7F CC 24 F1 AF 81 5F 1F 4E F8 2F C1 06 0D EA>)
(   3,<2023-05-19 14:08:38.00 +0400>,<she>,<DPX200>,
      <pk PHC0 = 194.7039 PHC1 = -420.2 
       data hash MD5: 64K
       C6 9B 49 4D 8C 21 ED 55 31 CC 51 66 A5 AF DB 91>)
$$ ##END=
$$ 
$$ hash MD5
$$ 0D A6 70 6C 8D C8 92 B7 C4 17 9D D5 DA 4A 70 73
##$RELAX= 
##$RELAX= 
##$RELAX= 
##$RELAX= 
##$RELAX= 
##$RELAX= 
##$RELAX= 
##$RELAX= 
##$RELAX= 
$$ Bruker specific parameters
$$ --------------------------
##$DU= <F:/spectra>
##$EXPNO= 1
##$NAME= <P31>
##$PROCNO= 1
##$TYPE= <nmr>
##$USER= <she>
##$AMP= (0..31)
100 100 100 100 100 100 100 100 100 100 100 100 100 100 100 100 100 100 
100 100 100 100 100 100 100 100 100 100 100 100 100 100 
##$AQSEQ= 0
##$AQ_mod= 1
##$AUNM= <au_zg>
##$AUTOPOS= <>
##$BF1= 81.014009
##$BF2= 200.13
##$BF3= 200.13
##$BF4= 200.13
##$BF5= 200.13
##$BF6= 200.13
##$BF7= 200.13
##$BF8= 200.13
##$BYTORDA= 1
##$CFDGTYP= 0
##$CFRGTYP= 5
##$CHEMSTR= <none>
##$CNST= (0..31)
1 1 145 1 1 1 1 1 1 1 1 1 1 1 1 1 1 1 1 1 1 1 1 1 1 1 1 1 1 1 1 1 
##$CPDPRG= <waltz16>
##$CPDPRG1= <>
##$CPDPRG2= <waltz16>
##$CPDPRG3= <>
##$CPDPRG4= <mlev>
##$CPDPRG5= <mlev>
##$CPDPRG6= <mlev>
##$CPDPRG7= <mlev>
##$CPDPRG8= <mlev>
##$CPDPRGB= <>
##$CPDPRGT= <>
##$D= (0..31)
0 1 0 0 0 0 0 0 0 0 0 0.03 2e-05 3e-06 0 0 0 0 0 0 0 0 0 0 0 0 0 0 0 0 
0 0 
##$DATE= 1684490881
##$DBL= (0..7)
120 120 120 11 120 120 24 19 
##$DBP= (0..7)
150 150 150 150 150 150 150 150 
##$DBP07= 0
##$DBPNAM0= <>
##$DBPNAM1= <>
##$DBPNAM2= <>
##$DBPNAM3= <>
##$DBPNAM4= <>
##$DBPNAM5= <>
##$DBPNAM6= <>
##$DBPNAM7= <>
##$DBPOAL= (0..7)
0.5 0.5 0.5 0.5 0.5 0.5 0.5 0.5 
##$DBPOFFS= (0..7)
$$ [...]
##$SUBNAM2= <"">
##$SUBNAM3= <"">
##$SUBNAM4= <"">
##$SUBNAM5= <"">
##$SUBNAM6= <"">
##$SUBNAM7= <"">
##$SUBNAM8= <"">
##$SUBNAM9= <"">
##$SW= 501.771253377433
##$SWIBOX= (0..15)
0 1 3 0 0 0 0 0 0 0 0 0 0 0 0 0 
##$SW_h= 40650.406504065
##$TD= 32768
##$TD0= 1
##$TE= 0
##$TE2= 300
##$TE3= 300
##$TEG= 300
##$TL= (0..7)
0 120 53 12 22 120 120 120 
##$TP= (0..7)
150 150 150 150 150 150 150 150 
##$TP07= 0
##$TPNAME0= <>
##$TPNAME1= <>
##$TPNAME2= <>
##$TPNAME3= <>
##$TPNAME4= <>
##$TPNAME5= <>
##$TPNAME6= <>
##$TPNAME7= <>
##$TPOAL= (0..7)
0.5 0.5 0.5 0.5 0.5 0.5 0.5 0.5 
##$TPOFFS= (0..7)
0 0 0 0 0 0 0 0 
##$TUNHIN= 0
##$TUNHOUT= 0
##$TUNXOUT= 0
##$USERA1= <user>
##$USERA2= <user>
##$USERA3= <user>
##$USERA4= <user>
##$USERA5= <user>
##$V9= 5
##$VALIST= <valist>
##$VCLIST= <CCCCCCCCCCCCCCC>
##$VD= 0
##$VDLIST= <DDDDDDDDDDDDDDD>
##$VPLIST= <PPPPPPPPPPPPPPP>
##$VTLIST= <TTTTTTTTTTTTTTT>
##$WBST= 1024
##$WBSW= 4
##$XGAIN= (0..3)
0 0 0 0 
##$XL= 0
##$YL= 0
##$YMAX_a= 20685
##$YMIN_a= -20696
##$ZGOPTNS= <>
##$ZL1= 120
##$ZL2= 120
##$ZL3= 120
##$ZL4= 120
##$ABSF1= 0
##$ABSF2= 0
##$ABSG= 0
##$ABSL= 0
##$ALPHA= 0
##$AQORDER= 0
##$ASSFAC= 0
##$ASSFACI= 0
##$ASSFACX= 0
##$ASSWID= 0
##$AUNMP= <proc_1d>
##$AZFE= 0.1
##$AZFW= 0.5
##$BCFW= 0
##$BC_mod= 2
##$BYTORDP= 0
##$COROFFS= 0
##$CY= -3
##$DATMOD= 1
##$DC= 0
##$DFILT= <>
##$DTYPP= 0
##$F1P= 0
##$F2P= 0
##$FCOR= 1
##$FTSIZE= 65536
##$FT_mod= 6
##$GAMMA= 0
##$GB= 0
##$INTBC= 1
##$INTSCL= 6.047779e-11
##$ISEN= 30
##$LB= 1
##$LEV0= 0
##$LPBIN= 0
##$MAXI= 10000
##$MC2= 0
##$MEAN= 0
##$ME_mod= 0
##$MI= 50
##$NCOEF= 0
##$NC_proc= -3
##$NLEV= 6
##$NOISF1= 182.463
##$NOISF2= 159.3651
##$NSP= 0
##$NTH_PI= 0
##$NZP= 0
##$OFFSET= 248.5645
##$PC= 4
##$PHC0= -10676.37
##$PHC1= 49.88489
##$PH_mod= 1
##$PKNL= yes
##$PPARMOD= 0
##$PSCAL= 0
##$PSIGN= 0
##$REVERSE= no
##$SF= 81.0140089999694
##$SI= 65536
##$SIGF1= 159.3651
##$SIGF2= -187.1042
##$SINO= 113.3802
##$SIOLD= 16384
##$SREGLST= <1H.CDCl3>
##$SSB= 0
##$STSI= 65536
##$STSR= 0
##$SW_p= 40650.406504065
##$SYMM= 0
##$S_DEV= 0
##$TDeff= 32768
##$TDoff= 0
##$TI= <>
##$TILT= no
##$TM1= 0
##$TM2= 0
##$TOPLEV= 0
##$USERP1= <user>
##$USERP2= <user>
##$USERP3= <user>
##$USERP4= <user>
##$USERP5= <user>
##$WDW= 1
##$XDIM= 65536
##$YMAX_p= 451927818
##$YMIN_p= -2450842
$$ End of Bruker specific parameters
$$ ---------------------------------
##NTUPLES= NMR SPECTRUM
##VAR_NAME=  FREQUENCY,     SPECTRUM/REAL,   SPECTRUM/IMAG
##SYMBOL=    X,             R,               I
##VAR_TYPE=  INDEPENDENT,   DEPENDENT,       DEPENDENT
##VAR_FORM=  AFFN,          ASDF,            ASDF
##VAR_DIM=   65536,         65536,           65536
##UNITS=     HZ,            ARBITRARY UNITS, ARBITRARY UNITS
##FACTOR=    0.620285442955139, 1,           1
##FIRST=     20137.2065510682, 0,            0
##LAST=      -20513.1999529968, 0,           0
##MIN=       -20513.1999529968, -2450842,    0
##MAX=       20137.2065510682, 451927818,    0
$$ Real data points
##PAGE= N=1
##DATA TABLE= (X++(R..R)), XYDATA
$$ [...]
39399a3751j13398L539O8752L345n1349P617N0788m3473j40615o6283P7702P0751
$$ -13751 -127149 -123610 -54858 -51513 -102862 -95245 -44457 -87930 -228545 -294828 -217126 -146375
39387a46375n5340p4530N7413J52797J05646O629o4139j23228j40835m3251J00489
$$ -146375 -201715 -276245 -218832 -66035 39611 46240 -17899 -141127 -281962 -325213 -224724
39376b24724J15733j910o3936Q3L8984k7320n3399N4322J28734N189j77195j63208
$$ -224724 -108991 -110901 -174837 -174754 -135770 -163090 -216489 -162167 -33433 -28244 -205439 -368647
39364c68647L4151J64877J11914J2451k939L728o6642j46639q7580R2029J75260
$$ -368647 -334496 -169619 -57705 -45254 -48193 -44465 -111107 -257746 -345326 -253297 -78037
39353g8037K0241k13556k28200K8307K75406K60396P1896l3766o253q206j00655
$$ -78037 -57796 -271352 -499552 -471245 -195839 64557 136453 102687 96434 88228 -12427
39342a2427j46759o0445M7461N2468n005j8376J6912K4364l3074j14764j39951
$$ -12427 -159186 -219631 -172170 -119702 -124707 -143083 -126171 -101807 -134881 -249645 -389596
39331c89596n2212R5603J49536M2410p5694l7091O7850K1410j37887j29162J16980
$$ -389596 -441808 -346205 -196669 -154259 -229953 -267044 -199194 -177784 -315671 -444833 -327853
39320c27853K96118J63592j06218j88051n3314O7214M7333k5732m7644j6763K7201
$$ -327853 -31735 131857 25639 -162412 -215726 -148512 -101179 -126911 -174555 -191318 -164117
39309a64117N7650O5114P4806J13650J23167R154j71081k15144n8439R9175O6462
$$ -164117 -106467 -41353 33453 147103 270270 279424 108343 -106801 -165240 -66065 397
39298C97q3881j64279j30967m6155P0624J82691J69311R327j00207j3661J07179
$$ 397 -83484 -247763 -378730 -424885 -354261 -171570 -2259 7068 -93139 -106800 379
39287C79L8986j27498j33119K0713R4202J7057m0037m609q84o3077n1839N6761
$$ 379 39365 -88133 -221252 -200539 -106337 -89280 -129317 -133926 -134810 -197887 -249726 -192965
39275a92965Q2962l4163q9295N3583K07259J37895p9912j90463j19095j1407J4704
$$ -192965 -110003 -144166 -233461 -179878 27381 165276 85364 -105099 -224194 -235601 -220897
39264b20897j6918l8384j6585M6447J05523R6081K2292l3763l2488k1971k1538
$$ -220897 -237815 -276199 -292784 -246337 -140814 -44733 -22441 -56204 -88692 -110663 -132201
39253a32201K1755R5601Q1059m8107j23889k2126J21900J07446k3632p3348j3267
$$ -132201 -110446 -14845 66214 18107 -105782 -127908 -6008 101438 77806 4458 -8809
39242h809K797o7030q1975J6083Q3299J0844r8282j06571m9215k8051j7196O5940
$$ -8809 -6012 -73042 -155017 -138934 -55635 -44791 -143073 -249644 -298859 -326910 -344106 -278166
39230b78166J72484J74382P3571j157n691l4807j33462j98269j36324q308P1038
$$ -278166 -105682 68700 142271 141114 135423 100616 -32846 -231115 -367439 -375747 -304709
39219c04709Q4627P5191L7451m1989r7208n8545J9768L2876J463L1151R8934N0590
$$ -304709 -220082 -144891 -107440 -149429 -246637 -305182 -285414 -252538 -251075 -219924 -120990 -70400
39207g0400j37579k61655j61223M5434J33803Q0443L6986O1307O0189m235l1200
$$ -70400 -207979 -469634 -630857 -585423 -451620 -371177 -334191 -272884 -212695 -216930 -248130
39196b48130M1652J20205R6312O971m0338k9892k7823n1655m9051j472L4971J4755
$$ -248130 -206478 -86273 10039 17010 -23328 -53220 -81043 -132698 -181749 -183221 -148250 -133495
39184a33495k7505k6016K7151P2610N3682k3040r5023j03278m7848J3326K8702
$$ -133495 -161000 -187016 -159865 -87255 -33573 -56613 -151636 -254914 -302762 -289436 -260734
39173b60734J4977L1723Q4496R2163m037j26540j35024k1355O0227N194q6762
$$ -260734 -245757 -214034 -129538 -37375 -41412 -167952 -302976 -324331 -264104 -258910 -345672
39162c45672n6718P9911J61979J14231K4390j1938k87K2277M9851O0297R975p5976
$$ -345672 -402390 -322479 -160500 -46269 -21879 -33817 -34104 -11827 38024 98321 108296 32320
39150C2320j05516o0160l1709o3625o8131K0497J18722J19091M8036j0006n8207
$$ 32320 -73196 -133356 -165065 -228690 -296821 -276324 -157602 -38511 9525 -481 -58688
39139e8688j32763j77217j10960K2810J08423J20020J09989Q0099L184o2036l2123
$$ -58688 -191451 -368668 -479628 -456818 -348395 -228375 -118386 -38287 -35103 -97139 -129262
39128a29262L9665K0673q1024j16164l4594M0769K7613P609N5534R1226J4517
$$ -129262 -89597 -68924 -149948 -266112 -300706 -259937 -232324 -224715 -169181 -77955 -63438
39117f3438j17210j62980q3296M3378J32839J43734P2454k0666l5242M0435Q1627
$$ -63438 -180648 -343628 -426924 -383546 -250707 -106973 -34519 -55185 -90427 -49992 31635
39106C1635o897j35533j43840k5045Q1334R7441P8780P3158M2332k9328o5248
$$ 31635 24738 -110795 -254635 -279680 -198346 -100905 -22125 51033 93365 64037 -1211
39095a211j6090L6436q282j07130j25897l0405P6524J07492Q0376L8673j5488
$$ -1211 -17301 19135 10853 -96277 -222174 -252579 -176055 -68563 11813 50486 34998
39084C4998o3815m3973M7499J03009M4070n1543o5835k4584l5647q4907n5077
$$ 34998 -28817 -72790 -25291 77718 121788 70245 4410 -20174 -55821 -140728 -195805
39073a95805N3491R6052K1418l3435L0694J10736P7941j7294n9405p2521j41370
$$ -195805 -142314 -46262 -24844 -58279 -27585 83151 161092 143798 84393 11872 -129498
39062a29498k06798j30831O1677J85786J48801M4803k0984n1717o4710k2620O9277
$$ -129498 -336296 -467127 -405450 -219664 -70863 -26060 -47044 -98761 -163471 -186091 -116814
39051a16814J10284L6214p0854q5836m114O8876N9940k251m8101m9334l1276k3512
$$ -116814 -6530 29684 -41170 -127006 -131120 -62244 -2304 -4555 -52656 -101990 -133266 -156778
39039a56778j6161J9549O9895P4175L607q8806j27604r3861k0291M8872O5264
$$ -156778 -172939 -153390 -83495 -9320 -5713 -94519 -222123 -315984 -336275 -287403 -222139
39028b22139N025o7847m1318P9413J31342J0400j53093j59228j5104R9053J00694
$$ -222139 -217114 -284961 -326279 -246866 -115524 -105124 -258217 -417445 -432549 -333496 -232802
39017b32802P8025R5966R5623K9016m2602m7394l581L0087K9756j747n1292q3215
$$ -232802 -154777 -58811 36812 65828 23226 -24168 -27749 2338 32094 30347 -20945 -104160
39005a04160p1757m5659l5370j408R1915J62862R8956n2937j21880m9293M6006
$$ -104160 -175917 -221576 -256946 -258354 -166439 -3577 95379 42442 -79438 -128731 -82725
38994h2725N9111J6914k5210o3857q0851l0445N5610P6092K0657o752L0371L9405
$$ -82725 -23614 -6700 -31910 -95767 -176618 -207063 -151453 -75361 -54704 -61456 -31085 8320
38982H320k2646n9728p985M4852P580p0984j01483q2828m5763J4259O5847L1386
$$ 8320 -14326 -74054 -82039 -37187 -29607 -100591 -202074 -284902 -330665 -316406 -250559 -219173
38970b19173o6637q7537Q960Q0662M2702J1786P4300J00896k0160j41130p8398
$$ -219173 -285810 -373347 -364387 -283725 -241023 -229237 -154937 -54041 -74201 -215331 -293729
38959b93729O6342P0260l3947l1398Q9579J24948J6645o3823k5613J6956r753
$$ -293729 -227387 -157127 -191074 -222472 -132893 -7945 8700 -55123 -80736 -63780 -73533
38948g3533j8371L2203M1187k3814l8786L9603N8001p0629j78667r0760R4327
$$ -73533 -91904 -59701 -18514 -42328 -81114 -41511 16490 -54139 -232806 -323566 -229239
38937b29239J54687O2435l6542p3782r9210j19639p7898J4574P1953O6197M8439
$$ -229239 -74552 -12117 -48659 -122441 -221651 -341290 -419188 -404614 -332661 -266464 -218025
38926b18025M2019K3905Q037L6583Q3916P4682Q662l3023k1193j4916l8300k8024
$$ -218025 -176006 -152101 -144064 -107481 -23565 51117 59779 26756 5563 -9353 -47653 -75677
38914g5677M4953R7766N4374l1528n8785l1597l2989p4036p6776j4022L6795J8571
$$ -75677 -30724 67042 121416 89888 31103 -494 -33483 -107519 -184295 -198317 -161522 -142951
38902a42951j3857J0241N9540O0644K4195J1044N797n2673j17390n4898J31440
$$ -142951 -156808 -146567 -87027 -26383 -2188 8856 14653 -38020 -155410 -210308 -78868
38891g8868K40367J30949p2214j53910r4864l7280l8280l6624k9664q4768j61961
$$ -78868 161499 292448 220234 66324 -28540 -65820 -104100 -140724 -170388 -255156 -417117
38880d17117j23122L0333J18469O2335J5353R7532J80100J03865m0308o1811O695
$$ -417117 -540239 -509906 -391437 -329102 -313749 -216217 -36117 67748 27440 -34371 -27676
38869b7676k0491j40730j51550L807J27841Q0787j6979j1464M1387J3762n4205
$$ -27676 -48167 -188897 -340447 -336640 -208799 -128012 -144991 -156455 -115068 -101306 -155511
38858a55511l7202L6906K4411q1952j17531M678J52707J56763L8173l5144J5274
$$ -155511 -192713 -155807 -131396 -213348 -330879 -326201 -173494 -16731 21442 -13702 1572
38847A572P8463J4282j43591k14042j02603O3994R6233j7309j21655j20694o6282
$$ 1572 80035 94317 -49274 -263316 -365919 -301925 -205692 -223001 -344656 -465350 -531632
38836e31632j4116O1934J52068J53544M0058l6730M1824J50101R3782p3392j17938
$$ -531632 -545748 -483814 -331746 -178202 -138144 -174874 -133050 17051 110833 37441 -80497
38825h0497N041P7806l2678j60764r2997J18939K42295J70464P874j02882j14778
$$ -80497 -75456 2350 -30328 -191092 -284089 -165150 77145 247609 255483 152601 37823
38814C7823n6638J4017L2254k2695q3564n8147M9908J26574P5417o4461j55064
$$ 37823 -18815 -4798 27456 4761 -78803 -136950 -87042 39532 114949 50488 -104576
38803a04576j14154p645M0183J0447j291M8982P3449K525p9092n9575J0453L470
$$ -104576 -218730 -226375 -186192 -175745 -177036 -128054 -54605 -52080 -131172 -190747 -180294 -176824
38791a76824n8392m0398N5865Q0429r24l9151L0895O2585m6759j60055j14617
$$ -176824 -235216 -275614 -219749 -139320 -140244 -179395 -148500 -85915 -132674 -292729 -407346
38780d07346K2517Q5941P2393Q4542J11832O1478n1840j25676j35820j23327o6000
$$ -407346 -384829 -298888 -226495 -141953 -30121 31357 -20483 -146159 -281979 -405306 -471306
38769d71306P0458J96734J89266Q6067K4605J5488l9063j23598j11946l729M5804
$$ -471306 -400848 -204114 -14848 71219 95824 111312 72249 -51349 -163295 -167024 -121220
38758a21220k3106q2289l8832K3589J1495k2796O254P0136R3818P9672P3136P3506
$$ -121220 -144326 -226615 -265447 -241858 -230363 -253159 -246905 -176769 -82951 -3279 69857 143363
38746A43363N2144O744m8955r7610j01353m1650J7908j215n8691m0329N1776Q6552
$$ 143363 195507 202251 153296 55686 -45667 -87317 -69409 -70624 -129315 -169644 -117868 -31316
38734c1316J3993n3456k9155J3418k2175r9441j23452p8617n586P5958J39456
$$ -31316 -17323 -70779 -99934 -86516 -108691 -208132 -331584 -410201 -415787 -339829 -200373
38723b00373J25431K6774o6013p6918l8411j4349l303J9127L8064M3360O0970
$$ -200373 -74942 -48168 -114181 -191099 -229510 -243859 -247162 -228035 -189971 -146611 -85641
38712h5641Q3745N7193q219j4715N8685Q5041j4678j16261o7652O8737J05876
$$ -85641 -1896 55297 47078 32363 91048 176089 161411 45150 -22502 46235 152111
38701A52111J0363p2321n4118j0071k7065p6450q3221l3185L2079O7244M3575
$$ 152111 162474 90153 36035 25964 -1101 -77551 -160772 -193957 -161878 -94634 -51059
38690e1059l1251r5330q2236n009N1826L8811j337m457K3637K5055j2469k2557
$$ -51059 -82310 -177640 -259876 -264885 -213059 -174248 -175585 -180042 -156405 -131350 -143819 -166376
38678a66376M5957J31949J22982J9624m4508L417N0921k9036j54998j37022K4694
$$ -166376 -120419 11530 134512 154136 109628 113045 163966 134930 -20068 -157090 -132396
38667a32396J17980K9940q9710o1669O6981J18919M3064n2828p4199l0259K6235
$$ -132396 -14416 15524 -74186 -135855 -68874 50045 93109 40281 -33918 -64177 -37942
38656c7942N8393M5986r800p3149r3363m1830O2982J45327J14372k6949j41734
$$ -37942 20451 66437 56637 -16512 -109875 -151705 -88723 56604 170976 144027 2293
38645B293j07964J4224O2898L116m7332j6988L3843M4599L2625J3471k0975k6629
$$ 2293 -105671 -91447 -28549 -25433 -72765 -89753 -55910 -11311 21314 34785 13810 -12819
38633a2819M0045Q5597j5943j64962j19583J04680J92451R462j58026m4455J74871
$$ -12819 27226 112823 96880 -68082 -187665 -82985 109466 118928 -39098 -83553 91318
38622I1318J71447l5697j70822j44319q8198m9136L3474R8737K8568q0725j9680
$$ 91318 262765 227068 56246 -88073 -176271 -225407 -191933 -93196 -64628 -145353 -165033
38611a65033J57046J68355l6146j74450q4568K6505n1153j78227j05154J16534
$$ -165033 -7987 160368 124222 -50228 -134796 -108291 -159444 -337671 -442825 -326291
38601c26291K10914Q4023o9493o1841N5504J03385J9991p8702o5407L0703P3311
$$ -326291 -115377 -31354 -100847 -162688 -107184 -3799 16192 -62510 -127917 -97214 -23903
38590b3903J9348k5287R833L4515m0929j25910q6420J5732J3862p1948n3721J00491
$$ -23903 -4555 -29842 -20009 14506 -26423 -152333 -238753 -223021 -209159 -281107 -334828 -234337
38578b34337J85735P3943q8539j04303J1928J11311J23890P0765l2561j54623
$$ -234337 -48602 25341 -63198 -167501 -155573 -44262 79628 150393 117832 -36791
38568c6791j99431j02782N6374J33792Q6935j016l6632m09O0715Q2835M4076j0394
$$ -36791 -236222 -339004 -282630 -148838 -61903 -62919 -99551 -99960 -39245 43590 87666 77272
38556G7272k9835l4619p2661j11647o7107N0444J18247O5380m0008j06815j26480
$$ 77272 47437 12818 -59843 -171490 -238597 -188153 -69906 -4526 -44534 -151349 -277829
38545b77829j12212l7279Q7556J61657J13623J3566k1754J3007L6394K1123J0550
$$ -277829 -390041 -427320 -339764 -178107 -64484 -50918 -72672 -59665 -23271 -2148 8402
38534H402J1575k5193r7891j11780j190J49884J78170L9380j19784j32918k2803
$$ 8402 19977 -5216 -103107 -214887 -216077 -66193 111977 151357 31573 -101345 -124148
38523a24148L9731j6431o6150M794J07640Q5842l2624p7479o693L8880j9776o9338
$$ -124148 -84417 -100848 -166998 -162204 -54564 31278 -1346 -78825 -85518 -46638 -66414 -135752
38511a35752K01J07594J05829L199o8649n4221j4483J0502M9865R1853M4172j21515
$$ -135752 -135551 -27957 77872 81071 12422 -41799 -56282 -45780 4085 95938 140110 18595
38499A8595k61016k02059J6322J59861R3799m2466m7741M3365L7801p4101p1678
$$ 18595 -242421 -444480 -428158 -268297 -174498 -216964 -264705 -221340 -183539 -257640 -329318
38488c29318J34052L04331J99660n5858j51663l6516N6318R99n8045J2295J11500
$$ -329318 -195266 109065 308725 252867 101204 64688 121006 122005 63960 76255 187755
38477A87755Q0956n1629j35193j12108n6188m1809o3120o6100j6341N1184M8845
$$ 187755 268711 217082 81889 -30219 -86407 -128216 -191336 -257436 -273777 -222593 -173748
38466a73748n5824j63422j44323r036J05499J14609N7782l869n1075n7521L051
$$ -173748 -229572 -392994 -537317 -546353 -440854 -326245 -268463 -272332 -323407 -380928 -377877
38455c77877P3547N4232l8044o9268J1046R3431Q9363N7848O8893O6297j8028
$$ -377877 -304330 -250098 -288142 -357410 -346364 -252933 -163570 -105722 -36829 29468 11440
38444A1440j10800r2369J3059P0650K8687l7436o3967p0010p3028l0874P7603
$$ 11440 -99360 -191729 -178670 -108020 -79333 -116769 -180736 -250746 -323774 -354648 -277045
38433b77045J70152J32500k5986j45772r2634O5370J28270K0122j14427j17273
$$ -277045 -106893 25607 -379 -146151 -238785 -173415 -45145 -25023 -139450 -256723
38423b56723k4575K6840J8185L6099Q6210P7303n649n7854j3951O8200J11407
$$ -256723 -281298 -254458 -236273 -200174 -113964 -36661 -42310 -100164 -114115 -45915 65492
38412F5492R8290K7289r3140j80889j32671K1077J24577R4800K041p0765j19245
$$ 65492 163782 191071 97931 -82958 -215629 -194552 -69975 24825 26866 -43899 -163144
38401a63144j32879o2938O2322J22147P4172K0157L4187N2899J3071l2385k6758
$$ -163144 -296023 -358961 -296639 -174492 -100320 -80163 -45976 6923 19994 -12391 -39149
38390c9149j3037k7569j4288M7288N5213m4191j17674l3369J05559R1217p7399
$$ -39149 -52186 -79755 -94043 -46755 8458 -35733 -153407 -186776 -81217 10000 -67399
38379f7399j87037j05248O5356J45661Q0957m2586j05562n8951L5746P0790K0124
$$ -67399 -254436 -359684 -294328 -148667 -67710 -110296 -215858 -274809 -239063 -168273 -148149
38368a48149l0941j0921M1840N5018L1830K2162L4639M0110K4321j0805n9252
$$ -148149 -179090 -190011 -148171 -93153 -61323 -39161 -4522 35588 59909 49104 -10148
38357a0148r2535p8336l5398n835K6919R5179J28860K7172j33950j51952j3352
$$ -10148 -102683 -181019 -216417 -222252 -195333 -100154 28706 55878 -78072 -230024 -243376
38346b43376N2093n9871j36157j758J55985P9932j09120q0651J70578K98820J29055
$$ -243376 -191283 -251154 -387311 -389069 -233084 -153152 -262272 -342923 -172345 126475 255530
38335B55530j08911j48654k4498P9849J02768P6806o055j39980k20814j62062
$$ 255530 146619 -2035 -26533 53316 156084 232890 226835 86855 -133959 -296021
38325b96021l4601K4122n394k9594J795L7874K2465j9325j1337P7799J81352J91069
$$ -296021 -330622 -306500 -311894 -341488 -339693 -301819 -279354 -298679 -310016 -232217 -50865 140204
38313A40204Q1895m3943p3602k0120Q914m0351j12879j29811o9902K8516R4254
$$ 140204 222099 178156 104554 84434 93348 52997 -59882 -189693 -259595 -231079 -136825
38302a36825O6440l1297q1430o604J08976J15211k126j09460j11525m7269J2639
$$ -136825 -70385 -101682 -183112 -189716 -80740 34471 32345 -77115 -188640 -235909 -223270
38291b23270N8088R2728Q8079L7293j2714k7766k7754k8933j0054K7714L6254
$$ -223270 -165182 -72454 15625 52918 40204 12438 -15316 -44249 -54303 -26589 9665
38280I665J518j8194J0560K6669k8908j03810j06689m9635k2235m0486k6280M7773
$$ 9665 11183 -7011 3549 30218 1310 -102500 -209189 -258824 -281059 -321545 -347825 -300052
38268c00052R5500N0493j8985p437O5639Q5659J9971l4168j349O0288N2985j8785
$$ -300052 -204552 -154059 -173044 -180481 -114842 -29183 -9212 -43380 -44729 15559 68544 49759
38256D9759o9720n8376j8896J2280L4487N4241P3892J00168J14758O0126p7485
$$ 49759 -19961 -78337 -97233 -84953 -50466 3775 77667 177835 292593 352719 275234
38245B75234j92798j59737o669R9050O1404l7629p4344m0772j2480k5281m9102
$$ 275234 82436 -77301 -83970 15080 76484 38855 -35489 -76261 -88741 -114022 -163124
38234a63124n0656l0313q019K936J3140M1381O7754L9674l4594n3867L6971J31257
$$ -163124 -213780 -244093 -252112 -249176 -236036 -194655 -126901 -87227 -121821 -175688 -138717 -7460
38222g460R4625k9851q9085o1248o0936j07857q4184L8429J22667Q7761K6475
$$ -7460 87165 57314 -31771 -93019 -153955 -261812 -345996 -307567 -184900 -97139 -70664
38211g0664J4656j1535q0979p9607M0556J21419L8912p6240n1746L5704P440r2631
$$ -70664 -56008 -67543 -148522 -228129 -187573 -66154 -27242 -103482 -155228 -119524 -112084 -204715
38199b04715p1520P7438J63308J03836J2046k9344o2605r6851o0634L4359O3484
$$ -204715 -276235 -198797 -35489 68347 80393 51049 -11556 -108407 -169041 -134682 -71198
38188g1198r714n9351K762R0786Q9091J7962k7824j7347J5101M0476M5824K5492
$$ -71198 -80912 -140263 -137501 -46715 42376 60338 32514 15167 30268 70744 116568 142060
38176A42060J894P830K4430r693j06288j94060j94291r3030N5650J55675J24610
$$ 142060 143954 151784 176214 166521 60233 -133827 -328118 -421148 -365498 -209823 -85213
38165h5213j2895j13780p3436L3982N8485j2526n3152J502P5526Q7448N4767L0823
$$ -85213 -98108 -211888 -285324 -251342 -192857 -205383 -258535 -257033 -181507 -94059 -39292 -8469
38153h469K7949L7667N3073M7211m88m3532j5191M8831K7900j06232k16424j64324
$$ -8469 19480 57147 110220 157431 156943 113411 98220 147051 174951 68719 -147705 -312029
38141c12029J0792J39644J18784O680o6837m7375O538K5112K8270P5332J30990
$$ -312029 -301237 -161593 -42809 -36129 -102966 -150341 -143803 -118691 -90421 -15089 115901
38130A15901P8226r4422k15603j31324Q0493J98116J23546l5427j28060j08999
$$ 115901 194127 99705 -115898 -247222 -166729 31387 154933 119506 -8554 -117553
38120a17553k8987L6475L7709j2502m7343k3612K6797M7278J8643m9864j26022
$$ -117553 -146540 -110065 -72356 -84858 -132201 -155813 -129016 -81738 -63095 -112959 -238981
38109b38981j27913P931J84973J98907J4937j40925q7272N0835M9261o2869o8805
$$ -238981 -366894 -358963 -173990 24917 39854 -101071 -188343 -137508 -88247 -151116 -219921
38098b19921P8791J85374J00910r6852k26170j83315l805J56488J39886j4928
$$ -219921 -141130 44244 145154 48302 -177868 -361183 -364988 -208500 -68614 -83542
38088h3542p4790O7701K00796R9955j08839j44783k3676J08j07181j09482O0726
$$ -83542 -158332 -90631 110165 210120 101281 -43502 -67178 -67070 -174251 -283733 -223007
38077b23007J65496O2861p1827o7410j5896m0267n8442K2654R3495L5790m6861
$$ -223007 -57511 5350 -66477 -133887 -149783 -190050 -248492 -225838 -132343 -96553 -143414
38066a43414p174Q4043P1526q027m797P2336Q1016k31m4057L321M1204j8214j24382
$$ -143414 -150588 -66545 4981 -3046 -7843 64493 145509 145278 101221 104542 145746 127532 3150
38053C150j66226j01781J3178Q7198P7753K4889j1775k8472m1297j5372P2126
$$ 3150 -163076 -264857 -251679 -164481 -86728 -61839 -73614 -102086 -143383 -158755 -86629
38042h6629J30266N2510r2628j26169k4444N1345J8128k3677K911L4899K9533
$$ -86629 43637 96147 3519 -122650 -147094 -95749 -77621 -101298 -98387 -63488 -33955
38031c3955M2260O2158j7813j61308j48559P7534K47987J34388j20446k37542
$$ -33955 8305 70463 52650 -108658 -257217 -179683 68304 202692 82246 -155296
38021a55296j78476p1344N0637J82451J85937j5871k06819j36823Q0385J30682
$$ -155296 -333772 -405116 -354479 -172028 13909 -1962 -208781 -345604 -265219 -134537
38011a34537j2607q6347J1762J03560P8130L8965M7348J6274n8632m2192O7315
$$ -134537 -147144 -233491 -221729 -118169 -40039 -1074 46274 62548 3916 -38276 29039
38000B9039P8651n6488j11476N4466K49687K58386J76411K05921K94926K61319
$$ 29039 107690 51202 -60274 -5808 243879 502265 678676 884597 1179523 1440842
37990A440842J71146K91311O64231R86681R86466P36818M94244L44105J30684
$$ 1440842 1611988 1903299 2567530 3554211 4540677 5277495 5771739 6115844 6246528
37981F246528k92841q35268j217999j236574r47732n86424l29019j86492j03438
$$ 6246528 5953687 5118419 3900420 2663846 1716114 1129690 800671 614179 510741
37972E10741o0915n0512l8706j8427k9759p3954p9829k2504M736o9117j52685
$$ 510741 449826 399314 360608 342181 312422 238468 158639 136135 140871 71754 -80931
37961h0931j13688J0147O3514J3337k2960O40j5177j02947j16307L9774K02440
$$ -80931 -194619 -184472 -120958 -107621 -130581 -129941 -145118 -248065 -364372 -324598 -122158
37950a22158J54057m5510j32688k7735O6507J917q9335l4366Q2631N6451r2065
$$ -122158 31899 -13611 -146299 -174034 -107527 -105610 -194945 -229311 -146680 -90229 -182294
37939a82294j24240N6113K44765K14250J0601j33313r9422J4282O4977L3254l948
$$ -182294 -306534 -250421 -5656 208594 219195 85882 -13540 742 65719 98973 95025
37928I5025m380q072n6381j08732q6098Q985P7183N4619k237j7058j4598n2766
$$ 95025 90645 82573 26192 -82540 -168638 -159653 -82470 -27851 -30088 -47146 -61744 -114510
37916a14510q4426j2598J25164J64493M5546q0998n0670R5209J67540O1001j38073
$$ -114510 -198936 -211534 -86370 78123 123669 42671 -7999 87210 254750 315751 177678
37905A77678k51587j79173Q204J27186O9303o9630j03024R105J23740J26175O4273
$$ 177678 -73909 -253082 -244878 -117692 -48389 -118019 -221043 -211938 -88198 37977 102250
37894A02250K4023j1233q4282j36418p6949O0399J40763J00045R470l4290j8764
$$ 102250 126273 115040 30758 -105660 -182609 -122210 18553 118598 128068 93778 75014
37883G5014l347l4249q1662o1480N5185J63918J27779k8673j17416k9282J13219
$$ 75014 71667 37418 -44244 -105724 -50539 113379 241158 212485 95069 65787 179006
37872A79006J26533J0335q6062q6653n2495m0754k6171J3041L0938j5015q6908
$$ 179006 305539 315874 229812 143159 90664 49910 23739 36780 67718 52703 -34205
37861c4205j06738m8114L9295Q5462O8838L0763J6985J6893n284k9977k970N0285
$$ -34205 -140943 -189057 -149762 -64300 4538 35301 52286 69179 63895 33918 30948 81233
37849H1233K5759q9603j47488l6313J27766J40888j13j01225o0996L640l0524
$$ 81233 106992 17389 -130099 -166412 -38646 102242 102129 904 -60092 -56452 -86976
37838h6976j01714q2088J6105P5683O1253M9051Q3681J12723Q2653J8588k4587
$$ -86976 -188690 -270778 -254673 -178990 -117737 -68686 14995 127718 210371 228959 204372
37827B04372l6415m4878p0169j02457j01267k4182J01543J58306O9973n6759m4077
$$ 204372 167957 123079 52910 -49547 -150814 -174996 -73453 84853 154826 98067 53990
37816E3990Q1200Q3215j23494k83353j45209J39557K13859L7337q4373J244Q6718
$$ 53990 135190 218405 94911 -188442 -333651 -194094 19765 57102 -27271 -26027 60691
37805F0691k181j13539n8185O2596N7033k5943k6146K0205k1502r1630k9767J08689
$$ 60691 58510 -55029 -113214 -50618 6415 -19528 -45674 -25469 -46971 -138601 -168368 -59679
37793e9679J13412l6844j56246j55238j06706l6111Q3546J46140J6080j76123
$$ -59679 53733 16889 -139357 -294595 -401301 -437412 -353866 -207726 -191646 -367769
37783c67769j49032Q6701K16867J11283q912J7674N8536M563j5247P6236J11347
$$ -367769 -516801 -430100 -213233 -101950 -110862 -93188 -34652 -30089 -45336 30900 142247
37772A42247q855r6789r102Q2175Q404p6487O855J00185j3027j78253j04847J22438
$$ 142247 133392 36603 27501 109676 118080 41593 48448 148633 135606 -42647 -147494 -25056
37760b5056J67505j2159j39258r3414k9681j9848M8536J62472J24455r4330k42694
$$ -25056 142449 130290 -8968 -102382 -132063 -151911 -103375 59097 183552 89222 -153472
37749a53472j55790J7436P3341J8969l8677o7370n4978M0601J71109J88026O0436
$$ -153472 -309262 -291826 -218485 -199516 -238193 -305563 -360541 -319940 -148831 39195 99631
37738I9631m9556l1265J0813m4939j25504r5726J1923N8026J7810m860M3540R5172
$$ 99631 50075 18810 29623 -15316 -140820 -236546 -224623 -166597 -148787 -153647 -110107 -14935
37726a4935P2632r778p2867o1274J821L7383l803q1336j11681o3303K2138Q3550
$$ -14935 57697 47919 -24948 -86222 -84401 -47018 -50821 -132157 -243838 -307141 -285003 -201453
37714b01453Q0976J1172p2978q8713j5785O9942R5643P2798L4120l4549j25876
$$ -201453 -120477 -109305 -182283 -270996 -286781 -216839 -121196 -48398 -14278 -48827 -174703
37703a74703j53622o3062O2690J06636P0860L1129P719j5020j4791J3512J2460
$$ -174703 -328325 -391387 -328697 -222061 -151201 -120072 -112353 -127373 -142164 -128652 -116192
37692a16192j6764L8136J90815K33006K2236k33615k33182l0673O1639l3954q9166
$$ -116192 -132956 -94820 95995 329001 351237 117622 -115560 -146233 -84594 -118548 -207714
37681b07714M602P7205K2064j8734N8109J19006M2211o5837o8883j9215j7510
$$ -207714 -203112 -125907 -103843 -122577 -64468 54538 96749 30912 -37971 -57186 -74696
37670g4696l3149j9468l6782j03580r4283M6995J54544Q5721l6499k7650M9663
$$ -74696 -107845 -127313 -164095 -267675 -361958 -314963 -160419 -74698 -111197 -138847 -89184
37659h9184R342j27952j68357n5165P7644J38040J58586J53237Q1900k4900o8373
$$ -89184 -79842 -207794 -376151 -431316 -353672 -215632 -57046 96191 178091 153191 84818
37648H4818l2803r34q933j6754k4956p7937j35205q7735N6714J41779P6550l6291
$$ 84818 52015 51081 42148 25394 438 -77499 -212704 -300439 -243725 -101946 -25396 -61687
37636f1687n9054n140K0371r460l1176j0111J7473J4598r659k9081k9302J399
$$ -61687 -120741 -125881 -105510 -114970 -146146 -156257 -138784 -124186 -133845 -162926 -192228 -190829
37624a90829P2029J58686J96515J30610k1155j68538k18388j43352O341J36613
$$ -190829 -118800 39886 236401 367011 345856 177318 -41070 -184422 -178081 -41468
37614d1468J59591N4930r0755j41320n2722O5034P5636j5286q3008o2406j9621
$$ -41468 118123 173053 82298 -59022 -111744 -46710 28926 13640 -69368 -131774 -151395
37603a51395k4963l9457R970R4032J02265k15j03414p9058N0438J24487M3594
$$ -151395 -176358 -215815 -205845 -111813 -9548 -9763 -113177 -192235 -141797 -17310 26284
37592B6284r4784j20649k2812M2210j4810q9089n6016L5667N5585m95k9436l475
$$ 26284 -68500 -189149 -211961 -169751 -184561 -273650 -329666 -293999 -238414 -238909 -268345 -271820
37580b71820R789k632K7109J05522J37050O3895n2759j23155j15410l7725P0199
$$ -271820 -262031 -264663 -237554 -132032 5018 68913 16154 -107001 -222411 -260136 -189937
37569a89937J16984L9287q0031q9687R237N1656l6538j13321l7072J12241J46141
$$ -189937 -72953 -33666 -113697 -203384 -194147 -142491 -179029 -292350 -329422 -217181 -71040
37558g1040K8744r0021p3047N3788J42116P7470q5973j56311l0831J35754J12503
$$ -71040 -42296 -132317 -205364 -151576 -9460 68010 -17963 -174274 -205105 -69351 43152
37547D3152o7313j28544L1895J66005N0036j52632j27577J11908K47921J27065
$$ 43152 -24161 -152705 -120810 45195 95231 -57401 -184978 -73070 174851 301916
37537C01916n8246j01652n5534o0126r3447n6448J5354O955o7237q3323k3583
$$ 301916 243670 142018 86484 26358 -67089 -123537 -108183 -101228 -168465 -251788 -275371
37526b75371k893m9513k8713J20908K18925P3249j97160k66334l5182K24867K32998
$$ -275371 -278264 -327777 -356490 -235582 -16657 56592 -140568 -406902 -442084 -217217 15781
37515A5781M5092p9654l6125N8278Q4582M6720j0320o2700p3409j3052O1880M9305
$$ 15781 60873 -18781 -54906 3372 87954 134674 124354 61654 -11755 -24807 37073 86378
37503H6378n5603j40516j17949j5605Q2276J13390O1003k5676m8146K2854P4113
$$ 86378 30775 -109741 -227690 -243295 -161019 -47629 13374 -12302 -60448 -37594 36519
37492C6519n28j14338r4842M1124R5981j648q6722k5888Q0344P7589m379l4275
$$ 36519 35991 -78347 -173189 -132065 -36084 -37732 -124454 -150342 -69998 7591 3212 -31063
37480c1063J185P913m0427o7997j8733P7095J44050J16195j1791j43003j44045
$$ -31063 -29878 -21965 -62392 -130389 -149122 -72027 72023 188218 176427 33424 -110621
37469a10621n822J19731R8442l0649j31972j37197p0786J8104P5549N2717l1179
$$ -110621 -116443 3288 101730 71081 -60891 -198088 -268874 -250770 -175221 -122504 -153683
37458a53683q2169m5460K6722O9249R2891J18377J03951K1935o1350p1280l4685
$$ -153683 -235852 -281312 -254590 -185341 -92450 25927 129878 151813 90463 19183 -15502
37447a5502k1707l4751l7478l5168m0426k0349L0595L2950n2994j09262k597J92939
$$ -15502 -37209 -71960 -109438 -144606 -185032 -205381 -174786 -141836 -194830 -304092 -306689 -113750
37435a13750K61314J28587n3075j23322r2509o2195p0051p8966o1524l4091k2819
$$ -113750 147564 276151 223076 99754 7245 -54950 -125001 -203967 -265491 -299582 -322401
37424c22401k4876p115M7137R1599O0501k5026n8608L004O9101N8180K8993O8567
$$ -322401 -347277 -354392 -307255 -215656 -155155 -180181 -238789 -235785 -166684 -108504 -79511 -10944
37412a0944J24072Q2346k8588p3000k9894j8092p6128q2706L4895J54317J20946
$$ -10944 113128 195474 166886 93886 63992 45900 -30228 -112934 -78039 76278 197224
37401A97224m0745j77664j96911j15389R747J04970R4837m557n5967K6561J22085
$$ 197224 156479 -21185 -218096 -333485 -323738 -218768 -123931 -128488 -184455 -157894 -35809
37390c5809N3486j31966j97344n6529R1787N7501o5518o4675N4304Q9220k4711
$$ -35809 17677 -114289 -311633 -368162 -276375 -218874 -284392 -349067 -294763 -205543 -230254
37379b30254j03997l12J66893J80294L1212q2657l5283P9718J01512P166r2000
$$ -230254 -334251 -334563 -167670 12624 43836 -38821 -74104 5614 107126 114292 22292
37368B2292j08307o3200j9231J1369M9345P2858L1913m9478o4452K8054J13015
$$ 22292 -86015 -149215 -168446 -157077 -107732 -34874 -2961 -52439 -116891 -88837 24178
37357B4178O4833o6231j23825p1300j5078r476P265N1913L4121p0618j32354n2760
$$ 24178 89011 22780 -101045 -172345 -187423 -196899 -189634 -137721 -103600 -174218 -306572 -359332
37345c59332Q2096J42148J32035J13409O3682m4806j19930o4958M5051N8080k7808
$$ -359332 -277236 -135088 -3053 110356 174038 129232 9302 -55656 -10605 47475 19667
37334A9667p9415l7730K7369N0979L7852R437j2694L19K6548r648r8252j01810
$$ 19667 -59748 -97478 -70109 -19130 18722 28159 15465 15784 42332 32684 -65568 -167378
37322a67378L2438J38891O6175p6711r4552j3134P567l0398k766P2149P2250K6574
$$ -167378 -134940 3951 70126 -6585 -101137 -114271 -106704 -137102 -139868 -67719 4531 31105
37310C1105O0165J20099M3581j18108j45872k7142K7628l6496n2333J5085n93
$$ 31105 91270 211369 254950 136842 -9030 -36172 -8544 -45040 -97373 -82288 -82881
37299h2881j02868o8696J21860J66997n6630k32939r3518J51184J58707k7594
$$ -82881 -185749 -254445 -132585 34412 -22218 -255157 -348675 -197491 -38784 -66378
37289f6378j17889l5834O0535P3066J8380q4786j66105q7590J23924K08297M6245
$$ -66378 -184267 -220101 -159566 -86500 -68120 -152906 -319011 -406601 -282677 -74380 -28135
37278b8135j10202k9413J09256K9440j51238j23966P0963J21692j6875p9997K2619
$$ -28135 -138337 -167750 -58494 -29054 -180292 -304258 -233295 -111603 -128478 -208475 -185856
37267a85856P7912k6389j26059r5296k8933j1018K9100J26449J80249J38477P7193
$$ -185856 -107944 -134333 -260392 -355688 -384621 -395639 -366539 -240090 -59841 78636 155829
37256A55829K6619p4901j94501j90886n4347N5597P8318J26721K15059J69025
$$ 155829 182448 107547 -86954 -277840 -332187 -276590 -198272 -71551 143508 312533
37246C12533n8956k25724j32470O8384J03160l3050j24996p4994J2784L5671L310
$$ 312533 253577 27853 -104617 -36233 66927 33877 -91119 -166113 -153329 -117658 -114348
37235a14348l9414o4379m1776K7265P2071L2379m1365m6428L1144J05672J06396
$$ -114348 -153762 -218141 -259917 -232652 -160581 -128202 -169567 -215995 -184851 -79179 27217
37224B7217L7920n9311j44241j73531j20029o592J03678J53458J20428K4112p3867
$$ 27217 65137 5826 -138415 -311946 -431975 -438567 -334889 -181431 -61003 -36891 -110758
37213a10758r7191j6552J12431J86557J39481J557j16411j17975k0638N6878L1371
$$ -110758 -207949 -224501 -112070 74487 213968 215525 99114 -18861 -39499 17379 48750
37202D8750m6302o8694k1471P616l3598q5435o7443O619N4832M4758K7775M4676
$$ 48750 2448 -66246 -87717 -80101 -113699 -199134 -266577 -259958 -205126 -160368 -132593 -87917
37190h7917M8705k4294j26570j17220N2238K31242K20020K878k31911k93045j54037
$$ -87917 -39212 -63506 -190076 -307296 -255058 -23816 196204 199082 -32829 -325874 -479911
37179d79911N6443J69593J05465m6839j04789r443R0467N6952k2641J3331J14844
$$ -479911 -423468 -253875 -148410 -195249 -300038 -309481 -219014 -162062 -184703 -171372 -56528
37168e6528R6334l4098o9283M6371J16258K2755q5368o0454J3727J4107j781N1679
$$ -56528 39806 5708 -63575 -17204 99054 121809 36441 -24013 -10286 3821 2040 53719
37156E3719R2154K3130o3505m0152K8290J3133l4531J5924J19898J20633P307
$$ 53719 145873 169003 105498 65346 93636 106769 72238 88162 208060 328693 336000
37145C36000r1246j22246j30321j11865l6633K5482j3752q3244l9422R3150J49762
$$ 336000 244754 122508 -7813 -119678 -156311 -130829 -144581 -227825 -267247 -174097 -24335
37134b4335Q1755O102m390r773n6708q9783n1377K9067P4174L1828p3896j25945
$$ -24335 57420 63522 59132 49359 -7349 -97132 -148509 -119442 -45268 -13440 -87336 -213281
37122b13281j9272J64575K02705L6554j11104n3848P9994O7981n2911q4817j4048
$$ -213281 -232553 -67978 134727 171281 60177 6329 86323 154304 101393 16576 2528
37111B528J009o9668r5399l6222P906K326J8617N9880M3278k5228l8558L0300
$$ 2528 3537 -66131 -161530 -197752 -189846 -187520 -168903 -109023 -65745 -90973 -129531 -99231
37099i9231R2041R2364N7127j51p6421j14487p6788l3160m0073k0569P6262J16812
$$ -99231 -7190 85174 142301 142150 65729 -48758 -125546 -158706 -198779 -219348 -143086 -26274
37087b6274p618j38342p2790Q1109P0708p1395r6965J5464N1194k2980j3441R6474
$$ -26274 -33892 -172234 -245024 -163915 -93207 -164602 -261567 -246103 -194909 -217889 -231330 -134856
37075a34856Q6371p6589j34781J2335J22549L5116o5139n133P7777K7186l1315
$$ -134856 -48485 -125074 -259855 -247520 -124971 -89855 -154994 -160127 -82350 -55164 -86479
37064h6479N5166J53636O9626j01821j29642j6566M5198n690n4894k7427L9826
$$ -86479 -31313 122323 191949 90128 -39514 -56080 -10882 -16572 -71466 -98893 -59067
37053e9067R2365Q7299n147j21969j26571p679O6217j737q1052l9927L5220J2720
$$ -59067 33298 120597 115450 -6519 -133090 -140769 -74552 -76289 -157341 -197268 -162048 -149328
37041a49328m1672P323J09248J07349l004q7079q9268o8273n5959l2619p479M185
$$ -149328 -191000 -183677 -74429 32920 29916 -57163 -146431 -214704 -270663 -303282 -310761 -306576
37029c06576L9373J09494J28713L9790o1442n8675o23j2013q3592j04850n9100
$$ -306576 -267203 -157709 -28996 10794 -50648 -109323 -109946 -121959 -205551 -310401 -369501
37018c69501k7364k1611L3203J48113K29049K01002Q1217o6874j70403j60721
$$ -369501 -396865 -418476 -385273 -237160 -8111 192891 274108 207234 36831 -123890
37008a23890m2862O6468N8543k8424p3702m8607k7859m4542m2950J3655Q1772
$$ -123890 -166752 -100284 -41741 -70165 -143867 -192474 -220333 -264875 -307825 -294170 -212398
36997b12398J09878J01280P8392L9465k0688q3431j21657j19504o8562K6758J24206
$$ -212398 -102520 -1240 77152 116617 95929 12498 -109159 -228663 -297225 -270467 -146261
36986a46261J50646P2076m1340o4998K7735J01517K3353j29897j47842O835J16754
$$ -146261 4385 76461 35121 -29877 -2142 99375 122728 -7169 -155011 -148176 -31422
36975c1422K0263j43890j47304m426R4470R3018Q7770Q5755o977j45601j45588
$$ -31422 -11159 -155049 -302353 -306779 -212309 -119291 -31521 54234 47257 -98344 -243932
36964b43932J5474J21192L7720q7858o9503N0357J13197Q5002L9391M035l5266
$$ -243932 -228458 -107266 -69546 -157404 -226907 -176550 -63353 21649 61040 65075 29809
36953B9809m7605O89N8520M2342m9355j36634j46824o8591M4357J05755P7003
$$ 29809 -17796 -17107 41413 83755 34400 -102234 -249058 -317649 -273292 -167537 -90534
36942i0534J3972j5104k4095m4169k3495Q1643J67536J00248n7414j20446o7171
$$ -90534 -76562 -91666 -115761 -159930 -183425 -101782 65754 166002 108588 -11858 -79029
36931g9029m3242q0683n2133N5799P9659k2391n9371P2486J87925J02017p2886
$$ -79029 -122271 -202954 -255087 -199288 -119629 -142020 -201391 -128905 59020 161037 88151
36920H8151j15900l3151K635n1428p3491K320Q9563P3915n1983j70452j35018
$$ 88151 -27749 -60900 -58265 -109693 -183184 -180864 -91301 -17386 -69369 -239821 -374839
36909c74839O0654K19366J53085n4137j47793n9860L4420L1731L0031P9409O3542
$$ -374839 -314185 -94819 58266 4129 -143664 -203524 -169104 -137373 -107342 -27933 35609
36898C5609n5094j21814o5509m3140j40470j77155j8890J53831J36266M2415P5786
$$ 35609 -19485 -141299 -206808 -249948 -390418 -567573 -586463 -432632 -296366 -253951 -178165
36887a78165J47306M4082j60066k05722p7939K643j9708K0218J53353J88231M6805
$$ -178165 -30859 13223 -146843 -352565 -430504 -427861 -447569 -427351 -273998 -85767 -38962
36876c8962r0248p4736K152M439l8569l3502J6307N9686Q8206Q7588O587j37552
$$ -38962 -129210 -203946 -201794 -197355 -235924 -269426 -253119 -193433 -105227 -17639 -11052 -148604
36864a48604k14376j30796L6213J31138R8437J2628l2999j7401J1838M178k9428
$$ -148604 -362980 -493776 -457563 -326425 -227988 -215360 -248359 -265760 -253922 -249744 -279172
36853b79172k4913M4785J12688R2364n656p9614n7712K2079N7356q890j17673
$$ -279172 -304085 -259300 -146612 -54248 -59904 -139518 -197230 -175151 -117795 -126685 -244358
36842b44358j36069j889J75931K16669Q0699p8945j02682L85R6412Q7636p046
$$ -244358 -380427 -382316 -206385 10284 90983 12038 -90644 -90259 6153 93789 86743
36831H6743q3990m4445R5681J81106Q0787j17294j83875n2177Q2002L4422j13719
$$ 86743 2753 -41692 53989 235095 315882 198588 14713 -37464 44538 78960 -34759
36820c4759j48604k6072R3629Q1734j3123o9779n3888k5533k9889l7795q845K8272
$$ -34759 -183363 -209435 -115806 -34072 -47195 -116974 -170862 -196395 -226284 -264079 -272924 -244652
36808b44652J7331j6290R115P2856L9552j17435k08417p7960J42822K06307R3634
$$ -244652 -227321 -243611 -234496 -161640 -122088 -239523 -447940 -525900 -383078 -176771 -83137
36797h3137k981Q864L8689K1029l994k2492o1579o6154M0810J69274J43176j6637
$$ -83137 -86118 -77254 -38565 -17536 -21530 -44022 -105601 -171755 -130945 38329 181505 164868
36785A64868j08812o8099k9870m8999j4410R0516J06683j5567r2387L629J41176
$$ 164868 56056 -12043 -41913 -90912 -105322 -14806 91877 76310 -16077 -12448 128728
36774A28728J48915M9954m1568q5610p5857l812N5038k838j08090q1564N0543
$$ 128728 277643 327597 286029 200419 124562 120750 175788 172950 64860 -16704 33839
36763C3839N7201j07602k01545r7321Q497m5989j11012j6680J18614J10874K4252
$$ 33839 91040 -16562 -218107 -315428 -306931 -352920 -463932 -480612 -361998 -251124 -226872
36752b26872J8544O5165N0775Q857K7474O1870L5973J12J4068J2469n1836q1667
$$ -226872 -208328 -143163 -92388 -83531 -56057 5813 41786 41898 55966 68435 16599 -65068
36740f5068j0585N4624K0895k7203q38L0574k035l1144j7948n0908j34775j08903
$$ -65068 -75653 -21029 -134 -27337 -28175 2399 364 -30780 -48728 -99636 -234411 -343314
36728c43314O2390J60572N4141q1355p7088l6170o6452l2871J55764K80594J36175
$$ -343314 -280924 -120352 -66211 -147566 -224654 -260824 -327276 -360147 -204383 76211 212386
36717B12386j10670j87697j25146r4483o1644O9314J66734P0026q7778q3934K3973
$$ 212386 101716 -85981 -211127 -305610 -367254 -297940 -131206 -61180 -148958 -232892 -208919
36706b08919M4012j303J2240K3442o2932j15445k780J04210J2925j02297J4636
$$ -208919 -164907 -166210 -153970 -130528 -193460 -308905 -311685 -207475 -194550 -296847 -282211
36695b82211K11317J58032p8218j51489k3271L8197k2932p340Q7905M6980j12932
$$ -282211 -70894 87138 8920 -142569 -165840 -127643 -150575 -157915 -70010 -23030 -135962
36684a35962j16853Q1027J99968J01775k3886k9930j1380m0494l3976J5605k1035
$$ -135962 -252815 -171788 28180 129955 106069 76139 64759 24265 -9711 5894 -15141
36673a5141j42836j67497l4850R1900R6545M2200j1297p9946j11676j6657J24236
$$ -15141 -157977 -325474 -360324 -268424 -171879 -129679 -140976 -220922 -332598 -349255 -225019
36662b25019J20467l0291j33373r7072j4001M9326J06804J14981K7524m0019M5260
$$ -225019 -104552 -134843 -268216 -365288 -379289 -329963 -223159 -108178 -80654 -120673 -75413
36651g5413J67428J16053m6904q4834l076j8281j30521j05983P9233J57698J9119
$$ -75413 92015 208068 161164 76330 73254 54973 -75548 -181531 -102298 55400 74519
36640G4519j08734m4571Q7491J08063K6359p4635j56742j48438J3391J97961J81148
$$ 74519 -34215 -78786 8705 116768 143127 68492 -88250 -236688 -223297 -25336 155812
36629A55812j2092j19250m4308K5866k2375m8909N0347J38846P1327p8326j56186
$$ 155812 143720 24470 -19838 6028 -16347 -65256 -14909 123937 195264 116938 -39248
36618c9248j30915n6798K0753N4063J9227j7143J2810M0820k7454j12772p0747
$$ -39248 -170163 -226961 -206208 -152145 -132918 -150061 -137251 -96431 -123885 -236657 -307404
36607c07404N1612R3604O1406P6216R3831k8306k05278j84914M0095J87208J07262
$$ -307404 -255792 -162188 -100782 -24566 69265 40959 -164319 -349233 -309138 -121930 -14668
36596a4668l0905m9208P543L1093J8204M742Q527O3721J48578J17488r6221k83603
$$ -14668 -45573 -94781 -87238 -56145 -37941 -33199 -24672 39049 187627 305115 208894 -74709
36584g4709k12157Q082R4795L8738M1858R0902o343j85169j56447Q4501K05505
$$ -74709 -286866 -278784 -183989 -145251 -103393 -12491 -18834 -204003 -360450 -275949 -70444
36573g0444P9533l2409L6566R4134k2443j54092j22262j8670J2123J6518O4182
$$ -70444 9089 -23320 13246 107380 84937 -69155 -191417 -210087 -197964 -181446 -117264
36562a17264P2178j5915p9147j8640O9516O6899J4119o932j8103n9053r0863p5444
$$ -117264 -45086 -61001 -140148 -158788 -89272 -22373 -8254 -15186 -33289 -92342 -183205 -258649
36550b58649l7351K556M3656N0079N408n409Q0497J52242P8176n6598p7929j6735
$$ -258649 -296000 -293444 -249788 -199709 -194301 -199710 -119213 33029 111205 54607 -23322 -40057
36538d0057l1546r9138n3759R7190J66211Q5203k7618q1030p6134j0642P4392
$$ -40057 -71603 -170741 -224500 -127310 38901 124104 96486 15456 -60678 -71320 3072
36527C072M7016r9355j29208P8661K46112R1686j81610j84194M5161J57224Q3619
$$ 3072 50088 -49267 -178475 -99814 146298 237984 56374 -127820 -82659 74565 158184
36516A58184M2417N9233l0654j70079j49780l6071n9819j48331n6204J19917Q7500
$$ 158184 200601 259834 229180 59101 -90679 -126750 -186569 -334900 -391104 -271187 -183687
36505a83687n9029K0415K41368J91851j07290j97139J2903J03636q0698j87308
$$ -183687 -242716 -222301 19067 210918 103628 -93511 -80608 23028 -57670 -244978
36495b44978m8156L5326q3121j09720R3480K13129O6535o1994M4306J65425R4216
$$ -244978 -293134 -257808 -340929 -450649 -357169 -144040 -77505 -139499 -95193 70232 164448
36484A64448j2921l057M56o4618k7335J29684J50893k4995j28025o2321o5331
$$ 164448 151527 148470 148926 84308 56973 186657 337550 312555 184530 122209 56878
36473E6878j90692j58105Q0019J67873k4830j50704j5693R1235j8194p2838J10081
$$ 56878 -133814 -291919 -211900 -44027 -68857 -219561 -235254 -144019 -162213 -235051 -124970
36462a24970K47945J12631n9629k2462P1893L9534j380M1270J4284j07405q8340
$$ -124970 122975 235606 175977 153515 225408 264942 263562 304832 319116 211711 123371
36451A23371Q9120J12904o8772r9852J06073J56200p4860j53201J09283K41101
$$ 123371 212491 325395 256623 156771 262844 419044 344184 190983 300266 541367
36441E41367o3606l67641k38016M6818P2120j1225P6068J43483m1629k14944q5521
$$ 541367 477761 110120 -127896 -81078 -8958 -20183 55885 199368 157739 -57205 -142726
36430a42726J04264M7777m4915J03022K48883P7794j77333j48819J7209l932j05337
$$ -142726 -38462 9315 -35600 67422 316305 394099 216766 67947 85156 81224 -24113
36419b4113l7127O0301l0586j16255L4643J91078P6853q5096J185J21123k5544
$$ -24113 -61240 -939 -31525 -147780 -113137 77941 154794 69698 70883 192006 166462
36408A66462k01103n1649K04270J53260o7021n5051J06051N1520j49722j37739
$$ 166462 -34641 -86290 117980 271240 204219 149168 255219 306739 157017 19278
36398A9278O3048J25842K5156n603L2807j9888q1075N708Q7078l1420j49617l119
$$ 19278 82326 208168 233324 227721 260528 240640 159565 165273 252351 220931 71314 68195
36386F8195J98173Q8537j98657k31289K1649J99780J42120J4321m7208l3330O7007
$$ 68195 266368 354905 156248 -75041 -53392 146388 288508 302829 255621 222291 289298
36375B89298J77527J03558j36265k15719q011J57959M2882j06861m5360L6478
$$ 289298 466825 570383 434118 218399 210388 368347 411229 304368 259008 295486
36365B95486n2988r8542O2959J46121n6636k22493n7750J65888J35968O3810J91212
$$ 295486 242498 143956 206915 353036 296400 73907 16157 182045 318013 381823 573035
36354E73035K48429r046k28082m7272K27396J79783L4601J80036M13835L69330
$$ 573035 821464 812418 584336 537064 764460 944243 978844 1158880 1572715 1942045
36344A942045K37198L32117L79747J360m89147n45953k88223j83733j97739k2414
$$ 1942045 2179243 2511360 2891107 2892467 2403320 1857367 1569144 1385411 1187672 1165258
36334A165258J89878J00167j18955j05728j5709j71417l43293j44021J82875J48211
$$ 1165258 1355136 1455303 1336348 1230620 1214911 1043494 700201 556180 739055 887266
36324H87266j07979j04214R9019P8252j38782j86383o4517l4752m8296P6073J71683
$$ 887266 779287 675073 774092 852344 713562 527179 462662 427910 379614 455687 627370
36313F27370K9878j29379o3705P967j12975j33697J21603K13557j28889l62964
$$ 627370 657248 527869 464164 472131 359156 225459 347062 560619 431730 68766
36303F8766l0434L60317J98087j51010n9515K13402J00439j51068J367K98239
$$ 68766 38332 398649 596736 445726 386211 599613 700052 548984 550351 848590
36293H48590J78850j22673n3194J74586M0583k21862q9440K07972J57287l2378
$$ 848590 1027440 904767 851573 1026159 1066742 844880 755440 963412 1120699 1088321
36283A088321O6032J53918j63688m22939r3467L26676J69702j51585K1005K65788
$$ 1088321 1154353 1308271 1144583 721644 628177 954853 1124555 972970 993975 1259763
36273A259763p0513m73534j65002L42473J37359l64083k05482K86875J73607k53243
$$ 1259763 1189250 715716 550714 893187 1030546 666463 460981 747856 921463 668220
36263F68220p0516M23949K80911k24849j37759K87338J22975l25802r8363M51325
$$ 668220 597704 1021653 1302564 1077715 939956 1227294 1350269 1024467 926104 1377429
36253A377429K68693l12816j67023M24963L12107k59037j38330M13846K18902
$$ 1377429 1646122 1333306 1166283 1591246 1903353 1644316 1505986 1919832 2138734
36244B138734m25421k39667N14272M70955k07382j70334M56127L57029k98066
$$ 2138734 1713313 1473646 1987918 2458873 2251491 2081157 2537284 2894313 2596247
36235B596247j60532N69172M78885k36801j30420O01956N21284q2473K80046J163728
$$ 2596247 2435715 3004887 3483772 3246971 3116551 3718507 4239791 4157318 4437364 5601092
36225E601092Q81347p3547J80029J148078Q19955j90442M26084K037605J992187
$$ 5601092 6482439 6408892 6588921 7736999 8556954 8366512 8792596 10830201 12822388
36216A2822388Q32530J515041L656562M176398L603085N475387R291474J1096679
$$ 12822388 13654918 15169959 18826521 23002919 26606004 32081391 41372865 52469544
36208E2469544J1558991J5341522K1475898K4214477K6033308L8124737O1629540
$$ 52469544 64028535 79370057 100845955 125060432 151093740 189218477 250848017
36201B50848017P8976930P2624920M3977153N500798l5471514p2852823r1573613
$$ 250848017 329824947 402449867 446427020 451927818 416456304 343603481 252029868
36194B52029868p9606919m8196287k3655738j7406643j7739550j2725713o163927
$$ 252029868 172422949 124226662 100570924 83164281 65424731 52699018 46535091
36187D6535091n508973p753761o376734k922070k458095l896894l106592r75931
$$ 46535091 41026118 33272357 26895623 23973553 21515458 17618564 14511972 13536041
36179A3536041r85585k293745j791671k10766l24828j441740j005591L40701J73250
$$ 13536041 12550456 10256711 8465040 8254274 7929446 6487706 5482115 5822816 5996066
36170E996066r94731r04706Q8914J2839p71777n02268L68081J43781o86319m49009
$$ 5996066 5001335 4096629 4185543 4198382 3426605 2924337 3292418 3436199 2749880 2300871
36160B300871L82785J58888o79782m91051L54513K39239n64321n04030K46404
$$ 2300871 2683656 2842544 2162762 1671711 2026224 2265463 1701142 1197112 1443516
36151A443516K58582l32644k35068L65803K24776m36414l64378K45448J60704
$$ 1443516 1702098 1369454 1134386 1500189 1724965 1288551 924173 1169621 1330325
36142A330325m39330l22832L70472L92139k38927l55083J25620K12886j45080
$$ 1330325 890995 568163 938635 1330774 1091847 736764 862384 1075270 930190
36133I30190j04499K47911P7131m16780k98770K49563K32948k47743k25467K33123
$$ 930190 825691 1073602 1150733 733953 435183 684746 917694 669951 444484 677607
36123F77607J93305k84914k68043K18984K58508j76723k32472J28823J24271k32187
$$ 677607 870912 585998 317955 536939 795447 618724 386252 515075 639346 407159
36113D07159j62556K78982K62007j97819k51442J62408K50234q5038j35339J61777
$$ 407159 244603 523585 785592 587773 336331 498739 748973 663935 528596 690373
36103F90373J41599k00855j87774J60162J39439k30537k30787J23041R5895k93976
$$ 690373 831972 631117 443343 603505 742944 512407 281620 404661 500556 206580
36093B06580k59646K28704L41475o4818k13654J11147K30854p0723j87680O5606
$$ 206580 -53066 175638 517113 452295 238641 349788 580642 509919 322239 387845
36083C87845J26439j46778j96636R3671J62307r7983j27560J60002J79667j60848
$$ 387845 514284 367506 170870 264541 426848 328865 201305 361307 540974 380126
36073C80126k47996N2685J40051j44202k12884J15427K70965L2198j03971N9706
$$ 380126 132130 184815 324866 180664 -32220 83207 354172 386370 282399 342105
36063C42105R3071q9387M75L83548M26588L3266o1927M14160P43954M34784l5916
$$ 342105 435176 345789 346264 729812 1156400 1189666 1127739 1541899 2285853 2720637 2684721
36052B684721j74197k21192m37772n19570k66157n5687j50389k36966q9755Q585
$$ 2684721 2510524 2289332 1851560 1331990 1065833 1010146 859757 622791 533036 541621
36042E41621j01539j11199R7802J52831q8471k19461m0060P4448q6847j72236
$$ 541621 440082 328883 426685 579516 491045 271584 231524 305972 219125 46889
36032D6889K3649J54198O162r2305O2947J45361m8402j85521l8575Q6140l7070
$$ 46889 70538 224736 230898 138593 201540 346901 298499 112978 74403 160543 123473
36021A23473j20323M9585J77230K4974j41758p7484P091p9862j19354N0113J70027
$$ 123473 3150 52735 229965 254939 113181 35697 42788 -37074 -156428 -106315 63712
36010F3712M2377j01782o2497k5139j20896j18867R7128K20004M3400j56129j06833
$$ 63712 106089 4307 -58190 -83329 -204225 -323092 -225964 -5960 37440 -118689 -225522
35999b25522K4437K1660J0569J19578J65464K0817r2367l566Q6096j704p8704
$$ -225522 -201085 -179425 -168856 -49278 116186 137003 44636 41070 127166 125462 46758
35988D6758L9154J65044P0109j23028j75001r5184j9267L3818P5307N0855j4184
$$ 46758 85912 250956 321065 198037 23036 -72148 -91415 -57597 17710 68565 54381
35977E4381p069M6381J2950n5897J5909J62326J38467l9946j24242r3210j33268
$$ 54381 47312 93693 106643 50746 66655 228981 367448 327502 203260 110050 -23218
35966b3218j75492K2107L15718K80398n9402k09076k2530Q8179p7759j80182j3176
$$ -23218 -198710 -176603 139115 419513 360111 151035 128505 216684 138925 -41257 -54433
35955e4433J18897r49j08793O729J09621l306j16395l0703O5279r539q5380o193
$$ -54433 64464 63515 -45278 -38549 71072 67766 -48629 -79332 -14053 -23592 -108972 -115165
35943a15165O4218o432n0354M7793J15388N3879M0339J38587J24118p5123j90671
$$ -115165 -50947 -57379 -107733 -59940 55448 109327 149666 288253 412371 337248 146577
35932A46577r2051j2079p1273m7802J34281J79248l5379j74534j8766J48224N7932
$$ 146577 54526 42447 -28826 -76628 57653 236901 201522 26988 8222 156446 214378
35921B14378q8737l8189O5533P396r9579p9381j0143J0105N8848J13940j0631
$$ 214378 125641 87452 152985 160381 60802 -18579 -28722 -18617 40231 154171 143540
35910A43540k34624j90216J29154K35473m2862k03827Q4569L77992J94802j79710
$$ 143540 -91084 -281300 -152146 83327 40465 -163362 -78793 299199 494001 314291
35900C14291k13344L428L9406q3926l1255J61152J60865m6290j61935r8503l4471
$$ 314291 100947 104375 143781 59855 28600 189752 350617 304327 142392 43889 9418
35889I418l4176j2650J0606l0781m5994N7085J47460P8028m6442o4892l0254l8541
$$ 9418 -24758 -37408 -26802 -57583 -103577 -46492 100968 178996 132554 67662 37408 -1133
35877a133j5876P3098O0580j14505k06392n5469J05777M3829p3521K25J48487
$$ -1133 -17009 56089 116669 2164 -204228 -259697 -153920 -110091 -183612 -183387 -34900
35866c4900J29631M257k8408Q602K774J6016J06928J33043K1998l5122N1508L9328
$$ -34900 94731 98988 70580 79182 81956 97972 204900 337943 359941 324819 376327 415655
35854D15655j91766l19035r8254J60566Q8337j15485n6057J58099J44231n9344
$$ 415655 223889 -95146 -193400 -32834 55503 -59982 -116039 42060 186291 126947
35844A26947j00546L8482N6991r1024j53270n9354J4760K1117O4509J05897K8951
$$ 126947 26401 64883 121874 30850 -122420 -181774 -167014 -145897 -81388 24509 53460
35833E3460o5116k512J08974M2892j25687j41124j0161N6487M3222Q2526J12617
$$ 53460 -11656 -14168 94806 137698 12011 -129113 -139274 -82787 -39565 42961 155578
35822A55578j4745j74548j25260N1391P3835m8175o0663N5026P4130k8904m2352
$$ 155578 140833 -33715 -158975 -107584 -33749 -81924 -142587 -87561 -13431 -42335 -84687
35811h4687Q1608J66594J45345J02071K0143j55166k63720j23174R3138P9404
$$ -84687 -3079 163515 308860 410931 431074 275908 12188 -110986 -17848 61556
35801F1556p5138l5649J59565J42879j16307k30551o1542O5139l9829j27478j8330
$$ 61556 -13582 -49231 110334 253213 136906 -93645 -155187 -90048 -129877 -257355 -275685
35790b75685O8707l3937r4748Q9882K81451J73652r3205j60417m027R1969K586
$$ -275685 -206978 -240915 -335663 -245781 35670 209322 116117 -44300 -48327 43642 46228
35779D6228j14296j15039l3516M6006Q5508N9270l0942j01900n8562P7245J80909
$$ 46228 -68068 -183107 -216623 -170617 -85109 -25839 -56781 -158681 -217243 -139998 40911
35768D0911J64541N4803n4249q9890n3976p453M84k5177o0837r5805j00896l4368
$$ 40911 205452 260255 206006 116116 62140 54687 55171 29994 -30843 -126648 -227544 -261912
35756b61912O7566Q5169k1205j18639o7434R0868K09135K22785J55641K3079j37014
$$ -261912 -194346 -109177 -130382 -249021 -316455 -225587 -16452 206333 361974 385053 248039
35745B48039k07524j14792L5599Q0180J5307l2061o977L2140M1791L6228K1093
$$ 248039 40515 -74277 -38678 41502 56809 24748 17771 49911 91702 127930 149023
35734A49023j0225l4434l5303m5686q1318q9191l2104M3271Q6488J07668J06877
$$ 149023 138798 104364 69061 23375 -57943 -147134 -179238 -135967 -49479 58189 165066
35723A65066N0622k2389j0695O5574N5366o2062j02099J8728J14489L0959r8571
$$ 165066 215688 193299 182604 248178 303544 241482 139383 158111 272600 303559 204988
35712B04988r8412m2556o3962p0416O4979J94875R9462j16501j59080j2126N9329
$$ 204988 106576 64020 58 -70358 -5379 189496 288958 172457 13377 1251 60580
35701F0580m7551j43825r1388R200L9994L9880P3930J07003Q4896J7859n8154
$$ 60580 13029 -130796 -222184 -212984 -172990 -133110 -59180 47823 132719 150578 92424
35690I2424j07760q3435J9728J17521J29890P7197J2594n7902j11979q8990k2954
$$ 92424 -15336 -98771 -79043 38478 168368 245565 258159 200257 88278 -712 -23666
35679b3666m3981j36853r4731J30035K54344O9750j94769j98842L344J05730N0968
$$ -23666 -67647 -204500 -299231 -169196 85148 154898 -39871 -238713 -235369 -129639 -78671
35668g8671L0670Q2207N9405l0558k0098Q3272Q5630m2874j15372o3491k8912
$$ -78671 -48001 34206 93611 63053 42955 126227 211857 168983 53611 -9880 -38792
35657c8792o7684m8413P7027J57205Q8073l4563q6566o0160Q796Q6699R6352K4
$$ -38792 -106476 -154889 -77862 79343 167416 132853 46287 -13873 -5077 81622 177974 177998
35645A77998p6471P002J53067J42089j9977j12691n9229j4970p0847j22352q7338
$$ 177998 101527 108529 261596 403685 383708 271017 211788 196818 125971 3619 -83719
35634h3719k4822J6083N4918N4787m3509j40342o7704J10915J45524j1442j26672
$$ -83719 -108541 -92458 -37540 17247 -26262 -166604 -234308 -123393 22131 10689 -115983
35623a15983o1645M4585N9359N2154Q3938N9210n8738j16178k2814O5488l458
$$ -115983 -177628 -133043 -73684 -21530 62408 121618 62880 -53298 -76112 -10624 -14082
35612a4082j23495j13244n572M0357O025K967O2818J03571P3527O440m4587m5540
$$ -14082 -137577 -250821 -256393 -216036 -210011 -207044 -144226 -40655 32872 39312 -5275 -50815
35600e0815J2799Q5280R0715J0420p5002q3192j8561N4278P1308K460j06138j31960
$$ -50815 -38016 47264 137979 148399 73397 -9795 -28356 25922 97230 99690 -6448 -138408
35588a38408o605J61687J97465Q3628l5438p1109p6032r5184p6242J3437R7106
$$ -138408 -145013 16674 214139 297767 262329 191220 115188 20004 -56238 -42801 54305
35577E4305R2598L1560Q495N4917J12926J16976P9320Q6766J94401L40717M29902
$$ 54305 146903 178463 186958 241875 354801 471777 551097 637863 832264 1172981 1602883
35566A602883M77207N67894P07013Q93056J303101K059356K696670K289794N00498
$$ 1602883 2080090 2647984 3354997 4248053 5551154 7610510 10307180 12596974 13097472
35557A3097472j738945l020316k847961j892515j016058n20726l22814l15424
$$ 13097472 11358527 8338211 5490250 3597735 2581677 2060951 1738137 1422713
35549A422713l54948k61986o0248K4478o8281j24957k8892M8374k3648r8905m0842
$$ 1422713 1067765 805779 745531 770009 701728 576771 547879 596253 572605 473700 432858
35538D32858J6461p4659j74051p2400J41265J98209N2155q1671o1826J2647p737
$$ 432858 449319 374660 200609 128209 269474 467683 519838 438167 376341 388988 381251
35527C81251j16472j86422j36346j8419M7569J5258l8491k7663K8602O3510P2325
$$ 381251 264779 78357 -57989 -76408 -28839 -13581 -52072 -79735 -51133 12377 84702
35516H4702P4425L3080o6515j23560n0290O3665P4318J1596O788N2064L6438k8633
$$ 84702 159127 192207 125692 2132 -48158 15507 89825 101421 108209 160273 196711 168078
35504A68078m2836l4714j04894j85010j15122N6508J25530P0510M7240N9085k9784
$$ 168078 125242 90528 -14366 -199376 -314498 -257990 -132460 -61950 -14710 44375 14591
35493A4591j43945m5164K06982K52228P540j68632o3693O1620k6126j23569n383
$$ 14591 -129354 -174518 32464 284692 292232 123600 59907 121527 95401 -28168 -33551
35482c3551J27317O852j97994j68518J0837L2879p5583m0292J25896J41029k7914
$$ -33551 93766 100618 -97376 -265894 -255057 -222178 -297761 -338053 -212157 -71128 -99042
35471i9042j08522r061N1242l1847p3834L1792J16701N7642o657M7693R7081J2138
$$ -99042 -207564 -216625 -165383 -197230 -271064 -239272 -122571 -64929 -71586 -23893 73188 85326
35459H5326q6331l3210Q4976P0404o1432j28216r1000q6721j49011j16909R5448
$$ 85326 -1005 -34215 50761 121165 59733 -68483 -159483 -246204 -395215 -512124 -416676
35448d16676L04169K73088M4571j04199k9339J06437Q9668m5671j05065l8805
$$ -416676 -112507 160581 205152 100953 71614 178051 267719 222048 116983 78178
35438G8178J3759k3881n2690M833N7611M527q2104o5564L9189R2595L4553n6003
$$ 78178 91937 68056 15366 20199 77810 82337 233 -65331 -26142 66453 101006 45003
35426D5003q7633m7873J8982N0593L386q4631j01875j814J11232J14729L7845
$$ 45003 -42630 -90503 -71521 -20928 -17542 -102173 -204048 -205862 -94630 20099 57944
35415E7944O82K6044L0871j4848m9112m3412m0338m0599J8076J14880J07463o0684
$$ 57944 58626 84670 115541 100693 51581 8169 -32169 -72768 -54692 60188 167651 106967
35403A06967k13491j40432J05452K54479J67748n020o1408p348J4918l9618r1867
$$ 106967 -106524 -246956 -141504 112975 280723 275703 214295 206947 221865 182247 90380
35392I0380r6217q2447n0780L3590J22260R8211m4018j57750j43307o6405r076
$$ 90380 -5837 -88284 -139064 -105474 16786 114997 70979 -86771 -230078 -296483 -305559
35381c05559O2903J79170K36713J33334n6958j78263j90716j45827m7505J07591
$$ -305559 -242656 -63486 173227 306561 249603 71340 -119376 -265203 -312708 -205117
35371b05117K17544J72900L0272o4161q0900q0820m2657Q6532K04855J44432m5394
$$ -205117 12427 185327 215599 151438 70538 -10282 -52939 33593 238448 382880 337486
35360C37486j28008l4762L0144p9499k21038j88228r940J19551J07937L1183j1808
$$ 337486 209478 174716 204860 125361 -95677 -283905 -293845 -174294 -66357 -35174 -46982
35349d6982o615j959l4465p3302n1585K0049L1396n8165j08302Q679J73802J68020
$$ -46982 -53597 -55556 -90021 -163323 -214908 -194859 -163463 -221628 -329930 -321251 -147449 20571
35337B0571J2591o0404J8544N6395o8141k04118j73427k2863R4255J27099R7870
$$ 20571 33162 -27242 -8698 47697 -20444 -224562 -397989 -420852 -326597 -199498 -101628
35326a01628J3854o8840l5997J04298J68409N4845q3089p1396J4051k730q5284
$$ -101628 -87774 -156614 -192611 -88313 80096 134941 51852 -19544 -5493 -8223 -93507
35315i3507m5913J22013J98784N9440j41919j88826p6584L3149N6660O3696J13050
$$ -93507 -139420 -17407 181377 240817 98898 -89928 -166512 -133363 -76703 -13007 100043
35304A00043J31581L3994j06036j30644l6000J1006n9637r9221M289J09830M3436
$$ 100043 231624 265618 159582 28938 -7062 3944 -55693 -154914 -150625 -40795 2641
35293B641r1845o3486J03760J56722K3363p9200l543J11125Q7096l4181j10731
$$ 2641 -89204 -152690 -48930 107792 131155 51955 48412 159537 246633 212452 101721
35282A01721j12423q5148l3113L9220O6119Q253o9965q3433k2327P1934J48184
$$ 101721 -10702 -95850 -128963 -89743 -23624 -15371 -85336 -168769 -191096 -119162 29022
35271B9022J46977N5495l5793l8339q504n0882j14454o7963M4632M7585n9753
$$ 29022 175999 231494 195701 157362 148858 97976 -16478 -84441 -39809 7776 -51977
35260e1977q5890K1197Q3732J1805m9916k718L5727j8666m5036L2923O1501p3847
$$ -51977 -137867 -116670 -32938 -21133 -71049 -73767 -38040 -56706 -101742 -68819 -7318 -81165
35248h1165k00240j09957J01784J87617J11140K9665Q697k2705q5522j13982q1550
$$ -81165 -281405 -391362 -289578 -101961 9179 38844 47541 24836 -60686 -174668 -256218
35237b56218k4691K5624L8315k2195j05725q1477O8344J76886J25862K3394J9875
$$ -256218 -280909 -255285 -216970 -239165 -344890 -426367 -358023 -181137 -55275 -31881 -12006
35226a2006P4759N8469k4297p1843n7566j9920L7104J02249J03150J8977m5362
$$ -12006 62753 121222 96925 25082 -32484 -52404 -15300 86949 190099 209076 163714
35215A63714j5810K5353q926n3886k6349O666m8964j28153j07356n016P1600R7303
$$ 163714 147904 173257 164331 110445 84096 90762 41798 -86355 -193711 -198727 -127127 -29824
35203b9824J02672O4368l1275r6651n6524K4432N3727N7148Q5741Q5347K397q4842
$$ -29824 72848 137216 105941 9290 -47234 -22802 30925 88073 173814 259161 261558 176716
35191A76716q8851o4058q7612r9410k1683O8724N8751o580j8700o84l3658p6455
$$ 176716 87865 23807 -63805 -163215 -184898 -116174 -57423 -64003 -82703 -83387 -117045 -193500
35179a93500l7548M7708Q0712O8005O8952N8592M86l5976M683K6599n9684j45699
$$ -193500 -231048 -183340 -102628 -34623 34329 92921 93407 57431 62114 88713 29029 -116670
35167a16670q4937N1296Q5795K1608k229K1879k4255j37705j68263n1712R6451
$$ -116670 -201607 -150311 -64516 -42908 -45137 -23258 -47513 -185218 -353481 -405193 -308742
35156c08742J37146M5828r0996j37648k4772J32937J41053J0640k8215J08463
$$ -308742 -171596 -125768 -216764 -354412 -379184 -246247 -105194 -94554 -122769 -14306
35146a4306J98885P3910j02889j24848p4029j00584j02180N4185J92124P6969
$$ -14306 184579 258489 155600 30752 -43277 -143861 -246041 -191856 268 77237
35136G7237j47868j65003m053M8903k7388K751J40156J22533p9308j73160l9292
$$ 77237 -70631 -235634 -239687 -190784 -218172 -215421 -75265 47268 -32040 -205200 -244492
35125b44492Q7140M1555l2693p722J0775n6605r1893k5826K1621p407J5954J37390
$$ -244492 -157352 -115797 -148490 -156212 -145437 -202042 -293935 -319761 -298140 -305547 -289593 -152203
35113a52203J87787P2811n4237n8753k4631m3533m7865m030k3497j16278q6853
$$ -152203 35584 108395 54158 -4595 -29226 -72759 -120624 -124654 -148151 -264429 -351282
35102c51282J31329K83007J59296n9448q1554N4276Q5353n2009j71011j39533
$$ -351282 -219953 63054 222350 162902 81348 135624 220977 168968 -2043 -141576
35092a41576j2367J05216J50122R2392k6653q9304m0735L3229N1124M6489L7645
$$ -141576 -153943 -48727 101395 193787 167134 77830 37095 70324 121448 167937 205582
35081B05582n7664k28949k56462m082K89136K67134m3168k50849j34066R3446
$$ 205582 147918 -81031 -337493 -341575 -52439 214695 171527 -79322 -213388 -119942
35071a19942J29122j6590j10951n3766L8044N4768L3364L9957M3325p830o2095
$$ -119942 9180 -7410 -118361 -172127 -134083 -79315 -45951 -5994 37331 29501 -32594
35060c2594l5254L3532K7798m4042m4047N4971Q9744l4095j59099j01684O4566
$$ -32594 -67848 -34316 -6518 -50560 -94607 -39636 50108 16013 -143086 -244770 -180204
35049a80204J28594N1155l4740o1757o8927n3370J9482Q6676N6990j7579j9019
$$ -180204 -51610 -455 -35195 -96952 -165879 -219249 -199767 -113091 -56101 -73680 -92699
35038i2699L0325K8573M149M7490R3087J9795q3824l9507P2984J3975j74521j88551
$$ -92699 -62374 -33801 -29652 17838 110925 130720 46896 7389 80373 94348 -80173 -268724
35026b68724K5276J55680L7083r7950m2403O0573K7326n0930l9352j7467n8071
$$ -268724 -243448 -87768 -50685 -148635 -191038 -130465 -103139 -154069 -193421 -210888 -268959
35015b68959k5489J36922J90446j9386k19500r9579J67468J89899j6056r1893
$$ -268959 -294448 -157526 32920 13534 -205966 -305545 -138077 51822 35766 -56127
35005e6127N2391J31671j236j44692j32722p3617p4506l2426J28653K52057J73574
$$ -56127 -3736 127935 126699 -17993 -150715 -224332 -298838 -331264 -202611 49446 223020
34994B23020j2834r9465o5733o1905j48474k07061j19127O7882J95470J78549
$$ 223020 210186 110721 44988 -16917 -165391 -372452 -491579 -423697 -228227 -49678
34984d9678R0888N2278O7335M2591m2572q4779k0305O3055N9406M307M81N0719
$$ -49678 41210 93488 160823 203414 160842 76063 55758 118813 178219 182526 183007 233726
34972B33726P2582L1946l8531j10816j56850j21826m172Q3637M2071o6427j03039
$$ 233726 306308 338254 299723 188907 32057 -89769 -93941 -10304 31767 -34660 -137699
34961a37699m7765P758K8013N9882J00196P4011k8127j03273p0801K3572P7457
$$ -137699 -185464 -177706 -149693 -89811 10385 84396 56269 -47004 -117805 -94233 -16776
34950a6776N0385j5301n1323k4421K9997L4585m0460j25668j26681l9568M8857
$$ -16776 33609 18308 -33015 -57436 -27439 7146 -33314 -158982 -285663 -325231 -276374
34939b76374P1742N1285M4233N0282J5854o0248p6520L8030J59563P6775j85421
$$ -276374 -204632 -153347 -109114 -58832 -42978 -103226 -179746 -141716 17847 94622 -90799
34928i0799l15084j22791J55868J82996J3231k9050J06900J45111m614q0805M9951
$$ -90799 -405883 -528674 -372806 -189810 -176579 -205629 -98729 46382 41768 -39037 10914
34917A0914J31105l6912k23956j44297O8036R9170l5958q6672k0211j1153o8722
$$ 10914 142019 105107 -118849 -263146 -195110 -95940 -131898 -218570 -238781 -249934 -318656
34906c18656m0949N1479L5307p1205o7994O0537J13066L6949M171O6703O0523
$$ -318656 -359605 -308126 -272819 -344024 -412018 -351481 -238415 -201466 -197295 -130592 -70069
34895g0069n4899p9428P1365J84922R3163o2763r1323m3147m7537o1816J347O5153
$$ -70069 -124968 -204396 -133031 51891 145054 82291 -9032 -52179 -99716 -161532 -160185 -95032
34883i5032K5170m0895q225O8898O9696L4647O5112R0626k6386k08316k28125
$$ -95032 -69862 -110757 -118982 -50084 19612 54259 119371 209997 183611 -24705 -252830
34872b52830n3220R8070P5328k1892l7459K8000P4699N6048l957o6943r4742o2387
$$ -252830 -306050 -207980 -132652 -154544 -192003 -164003 -89304 -33256 -37213 -104156 -198898 -261285
34860b61285P439O3831Q8458R1839O6585J1453k0169J7212O6450L5384n0553p8579
$$ -261285 -253846 -190015 -101557 -9718 56867 68320 48151 65363 131813 167197 116644 38065
34848C8065l3569k0444p5511r8931l5388J9145j4002m7576K4811J34207J39716
$$ 38065 4496 -15948 -91459 -190390 -225778 -206633 -220635 -268211 -243400 -109193 30523
34837C0523N9241L2464Q5049R8854K2796m9669n1594m2744p6709r9257o0834j8298
$$ 30523 89764 122228 207277 306131 328927 279258 227664 184920 108211 8954 -51880 -70178
34825g0178l0727m9175j2230L1993J1711l1585j5826K8607J4719l0814l200Q5305
$$ -70178 -100905 -150080 -162310 -130317 -118606 -150191 -166017 -137410 -122691 -153505 -156705 -71400
34813g1400J00345l393j10183j22997p9241l1942M6366J54115J81111O1544q1574
$$ -71400 28945 25552 -84631 -207628 -286869 -318811 -272445 -118330 62781 124325 42751
34802D2751q0686L8537R7823K1276q2159r8464m8415q913N695K0878K6314n648
$$ 42751 -37935 602 98425 119701 37542 -60922 -109337 -118250 -112555 -91677 -65363 -71011
34790g1011n4683o4833j6982M9121Q4437P5149L8929J740j6544j2799m921j2244
$$ -71011 -125694 -190527 -207509 -158388 -73951 1198 40127 41867 25323 12524 7603 -4641
34778d641k6929k1539P607K7669J6418m203j0498k3846o5960r0723l4426O7394
$$ -4641 -31570 -53109 -45502 -17833 -1415 -5618 -16116 -39962 -105922 -196645 -231071 -163677
34766a63677J00105L1479l6423k3990R210j8270n8776j4496Q1583R1105k7543
$$ -163677 -63572 -32093 -68516 -92506 -83296 -101566 -160342 -174838 -93255 -2150 -29693
34755b9693j52169j53202l8409Q0421J08920M5873k3706j7413L8058L4713m4586
$$ -29693 -181862 -335064 -373473 -293052 -184132 -138259 -161965 -179378 -141320 -106607 -151193
34744a51193o7603M6965J64596J11344n5862j33325q4044n7342r2851l9946J53391
$$ -151193 -218796 -171831 -7235 104109 48247 -85078 -169122 -226464 -319315 -359261 -205870
34733b05870K87722J82187o0841k03760j68514n1922M7475Q1754K1390r1452j26235
$$ -205870 81852 264039 203198 -562 -169076 -220998 -173523 -91769 -70379 -161831 -288066
34722b88066k7458P2817L3772p4229p7984K6223Q0799K8201j3247L9709J08168
$$ -288066 -315524 -242707 -208935 -283164 -361148 -334925 -254126 -225925 -239172 -199463 -91295
34711i1295R6005L5219P012J0750k725k9515k8987n698K174p03K5613O9893O0012
$$ -91295 4710 39929 46941 57691 54966 25451 -3536 -9234 -7060 -7763 17850 87743 147755
34698A47755l1108j23153j22300m5688J0173J1640K0684P1198R8418M3513m1327
$$ 147755 116647 -6506 -128806 -174494 -164321 -152681 -131997 -60799 37619 81132 39805
34687C9805o3386j3397N4047J12416J50087J16689p908j24453j15386k0026J5434
$$ 39805 -23581 -36978 17069 129485 279572 396261 388353 263900 148514 128488 143922
34676A43922m1042p0094j857P9563P3996o074q8747j25286q5505K7792J27961
$$ 143922 102880 32786 30929 110492 184488 178414 89667 -35619 -121124 -93332 34629
34665C4629J11075R03p7756q3033q2847q5947j6045R9046R9841n1260j65318r8329
$$ 34629 145704 146607 68851 -14182 -97029 -182976 -199021 -99975 -134 -51394 -216712 -315041
34653c15041L2684M9566j6698k6398J8566J8345j1107L3025J33845J60138P5214
$$ -315041 -282357 -232791 -249489 -275887 -257321 -238976 -250083 -217058 -83213 76925 152139
34642A52139j4387l0616j3818k0156l7428l3229j0150J2435K3767J9691L898j5710
$$ 152139 137752 107136 93318 73162 35734 2505 -7645 4790 28557 48248 52146 36436
34630C6436m0318o0199l3636M4679P2584m2242j92426j61819N2536J97466J28311
$$ 36436 -3882 -64081 -97717 -53038 19546 -22696 -215122 -376941 -324405 -126939 1372
34619A372J4050M0554J12059M9112q6568j10398l6443j9653n8248k2911O2688
$$ 1372 15422 55976 168035 217147 130579 20181 -16262 -35915 -94163 -117074 -54386
34608e4386M5786n8361o5457N2328J03066L459p6447n12J16007J05767m547q0681
$$ -54386 -8600 -66961 -132418 -80090 22976 26435 -50012 -50524 65483 171250 166703 86022
34596H6022q0598m6515n112K1191m24l4321J1970J21895J40995J0665r9479k5971
$$ 86022 5424 -41091 -46203 -25012 -25436 -59757 -47787 74108 215103 225768 126289 100318
34584A00318J29789J39858j4994j15990m485K27658L66240K95674P1437j53068
$$ 100318 230107 369965 354971 238981 234496 462154 828394 1124068 1195505 1042437
34574A042437k50821k21568j74028j77509j67977o6244N7088N4170o4517j08626
$$ 1042437 791616 570048 396020 218511 50534 -15710 41378 95548 31031 -77595
34564g7595J7690J49577Q8517r6144j58649l7756O5403J0140p5897k8575P6084
$$ -77595 -59905 89672 178189 82045 -76604 -114360 -48957 -38817 -114714 -143289 -67205
34553f7205O1584l8496l6620P7682J05696k5724j30293o2657N0477K7727p9313
$$ -67205 -5621 -44117 -80737 -3055 102641 76917 -53376 -116033 -65556 -37829 -117142
34542a17142r7110j8872J4513l2984m9549K1644J01554J21470J14400J17368R1173
$$ -117142 -214252 -233124 -218611 -251595 -301144 -279500 -177946 -56476 57924 175292 266465
34531B66465J39r6383r9265L314J07583J04497N437p1434n5797j7003m1970p7522
$$ 266465 266604 170221 70956 74270 181853 286350 291787 220353 164556 147553 105583 28061
34519B8061j3909J02406J04321k5884j03408k6295O9549N0001l369K6919O4696
$$ 28061 14152 116558 220879 194995 91587 65292 134841 184842 181473 208392 273088
34508B73088j2927j28293j24682m3471m6227j19976j05265N681N0809m713k515
$$ 273088 260161 131868 7186 -36285 -82512 -202488 -307753 -302072 -251263 -255976 -258491
34497b58491J14898J77241O4243q5041q4662K2007N7190j4022o0819l170Q5437
$$ -258491 -143593 33648 97891 12850 -71812 -49805 7385 -6637 -67456 -70626 14811
34486A4811R9998L5594l1007m1878j3099o134n8597j42970j89939j48340k8518
$$ 14811 114809 150403 119396 77518 64419 58285 -312 -143282 -333221 -481561 -510079
34475e10079R8216J51414J20450Q1021R3292J05688L2343q8308j19127k4913O9116
$$ -510079 -411863 -260449 -139999 -58978 34314 140002 172345 84037 -35090 -60003 9113
34464I113O1465K89l3201m7411o7840n7172k290K3679j5214l4915K4062P4011
$$ 9113 70578 70867 37666 -9745 -77585 -134757 -137047 -113368 -128582 -163497 -139435 -65424
34452f5424J9405p7621r5165l0790L3809O3696N8224K163o5418m3719O0777R1776
$$ -65424 -46019 -123640 -218805 -249595 -215786 -152090 -93866 -91703 -157121 -200840 -140063 -48287
34440d8287q554p0093K9168J32713N7098q9663q9486K0885M1973l0697k9198O6317
$$ -48287 -56841 -126934 -97766 34947 92045 2382 -87104 -66219 -24246 -54943 -84141 -17824
34428a7824J09225N5303n230m8495j05361j03463K0076J12632j86j77326j38740
$$ -17824 91401 146704 141474 92979 -12382 -115845 -95769 16863 16677 -160649 -299389
34417b99389P0051J46737M3322J1759J11131R5860j00538j91858k8394J23921
$$ -299389 -229338 -82601 -39279 -27520 83611 179471 78933 -112925 -141319 -17398
34407a7398K7441j35834q8486R5503J56304O1901j8353j4689M899k725l5421r2281
$$ -17398 10043 -125791 -214277 -118774 37530 99431 81078 66389 71288 68563 33142 -59139
34395e9139j14967j2893J47999J55455l0556j67753q3435P3192J01171N4546O9169
$$ -59139 -174106 -186999 -39000 116455 85899 -81854 -165289 -92097 9074 63620 132789
34384A32789Q4577j0991j17879p3433N0717N7367n1110r9900l7506K4029L0455
$$ 132789 217366 206375 88496 15063 65780 123147 72037 -27863 -65369 -41340 -10885
34373a0885L7959N9290L8500k4344o8864q0794q1444m6908M2052J12317P9209
$$ -10885 27074 86364 124864 100520 31656 -49138 -130582 -177490 -135438 -23121 56088
34362E6088k4500j00343j12395p7042k957O7096N1765k9447k6726J09514J97499
$$ 56088 31588 -68755 -181150 -258192 -261149 -194053 -142288 -171735 -198461 -88947 108552
34351A08552P8145j21321j62136l4061P8668R4086Q0831N6839l4455j44427j24429
$$ 108552 186697 65376 -96760 -130821 -52153 41933 122764 179603 145148 721 -123708
34340a23708M1273J69215J08466p1292j78681j15650M3643J45013J07843M87n2813
$$ -123708 -82435 86780 195246 123954 -54727 -170377 -126734 18279 126122 126609 73796
34329G3796k9685p056j0636J2234N0118J2780q5633j01469q447J9844r4049j50756
$$ 73796 44111 37055 26419 38653 88771 101551 15918 -85551 -93998 -74154 -168203 -318959
34317c18959J9052K40565K28444J1892j32225r5468k5822l1271m9107k7991k1720
$$ -318959 -299907 -59342 169102 180994 48769 -46699 -72521 -103792 -152899 -180890 -202610
34306b02610n6242p2641m2906q985J2263M5474Q0159Q7219Q8218J00285O5835
$$ -202610 -258852 -331493 -374399 -383384 -371121 -325647 -245488 -158269 -70051 30234 96069
34295I6069l5457q0218K7285J50296Q8563r8403j65230n7890K8368j2361n2257
$$ 96069 60612 -19606 7679 157975 246538 148135 -17095 -74985 -46617 -58978 -111235
34284a11235O914O2931K0560l0344J2325O9899K2640o9828n4468O6636J27449
$$ -111235 -104321 -41390 -20830 -51174 -38849 31050 53690 -16138 -70606 -3970 123479
34273A23479L3839j07266j28100q258J02678O6307p1012j27563j7957J24841J12791
$$ 123479 157318 50052 -78048 -86306 16372 82679 11667 -115896 -133853 -9012 103779
34262A03779n5581j93531j54274P049J10832N5712p0816r2110L3940J39172O9341
$$ 103779 48198 -145333 -299607 -292558 -181726 -126014 -196830 -288940 -255000 -115828 -46487
34251d6487p4325p3390N6308Q0159n0213q7390Q2422J92172J7314k09881j41307
$$ -46487 -120812 -194202 -137894 -57735 -107948 -195338 -112916 79256 96570 -113311 -254618
34240b54618J16418J65302m4099j55747L797J85647J58074K6842k9385l9797q1938
$$ -254618 -138200 27102 -16997 -172744 -168947 16700 174774 201616 172231 132434 50496
34229E0496r0799j2079N2297K0852j8495J2989K9392m3200j00721l5209P4636
$$ 50496 -40303 -52382 -85 20767 2272 15261 44653 1453 -99268 -134477 -59841
34218e9841J07767Q9948P5552n057j85491k89377j44109J24664K38828J45015
$$ -59841 47926 137874 213426 208369 22878 -266499 -410608 -285944 -47116 97899
34208I7899K6387j2068l3907o1795k1564O6285N9821o6086j45752p9383Q984j2970
$$ 97899 124286 112218 78311 16516 -5048 61237 121058 54972 -90780 -170163 -161179 -174149
34196a74149o6718j1703J04286J25818N6085M6604J26942J38638m607j60316j68617
$$ -174149 -240867 -252570 -148284 -22466 33619 80223 207165 345803 341196 180880 12263
34185A2263q7253o7518q8663o380J62508K15126P2487p9040o7041J0361k9464
$$ 12263 -74990 -142508 -231171 -237551 -75043 140083 212570 133530 66489 76850 47386
34174D7386j36151j10675M8712J25362L5100l3553O6182J80416Q5344j46265k24611
$$ 47386 -88765 -199440 -150728 -25366 9734 -23819 42363 222779 308123 161858 -62753
34163f2753n9340J11483O1646j22445j93882q6244M5999P9056M9211J7331l6589
$$ -62753 -122093 -10610 51036 -71409 -265291 -351535 -305536 -226480 -177269 -159938 -196527
34152a96527j08965r8265M1830J71726J38123J2118j6333N4981M3437r4829j64131
$$ -196527 -305492 -403757 -361927 -190201 -52078 -39960 -56293 -1312 42125 -52704 -216835
34141b16835l3864J51250J90082R4942K877m3409p0147m8162L5117P5222l878
$$ -216835 -250699 -99449 90633 185575 188452 145043 74896 26734 61851 137073 133195
34130A33195q8359m0468N3428Q719j38645j71766m1370O0266J2466o2977k3432
$$ 133195 44836 4368 57796 66515 -72130 -243896 -285266 -225000 -212534 -275511 -298943
34119b98943Q0225J11845M4738m1242o5286O589J28725J63558J7150j85819k02466
$$ -298943 -218718 -106873 -62135 -103377 -168663 -162074 -33349 130209 147359 -38460 -240926
34108b40926J784J74509J06803r3864j72882o1056R1795J44413R5459J9351k0419
$$ -240926 -239142 -64633 42170 -51694 -224576 -285632 -193837 -49424 46035 65386 44967
34097D4967J80M8144M9196k5445j03149r2292p166M3375m110q2333p3488L8769
$$ 44967 45147 93291 142487 117042 13893 -78399 -85565 -42190 -46300 -128633 -202121 -163352
34085a63352J32626R1295l9781j03919m7263J0840k9126q6248l2947R3073J46343
$$ -163352 -30726 60569 20788 -83131 -130394 -119554 -148680 -234928 -267875 -174802 -28459
34074b8459R1967J9215k9906q2191r5952J2800J78741K06988N1150r6915q4034
$$ -28459 63508 82723 52817 -29374 -125326 -112526 66215 273203 324353 227438 143404
34063A43404l227r195p3150p4121k4632k9002p5430m4604Q4221J85196J62625
$$ 143404 140177 130982 57832 -16289 -40921 -69923 -145353 -189957 -105736 79460 242085
34052B42085N8516m0301j00183j14213p0972J251L0588m339l3120l651J8860n5072
$$ 242085 300601 260300 160117 45904 -25068 -23817 6771 2432 -30688 -34339 -15479 -70551
34040g0551j73499j74602r357J61426J61956K8272n4560o421P1673P6149L1727
$$ -70551 -244050 -418652 -428009 -266583 -104627 -76355 -130915 -137336 -65663 10486 42213
34029D2213O70k4815o2186o1840J1916Q7619P6950J3601j268L7638L7200m0771
$$ 42213 42883 18068 -44118 -105958 -94042 -6423 70527 84128 82860 120498 157698 116927
34017A16927j19562j11683j3292J09019J68929J08550m1234j57320j41106l0460
$$ 116927 -2635 -114318 -127610 -18591 150338 258888 217654 60334 -80772 -111232
34007a11232N5368O0415K2827j3719m6712p7665q6121m6290N0374J63375J89279
$$ -111232 -55864 4551 27378 13659 -33053 -110718 -196839 -243129 -192755 -29380 159899
33996A59899N6221j35964j74876o577J60605J26972l0436r9788n0134k3518o4046
$$ 159899 216120 80156 -94720 -101297 59308 186280 155844 56056 5922 -17596 -81642
33985h1642n9371L6030J02636L9170q7839j43707q7641J3772P3547N4157q169
$$ -81642 -141013 -104983 -2347 36823 -51016 -194723 -282364 -268592 -195045 -140888 -149057
33974a49057m1098k1723M040Q604J9335K9556k2189j12098r6062P1036K07212
$$ -149057 -190155 -211878 -207838 -199234 -179899 -150343 -172532 -284630 -380692 -309656 -102444
33963a02444J45560j1041n5506Q128K2964l0371l4618J9441K3987k7612l5987
$$ -102444 43116 32075 -23431 -15303 7661 -22710 -57328 -37887 -13900 -41512 -77499
33952g7499k396k4645q8458p6784R798N4427M7570R0169J67420J47367K3619o5471
$$ -77499 -79895 -104540 -192998 -269782 -259984 -205557 -157987 -67818 99602 246969 270588 205117
33940B05117p7843r9150j22421m7296P8049Q0562l3638p3197m369j743q9892o1173
$$ 205117 127274 28124 -94297 -141593 -63544 17018 -16620 -89817 -94186 -95929 -185821 -246994
33928b46994J31143K23953N7581j57693j80514p4812n743M3007J25100J38365
$$ -246994 -115851 108102 165683 7990 -172524 -247336 -253079 -210072 -84972 53393
33918E3393J3956r6967m8415O7485J08522J04430R6106j6158k32182k98060p2206
$$ 53393 67349 -29618 -78033 -10548 97974 202404 298510 282352 50170 -247890 -320096
33907c20096J72642J27034o9350o9431J10885J52939k1560j61372j26147n4165
$$ -320096 -147454 -20420 -89770 -159201 -48316 104623 83063 -78309 -204456 -258621
33897b58621n2636l8204M3140R9688P2645J9941k6257r0295j16010m248J80158
$$ -258621 -311257 -349461 -306321 -206633 -133988 -114047 -140304 -230599 -346609 -350857 -170699
33886a70699K38424J14726m0311j11338j33721j35309o5018N8655J11189N1095
$$ -170699 67725 182451 142140 30802 -102919 -238228 -303246 -244591 -133402 -82307
33876h2307j0620L70J3577l1480o8708l5687N862j4738l9467K5599J37781J50963
$$ -82307 -92927 -92557 -78980 -110460 -179168 -214855 -208993 -223731 -263198 -237599 -99818 51145
33864E1145J5368j37805j44865r129J01254P1385r118P175Q2082M7753r6120j40692
$$ 51145 66513 -71292 -216157 -225286 -124032 -52647 -61765 -54590 27492 75245 -20875 -161567
33852a61567K264J33645P1754o0069m4666P7647R8982j3946j07002j10822r3765
$$ -161567 -159303 -25658 46096 -13973 -58639 19008 117990 104044 -2958 -113780 -207545
33841b07545p2869M755R8162R7207J7345j5847K2937M3426K5492L2052M5460r503
$$ -207545 -280414 -275659 -177497 -80290 -62945 -78792 -55855 -12429 13063 45115 90575 81072
33829H1072q1233l9698Q1815J10581J9176m2080k8303o5007j65924j49901M3145
$$ 81072 -161 -39859 41956 152537 171713 129633 101330 36323 -129601 -279502 -236357
33818b36357J98086J41114n156n7666o3133j39715j95874o4199J74667K54399
$$ -236357 -38271 102843 97687 40021 -23112 -162827 -358701 -422900 -248233 6166
33808F166Q9215j29220k05011j32545l971J11943J55593P9668o6071j44422q3399
$$ 6166 95381 -33839 -238850 -371395 -375366 -263423 -107830 -28162 -94233 -238655 -322054
33797c22054M1411J10506Q5446N557p0275q4421j3764P1869N3669p2426j45119
$$ -322054 -280643 -170137 -84691 -79134 -149409 -233830 -247594 -175725 -122056 -194482 -339601
33786c39601m1225J25987J37671k2229j40984q8381Q113j0878q3850n0930P4181
$$ -339601 -380826 -254839 -117168 -139397 -280381 -368762 -360649 -371527 -455377 -506307 -432126
33775d32126J36567R2908M6718M6684L1124j6869l2943j2833k0829l3339M3243
$$ -432126 -295559 -202651 -155933 -109249 -78125 -94994 -127937 -140770 -161599 -194938 -151695
33764a51695J64739J62018J9698p1368k2386J7988n1909j04221l8850J0259p3470
$$ -151695 13044 175062 194760 123392 101006 118994 67085 -37136 -75986 -65727 -139197
33753a39197j45399m4558J03827R4261q280q296N9840J8646r7944r6175K2619
$$ -139197 -284596 -329154 -225327 -131066 -139346 -147642 -87802 -69156 -167100 -263275 -240656
33742b40656P3288K7535K8323O9540o415j55907j23169J19789K49068O4561j92591
$$ -240656 -167368 -139833 -111510 -41970 -48385 -204292 -327461 -207672 41396 105957 -86634
33731h6634k01381j2604R3512L8525j4373L0213Q2734N8174N397J173K3424m842
$$ -86634 -288015 -300619 -207107 -168582 -182955 -152742 -70008 -11834 -6437 -5264 18160 13318
33719A3318q6605j26924n7208N3667P6797O712k9958K0475N1228q308m6049M6470
$$ 13318 -73287 -200211 -257419 -203752 -126955 -120243 -150201 -129726 -78498 -86806 -132855 -86385
33707h6385J60882J22917k7896j02603n2261J583p886k5752j4131J3105O4407
$$ -86385 74497 197414 169518 66915 14654 16237 8351 -17401 -31532 -18427 45980
33696D5980J16611N1852j55337k70689p8989K24472K30231r2421l26392k01799
$$ 45980 162591 214443 59106 -211583 -290572 -66100 164131 71710 -254682 -456481
33686d56481N9984J34042L7392j0195M5308Q5295N3856Q380l043J3305L1834K0576
$$ -456481 -396497 -262455 -225063 -235258 -189950 -104655 -50799 -42419 -45462 -32157 -323 20253
33674B0253k7585n4071m735O2867N0657j9794n2712n2909q7921j10517k5335Q9252
$$ 20253 -7332 -61403 -66138 -3271 47386 27592 -25120 -78029 -165950 -276467 -301802 -212550
33662b12550O4377n5245n4263Q2072J27389P804o3416M4139J60405J18056J5774
$$ -212550 -148173 -203418 -257681 -175609 -48220 -40416 -103832 -59693 100712 218768 234542
33651B34542N263L7844L250o3418p6107m1193J4868R4184J17457k5919k31972
$$ 234542 239805 277649 280899 217481 141374 100181 115049 209233 326690 300771 68799
33640F8799k34755j3418J25790R799j49822j33504l8624j9138j836Q8872J10782
$$ 68799 -165956 -179374 -53584 -43785 -193607 -327111 -365735 -384873 -386709 -297837 -187055
33629a87055j4025p2560Q0966K10498P9862j11181n8667J10420P2153j06219r0346
$$ -187055 -201080 -273640 -192674 17824 97686 -13495 -72162 38258 110411 4192 -86154
33618h6154J13887J66827j2795j27563j9983J06635P5710j5039l9989l3135k9944
$$ -86154 27733 194560 181765 54202 34219 140854 216564 201525 161536 128401 98457
33607I8457J2633O1974K0804o1702l9019M9055J7342j15618j25084K3196R6689
$$ 98457 111090 173064 193868 132166 93147 142202 159544 43926 -81158 -57962 38727
33596C8727K985n4027M6071J21433K4821q6397l0111Q8167P2980l6690p0150j4809
$$ 38727 41712 -12315 33756 155189 180010 93613 63502 151669 224649 187959 117809 103000
33584A03000J1517j6169k1291J9159N2617L8391l2017j36650j89428j05436N1195
$$ 103000 114517 98348 77057 96216 148833 187224 155207 18557 -170871 -276307 -225112
33573b25112J13935N9551M6665J38624J76194M3092j23850j45351o7278m5780
$$ -225112 -111177 -51626 -4961 133663 309857 352949 229099 83748 16470 -29310
33563b9310r0409j00385n9297j8760L3844J23089J67250P9897n7938q6880J512
$$ -29310 -119719 -220104 -279401 -298161 -264317 -141228 26022 105919 47981 -38899 -37387
33552c7387P1247N1464j242l2607m7275m0493K795L7114l550q6741j03385k2361
$$ -37387 33860 85324 84082 51475 4200 -36293 -33498 3616 66 -86675 -190060 -212421
33540b12421O4362O8292M655m9368m1462J9729P6461P4650K9310P773K6161K4829
$$ -212421 -148059 -79767 -75112 -124480 -165942 -146213 -69752 4898 34208 41981 68142 92971
33528I2971j3385q878P2395J12711r10j77589k20349r1268N9062J09547P5287
$$ 92971 79586 70708 143103 255814 254904 77315 -143034 -234302 -175240 -65693 9594
33517I594M458p5824r4297K0308J81456J89471R719j44266j06704Q625J2947n2917
$$ 9594 14052 -61772 -156069 -135761 45695 235166 244885 100619 -6085 2540 15487 -37430
33505c7430j3799J17366J41549J423j11335n0003O4657L7793j06466j71561o9788
$$ -37430 -51229 66137 207686 209109 97774 47771 112428 150221 43755 -127806 -197594
33494a97594P9743J27763O4178j2233k7848m941j7250q6328j34597p6028N2574
$$ -197594 -117851 9912 74090 61857 34009 29068 11818 -74510 -209107 -285135 -232561
33483b32561J19736P6179J5405J2538N629p4479j50696j04582K6822J00821Q0658
$$ -232561 -112825 -36646 -21241 -8703 -3074 -77553 -228249 -332831 -306009 -205188 -124530
33472a24530N1978M6932Q537o1734p6775j6993L0556K4860K6010N6598N1525q58
$$ -124530 -72552 -25620 -17083 -78817 -155592 -172585 -142029 -117169 -91159 -34561 16964 16106
33460A6106j6054K0820P88j09215j68138p8612M1706M4976j9871k1618K4533J9555
$$ 16106 52 20872 21660 -87555 -255693 -334305 -292599 -247623 -267494 -289112 -264579 -245024
33448b45024j3296K6257J13372J22297L1303n6484q1336o7805j6901Q6115J62982
$$ -245024 -258320 -232063 -118691 3606 34909 -21575 -102911 -170716 -187617 -101502 61480
33437F1480J02917n1058j24860n2204M5573N5307J6548J5248M6361N3627K7362
$$ 61480 164397 113339 -11521 -63725 -18152 37155 53703 68951 115312 168939 196301
33426A96301k953k2763l1904k4855OL3747O3290O6019K1631m2822o3080l1983
$$ 196301 193348 170585 138681 113826 113832 147579 210869 276888 298519 255697 192617 160634
33414A60634k1917n9366o0747K0664P5059j1211j57392j90813r3584J0723O9862
$$ 160634 138717 79351 18604 39268 114327 103116 -54276 -245089 -338673 -327950 -258088
33403b58088J21247J25516p224k01272k31241k6724K04999K44112J09461l3072
$$ -258088 -136841 -11325 -18549 -219821 -451062 -477786 -272787 -28675 80786 47714
33393D7714q5639n5559J4297O2993L7493l2730n5063m393M8006N8339N6906M6566
$$ 47714 -37925 -93484 -79187 -16194 21299 -11431 -66494 -70887 -22881 35458 92364 138930
33381A38930j6830j01188r6125J681M3397m5149j29847p3845M5456O0023l7637
$$ 138930 122100 20912 -75213 -73532 -30135 -75284 -205131 -278976 -233520 -173497 -211134
33370b11134j04882n3359P5734J94053K22167J15697o3173j53447p8399L3755
$$ -211134 -316016 -369375 -293641 -99588 122579 238276 175103 21656 -56743 -22988
33360b2988K5392n2261k2109J25389J91453N7631j31968j65423m6693K7573n3774
$$ -22988 2404 -49857 -71966 53423 244876 302507 170539 5116 -41577 -14004 -67778
33349f7778j68548j31661M7934J62359O6438j30035j94449n5360J30727J87454
$$ -67778 -236326 -367987 -320053 -157694 -91256 -221291 -415740 -471100 -340373 -152919
33339a52919J00265k8159j09374j07098k2967Q4763J17617M0614n8918p1300J679
$$ -152919 -52654 -80813 -190187 -297285 -320252 -235489 -117872 -77258 -136176 -207476 -205797
33328b05797O2753M6752j8722o7523o2777j1743M9850Q0485O1862J5730j4292
$$ -205797 -143044 -96292 -115014 -182537 -245314 -257057 -207207 -126722 -64860 -49130 -63422
33317f3422l298K9923M2321K0523N319L3370O3839K0195q4683j39131q3738N053
$$ -63422 -66720 -36797 5524 26047 31366 64736 128575 148770 64087 -75044 -158782 -153729
33305a53729L3456R828k0095o2385j05917o2982R4445K24553J87480N2388k3469
$$ -153729 -120273 -110445 -130540 -192925 -298842 -361824 -267379 -42826 144654 197042 173573
33294A73573l8674p9589r1276L5537J89340J33048j06803k30304j05943N6780
$$ 173573 134899 55310 -35966 -429 188911 321959 215156 -15148 -121091 -64311
33284f4311P1498L0730N8453P6996O113m3579J4055M3186p1066j77423j04062
$$ -64311 7187 37917 96370 173366 179479 135900 149955 193141 122075 -55348 -159410
33273a59410K7509J1331p0758J092J65363J50248o5507j95579q9240O4795O5567
$$ -159410 -131901 -120570 -191328 -190236 -24873 125375 59868 -135711 -224951 -160156 -94589
33262i4589j9005k2637N5707R6410N2018j5423k6996M0433J25076J15532k1174
$$ -94589 -113594 -136231 -80524 15886 67904 52481 25485 65918 190994 306526 285352
33251B85352j65805j83286r7651k9489p138K6665O0664K8030l9794l3726N1631
$$ 285352 119547 -63739 -161390 -190879 -198017 -171352 -110688 -82658 -122452 -156178 -104547
33240a04547J06153Q1491L5142m775o3018r7740k5906J03830J28248M801j17832
$$ -104547 1606 83097 118239 113464 50446 -47294 -73200 30630 158878 163679 45847
33229D5847j09429l052J03499J53967J14601q674j11685r4949k8389m6693r7118
$$ 45847 -63582 -66634 36865 190832 305433 296759 185074 90125 61736 15043 -82075
33218h2075j5800J43080J38102m0457r9527P4649J86491K310k42978k05996L2358
$$ -82075 -97875 45205 183307 142850 43323 117972 304463 306773 63795 -142201 -109843
33207a09843J38361O2248K7007P2873Q262j81363k45575p2184J30014J66493J14106
$$ -109843 28518 90766 117773 190646 198908 17545 -228030 -300214 -170200 -3707 110399
33196A10399J09814J09715J9146j10441j73629j68896j27115p446J88315L02650
$$ 110399 220213 329928 349074 238633 65004 -103892 -231007 -238453 -50138 252512
33186B52512J88353o6392k21260j66482j0532R1249Q9786K8924l0756n5348n2299
$$ 252512 440865 374473 153213 -13269 -23801 67448 157234 186158 155402 100054 47755
33175D7755n1538n7008l9366O820L7844J8393l3317p7707q7816m0888O0317J40434
$$ 47755 -3783 -60791 -100157 -93337 -55493 -37100 -70417 -148124 -235940 -276828 -216511 -76077
33163g6077J04279k9724j27763j10601m0541L079L2757P5253R4501P6867Q4968
$$ -76077 28202 -1522 -129285 -239886 -280427 -277348 -244591 -169338 -74837 2030 86998
33152H6998J25831Q3491q3683j98454r8689Q0283Q0047p9304j26206L2499J74927
$$ 86998 212829 296320 212637 14183 -84506 -4223 75824 -3480 -129686 -97187 77740
33141G7740J22251j8508q4768j01508j35265j07444M2684J62969Q4942q6828j13425
$$ 77740 199991 181483 96715 -4793 -140058 -247502 -204818 -41849 43093 -43735 -157160
33130a57160J5125R0370K9413l3857j7697j4865p7642r2173K1435J50421J57141
$$ -157160 -142035 -51665 -22252 -56109 -73806 -88671 -166313 -258486 -237051 -86630 70511
33119G0511P6732K1500k411m9067r2055p4119l7965o2833j05936n2577Q4305J57151
$$ 70511 147243 168743 166332 117265 25210 -48909 -86874 -149707 -255643 -308220 -223915 -66764
33107f6764R8046J2562J4357P4225R6291N7358l214o4729j14012j01621O23J21843
$$ -66764 31282 43844 58201 132426 228717 286075 282861 218132 104120 2499 3122 124965
33095A24965J60382J24563J16427J61726J51237K871j93241k70958j90371o4014
$$ 124965 285347 409910 526337 688063 839300 842171 648930 377972 187601 123587
33085A23587J054N640j509o584k0675l8892m4694k7488J5428O0891N0050m2994
$$ 123587 124641 130281 128772 122188 101513 62621 17927 -9561 5867 66758 116808 73814
33073G3814j33919j06458J1844N8372k7652r5672j1812J13325Q1376p5194j24241
$$ 73814 -60105 -166563 -154719 -96347 -123999 -219671 -231483 -118158 -36782 -111976 -236217
33062b36217J5253J46960Q7301q0487j51543q0948J0997M4356N2961P2200P3503
$$ -236217 -220964 -74004 13297 -67190 -218733 -299681 -288684 -244328 -191367 -119167 -45664
33051d5664L2179j9082l6162j8617L292J0128P609J0404J4288j0555p3603j13848
$$ -45664 -13485 -32567 -68729 -87346 -84054 -73926 -66317 -55913 -41625 -52180 -125783 -239631
33039b39631n0935Q6810J50955N3146r5453j16950j0469N2975j1771q2903l3258
$$ -239631 -290566 -203756 -52801 345 -95108 -212058 -222527 -169552 -181323 -264226 -297484
33028b97484O5949O5065j6788k4979O7037J03475M570q7326l0951Q0078O8282
$$ -297484 -231535 -166470 -183258 -208237 -141200 -37725 -33155 -120481 -151432 -71354 -3072
33017c072l2322l1905R0334J33282n757j54302j19041L1688Q4986o986q6137k7476
$$ -3072 -35394 -67299 23035 156317 150560 -3742 -122783 -91095 -6109 -13095 -99232 -126708
33005a26708J04902J54245N5880r1409j28689k8217M8785l6006j67902j18359
$$ -126708 -21806 132439 188319 96910 -31779 -59996 -11211 -47217 -215119 -333478
32995c33478Q6384J58656r038j44285j2677J92279J41773j09453k15685p1606
$$ -333478 -247094 -88438 -97476 -241761 -254438 -62159 79614 -29839 -245524 -317130
$$ [...]
##END NTUPLES=NMR SPECTRUM
##END=
