##TITLE=31Pdec_-32-2023
 CDCl3, 24 sc
 19.5.2023
##JCAMPDX= 6.0         $$ Bruker NMR JCAMP-DX V2.0
##DATA TYPE= NMR SPECTRUM
##DATA CLASS= NTUPLES
##ORIGIN= UXNMR, Bruker Analytische Messtechnik GmbH
##OWNER= root
$$ XWIN-NMR		Version 3.5
$$ Fri May 19 14:18:21 2023 Russian Standard Time (UT+4h)  she@DPX200
##.OBSERVE FREQUENCY= 81.013821
##.OBSERVE NUCLEUS= ^31P
##.ACQUISITION MODE= SIMULTANEOUS
##.ACQUISITION SCHEME= undefined
##.AVERAGES= 24
##.DIGITISER RES= 16
##SPECTROMETER/DATA SYSTEM= spect
##.PULSE SEQUENCE= zgpg30
##.SOLVENT NAME= CDCl3
##.SHIFT REFERENCE= (INTERNAL, CDCl3, 0, 248.564)
##AUDIT TRAIL= $$ (NUMBER, WHEN, WHO, WHERE, WHAT)
$$ ##TITLE= Audit trail, XWIN-NMR		Version 3.5
$$ ##JCAMPDX= 5.01
$$ ##ORIGIN= Bruker BioSpin GmbH
$$ ##OWNER= she
$$ F:/spectra/data/she/nmr/P31/1/pdata/1/auditp.txt
$$ ##AUDIT TRAIL=  $$ (NUMBER, WHEN, WHO, WHERE, WHAT)
(   1,<2023-05-19 14:16:29.78 +0400>,<she>,<DPX200>,
      <created by zg, POWCHK disabled, PULCHK disabled
       configuration hash MD5:
       00 E9 B6 7A A2 85 ED C7 34 08 36 98 17 FE 4E 26
       data hash MD5: 32K
       B7 59 0E 67 B7 C6 57 D4 07 78 32 F2 53 32 5D 33>)
(   2,<2023-05-19 14:16:36.81 +0400>,<she>,<DPX200>,
      <Start of raw data processing
       efp BC_mod = 2 LB = 1 FT_mod = 6 PKNL = 1 PHC0 = -10676.37 PHC1 = 49.88486 SI = 64K 
       data hash MD5: 64K
       B6 5A EF FB 5C 8E A3 04 9D E6 A4 3A 4D 2F 11 CA>)
(   3,<2023-05-19 14:17:00.56 +0400>,<she>,<DPX200>,
      <abs ABSG = 5 
       data hash MD5: 64K
       B0 CD 46 13 11 DE 78 3D 33 E2 BB 5F 02 40 F3 3E>)
(   4,<2023-05-19 14:17:42.04 +0400>,<she>,<DPX200>,
      <pk PHC0 = 4.370898 PHC1 = 0 
       data hash MD5: 64K
       69 C7 25 C2 DE 83 E4 1C 7D E8 C3 65 10 6D 55 EF>)
$$ ##END=
$$ 
$$ hash MD5
$$ 32 72 A6 A7 EE 01 50 E5 FB 89 4F 9E 9D 6F FB 17
##$RELAX= 
##$RELAX= 
##$RELAX= 
##$RELAX= 
##$RELAX= 
##$RELAX= 
##$RELAX= 
##$RELAX= 
##$RELAX= 
$$ Bruker specific parameters
$$ --------------------------
##$DU= <F:/spectra>
##$EXPNO= 1
##$NAME= <P31>
##$PROCNO= 1
##$TYPE= <nmr>
##$USER= <she>
##$AMP= (0..31)
100 100 100 100 100 100 100 100 100 100 100 100 100 100 100 100 100 100 
100 100 100 100 100 100 100 100 100 100 100 100 100 100 
##$AQSEQ= 0
##$AQ_mod= 1
##$AUNM= <au_zg>
##$AUTOPOS= <>
##$BF1= 81.014009
##$BF2= 200.13
##$BF3= 200.13
##$BF4= 200.13
##$BF5= 200.13
##$BF6= 200.13
##$BF7= 200.13
##$BF8= 200.13
##$BYTORDA= 1
##$CFDGTYP= 0
##$CFRGTYP= 5
##$CHEMSTR= <none>
##$CNST= (0..31)
1 1 145 1 1 1 1 1 1 1 1 1 1 1 1 1 1 1 1 1 1 1 1 1 1 1 1 1 1 1 1 1 
##$CPDPRG= <waltz16>
##$CPDPRG1= <>
##$CPDPRG2= <waltz16>
##$CPDPRG3= <>
##$CPDPRG4= <mlev>
##$CPDPRG5= <mlev>
##$CPDPRG6= <mlev>
##$CPDPRG7= <mlev>
##$CPDPRG8= <mlev>
##$CPDPRGB= <>
##$CPDPRGT= <>
##$D= (0..31)
0 1 0 0 0 0 0 0 0 0 0 0.03 2e-05 3e-06 0 0 0 0 0 0 0 0 0 0 0 0 0 0 0 0 
0 0 
##$DATE= 1684491389
##$DBL= (0..7)
120 120 120 11 120 120 24 19 
##$DBP= (0..7)
150 150 150 150 150 150 150 150 
##$DBP07= 0
##$DBPNAM0= <>
##$DBPNAM1= <>
$$ [...]
##$SUBNAM3= <"">
##$SUBNAM4= <"">
##$SUBNAM5= <"">
##$SUBNAM6= <"">
##$SUBNAM7= <"">
##$SUBNAM8= <"">
##$SUBNAM9= <"">
##$SW= 501.771253377433
##$SWIBOX= (0..15)
0 1 3 0 0 0 0 0 0 0 0 0 0 0 0 0 
##$SW_h= 40650.406504065
##$TD= 32768
##$TD0= 1
##$TE= 0
##$TE2= 300
##$TE3= 300
##$TEG= 300
##$TL= (0..7)
0 120 53 12 22 120 120 120 
##$TP= (0..7)
150 150 150 150 150 150 150 150 
##$TP07= 0
##$TPNAME0= <>
##$TPNAME1= <>
##$TPNAME2= <>
##$TPNAME3= <>
##$TPNAME4= <>
##$TPNAME5= <>
##$TPNAME6= <>
##$TPNAME7= <>
##$TPOAL= (0..7)
0.5 0.5 0.5 0.5 0.5 0.5 0.5 0.5 
##$TPOFFS= (0..7)
0 0 0 0 0 0 0 0 
##$TUNHIN= 0
##$TUNHOUT= 0
##$TUNXOUT= 0
##$USERA1= <user>
##$USERA2= <user>
##$USERA3= <user>
##$USERA4= <user>
##$USERA5= <user>
##$V9= 5
##$VALIST= <valist>
##$VCLIST= <CCCCCCCCCCCCCCC>
##$VD= 0
##$VDLIST= <DDDDDDDDDDDDDDD>
##$VPLIST= <PPPPPPPPPPPPPPP>
##$VTLIST= <TTTTTTTTTTTTTTT>
##$WBST= 1024
##$WBSW= 4
##$XGAIN= (0..3)
0 0 0 0 
##$XL= 0
##$YL= 0
##$YMAX_a= 5225
##$YMIN_a= -5231
##$ZGOPTNS= <>
##$ZL1= 120
##$ZL2= 120
##$ZL3= 120
##$ZL4= 120
##$ABSF1= 248.5645
##$ABSF2= -253.2056
##$ABSG= 5
##$ABSL= 3
##$ALPHA= 0
##$AQORDER= 0
##$ASSFAC= 0
##$ASSFACI= 0
##$ASSFACX= 0
##$ASSWID= 0
##$AUNMP= <proc_1d>
##$AZFE= 0.1
##$AZFW= 0.5
##$BCFW= 0
##$BC_mod= 2
##$BYTORDP= 0
##$COROFFS= 0
##$CY= -3
##$DATMOD= 1
##$DC= 0
##$DFILT= <>
##$DTYPP= 0
##$F1P= 0
##$F2P= 0
##$FCOR= 1
##$FTSIZE= 65536
##$FT_mod= 6
##$GAMMA= 0
##$GB= 0
##$INTBC= 1
##$INTSCL= 6.047779e-11
##$ISEN= 30
##$LB= 1
##$LEV0= 0
##$LPBIN= 0
##$MAXI= 10000
##$MC2= 0
##$MEAN= 0
##$ME_mod= 0
##$MI= 50
##$NCOEF= 0
##$NC_proc= -4
##$NLEV= 6
##$NOISF1= 182.463
##$NOISF2= 159.3651
##$NSP= 0
##$NTH_PI= 0
##$NZP= 0
##$OFFSET= 248.5645
##$PC= 4
##$PHC0= -10672
##$PHC1= 49.88486
##$PH_mod= 1
##$PKNL= yes
##$PPARMOD= 0
##$PSCAL= 0
##$PSIGN= 0
##$REVERSE= no
##$SF= 81.0140089999694
##$SI= 65536
##$SIGF1= 159.3651
##$SIGF2= -187.1042
##$SINO= 113.3802
##$SIOLD= 16384
##$SREGLST= <1H.CDCl3>
##$SSB= 0
##$STSI= 65536
##$STSR= 0
##$SW_p= 40650.406504065
##$SYMM= 0
##$S_DEV= 0
##$TDeff= 32768
##$TDoff= 0
##$TI= <>
##$TILT= no
##$TM1= 0
##$TM2= 0
##$TOPLEV= 0
##$USERP1= <user>
##$USERP2= <user>
##$USERP3= <user>
##$USERP4= <user>
##$USERP5= <user>
##$WDW= 1
##$XDIM= 65536
##$YMAX_p= 285433877
##$YMIN_p= -18812900
$$ End of Bruker specific parameters
$$ ---------------------------------
##NTUPLES= NMR SPECTRUM
##VAR_NAME=  FREQUENCY,     SPECTRUM/REAL,   SPECTRUM/IMAG
##SYMBOL=    X,             R,               I
##VAR_TYPE=  INDEPENDENT,   DEPENDENT,       DEPENDENT
##VAR_FORM=  AFFN,          ASDF,            ASDF
##VAR_DIM=   65536,         65536,           65536
##UNITS=     HZ,            ARBITRARY UNITS, ARBITRARY UNITS
##FACTOR=    0.620285442955139, 1,           1
##FIRST=     20137.2065510682, 0,            0
##LAST=      -20513.1999529968, 0,           0
##MIN=       -20513.1999529968, -18812900,   0
##MAX=       20137.2065510682, 285433877,    0
$$ Real data points
##PAGE= N=1
##DATA TABLE= (X++(R..R)), XYDATA
$$ [...]
39244e64630o0526J33436M15096M17839K3498k89796r7329K87582K83169n7078
39234D91261k00548l7036L8178q5450n3148K20603K96841m4506l74242k74684
39224b2731L3859J12943k4895p7170M300M3123J8991L9123N6133n2463k06736
39213g5523k09897n2982R3210J28485Q0473j976m2655O4230K73976L29373P1800
39202F58514k92063m23940k54794K3568K43574L34255K29525m7593k74083k37009
39192d0046k4802R5682N5300K0809P7973J09067K1595j07217j87814k49128l07045
39181e35626k34401Q0023M75631N82245K30042k74449m31649j31267K13948K13189
39171A87686j5361j09522l5433n2408j86987j62594R3453K88287K47106J59664
$$ y = [-564630, -625156, -491720, -76624, 341215, 364713, 74917, -22412, 265170, 548339, 491261, 290713, 253677, 291855, 206405, 153257, 373860, 670701, 626195, 251953, -22731, 11128, 124071, 99176, 22006, 26306, 69429, 88420, 127543, 183676, 131213, -75523, -285420, -338402, -245192, -116707, -36234, -38210, -80865, -16635, 257341, 586714, 658514, 366451, -57489, -312283, -288715, -45141, 289114, 518639, 471046, 196963, -40046, -64848, 30834, 86134, 106943, 184916, 293983, 315578, 208361, 20547, -228581, -535626, -770027, -690004, -214373, 367872, 597914, 323465, -108184, -239451, -25503, 187686, 172325, 62803, 27370, -25038, -212025, -374619, -281166, 7121, 254227, 413891]
39161D13891J49154P186l48432n38966k47945K17451L30668R6015o0709Q369O3562
39150I0244j3467p5033o5243r3366j28178j7319J62037J67026L6323N8071K30714
39139C51809K04140j09560l18021j60457P1323J5790j93507j89405M6033K14913
39129f6942J76531O8165K3757L3010N4032P3127O4914J6431l9962q4991j27255
39118A90817j21854r573J19395Q6745p3833r2889J39582L70842L28578O5978j93357
39107H10431l46428l75518k46062m2644J5335r0111p2962J69210K62200q0759
39097B692m74040l33641K26410N25746L03730M792N058J15272N6179o9149p4898
39086B88151o1205j46812j58925M8802K29539Q2827k20967k51185M5560K89838
$$ y = [413891, 563045, 570231, 221799, -317167, -565112, -347661, -16993, 79022, 18313, 26682, 90244, 76777, 1744, -63499, -156865, -285043, -302362, -140325, 26701, 63024, 121095, 351809, 555949, 446389, 128368, -32089, 39234, 55024, -138483, -327888, -281855, -66942, 109589, 177754, 201511, 234521, 288553, 361680, 426594, 443025, 403063, 318072, 190817, 68963, 59390, 178785, 265530, 191697, 98808, 238390, 609232, 937810, 1003788, 810431, 464003, 88485, -157577, -200221, -184886, -274997, -347959, -178749, 83451, 2692, -471348, -804989, -578579, -52833, 250897, 255689, 260747, 376019, 432198, 363049, 288151, 226946, 80134, -78791, -29989, 199550, 282377, 61410, -189775, -144215, 145623]
39076A45623K20655k4772j89144j70441j504J91804J97817o5855l31477k46599
39066b73893J03062K38029m7878l73698l11978K5998K13418J26281J9858P0270
39056b10531J62053J57270J01374O7244Q970r7908j33013r023J31041P1747j56477
39045I2747k85702j58398P5964J77941J19967O2339R0536J18570O7876Q793L5458
39034D06091Q2885l85k09661l42691k46456j1698J44337J21970p65r0476o5220
39023b12069O4759J77466J14928j21853l08425k48349l6874P4959K9777j5868
39013d81549O887L463l0626M3151K11822K46008P8136m3539K0083L3548j63923
39002g6539k65976K4750L95376L33436l1322j17466J31848J61233k07929m29886
$$ y = [145623, 366278, 341506, 152362, -18079, -19583, 172221, 370038, 304183, -27294, -273893, -170831, 67198, 19320, -354378, -666356, -640358, -426940, -300659, -280801, -210531, -48478, 108792, 210166, 277410, 286380, 188472, 55459, 46436, 177477, 249224, 92747, -192955, -351353, -275389, -97448, 22519, 84858, 175394, 293964, 361840, 370633, 406091, 488976, 488591, 278930, -63761, -310217, -321915, -177578, -55608, -56373, -146849, -212069, -147310, 30156, 145084, 23231, -285194, -533543, -570417, -495458, -465681, -481549, -474662, -471199, -501825, -458674, -246852, -844, 77292, 33753, 53836, 87384, -76539, -342515, -317765, 77611, 411047, 379725, 262259, 394107, 555340, 347411, -82475]
38992h2475j59033J63966Q3348j24394k5781J69807M1207k24286j68465P5780
38982b50326L1016k09153j26558K39044L03419j8283j42841J27516K43777p3881
38972A23730k91759j6676K63049K1622l53376k03708K72553L47276o4482l52320
38962b54091k06174O8039K04247K79205L07093J31906j63561k57040j15742o7926
38952g4044k37225l48554k21135l2579M8258R5723J50776R0262p0959j01117O9915
38941f30679K19693K07279J46550J06528O672r4460j9984J16175J642k45162j18899
38930c04645L72002N11746j4095m85143k17322L28592K84567k32686l82712m359
38920a44055K23980O206j48923Q5629L09821J72798m2088k1876J8112j53477k60207
$$ y = [-82475, -241508, -77542, 5806, -118588, -144369, 25438, 66645, -157641, -326106, -250326, -219310, -428463, -555021, -315977, -12558, -30841, -173682, -46166, 197611, 123730, -168029, -184705, 78344, 99966, -253410, -457118, -184565, 162711, 98229, -254091, -460265, -392226, -187979, 91226, 398319, 530225, 366664, 109624, -6118, -74044, -311269, -659823, -880958, -913537, -865279, -769556, -618780, -528518, -599477, -700594, -630679, -410986, -203707, -57157, 49371, 56043, -38417, -58401, 57774, 59416, -185746, -304645, 67357, 579103, 565008, 79865, -137457, 191135, 475702, 243016, -139696, -144055, 79925, 86131, -62792, 22837, 332658, 505456, 463368, 441492, 459604, 306127, 45920]
38909D5920k6159K41939J36236j41051j18845J51002K17422k0727k36988k52956
38899d207j84117p0946J46297L10414J81637j02517j60472J7662N5866j56807
38889C2810k94216j78304l5040K28J21674L50813L06553j57351n29234l12586
38879f94653K10372L77875P6670k21035j93828L5894K58740L75285K76161n3004
38869D48477l21653k25716O6398J20492q8499j58754M9750J98214O5763j09984
38859D4488r1573j0459k3435P575J87676K79283O6071k34253k65027l7553J71142
38848I3935K42324K30204J27157o7563j87482j11926n045n1584j16620j063J29287
38837B81624k1041l14302l05017P3368L84480L27437R8076k0977o2186j55815
$$ y = [45920, 19761, 261700, 397936, 256885, 138040, 289042, 506464, 485737, 248749, -4207, -188324, -259270, -112973, 197441, 379078, 276561, 116089, 133751, 189617, 32810, -261406, -439710, -474750, -474522, -352848, -2035, 304518, 147167, -382067, -694653, -484281, -106406, -29736, -250771, -444599, -408705, -149965, 225320, 501481, 448477, 126824, -98892, -32494, 87998, -501, -159255, -109505, 88709, 154472, 44488, -47085, -57544, -80979, -73404, 114272, 393555, 459626, 225373, -39654, -77207, 93935, 336259, 566463, 693620, 626057, 438575, 326649, 321604, 270020, 153400, 152337, 281624, 260583, -53719, -358736, -285368, 99112, 426549, 524625, 503648, 441462, 285647]
38827B85647k06951o5046J47480J43588j23604l52805k45113J14469L15362J05042
38817A18069k65904l43856q4410J10716L3115k6011J64919L02187M3209l28289
38807b76255k79376J01290K15791r4882l33090j69948R7973J23835K7845N8566
38797e28251J54461J46716P9158N9735O0421O6538J47693K21123O9937k42849
38787B34682l49580j50647N16r2604j36842O8053J97523k6907k77644j44795J50158
38776e28087J37698r5819j08384R6819J21382p4090j10551J07300K30420R0977
38766a32335n1916j9066K4366l1964k3512J25139K08441J10243K0950Q4339J36766
38755D51451Q526j76269k05501p7541P0801J52656J28687K095r9890m1694P3667
$$ y = [285647, 78696, 13650, 161130, 304718, 181114, -171691, -416804, -302335, 13027, 118069, -147835, -491691, -576101, -465385, -432270, -458281, -293362, 8825, 52034, -276255, -555631, -454341, -238550, -333432, -666522, -836470, -738497, -614662, -586817, -528251, -373790, -227074, -147916, -88181, -27760, 38778, 186471, 407594, 477531, 234682, -114898, -265545, -265029, -357633, -494475, -426422, -228899, -255806, -533450, -678245, -528087, -390389, -486208, -594592, -497773, -376391, -450481, -561032, -453732, -223312, -132335, -184251, -203317, -178951, -210915, -234427, -109288, 99153, 209396, 230346, 314685, 451451, 459977, 283708, 78207, 666, 71467, 224123, 352810, 354905, 255015, 213321, 286988]
38744B86988K1496j43437j26873Q0694J07728j83310l77180j10431L27612L87870
38734B71157L8780k66655k80503j87785j57378q1310J17160K44116J17111j07202
38724b92509j18235J08205K59733J05963j82262k42283J0199K66788K25839k9052
38714A12386j82402j29618o0426r9009r7047Q9696K97417K36160q7016l34751
38704b54610k62753j4886R9107J3514n2924N5410K08476J97671M2876n8193l0265
38693e6577R787j5091l0409J4900M3545J2397J0849P9400R2834k9335j43725q2749
38681i4174R0127J89913J54377J9555j99651m10610l85532n2198K86010K91297
38671a10886M8251r9721o5356m6118j11112j18631l4185K1269O2609K30518M40232
$$ y = [286988, 308484, 165047, 38174, 118868, 226596, 43286, -333894, -444325, -116713, 271157, 309937, 43282, -237221, -425006, -582384, -663694, -546534, -302418, -185307, -292509, -410744, -302539, -42806, 63157, -119105, -361388, -351189, -84401, 141438, 112386, -70016, -199634, -260060, -359069, -456116, -366420, -69003, 167157, 80141, -254610, -517363, -532249, -433142, -419628, -472552, -417142, -208666, -10995, 31881, -26312, -56577, -46790, -61881, -92290, -77390, -33845, -21448, -10599, 68801, 161635, 132300, -11425, -94174, -4047, 185866, 340243, 359798, 160147, -250463, -635995, -688193, -402183, -110886, -62635, -162356, -227712, -273830, -384942, -503573, -537758, -516489, -453880, -223362, 216870]
38660B16870L98564P5911j75212j21420K8662k3609k43001l76070l00649r5473
38650f15427R5090J49721N3108m4434J2965J54120J82151Q4295O094m9753j91071
38639a63141l09735j62745J57860K38422l3926k53106r7796K09315K91955J51113
38629B8216L1557K0017M6568P6350P1890l8309j75887j27378J00931K18710J00918
38618C53583k4506j9121p6316k72013k93139L7167L51091K58640o8911k61687
38608a5212l41752m65118m23435O294M77567M75326J26476k3620R2488O6461j54890
38597a79415j59460J49947L47501K06183J3479j3740m5990j61013j17018J25365
38587A65839J88227r7588l33903j73009J40285K16643J15486Q5580O3155j25517
$$ y = [216870, 615434, 691345, 516133, 394713, 423375, 399766, 156765, -219305, -519954, -615427, -520337, -370616, -317508, -361942, -348977, -194857, -12706, 71589, 77683, 27930, -163141, -472876, -635621, -477761, -239339, -273265, -526371, -624167, -414852, -122897, 28216, 59773, 79790, 126358, 202708, 274598, 236289, 60402, -66976, 33955, 252665, 353583, 329077, 309956, 233640, -38373, -331512, -294345, 56746, 315386, 246475, -15212, -356964, -822082, -1245517, -1239223, -761656, -286330, -159854, -183474, -90986, -24525, -179415, -338875, -188928, 158573, 364756, 378235, 364495, 318505, 157492, 40474, 165839, 354066, 256478, -77425, -250434, -110149, 106494, 221980, 307560, 370715, 245198]
38577B45198l28420k81975p1551L1247L1984J14475K10624Q9762j75227k33401
38567c67284J7082K59908K10234j3916r2731O8281K36058J51038j33271k88853
38557D6546j40390P2561M3643j15244o3809J52817J34388j62051k62568M7486
38547b46621L13409J44607j30942m4362K01549J18595j73166j49399J73793K42597
38537D50060q3511l04359j38423N9807j3142j07304N2524K39337J35383j11092
38527A79280j64374n5797m6438j32850q5939J23559K75346K27028M2429j53710
38517B08534k55583j91827l2173K4319p6281j20004M9558K46575K01733l8889
38507A5962k11484k07634j06437M8388K34757L06388J46564q0430j03326O2163
$$ y = [245198, -83222, -365197, -436748, -405501, -373517, -259042, -48418, 41344, -133883, -367284, -350202, -90294, 119940, 106024, 13293, 81574, 317632, 468670, 335399, 46546, -93844, -21283, 22360, -92884, -156693, -3876, 130512, -31539, -294107, -246621, 66788, 211395, 80453, 36091, 237640, 356235, 183069, 33670, 207463, 450060, 366549, 62190, -76233, -16426, -29568, -136872, -84348, 154989, 290372, 179280, 14906, -40891, -87329, -220179, -306118, -182559, 92787, 319815, 362244, 208534, -47049, -238876, -271049, -246730, -323011, -443015, -393457, -146882, 54851, 15962, -195522, -403156, -509593, -461205, -226448, 79940, 226504, 146074, 42748, 104911]
38497A04911J59773J06182O6102R9922M3290j68497l18788k04163O1431J85484
38487A35647M9647j76245k32792n2504J37819N3712k56431l91791j07852L06369
38477e34421L83817R2808j79486j73596J8408K21258L30975K25271j09226l49626
38467g3818j48050K72319K93733j84846n14485k39732K16135K21484j15791k04818
38457d77869Q0438K92392J66675n2415r6124l7543m6041j00913q8804K6500K07935
38446a25769L52195K98464K4208k10678j53628N8099R0076n9462p8610R6066J46780
38435D37741p2298k48301j06244J42913J50818k6474p9479K5671L5687j25839
38425A34195k26000j03537Q8311J25746J3045q4458q3365l4602L573L1995N7463
$$ y = [104911, 264684, 370866, 436968, 536890, 580180, 411683, 92895, -111268, -49837, 135647, 185294, 9049, -223743, -276247, -138428, -84716, -341147, -732938, -840790, -534421, -150604, -57796, -237282, -410878, -392470, -171212, 159763, 385034, 275808, -73818, -221868, 50451, 344184, 159338, -355147, -594879, -378744, -157260, -273051, -477869, -397431, -105039, 61636, 9221, -86903, -124446, -170487, -271400, -360204, -333704, -125769, 226426, 524890, 549098, 338420, 184792, 242891, 332967, 273505, 194895, 290961, 437741, 365443, 117142, 10898, 153811, 304629, 278155, 198676, 224347, 260034, 134195, -91805, -195342, -107031, 18715, 31760, -52698, -136063, -170665, -167092, -135097, -77634]
38414g7634N4016P613l6643j2787P7856J47523J14792K041q5884p3578J4814Q6643
38402B18772O3352m9012j50634j36887k2853N8929K2365n8086n6503K5069O9199
38391a6289J5992o3944p7195j6289O0962J08267J17232R3963M0281l1636p4968
38380A56376m0184L6705L3743q9442j80724q7711P9225P4389q3801r2018J65960
38369b7482L89418K89147J5529r7217l4588l8885j52569j69225k6038Q0540K9110
38358B57740n5860n9522n7051j11849j03054P4381K74090K46517k4643k76014
38348A64735k64094k8447J76169J72886L3064o3686o8767o8065r1833p8664l3812
38337a50514l8942o4104K0602J77596J92780M6153N810J69331K21214o9291l94404
$$ y = [-77634, -23618, -16005, -52648, -65435, 12421, 159944, 274736, 276777, 190893, 117315, 132129, 218772, 282124, 233112, 82478, -54409, -77262, -18333, 4032, -54054, -110557, -85488, -16289, -297, -64241, -141436, -157725, -96763, 11504, 128736, 222699, 262980, 231344, 156376, 116192, 152897, 186640, 97198, -83526, -171237, -92012, -17623, -101424, -193442, -27482, 361936, 651083, 666612, 569395, 534807, 495922, 343353, 174128, 148090, 228630, 257740, 201880, 142358, 85307, -26542, -129596, -55215, 218875, 465392, 440749, 164735, -99359, -127806, 48363, 221249, 254313, 190627, 121860, 53795, -38038, -116702, -150514, -189456, -253560, -232958, -55362, 137418, 183571, 189381, 358712, 579926, 510635, 116231]
38326A16231l28150J4311J65473K0077q6183L6130J92861J80457L2638j47529
38316A96316k94185l01251j22474O4798O8119r056M4400J60250J42243O9804J26111
38305A45075J56667q7624l65570k07426K56807L91353N3473j94185m3961J02284
38295B06893n8742j75117N6826K54745r953m12830l42719J51216M74941L51154
38285D96414L4625j97608k95203k51389p5771Q5201R7451M1965M5351N1059j8700
38274A3395o3072o861M582j27934k18987j01007O7918R0648P7325J76175K07601
38263A19783m2378l58062l36856K2258L43429L93448K47098L4557j54954k03688
38253F4635r2736j4683j09276k13112j23023N2161Q2785P89n557O5267Q2876N0423
$$ y = [116231, -211919, -197608, -32135, -12058, -98241, -62111, 130750, 311207, 343845, 196316, -97869, -399120, -521594, -456796, -388677, -397733, -353333, -193083, -50840, 18964, 145075, 301742, 214118, -151452, -358878, -102071, 289282, 342755, 148570, 104609, 206893, 148151, -26966, 29860, 284605, 274652, -138178, -480897, -329681, 145260, 496414, 531039, 333431, 38228, -213161, -288932, -203731, -106280, -64315, -18964, 32095, 13395, -49677, -56538, -51956, -179890, -398877, -499884, -431966, -341318, -263993, -87818, 119783, 77405, -280657, -617513, -595255, -251826, 141622, 388720, 423277, 268323, 64635, -28101, -42784, -152060, -365172, -488195, -436034, -353249, -352460, -358017, -292750, -209874, -159451]
38241a59451M4780L0061k7042k6819N3638M6257p8638o1512J84314L03749N8961
38230C68298k00944q5839J59442P0591k29356k56557n955Q2088j00897k14117
38220d13246j06939J701nJ6800O3969L2258K9609K27012L97528J48655l78778
38209A8564n92644k80258J58682L50470L00322Q2626k53223m05850n3954N06925
38199a68340N62098k683m72516l39229J6135J5565k54964l02837J3353L88087
38189e45331N07735K96695q5534l08504j46906J88169K51823k6269k61748k12955
38179c42825o0777J8774J17263K49261J92309q1758k26948n5443J27239K0688
38169d2217j88202j76286j4662J2604j00375j12640P6757L32160M66285L62951
$$ y = [-159451, -114671, -84610, -111652, -138471, -84833, -38576, -117214, -178726, 5588, 309337, 368298, 167354, 81515, 240957, 311548, 82192, -174365, -180320, -98232, -199129, -413246, -520185, -518484, -518489, -501689, -437720, -405462, -375853, -148841, 248687, 397342, 18564, -574080, -854338, -695656, -345186, -44864, 37762, -215461, -621311, -675265, -168340, 393758, 391075, -81441, -420670, -404535, -388970, -643934, -946771, -933418, -545331, -37596, 259099, 173565, -134939, -281845, -93676, 158147, 131878, -129870, -342825, -403602, -384828, -267565, -18304, 174005, 92247, -134701, -190144, -62905, -42217, -230419, -406705, -421367, -408763, -509138, -621778, -545021, -212861, 253424, 616375]
38159F16375N9247j93930j55174N0020N9684j68366k73883q4196J05095L5375
38149E0247j13349q4678L4265M2729k1195m0573o0960j08548m3072J45836J86462
38138a2836m7372k52480j55286L7829J2402r8583M3420L68113M67588K06722j26958
38127D42559k69234k50766k04817j66690j14781m1469M9601J29802J54501J32906
38117a38388J11241O8022l7455j07376M24J97701K32299P2638n1547m2412m1653
38106B63494p3280L6371K50866K51632k7601k10781p3446R2668J0525j12722k6370
38095C81356N7316j37361l76784k63214Q8597K42064J33467O0512R5318K7878
38085C09149j44766j63545K2970J51923P6010m6080n5602k55K1848r541q5850
$$ y = [616375, 675622, 481692, 326518, 376538, 436222, 267856, -6027, -90223, 14872, 50247, -63102, -147780, -113515, -70786, -91981, -132554, -193514, -302062, -345134, -199298, -12836, -60208, -312688, -467974, -430145, -417743, -516326, -472906, -104793, 362795, 569517, 442559, 173325, -77441, -282258, -448948, -563729, -605198, -555597, -425795, -271294, -138388, -27147, 40875, 3420, -103956, -103532, 94169, 326468, 399106, 347559, 305147, 263494, 190214, 226585, 477451, 729083, 701482, 490701, 417255, 509923, 520448, 407726, 381356, 438672, 301311, -75473, -338687, -250090, -8026, 125441, 185953, 281271, 309149, 164383, 838, 23808, 175731, 251741, 205661, 150059, 149804, 171652, 162111, 76261]
38074G6261j51608p6771J49808K84390J27856j32697j58544M6273J75436R4020
38064D34424m5111j25761j84378j97786p2437J13577J48323K3730l2033P4921
38054A37469J61227Q4105l8850n0069N739k830q1742j40940j27472k5775J72191
38043I3053L81982L94548Q1507l69703n63486l17925R7358K58578Q7872j01377
38033D2407p3434L3804K539r8935p3189N2264J06332Q2595O7519j2672k24699
38022i5469l32335r4255K33143J92718j14387j49334J45810K14284j54784m24628
38012e79237k03644J11356N0091j45369j7622K84700L11110J00246L1202J10893
38002E3726K9811j96097k16207N1337K85675K44848J8516j83061k11288l0817
$$ y = [76261, -75347, -152118, -2310, 282080, 409936, 277239, 118695, 164968, 340404, 434424, 389313, 263552, 79174, -118612, -191049, -77472, 70851, 94581, 62548, 137469, 298696, 382801, 343951, 293882, 299621, 296791, 215049, 74109, -53363, -79138, 93053, 475035, 869583, 951090, 581387, 17901, -300024, -202666, 55912, 143784, 42407, -31027, 2777, 5316, -93619, -166808, -114544, -8212, 74383, 141902, 129230, -95469, -427804, -522059, -288916, -96198, -210585, -359919, -214109, 175, -154609, -579237, -782881, -671525, -621434, -766803, -784425, -499725, -188615, -88369, -57167, 53726, 83537, -112560, -328767, -277430, 8245, 253093, 271609, 88548, -122740, -153557]
37992a53557J74760J09443j95380l02041l209K85638J36981k19442k88371o3209
37982e18387J15665J78883K53779K16377q8797l74673k64848M6177J09391K5569
37972c00864K23383N48115L82950k70122o37799l13854J64848J83727j18392k46549
37962c84557r0763J10958K03733J86709R8748M5531J17469J74988q210l25251
37952A29355l99075j41182J17889J46328P8512O1041K8902l1400J3191J23760
37942A27321O0648j69519k32172j1588J60613M7328j09843k3537J61069J34293
37932A44613q6312k30264j61321M3717K47889L11010J54118j01546k29933k09589
37922a17618k13961k45792r9483K06312L20870Q1992j91145j76448k1431l6852
$$ y = [-153557, 21203, 130646, -64734, -366775, -369984, -84346, 52635, -166807, -455178, -518387, -402722, -223839, 29940, 246317, 157520, -217153, -482001, -435824, -326433, -300864, -77481, 470634, 853584, 583462, -54337, -368191, -203343, -19616, -138008, -384557, -475320, -364362, -160629, 26080, 124828, 170359, 287828, 462816, 454606, 129355, -269720, -410902, -293013, -146685, -68173, -7132, 21770, -9630, 3561, 127321, 187969, 18450, -213722, -225310, -64697, -17369, -127212, -150749, 10320, 144613, 58301, -171963, -333284, -289567, -41678, 269332, 423450, 321904, 91971, -117618, -331579, -577371, -676854, -470542, -149672, -67680, -258825, -435273, -456704, -493556]
37912d93556j59961p5784K45983M60010K92714j20964l79269k17927K10430M62578
37902B24254K89161o1457j81534n8178j0496j20123j14213J03578K17948J3164
37892C02104k31316j61937Q7670J13625j16354k09787M3748L22084J96257k41025
37882A05069m19166l1266M79115M43877j00402m25279j51820K17590J30608j45892
37872A02434m7372K76790K15769k22572m00055j21723R5029k4824r2980J17794
37862a01710J95433j27790l88418j34247K96195L32036P0826L834J73212K22242
37852E41613O1442r1349j74252k61130k26133N8010L11978J61861k20867l08069
37842a46896p673K42323J80927J7099n3754j30288k52922k17770L9210K34976
$$ y = [-493556, -653517, -729301, -483318, -23308, 269406, 148442, -230827, -448754, -238324, 224254, 513415, 451958, 270424, 212246, 201750, 81627, -32586, 70992, 288940, 302104, 70788, -91149, -3479, 110146, -6208, -215995, -172247, 149837, 346094, 105069, -314097, -345363, 133752, 577629, 477227, 51948, -99872, 117718, 248326, 102434, 55062, 331852, 547621, 325049, -75006, -196729, -101700, -126524, -219504, -101710, 93723, -34067, -422485, -556732, -260537, 71499, 142325, 146159, 319371, 541613, 603055, 511706, 337454, 76324, -149809, -91799, 220179, 382040, 161173, -146896, -154569, 87754, 268681, 285780, 232026, 101738, -151184, -368954, -329744, -94768]
37832i4768J56496q720k081R7219N7845j00277j67181q8836J2919R7766K23494
37821A83876L16687J85984j61407m24947l61970q9093J09779J53865J57786J42152
37811B12712N727k05998k68445j11203M6759L5494r232Q3767J96845J21094p3586
37800C3934j48151p3825j3376P793J07851K47787K25413K994k10195k42656j24378
37789a86809L7715J49370J18031m4149j51770q0928K5205J3573J8790J84270K76096
37778C59394J8905l27331k69918J00196K07688n7411j59091J44046L56401P8860
37768D51739l11722k68366J00013K89253J50572o9852j86394j72828k2751J53580
37758A13244J16796j25514k00362P6078L43993K49453J1851J4401J40835L2244
$$ y = [-94768, 61728, 53008, 50927, 148146, 205991, 105714, -61467, -150303, -137384, -39618, 183876, 500563, 686547, 525140, 100193, -261777, -350870, -241091, -87226, 70560, 212712, 218439, 12441, -256004, -367207, -320448, -284954, -294186, -210419, -13574, 107520, 33934, -114217, -188042, -201418, -193625, -85774, 162013, 387426, 390420, 180225, -62431, -186809, -149094, 276, 118307, 74158, -77612, -158540, -133335, -119762, -100972, 83298, 359394, 378299, 50968, -218950, -118754, 88934, 31523, -127568, 16478, 372879, 451739, 140017, -128349, -28336, 260917, 411489, 341637, 155243, -17585, -40336, 113244, 230040, 104526, -95836, -19758, 324235, 573688, 585539, 599940, 740775, 773019]
37748G73019k31169k65549o4676J3237j09824j38859J6660Q0730p0814j81399
37738a78644o8002P3046K0427j03587m5795J85917L46560K70263K4612j91686
37728C33111k27623j02516J7326M927p8130q0860K0702R6026L9318j02831j92384
37717b72934j48726l3977J4063m1904p3662K7250J64237J70978P3952L3600O0573
37706b6550J5986j11602j72611j15924l5413N2925K04766L08106J72697j01500
37696A90880j93009n4692L5288j5793N436J15535J7893l00561l83516l1559K90863
37685c23235J76080o8605L3803L36865L75964J45914q679m5503j79995l44405
37675I8204k62724J2967J56631J04265O5371O5229m8847j94268j27335Q6059J36466
$$ y = [773019, 541850, 276301, 211625, 224862, 115038, -23821, -7161, 73569, 2755, -178644, -246646, -173600, -153173, -256760, -302555, -116638, 229922, 500185, 524797, 333111, 105488, 2972, 20298, 25225, -52905, -133765, -113063, -17037, 22281, -80550, -272934, -421660, -455637, -441574, -483478, -557140, -529890, -365653, -194675, -120723, -87123, -26550, -10564, -122166, -294777, -410701, -446114, -393189, -188423, 119683, 292380, 190880, -2129, -56821, -21533, -37326, -31890, 83645, 101538, -199023, -582539, -614098, -323235, -147155, -215760, -181957, 154908, 530872, 676786, 668107, 622604, 442609, 98204, -164520, -151553, 5078, 109343, 174714, 239943, 191096, -3172, -130507, -44448, 92018]
37664I2018J888m5861L2560o672j70923j55739R4955K22674L5423j54437j3751
37653f7865L09512M27809K42639k711q0840k0769k9578k31779m73910m61838j56572
37642e45902J27925J60828J09555J88065K44097N5289j82438j26051R6631O6544
37632A94543j84739j88016J49770L30829N9900k75936k21252Q1644J99212O6687
37622B12642l2910M0021J46248J35225O683j41384j79385m2320J41101J38033
37612D23954p6482k45426j73550J2129P3510j2848r1326p8914k7724L519J3282
37601a79876J2091r361o5322j37782j42209J3523K67399L79714K00712j00034
37591B38855k29304j44291m5722l2612J0336J53909K68760K17472N5510n1426
$$ y = [92018, 93906, 48045, 80605, 73933, -96990, -252729, -157774, 64900, 100323, -54114, -67865, 241647, 669456, 912095, 909384, 828544, 807775, 778197, 546418, 72508, -389330, -545902, -417977, -257149, -147594, 40471, 284568, 339857, 157419, 31368, 127999, 194543, 9804, -178212, -28442, 302387, 362287, 86351, -134901, -53257, 145955, 212642, 179732, 219753, 366001, 501226, 507909, 366525, 187140, 144820, 285921, 423954, 347472, 102046, -71504, -59375, 14135, 1287, -90039, -168953, -196677, -193158, -179876, -167785, -177146, -242468, -380250, -522459, -508936, -241537, 138177, 338889, 238855, 9551, -134740, -180462, -213074, -202738, -48829, 219931, 437403, 492913, 441487]
37581D41487l0700L0027j5932j96970l35211k30882L2942J49902M5215J4227K11327
37570A15432L04080q231l92463k97172J72351L71532R8444j56980p5286J0605
37560A42312j97545l64779r2485L32027L36018k5456j63000J07590L13820J22730
37550E11232j42515o2478J95388J54589k10549m26102k17523J28641K26951J03574
37540B61208K0331K1777l5946j31947r8862L3449M7768p4767j09747K187N2971
37529a1578j6876J3021J80663J70083j21850k80784l2067K10740j7505l96174
37519c02327k80493K18509L71137k477k87320j23254O9497p9877k33129J0542
37509f39192L51295K53789j71428l43362r1527J80162J62279N385l2966N8251
$$ y = [441487, 410787, 440814, 424882, 227912, -107299, -338181, -305239, -155337, -110122, -95895, 115432, 419512, 411281, 18818, -278354, -106003, 265529, 363973, 206993, 131707, 142312, -55233, -420012, -512497, -180470, 155548, 130092, -32908, 74682, 388502, 511232, 368717, 306239, 501627, 656216, 445667, 19565, -197958, -69317, 157634, 261208, 281539, 303316, 267370, 135423, 36561, 70010, 117778, 43011, -66736, -64549, -11578, -28454, -15433, 165230, 335313, 213463, -67321, -99388, 111352, 93847, -302327, -582820, -364311, 6826, 4349, -282971, -406225, -336728, -416605, -649734, -639192, -287897, -34108, -205536, -548898, -640425, -460263, -297984, -292599, -325565, -267314]
37499b67314J45939J59161R9413J0463j2891P8516J69374R8168r4076j80452n2143
37488A54158J24828J27535l6350j47652n7591J23978J57782l1694k53538k74219
37478a12763r3587P3428O6821n1498j06999j6148J42198K17073J37782m396n0757
37467B01154L1710J14044R2927J3594n9295j58469k76255k51622K828K59337K11140
37456A81093q2776k46274r6463J48281K27421J50977M3410q3152k22721k33697
37446b13901l0628J94256J78722k1220q4539J05952K73614J46687j27509j73476
37436B47958P8249K88479J82108j04618k82374l15107l44872l46446j54023J90969
37426e59677M08444L49422J58887J3873o6188q9906l1546J7276j01862l06667
$$ y = [-267314, -121375, 37786, 137199, 147662, 134771, 213287, 382661, 480829, 386753, 206301, 154158, 278986, 406521, 370171, 222519, 164928, 288906, 446688, 414994, 161456, -112763, -206350, -132922, -66101, -117599, -224598, -240746, -98548, 118525, 256307, 251911, 201154, 232864, 346908, 439835, 453429, 394134, 235665, -40590, -292212, -289384, -30047, 181093, 98317, -147957, -244420, -96139, 131282, 282259, 325669, 242517, 19796, -213901, -244529, -50273, 128449, 107229, 22690, 128642, 402256, 548943, 421434, 247958, 326207, 614686, 796794, 692176, 409802, 94695, -250177, -596623, -750646, -559677, -151233, 198189, 357076, 370949, 304761, 214855, 183309, 200585, 98723, -207944]
37416b07944k94799k595K46572K10810M5490l0119n1194o5127O8277L26586L33379
37405E79336q3956m62776l07632J29746K09838j26956l34922j45057J15769J50458
37395b76152R9201J58271K29818J64132L1208m0127n8331p0553o6763o3224r6554
37384A0926j05701j6002P3795K2283o7490K8849K59535L29503J51296m7894j16300
37373E22800j60675k54778k63490r2910J16146J81153J02821O346j5263M0974
37363A83124Q2876J416j42495j20152J19161K71915R2338j94080k10764j3249
37353G0090L5405j24903j91912k9798J51500J69698O2887r9971k58250k37506
37343d52760M1189K74595J16249k37427k66530P8568L15638J99794R391l5917
$$ y = [-207944, -502743, -505338, -258766, -47956, -2466, -32585, -83779, -148906, -80629, 245957, 579336, 495380, 32604, -275028, -145282, 64556, -62400, -397322, -542379, -426610, -276152, -176951, -18680, 211138, 375270, 406478, 366351, 308020, 237467, 170704, 107480, 10926, -94775, -110777, -36982, -14699, -82189, -53340, 206195, 535698, 686994, 639100, 522800, 362125, 107347, -156143, -249053, -132907, 48246, 151067, 157413, 142150, 183124, 266000, 267416, 124921, 4769, 123930, 395845, 488183, 294103, 83339, 70090, 105495, -19408, -211320, -241118, -89618, 80080, 142967, 42996, -215254, -452760, -411571, -136976, -20727, -258154, -524684, -446116, -130478, 69316, 78707, 42790]
37333D2790q1740j90866j37993J03860J80989m7017j96250L5156L67310L91818
37323D68057J61848k0249q8694j41636j50288o7115p885n6816r8655n3124k8965
37312h3522o3152j1320J09420K9976k74163l86949p4514K70483J97295j17635
37302d04081j91561K1367J69008R7282l6632j17172j33098m107K70547M06157
37292G7710J69105j80930j96427Q0207J80235o0969k83756j93182M2568J41039
37282b24400J15011J24208J65493J35729M8939p094l4868q5752j24945q7058k2899
37271B364m2143j16121q7537P8152J92767J04230n6554n5920P8829R6965o8038
37260A26994j79681p4436Q8669J01605L456p8064j54608k27296j40508J40915
$$ y = [42790, -38950, -229816, -367809, -263949, -82960, -129977, -326227, -291071, 76239, 468057, 629905, 609656, 520962, 379326, 229038, 161923, 154038, 97222, -1433, -54557, -83522, -146674, -157994, -48574, -18598, -292761, -679710, -754224, -483741, -286446, -404081, -595642, -574275, -405267, -307985, -344617, -461789, -594887, -598994, -328447, 77710, 246815, 65885, -130542, -50335, 129900, 68931, -214825, -408007, -365439, -224400, -109389, 14819, 180312, 316041, 364980, 357886, 323018, 237266, 112321, 25263, 2364, -39779, -155900, -243437, -165285, 27482, 131712, 75158, 19238, 98067, 195032, 126994, -52687, -127123, -38454, 63151, 66607, -11457, -166065, -393361, -533869, -392954]
37250c92954L27340J95828j8938J5057J75916J20077j05156j67625n3951m3444
37240E2150j40684q8664O2140j1357k43330j72628K50832M70295J82357j84636
37230A76475j80025P093l980j25474n0676J69099K56375J86301J20514L9207j74692
37219D20217m00256l75198q1897K20346L13807J91848k8309k01672k11346n2263
37209b04723J50070K35561J07386j92601m27641l29983K8435K26169P0989q1938
37199d18276P8284K40593K12l40732j96450K72004L62790P420j49324Q6254J58650
37188A01425j40669k38345J57541M63642K22168j28882r8227J5414j74706l06142
37178a26781N1021M60665K60256k96305m34700r9633Q8396o0844j06369J45550
$$ y = [-392954, -65614, 130214, 111276, 126333, 302249, 422326, 317170, 149545, 95594, 52150, -88534, -177198, -115058, -126415, -369745, -542373, -291541, 178754, 361111, 176475, -3550, 3543, -437, -125911, -176587, -7488, 248887, 435188, 555702, 594909, 420217, 19961, -355237, -437134, -216788, 97019, 288867, 260558, 58886, -152460, -204723, -54653, 180908, 288294, 95693, -331948, -661931, -633496, -407327, -336338, -418276, -339992, -99399, -99187, -439919, -636369, -364365, -1575, 5845, -143479, -57225, 101425, -39244, -277589, -120048, 343594, 565762, 436880, 338653, 354067, 179361, -126781, -75760, 384905, 645161, 348856, -85844, -185477, -97081, -157925, -264294, -118744]
37168a18744L26062J59834j52509l08375k26614K4716K67169K44982m8239k19724
37158e1442N391L29053L23202P1899p2228j03414k16466k88260r0372J55716M9230
37147A12309k66329k65413J02302L16692J05302j87517j78107N4006J98253J23985
37137A15483o8040j89807j16168O3644J12450r554n6519P7040J32639n0791j88791
37126a78414k2173J99900J43222k3111L2440J59176l078l17439l26289j4846J87378
37115a63234J08358m011J4192P3215J30249K06005J65786p6346k44577n7701K44007
37104C95943K49844J08640K96010P28026P72382K00173m81334p67463o94577n08085
37094B99559k87034p3594K6851L8069J02617K08115K06311R8225L307r1131k25403
$$ y = [-118744, 207318, 367152, 214643, -93732, -320346, -295630, -28461, 216521, 168282, -51442, -46051, 283002, 606204, 678103, 605875, 502461, 285995, -2265, -92637, 63079, 112309, -154020, -419433, -317131, -439, 104863, -82654, -260761, -206755, -8502, 115483, 47443, -142364, -258532, -194888, -82438, -91992, -148511, -71471, 61168, 10377, -178414, -200587, -687, 142535, 119424, 151864, 311040, 307962, -9477, -335766, -350612, -163234, -54876, -58887, -44695, 28520, 158769, 364774, 530560, 454214, 209637, 151936, 395943, 645787, 754427, 1050437, 1778463, 2550845, 2751018, 2269684, 1502221, 807644, 299559, 12525, -61069, -34218, 3851, 106468, 314583, 520894, 619119, 622426, 531295, 305892]
37083C05892k31673J6209K54752J64826q7850j20247J3194k2886j65906n5300
37073G1011K41832K53792j07151l87781l08820q1296O8553J55910J54256j5121
37063D5185j58439l457K60853K04399q3631r7336J87795K33304j24522l87006
37053G7145k47994k4265K3313R2697K57192J81992j96131l77379j19514R8408
37043b34536q0199k24898J04777M97481L22895k05023l61180l4091K29837J67438
37033A82501P1277J27944J26531n6564k01710j49875o3058r4185j14992J6649
37023a55482J54597P0677j63905k45228p0980J08785O8001m8365L4607K36919
37013a0374K04578r7281k58516o4694J36095J8907j49364J9867L19977K74839
$$ y = [305892, 74219, 90428, 345180, 510006, 422156, 301909, 315103, 292217, 126311, 71011, 312843, 566635, 459484, 71703, -237117, -318413, -249860, -93950, 60306, 45185, -113254, -116711, 144142, 348541, 264910, 167574, 355369, 588673, 464151, 77145, -170849, -195114, -171801, -79104, 178088, 360080, 163949, -213430, -332944, -234536, -314735, -539633, -434856, 62625, 385520, 180497, -180683, -214774, 15063, 182501, 253778, 381722, 508253, 451689, 249979, 100104, 37046, -57139, -172131, -155482, -885, 69792, -94113, -339341, -410321, -301536, -233535, -281900, -247293, -10374, 194204, 96923, -161593, -226287, -90192, -71285, -220649, -200782, 119195, 394034]
37003C94034l8920j39920N203l0135l00469l60397p6259J31739N6283L9638K67239
36992e1964L68373Q9911k08414j59638J1739m3642j74610o7877J44905J32293
36982D1076m3246o5298Q3622J53327Q6823N4154R5390O0347j16400l02920l09097
36971b62222m2943L59424N31316K37280k25314l12997R861K16749L6476j79053
36961C68577j31193o5327k14880k88818j8048K48726R4890j90062n6098L52219
36951I9986M01926j070l01646j94677L1418J07151J12900Q5169j11777l51584
36941a22204k49579J74795L74588R1657k16260j09846J56149J33741o0706k8699
36931A43636J71888J63007n0973j18420j1082n0560k29947j35448K83379M73814
$$ y = [394034, 355114, 215194, 220397, 190262, -110207, -470604, -546863, -415124, -358841, -319203, -51964, 316409, 406320, 197906, 38268, 50007, 6365, -168245, -236122, -91217, 41076, -2170, -67468, 16154, 169481, 256304, 310458, 405848, 466195, 349795, 46875, -262222, -305165, 54259, 585575, 822855, 597541, 284544, 294405, 511154, 547630, 368577, 237384, 172057, -42823, -331641, -349689, -100963, -6073, -196135, -252233, 99986, 501912, 500842, 199196, 4519, 35937, 143088, 255988, 341157, 229380, -122204, -371783, -196988, 177600, 269257, 52997, -56849, 99300, 233041, 172335, 143636, 315524, 478531, 427558, 309138, 298056, 247496, 17549, -117899, 165480, 639294]
36921F39294J27196k78323k23104L3737n0659l40562k51605K16228M18674R3775
36911C84651k44072j50104J16002J31560j3264L021J40732J28226m7006j67061
36901B82685j48364o1207O4265J74553J09585j36234k57684n1531J97301R3468
36891B66837k47797l43143m4005K70539K27571r8237l32840k13645J64772M16297
36881F6349K42637j80599l59337j16086J77104J59214k4046m2897Q1110J00614
36871A04063j0244q4610q2499o4684L385J28035J31628q9646l20585l13829j33201
36860g32187M2430K09640L58334K99879J0422j66090k4549J26722J26j43387J3083
36849e577K17342J06128p8970P6429L18414R9135m06723m96738r0682J44266j09160
$$ y = [639294, 766490, 488167, 265063, 298800, 248141, -92421, -344026, -127798, 290876, 384651, 140579, -9525, 106477, 238037, 224773, 227794, 368526, 496752, 449746, 282685, 134321, 73114, 137379, 311932, 421517, 285283, 27599, -23932, 173369, 266837, 19040, -324103, -368108, -97569, 130002, 31765, -301075, -514720, -349948, 66349, 308986, 128387, -230950, -347036, -169932, -10718, -34764, -77661, 3449, 104063, 93819, 9209, -73290, -137974, -134589, -6554, 125074, 35428, -285157, -598986, -732187, -689757, -480117, -121783, 178096, 188518, 22428, -2121, 124601, 124727, -18660, -5577, 211765, 317893, 238923, 315352, 633766, 732901, 326178, -170560, -261242, -116976, -226136]
36838b26136l62483j49760L23377N84033M65031J09897k17849k73948j06311r8578
36828D7273l91790n11742o7284M88644M58852q610k08069l5546J8072j06748J3119
36817c03829L27122L01454m4530q6851K53867L17478r4937l41446j06601N7860
36807B79587j89014l36405k4289K26207m4694l71706j80608K23354K48397J6074
36797a53097n9J44856J00428n2286k0959P0326n7651k24879p7724K36307K82325
36786B47587M9637j03553o8511l7945o2752k8421J9206n7227j73602j44203k5844
36775c85628j2923q3334n8334O6604J30358Q2336K1166J5629N7358J18811J39830
36764I1873N9217n9466o9605L3839R1777K0867r7366j74176j72915m6651J67069
$$ y = [-226136, -588619, -738379, -415002, 169031, 634062, 743959, 526110, 252162, 145851, 47273, -344517, -856259, -923543, -434899, 23953, 15343, -192726, -228272, -210200, -316948, -303829, 23293, 324747, 280217, 193366, 447233, 764711, 669774, 328328, 221727, 279587, 90573, -245832, -270121, -43914, -88608, -460314, -640922, -417568, -169171, -153097, -153156, -8300, 92128, 39842, 18883, 89209, 31558, -193321, -271045, -34738, 247587, 297224, 193671, 125160, 87215, 24463, -3958, 15248, -41979, -215581, -359784, -385628, -398551, -481885, -540219, -473615, -343257, -260921, -239755, -224126, -166768, -47957, 91873, 151090, 91624, 22019, 55858, 147635, 168502, 71136, -103040, -275955, -322606, -155537]
36753a55537K65369J42174O671M9186P9732j16888k92371j04604K28611K41109
36743C43452J6601N248J70878P5001k43698k82692K315J11030p6583j22938Q0607
36732G9221J01424j57964k18782Q0814K71760J10051n8036n3711j56205l62143
36722c63571k37654J78179K48791j26000k33423J73406L68612l0060l14887M1935
36712b94672M12610J50794k52895j06929K36564J06987k34778j46635J80661J31540
36702A83247j84508k27093o9066j36981k57233K5290M47489L55467j40780l05118
36692c09286J9022K45925Q0320j17516o2286P6928J21098J13875M1549j76238
36682C3391l79568k88359N4442L09939K81634N9201j60196j75017R3279L86697
$$ y = [-155537, 109832, 252006, 258677, 307863, 387595, 270707, -21664, -126268, 102343, 343452, 360053, 365301, 536179, 611180, 367482, 84790, 87105, 198135, 121552, -1386, 79221, 180645, 22681, -196101, -115287, 156473, 266524, 208488, 154777, -1428, -363571, -601225, -423046, -174255, -300255, -533678, -360272, 8340, -21720, -336607, -294672, 117938, 268732, 15837, -91092, 145472, 252459, 17681, -128954, 51707, 183247, -1261, -228354, -297420, -434401, -691634, -666344, -218855, 136612, -4168, -309286, -290264, -44339, 35981, -81535, -143821, -66893, 54205, 168080, 209629, 33391, -346177, -634536, -580094, -270155, 11479, 70680, -89516, -264533, -171254, 215443]
36672B15443L16756m9628k15968m1764L8585j70459k43656N2211K47380j7263
36662A31637l15148j64397J68966K24627J25825J49166R4014k13112l45270L0333
36652a13359M04992J81886k91761k80220J59209L87448K33563L0107r1421j87041
36642D33403j03816J87018K33353k01613n29756k11672K48872R4281l67525k77065
36632d94520K96932N14137J95016l2056N2181o459l16197l77756k6253K46017
36622E1042J29803q0709j02566m9382m2953j2304J2604q0833j48218L1249K71721
36611b0546K04346p9136j54049L0945J31365L6778k3379L3301N6428K2685L1659
36600B70397K9451n4212n8255J09148J67969p8742k84362p8567K58585K27609
$$ y = [215443, 532199, 482571, 266603, 224839, 263424, 92965, -150691, -98480, 148900, 131637, -183511, -347908, -178942, 45685, 171510, 320676, 414690, 201578, -143692, -113359, 291633, 473519, 181758, -98462, 60747, 448195, 681758, 711865, 620444, 433403, 329587, 516605, 749958, 548345, 18589, -193083, 55789, 150070, -217455, -494520, -197588, 316549, 511565, 479509, 531690, 525231, 209034, -168722, -194975, 51042, 180845, 100136, -2430, -51812, -94765, -107069, -94465, -175298, -323516, -292267, -20546, 183800, 104664, -49385, -18440, 112925, 149703, 126324, 159625, 216053, 238738, 270397, 299848, 245636, 187381, 296529, 464498, 385756, 101394, 22827, 281412, 509021]
36590E09021p3171j85170q3067p9819j58328n4309J59892J88035N8551J1009J6105
36579C08749p6954j46096n2502n166j61757k11364R9792M09824K97458r66m5774
36568D15244N4901o401q2470M7435J03494j65332l61545j13455J49517o5276l41462
36557c65350o6668L93673K86513j98244k95250p229N8147r2502M5720L42727J98323
36546B99860k66300l29166O5460K62489R5470M2293J73987L8769l30420l52325
36536b99883K6683J94795k6589j03706J91871L86771J72316j25831j86098j19442
36526A10887p5780j7749J1067p0587p8685J66384L79400J87455k01719l04843
36516A05830j23098J3332Q6899K33101K56838j4373k45501j41102m0950k55631
$$ y = [509021, 435850, 250680, 167613, 87794, -70534, -124843, 35049, 223084, 281635, 292644, 308749, 231795, 85699, 33197, 28031, -133726, -345090, -245298, 164526, 461984, 461018, 415244, 470145, 463744, 381274, 428709, 532203, 366871, 5326, -108129, 41388, -23888, -365350, -432018, -38345, 248168, 49924, -245326, -252555, -194408, -286910, -241190, 101537, 299860, 33560, -295606, -230146, 32343, 127813, 170106, 344093, 382862, 52442, -299883, -273200, -78405, -104994, -208700, -16829, 369942, 542258, 416427, 230329, 110887, 35107, 17358, 28425, -42162, -120847, 45537, 424937, 612392, 410673, 105830, -17268, -3936, 82963, 316064, 572902, 558529, 313028, 171926, 130976, -124655]
36506a24655l58346L2178L80240J13898k56949q251M31578K23619l35858l62415
36496b64961Q709r896k93915j08523L51397K65899k05234j85822K35424J89483
36486a7439k41863j50453L83347L28133l50524n14097J40573N82706K95417k036
36476D53764J11207P5431l09853l64423J04720L11667p5037l26639k3725K40345
36466A97457N9313j10892M543k3296l06210k72188J90296L76619K9248j84073
36456c9183Q9163L04742J25039k8012N0213m6270l42614k58137K18246L07762
36446C80949j81334m48348j08328J94336L6194j19085K4943O4651j14843p500
36436b78365L99511L92513j28356l25726P6795K72006j12456l05091J46538M96585
$$ y = [-124655, -483001, -450823, -70583, 43315, -213634, -221885, 209693, 433312, 97454, -264961, -256252, -266148, -560063, -668586, -317189, -51290, -256524, -442346, -206922, -17439, -259302, -409755, -26408, 301725, -48799, -562896, -422323, 160383, 455800, 453764, 564971, 640402, 330549, -33874, 70846, 382513, 307476, -19163, -42888, 197457, 256770, 145878, 150421, 127125, -179085, -451273, -260977, 115642, 144890, -39183, 49980, 354722, 479761, 451749, 501962, 455692, 113078, -145059, 73187, 380949, 199615, -248733, -357061, -162725, -126531, -245616, -220673, -156022, -270865, -278365, 121146, 513659, 385303, 59577, 136372, 408378, 295922, -9169, 137369, 633954]
36426F33954J37344l66933l56514j10818o6884j2556K35454K91002k0564k22538
36416A40947n4776J01489O4143J47914L00611K9587m97160m72997Q9702K22274
36406G1734k89449m55087J49129N94515K38997k31775j43016R6410L4595M3131
36396A09184L45992L62346j81796n88122l74166n3137n7133K693L39741M03650
36386C09252k3428k66394L3421K61909K3744j50494P7997J92033r0159k23698
36376A44183L7637J06044k38662l28176R3919K98610n7110k48104J50536M63057
36366D21934J80616j81712j69964j39885k89872j52353L44431N12104J47646p6506
36356E96439P8637K8283l20856k94349J17336Q3116m14860l97337K25840L61654
$$ y = [633954, 771298, 404365, 47851, -62967, -129851, -142407, 93047, 384049, 363485, 140947, 86171, 187660, 251803, 399717, 700328, 729915, 232755, -240242, -150540, 71734, -217715, -672802, -523673, 70842, 309839, 78064, -64952, 31458, 66053, 109184, 455176, 817522, 635726, 47604, -326562, -379699, -436832, -434139, -94398, 309252, 285824, 19430, 52851, 314760, 338504, 188010, 266007, 458040, 367881, 144183, 181820, 287864, 49202, -278974, -185055, 113555, 56445, -191659, -41123, 421934, 602550, 420838, 250874, 110989, -178883, -331236, 13195, 525299, 672945, 596439, 675076, 703359, 382503, 88154, 205490, 288606, -126254, -523591, -297751, 63903]
36346F3903j99089l22597K87092M56064k01002m57335K31773O80068J93294k06449
36336E25722J57580L62228j68563m71166M051K34252l42618o28630J1751M34413
36326A19020j21708n54060n937N20082J38274k79000N7932L16276j35483l32391
36316b76995L00325N82277j69629n89166K85594J076131M69695m58650l24309
36307H95273J30261k26076o21869k6053O63977K94154l15559K773M89568j028
36297A285421p08262m15050K45764J00761l27022q336N02262K27883k84095j44781
36287D74545Q2531l33311o24942k6122N27957P6009n04623j68091L45094Q6543
36277f4410k22938K14138N22136p9694n33486Q0369O58231J44346m27867R705
$$ y = [63903, -135186, -457783, -170691, 285373, 84371, -372964, -141191, 538877, 732171, 525722, 683302, 1045530, 876967, 405801, 409852, 644104, 301486, -327144, -315393, 119020, -2688, -556748, -562685, -42603, 95671, -183329, -125397, 190879, 55396, -276995, 23330, 605607, 435978, -153188, 132406, 1208537, 1678232, 1219582, 895273, 1025534, 799458, 177589, 151536, 815513, 1109667, 794108, 796881, 1286449, 1285421, 577159, 162109, 407873, 508634, 181612, 173276, 675538, 903421, 619326, 474545, 557076, 223765, -401177, -427299, 100658, 176667, -327956, -496047, -150953, -64410, -287348, -73210, 448926, 369232, -164254, -83885, 574346, 718692, 290825, 300530]
36267C00530M62997p3309n37274O0926N53383r6724o28710P6693O86147l1918
36257G72741p12253j2443O99486j3979p88763r0791P41961R5657p23929l3300
36247f5613Q91858K69618p41362l53632M04192j03812p86538q2475P84862K08701
36237D25799n41172J20965Q07154o8060q99348O2776J070019J18902j050603k31359
36227a84927R39946J91209q86890j4762J155702K67368r67795q1729J176000K34072
36217A828194j104989j43069J268946K76858j265750l76980J104578J33078j409322
36208C11544m21451J123037R9890j278997K23065J994638L52007j892412m90284
36199B1037J836917M88784j867041l56670K290123Q31259j972413m93687K488892
$$ y = [300530, 763527, 690218, 152944, 213870, 767253, 670529, 41819, 118512, 804659, 772741, 60488, 48045, 747531, 733552, -55211, -146002, 595959, 691616, -32313, -65613, 826245, 1095863, 354501, 869, 405061, 301249, -485289, -567764, 217098, 425799, -115373, 5592, 812746, 744686, -154662, -91886, 978133, 1097035, 46432, -184927, 755019, 946228, 59338, 44576, 1200278, 1467646, 499851, 418122, 1594122, 1828194, 723205, 580136, 1849082, 2125940, 860190, 483210, 1587788, 1720866, 311544, -109907, 1013130, 1113020, -165977, 57088, 2051726, 2403733, 511321, 21037, 1857954, 2346738, 479697, 123027, 2413150, 3244409, 1271996, 778309, 3267201]
36190C267201R77269k186206o06626K767788J157961k198772m06M006656J601365
36181H786230k982381j81762N621715L581969j645925K127199R317204N574020
36173C0198269j784141N921395J9817273J4354998J235183K3644908P7813985
36166A71201870R1968091K2263916p1628540r7635185n0654980n291022n013597
36159E5210553j9436935j3330524J056812K31850p927534n639420J624103J90463
36151A1979368n157752l037338K261708Q33178l481462j846520K298818R48349
36143D798349k800801j563698J950999R64297k117200j074398J850281Q31825
36135B839654k042217j197297J559777R58894j497984r66975J210529O21626j360436
$$ y = [3267201, 4244470, 2058264, 1451638, 4219426, 5377387, 3178615, 3178209, 7184865, 8786230, 5803849, 5622087, 11243802, 14825771, 13179846, 15307045, 24624249, 30198269, 28414128, 34335523, 54152796, 68507794, 69742977, 93387885, 171201870, 263169961, 285433877, 213805337, 116170152, 65515172, 60224150, 55210553, 35773618, 22443094, 23499906, 23731756, 15804222, 10164802, 11788905, 11979368, 6821616, 3784278, 6045986, 6879164, 3397702, 1551182, 3850000, 4798349, 1997548, 433850, 2384849, 3349146, 1231946, 157548, 2007829, 2839654, 797437, -399860, 1159917, 2118811, 620827, -346148, 864381, 1486007, 125571]
36126A25571n73617J537321Q33164j378444j013717R05631N77620j104907o38993
36117g30371J051747O11658j036185o26959R60183N48563j026292o34281R84803
36108A02866P44778p90399o72854P02777O33885n38877l63192P51006M88126o82920
36098C75196n19255N22200L34696n82732k63791O52717K17755q21730m47108O03560
36088G1508L00027o39928k27147P63424L10132p66331l38138Q15802M62151p51571
36078g1n54592N88937N06898m40664k59500O02962J89743r18032n91771O49277
36068b26813N26472o35876n30094P12837P98017l82072o58431K86003N27856l16347
36058A01552n48129K06398M36372j81636k98853L05779L80908j88138k01395L51870
$$ y = [125571, -448046, 1089275, 1922439, 543995, -469722, 435909, 1013529, -91378, -730371, 321376, 933034, -103151, -730110, 230073, 778636, -247656, -881937, 102866, 847644, 57245, -615609, 87168, 721053, 182176, -181016, 569990, 1058116, 375196, -144059, 378141, 712837, 130105, -133686, 519031, 736786, -84944, -532052, 71508, 371535, -268393, -495540, 267884, 578016, -188315, -526453, 289349, 751500, -71, -554663, 34274, 541172, 100508, -158992, 443970, 633713, -284319, -876090, -226813, 299659, -336217, -866311, -153474, 644543, 262471, -395960, -109957, 417899, 101552, -446577, -240179, 196193, 14557, -284296, 21483, 402391, 214253, 12858, 364728]
36048C64728K65979m14132m55110J34949K11559j92226r8244K26190j98561p83461
36038i38329k15854Q61821P03636m02041n90202K90249O11073L138k68213J08156
36028A63434J44513k25588o6104M79311M01274m1873K29012P97990L36880p68704
36018A450145r04291j07082J09182l83066k76050M53682M46929l60617n59250
36009a30418R2981L41307j01977j94029J99043J02504l99205k00740M93065L17398
35999E19929o10556o90264K75481P04057R9141k15779K76194L93528l41656p36226
35989c26151j55635L86313J71890r9285J17822K81383O5790k9639J06735o1767
35979D57456m19499k21744L64026L88625r3817j23104K46454L4186o10472n09983
$$ y = [364728, 630707, 216575, -238535, -103586, 107973, -84253, -182497, 43693, -154868, -938329, -1154183, -292362, 411274, 9233, -580969, -290720, 320353, 323491, 55278, 163434, 307947, 82359, 16255, 495566, 896840, 854967, 1083979, 1881969, 2218849, 1450145, 545854, 438772, 547954, 164888, -111162, 342520, 789449, 428832, -130418, -37437, 303870, 201893, 7864, 206907, 309411, -89794, -290534, 202531, 519929, -90627, -780891, -505410, 198647, 297788, 82009, 358203, 751731, 410075, -326151, -481786, -95473, 76417, -22868, 94954, 376337, 442127, 412488, 519223, 457456, 37957, -183787, 180239, 568864, 475047, 351943, 598397, 632583, 22111, -487872]
35969d87872K49559L12947m12131m96472L40165O44245q6020m67884J99368O88401
35959D84306J66190l49136R20L81662j5043m51447j34494K92987K9131m30349
35949b5273l19584M6814M5961j22915l5629J16358O7065K4544Q5725m0527k99091
35938d56552k14322J44197J63018j31227o8609L04470K02079l44828l77184K36343
35928e42615M76995J6780k13699J88771L74062n9888k60028K09936M52277j13252
35918E29339o35816l40860J78493J61187n9021L2323J01189j82523l24429L7338
35908e02780L49386J63730n4726O8365O0568l34575m31462J60522O31352K67686
35898C78066l31468l29246o507j2218j31396J07230L48531N1012l99824k95440
$$ y = [-487872, -238313, 74634, -337497, -833969, -493804, 150441, 64421, -403463, -204095, 484306, 650496, 301360, 302280, 683942, 668899, 217452, 82958, 375945, 405076, -25273, -344857, -298043, -252082, -374997, -410626, -294268, -227203, -202659, -116934, -157461, -456552, -670874, -526677, -363659, -494886, -563495, -259025, -56946, -401774, -778958, -542615, -65620, -48840, -262539, -73768, 300294, 240406, -19622, 190314, 642591, 529339, -106477, -447337, -268844, -107657, -166678, -134355, -33166, -215689, -540118, -502780, -153394, 10336, -44390, 23975, 84543, -250032, -681494, -520972, 110380, 378066, 46598, -282648, -289155, -301373, -432769, -325539, 22992, 74004, -325820, -621260]
35888f21260J60501K31321j12409k61731j3649K58684K95033J67387j7069j51146
35878f4338p9547J35806J94300M8707J1909J62626J66774p0366j60636P3874K59487
35867F78596J26989p4823j12405j28020j98618j33670M1138J6697j73230j24410
35857h1756J49739J42592k16588l54746m8385J92060N5891o9394R0560J89409
35847D9382j4164j79712o5845L0400o8034l2875K72655M11268J26978j75758j36180
35836B18115N804m3890j40235j21960j31184j86669m6806K22486J96499j28528
35826a56368k08712J18429L23921J15754r4289j0624L4906j87580l03513l1333
35816c99409K70624K14435l0243j48221j41681p6456R0278K03773J5201k61550
$$ y = [-621260, -460759, -229438, -341847, -603578, -617227, -358543, -63510, 103877, 86808, -64338, -143885, -8079, 186221, 234928, 246837, 409463, 576237, 505871, 345235, 419109, 678596, 805585, 730762, 618357, 490337, 291719, 158049, 199187, 215884, 42654, -81756, 67983, 210575, -6013, -360759, -409144, -217084, -161193, -230587, -140027, 49382, 35218, -144494, -210339, -179939, -247973, -280848, -8193, 403075, 530053, 354295, 218115, 223919, 180029, 39794, -82166, -213350, -400019, -446825, -224339, -27840, -156368, -365080, -246651, 77270, 193024, 98735, 88111, 123017, -64563, -368076, -399409, -128785, 85650, 55407, -92814, -234495, -310951, -220673, -16900, -1699, -263249]
35806b63249j60042J78708J49538k09486j89630L03343M64790m4107m72502k30614
35796d73251J86573J36853j45943j29871J06126J81569Q2238r421p2479o0983
35786a98589J39789L27088J40392k32041k21065J14641J06214l18406m23553M6809
35776e18721L94825J80263j10933p4065m7808k43785k20170J86680L81248P8532
35766F066j11772J84543L81962N7384j98997J21306M42813J19099l93470l45194
35756B63740M6943J15788j01627j58748j02245j98765k52190r460K23472J17010
35746e6082k8372J28228K69578L5275k24834o2260K47875K41500P8062P9752L3633
35735G42355k73278m12707l9517L16584O6981l70761k61707J83832K30747j00801
$$ y = [-263249, -423291, -244583, -95045, -304531, -494161, -190818, 273972, 229865, -242637, -473251, -286678, -149825, -295768, -425639, -319513, -137944, -55706, -65127, -137606, -198589, -58800, 268288, 408680, 176639, -44426, 70215, 176429, -141977, -565530, -518721, -123896, 56367, -54566, -128631, -176439, -420224, -640394, -453714, -72466, 6066, -105706, 78837, 460799, 518183, 319186, 440492, 883305, 1002404, 608934, 263740, 310683, 426471, 324844, 166096, 63851, -134914, -387104, -396564, -173092, -56082, -84454, 43774, 313352, 348627, 123793, 61533, 309408, 550908, 628970, 708722, 742355, 469077, 56370, 16853, 333437, 400418, 29657, -232050, -48218, 182529, 81728]
35725H1728j97169L024L4639j14014j6066K88928K91935r5601m10601l93492k22504
35714g49193l9030J63748K49518Q3681j25910j10531R945J2781L5227K41200L41064
35703A12500L8435l32156k56985J07615J99316k8172j24220L5545J11217l7002
35693a73907j39990k9096J16964J06969j7422j06134n6234J10185K06658Q4832
35683A02825p0104M0377K70118J67147k28001l35930j808J94442o8255k91987
35673b21176p3240J65703k2097k63991n4440L10073K75066Q199J7733K01584J00273
35662D43687k20833l32958k28871k08225k18561k3785J89631P1574k11153k03259
35652i42753J02895L52560M43844M82143L58866l0910l78682l48615j41202j26314
$$ y = [81728, -115441, -112417, -77778, -191792, -207858, 81070, 373005, 277404, -133197, -526689, -749193, -788223, -624475, -374957, -291276, -417186, -527717, -517772, -504991, -469764, -228564, 112500, 150935, -181221, -438206, -330591, -131275, -159447, -283667, -248122, -136905, -173907, -313897, -342993, -226029, -119060, -136482, -242616, -298850, -188665, 17993, 102825, 32721, 73098, 343216, 510363, 282362, -53568, -55376, 139066, 70811, -221176, -294416, -128713, -150810, -414801, -469241, -159168, 115898, 124097, 141830, 343414, 443687, 222854, -110104, -338975, -547200, -765761, -789546, -599915, -528341, -739494, -942753, -839858, -487298, -43454, 438689, 797555, 766645, 387963, 39348, -101854, -228168]
35642b28168j97180n5988J68682J88545J21904J83861J58872j66461m14552j79770
35632d20255J82060J11091j53540N5M09159L74989j02121l04552n210K36297Q1585
35621D09558j34099j26455p9140j22424n3044J92569L25525J65202j17549l20047
35611A40096l81439k39936O9883K42663O9043j45178k2153K03700N4942k93535
35601c01914k20454K84889N46778K70718o0975m9339O0862m0372j95878j66654
35591A27661o4564o4923p5853N221L7504q4594j81208p0093J29243J96056J24417
35580G8867M8194N589m8733j00629q7277p364O1397N2473M54R963Q4778N6668
35568A54380j65833l53638k21922J01596K19843Q2256L2417J79548K25896O8400
$$ y = [-228168, -425348, -481336, -312654, -124109, -2205, 181656, 340528, 174067, -240485, -420255, -238195, -127104, -280644, -280589, 128570, 503559, 401438, 96886, 91676, 327973, 409558, 275459, 149004, 69864, -52560, -105604, 86965, 412490, 577692, 460143, 140096, -241343, -481279, -411396, -168733, -99690, -244868, -267021, -63321, -8379, -301914, -522368, -237479, 309299, 580017, 519042, 469703, 530565, 490193, 294315, 127661, 63097, -1826, -77679, -72458, -34954, -119548, -300756, -370849, -241606, -45550, 78867, 127061, 132650, 83917, -16712, -103989, -111353, -49956, 2517, 2971, 12934, 97712, 154380, -11453, -365091, -587013, -485417, -265574, -183318, -150901, 28647, 254543, 322943]
35558C22943J8177J77691J79319j20643k81774m4293J38875j26004m28642k27252
35548c91603K17663K98843N8488k3660P3646O662j65378q2275J76662J85794p0993
35537B83849k15805j73132j83462j93299O7927M14884L23333j95005m93420k21274
35527e85404K18386L24013J14146j04035j75622j15635R593Q1842K8473n0110
35517b54353m2204l1512j11625j46395p571J24874M1360r8930k6385J56439J56028
35506b40274n226p6955l0476j2361O47R1859J18110m1345j32862J09765M21497
35495B02379L26907j16784l97319k88379m2466R5771J29261J04838N1216O2591
35485A28015J38506Q4140j44600k50857q5545J4451j92407l16114N4988N51411
$$ y = [322943, 341120, 518811, 698130, 577487, 295713, 251420, 390295, 264291, -164351, -391603, -173940, 124903, 183391, 159731, 233377, 240039, 74661, -7614, 169048, 354842, 283849, 68044, -105088, -288550, -481849, -413922, 962, 324295, 129290, -364130, -585404, -367018, -43005, 71141, -32894, -208516, -324151, -314558, -232716, -204243, -254353, -296557, -328069, -439694, -586089, -593660, -468786, -427426, -526356, -552741, -396302, -240274, -245500, -322455, -352931, -365292, -364645, -272786, -154676, -196021, -328883, -219118, 202379, 529286, 412502, 15183, -273196, -315662, -219891, -90630, 14208, 65424, 128015, 266521, 350661, 206061, -44796, -130341, -115890, -308297, -624411, -569423, -18012]
35475a8012N00318l3326l78098k73679p4606l2048l1973j2492m4129k4578J69182
35464b53441L05473J08232j86705j57071P3848O0174j46459r3647K23042L24757
35454B58203P8405j24054q2459m2288j30847j35232K6381J33179Q0597K1637K4105
35443A07627j063k6890L2309N4533q4736j74168L131J81986l068l35244l20945
35432e66528r163J50339J16612K08689L53877J57497k89296m32698j46836J04155
35422c53352O6155j7639O376j5315q9647k2061J27458J20795N9392J99383L20033
35411D01578L983m97720m89800N0173M08214K66167M9995K2587q8716l43227l33146
35400e49912K1474K22944N9707m1474J49385K37543k2106k49604j42629J5363
$$ y = [-18012, 482306, 448980, 70882, -202797, -277403, -309451, -341424, -353916, -398045, -422623, -253441, 52032, 160264, -26441, -183512, -109664, -49490, -195949, -289596, -66554, 258203, 336608, 212554, 130095, 87807, -43040, -178272, -151891, -18712, 61885, 83522, 107627, 106564, 79674, 111983, 166516, 81780, -92388, -89257, 92729, 89661, -245583, -566528, -575691, -425352, -308740, -100051, 253826, 411323, 122027, -310671, -457507, -353352, -287197, -304836, -298460, -313775, -403422, -425483, -298025, -177230, -117838, 81545, 401578, 405561, -92159, -581959, -531786, -123572, 142595, 192590, 215177, 126461, -216766, -549912, -528438, -305494, -245787, -287261, -137876, 99667, 77561, -172043, -314672, -299309]
35390b99309m6843j14273l920N3240o4053n5480K07882L61587J90838J2442M9724
35379B91835L0984k00771k98455o5209J10106n2594j80382P7604L70860K16505
35369C00483k00677l62591j88112M0328J88461K47010J20127j33648j70101J28027
35359c0693L40092J09390k80005l40448q1178J41453J91750J72228J16691K9983
35349C69263K2249J04591P2597j59968l62360l32468j62639O663J64766K22902
35339e4404M1869j82970n4014L27533L61051r6022m00160j25861K43691J37692
35329A98405j82902j53740J31479J85318o92n6124K8340n2508k55477k12993R9605
35318b71289K75847J13649j03217n2530K13117L86228K49894j18759l95975l32695
$$ y = [-299309, -346152, -460425, -464345, -411105, -475158, -530638, -322756, 38831, 229669, 242111, 291835, 322819, 122048, -176407, -241616, -131510, -184104, -364486, -286882, 83978, 300483, 99806, -262785, -450897, -410569, -222108, 24902, 145029, 11381, -158720, -30693, 309399, 418789, 138784, -201664, -282842, -141389, 50361, 222589, 339280, 369263, 391512, 496103, 568700, 408732, 46372, -286096, -448735, -442072, -277306, -54404, -12535, -195505, -249519, 78014, 439065, 343043, -57117, -182978, 60713, 198405, 15503, -138237, -6758, 178560, 177868, 121744, 150084, 97576, -157901, -370894, -271289, 4558, 118207, 14990, -37540, 175577, 561805, 811699, 692940, 296965, -35730]
35308c5730p0004L8654o4982j09902j3078j8920j82988j82644J09031L20138J74525
35297c5900m9271l2667L4512j28218l08094j55842J66122K34939O1560P887J51799
35286e3173K38234J78747J28883J04102n0780k99915l94211k46889m2765M3151
35276c94616K416j05033j87090j09859J31302K94810J66034j13462k06646k0823
35266e42967K20205L03886K26579P5303r9751k49279k82193j40586R0084J97872
35256b00847O0048j46822j12143J49768K37591m4711l08090j35397K31402K43901
35246b5300p8657k05963K4421K03617R1971m3824R836P5837J1077l2667K7908
35235E8256N1078L5132J47674K62038L4995l93915m24903M4849L66521J58346
$$ y = [-35730, -105734, -67080, -132062, -241964, -255042, -273962, -456950, -639594, -530563, -210425, -35900, -85171, -117838, -83326, -211544, -519638, -675480, -509358, -274419, -212859, -204972, -53173, 185061, 363808, 492691, 596793, 546013, 246098, -148113, -395002, -437767, -394616, -392200, -497233, -684323, -794182, -662880, -368070, -202036, -315498, -522144, -542967, -322762, -18876, 207703, 283006, 183255, -66024, -348217, -488803, -398719, -200847, -140799, -287621, -399764, -249996, -12405, -57116, -365206, -500603, -269201, -25300, -103957, -309920, -285499, -81882, 10089, -33735, -23899, 51938, 63015, 30348, 58256, 109334, 144466, 292140, 554178, 589173, 195258, -229645, -184796, 181725, 340071]
35225C40071j26336o2921L1270k01278m09244j62923K13056J76951q6805k5738
35215c13897K90455L08908n3353l14425k20190j1412Q8505J25522J42615Q6890
35205A29618j814l5537n6080j03377n8168J08501J49546p2314k60618j16558J52941
35194a63860J67231k2043r9540n0866q1900j36081J1793K68826L00856O6668j33802
35183A27282j37245q8735j33531k32081k84262k22187k4381K03084K77465K05074
35173c09517J95234K72677J75584j58289l61456j89062N2176l555j83407r9177
35163f08792J91980K99699R8777j76607k91803j56879J92348M88912L76894o9452
35153C45077l06390r2872J28608o133j52406Q8047L87271K44807j01468r6474
$$ y = [340071, 213735, 150814, 182084, -19194, -428438, -591361, -378305, -201354, -288159, -313897, -23442, 285466, 232113, -82312, -302502, -313914, -225409, -99887, 42728, 129618, 127804, 92267, 36187, -67190, -125358, -16857, 132689, 60375, -200243, -316801, -163860, 3371, -18672, -118212, -169078, -250978, -387059, -375266, -106440, 194416, 261084, 127282, -9963, -98698, -232229, -464310, -748572, -970759, -995140, -792056, -514591, -309517, -114283, 158394, 333978, 175689, -185767, -374829, -322653, -326208, -509615, -608792, -416812, -117113, -18336, -194943, -486746, -643625, -451277, 37635, 414529, 345077, 38687, -54185, 74423, 68290, -84116, 3931, 391202, 636009, 534541, 438067]
35143D38067J24453L289l71656l71235N5811K69842K9824j57096K3868J91719
35133B36886J9576j90409p5826J74719J89720L088r7178k6960Q7334J46954J08385
35122E76289m3633k10544k48180j89136j86887k19526j19451Q0704J47164M5352
35112c67848J5629J56998K50998J30546n6110j00991k7329K1263L254l4295o0193
35101f8078o5146n4114n0885l3473P0636K16388K00358l5105k14326r3910J34355
35090F700J18351r6337j49511N0699K11808J33580n8621k01580k79262k52177
35080e16350k4955L03665M30992K22093j06921k66796j85783K0497J84587J58801
35070B19830n9732k42698j51532J31636K78127J38288r8596k01149j57893p7980
$$ y = [438067, 562520, 565809, 194153, -177082, -121271, 148571, 178395, 21299, 45167, 236886, 256462, 66053, -9773, 164946, 354666, 357754, 260576, 233616, 320950, 467904, 576289, 532656, 322112, 73932, -115204, -302091, -521617, -641068, -560364, -413200, -367848, -352219, -195221, 55777, 186323, 130213, 29222, 1893, 23156, 26410, -7885, -68078, -133224, -187338, -238223, -271696, -201060, 15328, 215686, 180581, -33745, -127655, 6700, 125051, 28714, -120797, -70098, 141710, 275290, 216669, 15089, -264173, -516350, -541305, -237640, 193352, 415445, 308524, 41728, -144055, -123558, 61029, 219830, 160098, -82600, -234132, -102496, 175631, 313919, 215323, 14174, -143719, -221699]
35060b21699K423J13871K40598K91393J77449o8387k55593k10702j0364R5457
35050A54446L1848j9633L6586L4263j26812k28239n6329K17998K68109Q8008m3245
35039C57000J0747J14515J14575L413j39703k06966j15029O6642J27019k4120
35029C08093k15163k44753j17947M8153J77849J93093L0722j77213j79967P834
35019a69299P6346p8596j52080O4889L14497K75368L0967j51109k19346k26839
35009b35202j07294J30766K53595J35777k4952p4492j45236k70921j80019J82548
34999c35430L74981J24348j71142r2816R4680l4663k67773j48230J73209K10387
34989g2449M598k4252J09226M8135j37153m2238K65808K91670k8492k29677j31524
$$ y = [-221699, -219276, -105405, 135193, 426586, 604035, 535648, 280055, 69353, 58989, 154446, 186294, 166661, 203247, 237510, 110698, -117541, -173870, 44128, 312237, 400245, 357000, 367747, 482262, 596837, 600250, 460547, 253581, 138552, 205194, 332213, 308093, 92930, -151823, -269770, -221617, -43768, 149325, 180047, 2834, -177133, -169299, -92953, -171549, -323629, -258740, 55757, 331125, 362092, 210983, -8363, -235202, -342496, -211730, 41865, 177642, 152690, 78198, -67038, -337959, -517978, -335430, 39551, 163899, -7243, -100059, -5379, -40042, -307815, -456045, -282836, -72449, -67851, -92103, 17123, 65258, -71895, -114133, 151675, 443345, 414853, 185176, 53652]
34978E3652n7252j52821j55904K4199J18831M1861M1319J66976J50558l7751p9663
34967A14005P5782N5509k56461m20399j13451L47965M65710J97758j22985k34282
34957A09151j07781J08701J83991K7314j60472j65875r9379j54230j83076M9996
34947c91660L18099J74610k78751m42002j07650K51293K30751K7489J0775J73806
34937c3240K45799P9887k17823l67346j41451K87365L93661q521l82723k11646
34927c56038J91431K06432o6930p8375J08659m1564m07366k64755L94652O55765
34917C41911J22573m23257k91588R0757M1550k64126k61415J5879J42300P3804
34907d11612N8206R5537N1475K5009J18786J34981o2378k03510n9492J16816M5608
$$ y = [53652, -3600, -156421, -312325, -288126, -169295, -127434, -86115, 80861, 231419, 193668, 114005, 189787, 245296, -11165, -431564, -545015, -197050, 268660, 466418, 343433, 109151, 1370, 110071, 294062, 321376, 160904, -4971, -104350, -258580, -441656, -391660, -73561, 101049, -177702, -619704, -727354, -476061, -245310, -217821, -207046, -33240, 212559, 292446, 74623, -292723, -434174, -146809, 246852, 238331, -144392, -356038, -164607, 41825, -25105, -103480, 5179, -36385, -443751, -708506, -313854, 341911, 464484, 41227, -250361, -159604, -118054, -382180, -643595, -627716, -485416, -411612, -353406, -257869, -206394, -181385, -62599, 72382, 10004, -193506, -252998, -136182, -90574]
34896i0574n1728J17906L12192J45153j95597k27489K4633J09537p6417j85295
34886a17679o8140J7380p9789j48531o371K08586K77481J75066l798j82372k74181
34875b02348j90555K2722J67632J04454o7821j09996O8308K62781K00714q0046
34865A75845k31435o8662J47815J00124j07641j52844k4469K0455n8728n2912
34855b52452P0783J16284M5772K8494Q1210M5547o2876p5185k8399q3607j29012
34844b43441M6975K43125R6137j83366l2028M45083M77564j29248n87880l44287
34834b11366R6813Q5687j58978j04150J32190J09566q2284m4671J58216J47893
34824A28916n9028j30524m8861o6375j54740o1593J59696J94497Q60j55297j61830
$$ y = [-90574, -142302, -24396, 287796, 432949, 237352, 9863, 34496, 144033, 67616, -117679, -185819, -168439, -248228, -396759, -403130, -194544, 82937, 258003, 254205, 71833, -202348, -392903, -370181, -202549, -98095, -165916, -275912, -207604, 55177, 255891, 175845, -55590, -124252, 23563, 123687, 16046, -136798, -161267, -140812, -199540, -252452, -181669, -65385, -19613, 8881, 90091, 135638, 72762, -2423, -30822, -114429, -243441, -196466, 46659, 142796, -40570, -72598, 372485, 850049, 720801, 132921, -211366, -114553, -28866, -187844, -291994, -159804, -50238, -132522, -177193, -18977, 128916, 69888, -60636, -109497, -175872, -330612, -392205, -232509, -38012, -37152, -192449, -354279]
34813c54279j47964j52751q6374J4590L4264L2859J48599L10559L31262J99833
34803C30598K9951j52054l12017k79306p242K18379J43884n9136q3119L4643P2400
34792f3019N6980J32978J80123L110k31152k03541L762L2336j25286j12022J55195
34781a70536L11401J26331j49583j98438p0843p901o2299j01573n2059L2469R1131
34770b51900J30478J72378J74901O1855j29098k07527p0943R2007N2977p2111
34760d6983n898J63584P8555k08544j90159K44948M84126J06676l94937l50947
34750a19579N6693J60622r3667j60685J13053K66303N8754j54120q0675N0268
34740I6967k3749j22730J9023K52988K35974m0480k55781k08166j7032R1845L4973
$$ y = [-354279, -502243, -654994, -741368, -726778, -692514, -659655, -511056, -200497, 130765, 330598, 360549, 208495, -103522, -382828, -390070, -171691, -27807, -86943, -170062, -135419, -63019, -6039, 126939, 307062, 310172, 79020, -124521, -120759, -88423, -213709, -325731, -170536, 140865, 267196, 117613, -80825, -151668, -159569, -221868, -323441, -375500, -343031, -251900, -121422, 50956, 225857, 287712, 158614, -48913, -119856, -27849, 25128, -46983, -52881, 110703, 189258, -19286, -209445, 35503, 519629, 626305, 231368, -119579, -62886, 97736, 4069, -156616, -43563, 222740, 281494, 127374, 46699, 96967, 73218, -49512, -30489, 222499, 458473, 417993, 162212, -45954, -62986, 28859, 63832]
34729F3832r5020j43777l8494J33178J93283N1756j84577k92643j46374J26333
34719c32503K38199O1148j91775k12133J7699K40047K91387K42033J57933j7029
34709D95006k51827l40671j66502J20120K97142K90999J35478r4920k43429j76695
34699F4701l192L2075q3814j25735k3854N7444Q0351J87600L06629J46699k40164
34688C98740l68160m3876K75489J72241j21612j84403o2836k7600l1897R8904
34678A04990K24587J25128n3954m9723M7716J8023l6296O9024J50582l1901k41852
34667C26324j16638J35449K6601l30258l21038J64966M99362K41506k71304m82200
34657a27230k94216L9046K99405L38453O3852l54311n15381k51553J29214K40978
$$ y = [63832, -31188, -174965, -213459, -80281, 113002, 164758, -19819, -312462, -458836, -332503, -94304, -33156, -224931, -437064, -419365, -179318, 112069, 354102, 512035, 495006, 243179, -97492, -263994, -143874, 153268, 444267, 579745, 484825, 241396, 64701, 61509, 93584, 9770, -115965, -139819, -82375, -2024, 185576, 492205, 638904, 398740, 30580, -13296, 262193, 434434, 312822, 128419, 65583, 37983, 6086, 104990, 329577, 454705, 400751, 351028, 398744, 416767, 380471, 449495, 600077, 568176, 326324, 209686, 345135, 371736, 41478, -279560, -114594, 384768, 626274, 354970, -127230, -421446, -382400, -82995, 255458, 319310, -35001, -550382, -801935, -672721, -431743]
34647d31743R3197o64J32245L25192K87568m3109l75690l54965p752K47531J41331
34636A3141q8724p2763J49438K44429J12165k8754l5257q867n0422r7916o2309
34625G4161M1782J29035J11234k5119j40240o3018J28942J46936p2499k22870
34615A08344j02277N3513k6861j99501j88832o6779o0167q9818O8302L07642L14387
34604A17953Q5341q2290o6277j2945k756K5404N6677K9923K6608J24676J60923
34593D63237l1172k57922k04184N9610J86845Q9984j6227l4127n3370n9162L7739
34582A81251J25903L2958j13221n7837J07468P3480j23471j28753J21605K74914
34572D94297J25037j04344j50114m6076L1784j4220j84854l49990k65877J14603
$$ y = [-431743, -338546, -339210, -206965, 118227, 405795, 362686, -13004, -367969, -375721, -128190, 13141, -75583, -148346, 1092, 245521, 357686, 328932, 293675, 284808, 234386, 136470, 74161, 115943, 244978, 356212, 331093, 190853, 127835, 256777, 403713, 331214, 108344, 6067, 59580, 32719, -166782, -355614, -422393, -482560, -572378, -504076, -196434, 117953, 203294, 121004, 54727, 41782, 39026, 64430, 121107, 151030, 177638, 302314, 463237, 432065, 174143, -30041, 29569, 216414, 306398, 290171, 256044, 202674, 143512, 181251, 307154, 340112, 226891, 169054, 276522, 350002, 226531, 97778, 219383, 494297, 619334, 514990, 364876, 318800, 350584, 336364, 151510, -198480, -464357, -349754]
34562c49754M32831L28118n2182k74640k19751q7948L6333J80893J85754q9250
34552I0404l55348k23056J34350K04555l2956j13232Q1239J54443m8523j77286
34542b85410m0396P7096j7250r4058J6688J25365R7163Q1636J16186j96k22117
34531a45293j74730J91119L96221J83723o0921Q148J19785p6233l55765l01446
34521b15392J2306K00938J71267R8261K1834j16832k08544j18159L9195O6816
34511d8310o058l7479l0098m4229l2454K7565L2136k7885J4186J64308J36333
34500A48015j89014m55930k93855J40759L95947L14254R9364m3933n7263M7062
34490A05406J60611R9765j44026l14650k27859k5136P9312R8237J23443R7522
$$ y = [-349754, 83077, 411195, 359013, 84373, -135378, -223326, -186993, -6100, 179654, 90404, -264944, -488000, -353650, -149095, -182051, -295283, -214044, -59601, -108124, -285410, -325806, -248710, -265960, -360018, -343330, -217965, -120802, -39166, 77020, 76824, -145293, -320023, -128904, 267317, 451040, 390119, 398267, 518052, 441819, 86054, -215392, -203086, -2148, 169119, 267380, 289214, 172382, -36162, -154321, -115126, -48310, -54368, -91847, -121945, -166174, -198628, -171063, -138927, -166812, -152626, 11682, 148015, -40999, -496929, -790784, -650025, -254078, 60176, 159540, 115607, 58344, 105406, 266017, 365782, 221756, -92894, -320753, -345889, -266577, -168340, -44897, 52625]
34480E2625l5047j39382q8252J2986J2964l2302N420R0499J12219P0203J3524
34469G5457o0516j22775r3080O80L7651L4726J08147J69297J0266k33995j48171
34458b22313K73848M76364J46732k87175l12654n7067N8745J0056L3965J07906
34448B28407N7546l5169N971P0984k4404j43851q1944l800j60543l52891j99813
34437f39507J83282L14793J03398m8174R0789K88145K82382R5902j39649l10636
34427B20725k59448M3379K77082J09810k57010l16094k8077J27759m7807j65005
34417b94686N5726K87357J50437j35479r9846K14768L03166m5366m44535m50688
34407d59146j18484J47717J39518L6760P2571J98477K01891M6967q9694r8663
$$ y = [52625, 17578, -121804, -210056, -197070, -184106, -216408, -210988, -120489, -8270, 61933, 75457, 14941, -107834, -200914, -200234, -162583, -127857, -19710, 149587, 159853, -74142, -222313, 51535, 527899, 674631, 387456, 74802, 17735, 76480, 86536, 120501, 228407, 285953, 250784, 256755, 327739, 303335, 159484, 77540, 73740, -86803, -439694, -639507, -456225, -141432, -38034, -86208, 4581, 292726, 575108, 671010, 531361, 220725, -38723, 4656, 281738, 391548, 134538, -181556, -209633, -81874, -129681, -294686, -238960, 48397, 198834, 63355, -36491, 178277, 481443, 436077, -8458, -459146, -577630, -429913, -290395, -253635, -181064, 17413, 219304, 266271, 176577, 77914]
34397G7914m5112K9586J79742L43855L09449M1139j85222j63905n6837r5866k07328
34386B27415j92173q0757k0197J4449R7075J15220k0459j11863K2848J63153J5938
34375B30649k37251k01813M9693J00279p5451r2229J14063J64477m1545j19856
34365a08984P9247J77527j1405r5748J60380L22955L8041k53656k1770L74128
34355F60715K09678l65694m97065J1203L76911P1911m11581l96027N869K28867
34345a05213J23846j8482l2284M539M9172R4290J6555k26670l77998k06500P3534
34334f05211R3146o7473q213K95346M19184J91901k5798M0347J36568l0616k43619
34323A95562j21703K26755L40460Q2982k16144k70693j40090j309Q1727J01100
$$ y = [77914, 32802, 62388, 242130, 585985, 895434, 936573, 751351, 587446, 530609, 434743, 227415, 35242, -45515, -65712, -51263, 45812, 161032, 140573, 28710, 51558, 214711, 230649, -6602, -208415, -158722, -58443, -133894, -226123, -112060, 52417, 10872, -108984, -29737, 147790, 136385, 40637, 201017, 523972, 562013, 308357, 286587, 660715, 870393, 504699, 7634, 18837, 395748, 467659, 56078, -339949, -334080, -105213, 18633, 151, -32133, -27594, 21578, 115868, 132423, -94247, -472245, -678745, -605211, -512065, -579538, -587751, -292405, 126779, 318680, 292882, 333229, 469797, 439181, 195562, 73859, 300614, 641074, 724056, 507912, 237219, 97129, 95820, 177547, 278647]
34313B78647M9354k2957o3151j24705k45237k74953o7805K02118K12682j2226
34303f8233j02130J00392L02048K15182l5504j45347m3349J14188J87224J23426
34293F47897n8862k18224j74560L6607J68605J25900R3205J64163J21672j72357
34283G34046m28543l06371L8237J58330k2236j45124j3838J38291Q3711l9091
34273A97412p018R2868J7771k02507k67842m8611K02422J91337q464p2631R1080
34262A85817K02419M3420j74789j03944K00004L25051R0265k21527l07317k27797
34252A1602j78530j37790O555J60160J36831k2088j03834n4239j6529o1383r8883
34241c58128o5969o994M6623R9930R1243m3428j79073q5362K21051M04452K26592
$$ y = [278647, 328001, 305044, 241893, 117188, -128049, -403002, -470807, -268689, -56007, -68233, -170363, -69971, 232077, 447259, 411755, 266408, 223059, 337247, 524471, 647897, 589035, 370811, 196251, 232858, 401463, 527363, 620568, 784731, 906403, 734046, 305503, -868, 37369, 195699, 173463, 28339, 14501, 152792, 236503, 197412, 190394, 283262, 301033, 98526, -169316, -217927, -15505, 175832, 167368, 94737, 185817, 388236, 431656, 256867, 152923, 352927, 677978, 768243, 546716, 239399, 11602, -166928, -304718, -298163, -138003, -1172, -23260, -127094, -181333, -197862, -259245, -358128, -424097, -431091, -384468, -284538, -193295, -236723, -415796, -501158, -280107, 124345, 350937]
34230C50937j09377k02306L7681L04485L11700J17660l6537p6500j27548k41408
34220C28787k76914j26920Q0736J49848R3882P3812J04686L4425j63112k88336
34210A0894j99273j6077P8233Q8227J10527J16822J6716j31004j54319j0297J46739
34199E7188J57019K6775r9546q2436Q0049K19709J45199j25281l40712k95907
34189b57943o7314J12090J41696J04606Q2608N7656j388o8240j05570j09924q7442
34178a99165l6031L2529Q7708J05113Q0021L2539J4567P0020J51135J23716p3242
34167C88910k96756l17459r2115J52481J69842p372j08778J6705J90753J48794
34157B45005q1217k09354r3382P4059P1541l1471j4586J47097K52097J45554j09679
$$ y = [350937, 241560, 39254, 76935, 381420, 693120, 810780, 774243, 697743, 570195, 328787, 51873, -75047, 5689, 155537, 249419, 323231, 427917, 462342, 299230, 10894, -188379, -204456, -126223, -37996, 72531, 189353, 206069, 75065, -79254, -89551, 57188, 214207, 240982, 141436, 59000, 139049, 358758, 503957, 378676, 37964, -257943, -325257, -213167, -71471, 33135, 115743, 173399, 172011, 103771, -1799, -111723, -199165, -235196, -202667, -114959, -9846, 70175, 102714, 117281, 187301, 338436, 462152, 388910, 92154, -225305, -317420, -164939, 4903, -2469, -111247, -94542, 96211, 245005, 163788, -45566, -138948, -64889, 6652, -24819, -39405, 107692, 359789, 505343, 395664]
34146C95664l11161k87743n0772J70775J50007l8442j06257R786N9909m9393m8586
34135a06213J82685K77319l7099l57292j54771L37509M36518P5134j57500k9925
34125D66365L9491j65668k84286j23913m6765k25502k13359K37708N71861K70742
34115E26674k40267k48595J02473J21415k53537m13999j20539K05276K59664K11824
34105A50389J68973m7262l86918m27714k9511L49001K95482R964r0381K981J2915
34094G919j06054j35241J6129J71606J38169o9554k64506k71293q7574J20140
34084d80259K08172J95756J49136M0532j22121j52557O9169K86889J29158l11930
34074A1945n07810j97096K58149L85189J90667J4268Q493L7695j0648p2878o6034
$$ y = [395664, 84503, -203240, -254012, -83237, 66770, 28328, -77929, -68143, -8234, -57627, -106213, 76472, 353791, 316692, -40600, -195371, 142138, 578656, 653790, 496290, 466365, 505856, 340188, 55902, -68011, -114776, -340278, -553637, -315929, 255932, 526674, 286407, 37812, 140285, 261700, 8163, -405836, -526375, -321099, -61435, 150389, 319362, 272100, -114818, -542532, -572043, -223042, 72440, 82404, -7977, -4996, 7919, -98135, -233376, -217247, -45641, 92528, 22974, -241532, -512825, -600399, -480259, -272087, -76331, 72805, 113337, -8784, -161341, -92172, 194717, 323875, 11945, -495865, -692961, -434812, -49623, 141044, 155312, 163805, 201500, 190852, 117974, 51940]
34063E1940k2078k2852q0409j11422k7316J28501J72147K878j98158j54981J02447
34052a59303K23350R996k84368k87907J961K58928K74055J48204N0413r205r6379
34041A29745j89896k09760j37215j9314J04250K06616K41631J83636P9241j3133
34031C75801j07144k14418k19199N202L18463L52596k6923m52153m49663k5131
34021d42569L59228L50877M1525k46948k95654r5936J71148K38572K5422j98437
34011i2772j35105Q7720Q9951j35053j74133J09035K80972K2845k94628j48650
34001c89818K97844M08163J7212l48289k55265P0466J55182n5918k05301n8207
33991c63931K08113K62324L1394k29360k59799q9974P0318J52183K53042L59190
$$ y = [51940, 29862, 7010, -73399, -184821, -212137, -83636, 88511, 91389, -106769, -261750, -159303, 64047, 74043, -210325, -498232, -496271, -237343, 36712, 184916, 235329, 226124, 129745, -60151, -269911, -407126, -426440, -322190, -115574, 126057, 309693, 388934, 375801, 268657, 54239, -164960, -159758, 158705, 511301, 484378, 32225, -417438, -442569, -83341, 267536, 309061, 62113, -233541, -329477, -158329, 80243, 105665, -92772, -227877, -140157, -50206, -185259, -359392, -250357, 30615, 53460, -241168, -389818, -91974, 316189, 333401, -14888, -270153, -199687, -44505, -100423, -305724, -363931, -155818, 106506, 137900, -91460, -351259, -441233, -370915, -218732, 34310, 393500]
33981C93500K95291M1418j42058p2502P1786K5342j72444k79668k19114j15255
33971a73704n0452K263N7017J00654J46438J67825P3316j17308k03549p5038R2220
33960A9682J01025M0113R4933J97133J42303m2819j45654j24408j29266j88670
33950c5628j58775q525R8482O0960k3808l3721K6425Q1168O7745l5867j56598
33939a18142j42778M1601K05614J56139m0589j72231j65429r0839J5244J36804
33929a74606J74618O8340m8689k0072Q3879R0777J0178l1358m5788j20004j72495
33918a85220n0780J64960K25867P7648p5093o3976Q2460K37901K54256K7480l01963
33907C93540l49985L1292M16292L03657j59764l78595j83892j7381j70613l39809
$$ y = [393500, 688791, 730209, 588151, 515649, 587435, 612777, 440333, 160665, -58449, -173704, -224156, -221893, -164876, -64222, 82216, 250041, 323357, 206049, 2500, -72538, 19682, 120707, 160820, 255753, 452886, 595189, 552370, 406716, 282308, 153042, -35628, -194403, -202928, -104446, -43486, -67294, -101015, -74590, 6578, 74323, 38456, -118142, -260920, -219319, -13705, 142434, 101845, -70386, -235815, -326654, -311410, -174606, 12, 68352, 19663, -409, 83470, 174247, 184425, 153067, 107279, -12725, -185220, -236000, -71040, 154827, 232475, 157382, 93406, 175866, 413767, 668023, 695503, 393540, 43555, 74847, 491139, 794796, 635032, 256437, 72545, 55164, -115449, -455258]
33897d55258j63110J98314L23371J21481j30914j95779p8940Q4425J71565J36616
33887A1771L1072o1705j14495j13819O379K37409L62984J72938k00645l89953
33877e8064k56373k9761M7657p169n6070l8523L9571J42051J72963O4281q6600
33866f6037j26000p8975q8292j44756j06965J8506O8513J2702q70P8909J36077
33855b97188J28604J41017J53397L2515j78898k41918q7457N7753J8631j03468
33845c77012j63965j80660j73706m5242K13675L98598L45818J53691P688o6523
33835A12362j40211k03717j85285o8204Q6206J71140J00139n5289o5139J43633
33825a04365K75773N3820k74321k12128K05078L84851O6127k59577j02538K78940
$$ y = [-455258, -618368, -420054, -96683, 24798, -106116, -301895, -380835, -296410, -124845, 11771, 42843, -18862, -133357, -247176, -240797, -3388, 359596, 532534, 331889, -58064, -314437, -344198, -296541, -303710, -359780, -398303, -358732, -216681, -43718, 20563, -66037, -192037, -271012, -359304, -504060, -611025, -592519, -524006, -511304, -512174, -433265, -297188, -168584, -27567, 125830, 158345, -20553, -262471, -349928, -292175, -273544, -377012, -540977, -721637, -895343, -940585, -726910, -328312, 17506, 171197, 178885, 112362, -27849, -231566, -416851, -485055, -398849, -227709, -127570, -182859, -247998, -104365, 171408, 225228, -49093, -261221, -56143, 328708, 394835, 135258, 32720, 311660]
33815C11660L04721n0541k88602j62664M4461L2593j09546j30764O427J29712
33805H7457J08183j9515j21307j12939l1132K2623N457l0658k9633n782n085l4340
33793a66671n2162r356R9291K06730K24302J36564P78j40378k48620k15161J6117
33782a48566K35457J47069j52339k10288Q9232K65993q061l11670j14836L25095
33772A17086L42563p0826k93603r9623Q6525K4274O621J82827K32570J3409j01034
33761D40789J10722K85586J06451j67740k24754k31028l63986l23700J10786M79627
33751B22753K57792k60591l86019r8016M1395j05366r9307K06321L83420J83025
33741C45407o1833l9431O3070j7765j59997j45681o3329q2699j00099M8416K22722
$$ y = [311660, 616381, 565840, 277238, 114574, 159035, 191628, 82082, -48682, -42255, 87457, 195640, 176125, 54818, -58121, -89253, -66630, -61173, -91831, -121464, -127246, -132331, -166671, -218833, -228189, -128898, 77832, 302134, 438698, 439476, 299098, 50478, -164683, -148566, 86891, 233960, 81621, -128667, -39435, 226558, 218497, -93173, -208009, 117086, 459649, 388823, 95220, -4403, 82122, 106396, 113017, 295844, 528414, 541823, 440789, 551511, 837097, 943548, 775808, 551054, 320026, -43960, -367660, -256874, 222753, 480545, 219954, -166065, -264081, -222686, -328052, -427359, -221038, 162382, 345407, 283574, 244143, 307213, 289448, 129451, -16230, -79559, -162258, -262357, -213941, 8781]
33730H781J74722j9133n8596J03705K04817J01776l4299l6261L86p2648j78431
33719A94819j48432k2514Q772p5130q9369M0579J46041Q9694k1217l4578j030
33708H7635m5095j17106p6458N7745J35603J05571M3568P079J6191J02434K14105
33697E31272J79590m7212k35916j97373r3504j44872k07072k7238K17282J26367
33687A01324k19821l06115j374K17695M6367j71429m8806K14252K05009k3599
33677A3503q2311J24743K91709J78711r6832k44945j27357J04535J69343J3286
33667C44385p2480J21548L07442O5450m42950o02021k26952J94099K76337K07918
33657A72776K15448J33214j34497k50891n416K18503L9789k59616k23676q472
$$ y = [8781, 183503, 164370, 105774, 209479, 414296, 516072, 481773, 445512, 445898, 373250, 194819, 46387, 23873, 32645, -42485, -131854, -91275, 54766, 144460, 123243, 88665, 87635, 42540, -74566, -151024, -93279, 42324, 147895, 191463, 198542, 214733, 317167, 531272, 710862, 663650, 427734, 230361, 136857, -8015, -215087, -242325, -25043, 101324, -118497, -424612, -425986, -208291, -161924, -333353, -382159, -167907, 37102, 13503, -68808, 55935, 347644, 526355, 429523, 184578, 57221, 161756, 331099, 344385, 271905, 393453, 700895, 766345, 323395, -278626, -505578, -311479, -35142, 172776, 388224, 521438, 386941, 136050, 130634, 349137, 388926, 129310, -94366, -102838]
33647a02838n0138k32951r5234K83963L32019p4841l82793j98969K03040L89089
33637G0347L00083Q6620j82010m17006m32962j90411R4871K19074J79860M4939
33627b26595j32315k15028o6350J90430K53164P0457o7861K5752J65571J13128
33617A10353o6236j53170j01888k5898J9505O1461R3680Q3819M6669K578p9383
33606h510j97873k42289j17525Q9192J85686J16007J4084l069J7776j2102n9552
33595b18175m2537M905n270k7515M7628J41501N8339j34748j11250J73114K89096
33584A75088k3816l56217k02470K26019L09883p381j85069k838J50108K6735q4344
33573B5698L2510J07705p6807k52686j56068m103o4753j51860K566K18854J81503
$$ y = [-102838, -152976, -385927, -481161, -197198, 134821, 59980, -322813, -521782, -318742, 70347, 370430, 457050, 275040, -141966, -574928, -765339, -670468, -451394, -271534, -226595, -358910, -573938, -640288, -449858, -196694, -126237, -194098, -168346, -2775, 110353, 44117, -109053, -210941, -236839, -217334, -155873, -62193, 21626, 68295, 70873, -8510, -206383, -448672, -566197, -477005, -291319, -175312, -161228, -164297, -146521, -158623, -218175, -260712, -255807, -261077, -288592, -240964, -99463, -41124, -175872, -287122, -114008, 175088, 151272, -204945, -407415, -181396, 128487, 121106, -63963, -66801, 83307, 110042, 25698, 58208, 165913, 89106, -163580, -319648, -323751, -388504, -540364, -537798, -318944, -137441]
33562a37441o211m7110J2621o1826j98648j39501Q7101K27915K15275J48310K1052
33551A21537j63778j90350O4967L00652J81106j08632j46878L9551O7112j26934
33541C8353k14292o2503R5380J10983R8622J06957J9535j38702j60841j1156R9124
33530a8540O1136K446J5492L0734J5488M2012J04951R6787K309p2283o5406N175
33518B20301J11314J56525j3814l31824m18905o7922L64689L98881J05595n9019
33508D65821L1321P7285p9330k54999l11945l20693k78621n9854K66205M13109
33498e1701K72846M8035p1609r7951q1472k8490J220l6210k4757J31602K58481
33487C19994J42521p5436q9610P1044J24923M7941N7104J17198m4798l87406n04751
$$ y = [-137441, -143652, -190762, -178141, -239967, -438615, -578116, -491015, -263100, -47825, 100485, 121537, -42241, -232591, -167624, 133028, 314134, 205502, 58624, 98175, 165287, 38353, -175939, -238442, -143062, -32079, 66543, 173500, 193035, 54333, -106508, -117664, -18540, 42596, 45042, 60534, 91268, 106756, 148768, 253719, 350506, 352815, 280532, 215126, 220301, 331615, 488140, 474326, 142502, -276403, -344325, 20364, 419245, 524840, 465821, 497142, 574427, 495097, 240098, -71847, -392540, -671161, -731015, -464810, -51701, 221145, 269180, 197571, 99620, 18148, -10342, -9122, -45332, -70089, 61513, 319994, 462515, 387079, 297469, 368513, 493436, 541377, 598481, 715679, 670881, 283475, -221276]
33476b21276k44953O3084J40019R9109J00999O3957p5904j49374j8910J82726
33466f0523K38915Q4893k02690m38697l70024L1508L60741K21232j67447k34887
33456e36979Q9015L01369J51790l2377K084M0748q1808j23994N9116J54111n7678
33445c4603k31314k1090K62486J11154l20851m06355N151L89590L42382Q3016
33435A79566J351P4958J1470k22601l18921q6935K25242K32019n5669k35479r8526
33424b93525O5359o0157k94191k35464J03688L36571K97017J76462Q6358o9704
33414A12414k36215j77126O3930J13299j34142k78772k4895L44272L96386J52335
33404C31486n4578q3243l3966L1905J20619J56992N3770j24430k28674j96436
$$ y = [-221276, -466229, -403145, -263126, -164017, -63018, 939, -74965, -224339, -243249, -60523, 178392, 263285, 60595, -378102, -748126, -716618, -355877, -134645, -302092, -536979, -447964, -146595, 5195, -27182, -25098, 15650, -66158, -190152, -131036, 23075, -34603, -265917, -287007, -24521, 86633, -234218, -640573, -635422, -245832, 96550, 179566, 180917, 255875, 267345, 44744, -274177, -361112, -135870, 96149, 40480, -194999, -293525, -228166, -288323, -582514, -817978, -714290, -377719, -80702, 95760, 182118, 112414, -123801, -300927, -236997, -123698, -257840, -536612, -561507, -217235, 179151, 331486, 276908, 193665, 159699, 191604, 312223, 469215, 522985, 398555, 169881, -26555]
33394b6555o2117R9129J72405Q5328n8289q4096j0223l685o4221j7348J37274
33383A67602J76030L1990r2856j05409j69830l24060l08059o396K65575K08292
33373a57121L645J4621K17486K64504Q761l17521m13708k09961J10351K73190
33363b05753J61315m0512n3227J24040K23289J12056m1439o3474J0721Q9879J39955
33352D56850P7667j63169l86222k85218N4186J76057o7480k59554o9841K35304
33342b31420K48256L5613p4869m4252o1811j35837j28480n7306k0012N1822K37815
33331a80481L56156J88851j12762j93686k2588P9703n1992j98437j16164J04726
33321a46674J74814n803k02088j09863K41200M38338J68637l14723m44862p2419
$$ y = [-26555, -88672, 10457, 182862, 268190, 209901, 125805, 115582, 111897, 47676, 30328, 167602, 343632, 375622, 282766, 177357, 7527, -316533, -624592, -630988, -365413, -157121, -153476, -138855, 78631, 343135, 351896, 34375, -379333, -589294, -478943, -205753, -44438, -84950, -138177, -14137, 209152, 321208, 279769, 216295, 227016, 316895, 456850, 534517, 371348, -14874, -300092, -245906, -69849, -137329, -396883, -466724, -231420, 16836, 52449, -22420, -66672, -128483, -264320, -392800, -450106, -470118, -418296, -180481, 175675, 364526, 251764, 58078, 35490, 115193, 63201, -135236, -251400, -146674, 28140, 22337, -179751, -289614, -48414, 389924, 558561, 243838, -201024, -273443]
33311b73443L32694L01852p9551l83408l62040r1623K03257L04664J50536n2134
33301E0804l8959J26471J26104r7456k30900j07790L9145K2760N537J10244J22322
33290A28282q9366k17671J6789L42759L16991k240k01706j60995j11048j57176
33280a35381j70533j08258o9179n0697L7052J46463J57433J08385R9842N5979
33270G1106j34898l30700k89119m9182J29800J55086J46660J54967J19384O7022
33260D0126P5963P5453m7179j77529r6725J37469K17256K8400j82138j51241P5110
33249e035K34822J53024q6631k20096q0720J74925K27313J6720j72785j29043
33239A12494J2340L7147m0222j05674j40916j09777Q0991L01455K00308k32330
$$ y = [-273443, 59251, 361103, 281552, -101856, -463896, -555519, -352262, -47598, 102938, 50804, 11845, 138316, 264420, 166964, -63936, -171726, -132581, -109821, -104284, 5960, 128282, 38916, -178755, -161966, 180793, 497784, 495544, 293838, 132843, 21795, -135381, -305914, -414172, -483351, -534048, -496996, -350533, -193100, -84715, 15127, 71106, -63792, -394492, -683611, -732793, -602993, -447907, -301247, -146280, -26896, 40126, 116089, 191542, 144363, -33166, -129891, 7578, 224834, 253234, 71096, -80145, -5035, 229787, 382811, 296180, 76084, -4636, 170289, 397602, 414322, 241537, 112494, 124834, 161981, 121759, 16085, -124831, -234608, -153617, 147838, 348146, 115816]
33229A15816m48363p5108M45854M32160o4381l94306k72280k8418N8049R9905
33219a31072J97172K01488M7854q0190q1210r3895j76211j44012R6620L24256
33209A60800L01994J08909m920L1816N4825r3394l44711m41407k28535R9659J94301
33198a60663L0035n1204J11068K19026K8082j97184j13824R6398L5572j96630
33188a99324j50825J89314L39235P1384k69937l19667j18063J30742L23349L58465
33178C54673J48788j45235k34274j36953j37178k44883j35231K48169M87856L05753
33168E11485k9590j62192j42095j75586k14563j12786O3195J69922K19677K37822
33158C65289J23428j09393k03896l5738J34323O1366q6940n3098M4205m6509k04029
$$ y = [115816, -332547, -407655, 38199, 470359, 405978, 11672, -260608, -289026, -230977, -131072, 66100, 267588, 315442, 235252, 154042, 60147, -116064, -260076, -163456, 160800, 462794, 571703, 566783, 598599, 653424, 560030, 215319, -226088, -454623, -354964, -160663, -130628, -181832, -70764, 148262, 176344, -20840, -134664, -38266, -2694, -199324, -350149, -160835, 178400, 249784, -20153, -339820, -457883, -327141, -3792, 354673, 503461, 358226, 123952, -13001, -150179, -395062, -530293, -282124, 205732, 511485, 481895, 319703, 177608, 2022, -212541, -325327, -262132, -92210, 127467, 365289, 488717, 379324, 175428, 139690, 274013, 335379, 248439, 195341, 239546, 193037, -10992]
33147a0992j15218J52896K15837j4715k03751j25703N4081J19678R3076O4183
33137B29372J9325l3286j6549K2150p7318k59729k15794J42889M33752K87818
33127E32630j15897k95635j10144J54009K53482K12998R4903j16480l31533l55455
33117g7122j83729m2553k5932L6313K09760K60666N8346j15992J6570K37134J38874
33106E12335k08854l40334j03123J43785J07803n0868n6349P4299J45006Q2196
33096C05896m2356j38921j47870q9677r5181k28845l12271j51648J06821J56618
33086f37434L3407M6359J89572J01349k54568l78200J3257M70694M36226L6474
33076E7136j69839L644K36717K31658K0048j77591j47521J49942M28708K93326
$$ y = [-10992, -126210, 26686, 242523, 227808, 24057, -101646, -47565, 72113, 165189, 229372, 248697, 215411, 198862, 221012, 143694, -116035, -331829, -188940, 244812, 532630, 416733, 121098, 10954, 164963, 418445, 631443, 726346, 609866, 278333, -77122, -260851, -303404, -329336, -293023, -83263, 177403, 235749, 119757, 136327, 373461, 512335, 303481, -36853, -139976, 3809, 111612, 60744, 4395, 78694, 223700, 305896, 263540, 124619, -23251, -112928, -208109, -436954, -749225, -900873, -794052, -637434, -604027, -557668, -368096, -266747, -521315, -899515, -886258, -415564, 20662, 57136, -112703, -109059, 127658, 359316, 379364, 201773, 54252, 204194, 632902, 926228]
$$ [...]
##END NTUPLES=NMR SPECTRUM
##END=
