##TITLE=1H_27-2025
 200.13MHz, CDCl3,
 8 sc
 
 13.2.2025
##JCAMPDX= 6.0         $$ Bruker NMR JCAMP-DX V2.0
##DATA TYPE= NMR FID
##DATA CLASS= NTUPLES
##ORIGIN= UXNMR, Bruker Analytische Messtechnik GmbH
##OWNER= pz
$$ XWIN-NMR		Version 3.5
$$ Thu Feb 13 13:59:20 2025 Russian Standard Time (UT+4h)  she@DPX200
##.OBSERVE FREQUENCY= 200.1313
##.OBSERVE NUCLEUS= ^1H
##.DELAY= (6, 6)
##.ACQUISITION MODE= SIMULTANEOUS
##.ACQUISITION SCHEME= undefined
##.AVERAGES= 8
##.DIGITISER RES= 18
##SPECTROMETER/DATA SYSTEM= spect
##.PULSE SEQUENCE= zg30
##.SOLVENT NAME= CDCl3
##.SHIFT REFERENCE= (INTERNAL, CDCl3, 0, 14.3821)
##AUDIT TRAIL= $$ (NUMBER, WHEN, WHO, WHERE, WHAT)
$$ ##TITLE= Audit trail, XWIN-NMR		Version 3.5
$$ ##JCAMPDX= 5.01
$$ ##ORIGIN= Bruker BioSpin GmbH
$$ ##OWNER= she
$$ F:/spectra/data/she/nmr/H-C/1/audita.txt
$$ ##AUDIT TRAIL=  $$ (NUMBER, WHEN, WHO, WHERE, WHAT)
(   1,<2025-02-13 13:56:40.60 +0400>,<she>,<DPX200>,
      <created by zg, POWCHK disabled, PULCHK disabled
       configuration hash MD5:
       00 E9 B6 7A A2 85 ED C7 34 08 36 98 17 FE 4E 26
       data hash MD5: 16K
       90 77 A8 01 32 5C 56 D6 F7 F1 B8 F5 DD 9E 77 F6>)
$$ ##END=
$$ 
$$ hash MD5
$$ 8E DE A1 AA 61 63 F8 09 FB 10 E4 2D 3D D7 35 94
##$RELAX= 
##$RELAX= 
##$RELAX= 
##$RELAX= 
##$RELAX= 
##$RELAX= 
$$ Bruker specific parameters
$$ --------------------------
##$DU= <F:/spectra>
##$EXPNO= 1
##$NAME= <H-C>
##$PROCNO= 1
##$TYPE= <nmr>
##$USER= <she>
##$AMP= (0..31)
100 100 100 100 100 100 100 100 100 100 100 100 100 100 100 100 100 100 
100 100 100 100 100 100 100 100 100 100 100 100 100 100 
##$AQSEQ= 0
##$AQ_mod= 1
##$AUNM= <au_zg>
##$AUTOPOS= <>
##$BF1= 200.13
##$BF2= 200.13
##$BF3= 200.13
##$BF4= 200.13
##$BF5= 200.13
##$BF6= 200.13
##$BF7= 200.13
##$BF8= 200.13
##$BYTORDA= 1
##$CFDGTYP= 0
##$CFRGTYP= 5
##$CHEMSTR= <none>
##$CNST= (0..31)
1 1 145 1 1 1 1 1 1 1 1 1 1 1 1 1 1 1 1 1 1 1 1 1 1 1 1 1 1 1 1 1 
##$CPDPRG= <>
##$CPDPRG1= <>
##$CPDPRG2= <>
##$CPDPRG3= <>
##$CPDPRG4= <mlev>
##$CPDPRG5= <mlev>
##$CPDPRG6= <mlev>
##$CPDPRG7= <mlev>
##$CPDPRG8= <mlev>
##$CPDPRGB= <>
##$CPDPRGT= <>
##$D= (0..31)
0 0.7 0 0 0 0 0 0 0 0 0 0.03 0 0 0 0 0 0 0 0 0 0 0 0 0 0 0 0 0 0 0 0 
##$DATE= 1739440600
##$DBL= (0..7)
120 120 120 120 120 120 120 120 
##$DBP= (0..7)
150 150 150 150 150 150 150 150 
##$DBP07= 0
##$DBPNAM0= <>
##$DBPNAM1= <>
##$DBPNAM2= <>
##$DBPNAM3= <>
##$DBPNAM4= <>
##$DBPNAM5= <>
##$DBPNAM6= <>
##$DBPNAM7= <>
##$DBPOAL= (0..7)
0.5 0.5 0.5 0.5 0.5 0.5 0.5 0.5 
##$DBPOFFS= (0..7)
0 0 0 0 0 0 0 0 
##$DE= 6
##$DECBNUC= <off>
##$DECIM= 32
##$DECNUC= <off>
##$DECSTAT= 4
##$DIGMOD= 1
##$DIGTYP= 9
##$DL= (0..7)
0 120 120 120 120 120 120 120 
##$DP= (0..7)
150 150 150 150 150 150 150 150 
##$DP07= 0
##$DPNAME0= <>
##$DPNAME1= <>
##$DPNAME2= <>
##$DPNAME3= <>
##$DPNAME4= <>
##$DPNAME5= <>
##$DPNAME6= <>
##$DPNAME7= <>
##$DPOAL= (0..7)
0.5 0.5 0.5 0.5 0.5 0.5 0.5 0.5 
##$DPOFFS= (0..7)
0 0 0 0 0 0 0 0 
##$DQDMODE= 0
##$DR= 18
##$DS= 0
##$DSLIST= <SSSSSSSSSSSSSSS>
$$ [...]
##$SUBNAM0= <"">
##$SUBNAM1= <"">
##$SUBNAM2= <"">
##$SUBNAM3= <"">
##$SUBNAM4= <"">
##$SUBNAM5= <"">
##$SUBNAM6= <"">
##$SUBNAM7= <"">
##$SUBNAM8= <"">
##$SUBNAM9= <"">
##$SW= 18.0517328524113
##$SWIBOX= (0..15)
0 0 2 0 0 0 0 0 0 0 0 0 0 0 0 0 
##$SW_h= 3612.71676300578
##$TD= 16384
##$TD0= 1
##$TE= 0
##$TE2= 300
##$TE3= 300
##$TEG= 300
##$TL= (0..7)
0 120 120 120 120 120 120 120 
##$TP= (0..7)
150 150 150 150 150 150 150 150 
##$TP07= 0
##$TPNAME0= <>
##$TPNAME1= <>
##$TPNAME2= <>
##$TPNAME3= <>
##$TPNAME4= <>
##$TPNAME5= <>
##$TPNAME6= <>
##$TPNAME7= <>
##$TPOAL= (0..7)
0.5 0.5 0.5 0.5 0.5 0.5 0.5 0.5 
##$TPOFFS= (0..7)
0 0 0 0 0 0 0 0 
##$TUNHIN= 0
##$TUNHOUT= 0
##$TUNXOUT= 0
##$USERA1= <user>
##$USERA2= <user>
##$USERA3= <user>
##$USERA4= <user>
##$USERA5= <user>
##$V9= 5
##$VALIST= <valist>
##$VCLIST= <CCCCCCCCCCCCCCC>
##$VD= 0
##$VDLIST= <DDDDDDDDDDDDDDD>
##$VPLIST= <PPPPPPPPPPPPPPP>
##$VTLIST= <TTTTTTTTTTTTTTT>
##$WBST= 1024
##$WBSW= 4
##$XGAIN= (0..3)
0 0 0 0 
##$XL= 0
##$YL= 0
##$YMAX_a= 565954
##$YMIN_a= -576731
##$ZGOPTNS= <>
##$ZL1= 120
##$ZL2= 120
##$ZL3= 120
##$ZL4= 120
##$ABSF1= 10
##$ABSF2= 0
##$ABSG= 5
##$ABSL= 3
##$ALPHA= 0
##$AQORDER= 0
##$ASSFAC= 0
##$ASSFACI= 0
##$ASSFACX= 0
##$ASSWID= 0
##$AUNMP= <proc_1d>
##$AZFE= 0.1
##$AZFW= 0.1
##$BCFW= 1
##$BC_mod= 2
##$BYTORDP= 1
##$COROFFS= 0
##$CY= -3
##$DATMOD= 1
##$DC= 2
##$DFILT= <>
##$DTYPP= 0
##$F1P= 0
##$F2P= 0
##$FCOR= 0.5
##$FTSIZE= 0
##$FT_mod= 4
##$GAMMA= 1
##$GB= 0.15
##$INTBC= 1
##$INTSCL= 1
##$ISEN= 128
##$LB= 0.25
##$LEV0= 0
##$LPBIN= 0
##$MAXI= 10000
##$MC2= 0
##$MEAN= 0
##$ME_mod= 0
##$MI= 1.114404
##$NCOEF= 0
##$NC_proc= 0
##$NLEV= 6
##$NOISF1= 3.799351
##$NOISF2= 2.8
##$NSP= 1
##$NTH_PI= 0
##$NZP= 0
##$OFFSET= 14.38212
##$PC= 1
##$PHC0= -467.2552
##$PHC1= 12.59221
##$PH_mod= 1
##$PKNL= yes
##$PPARMOD= 0
##$PSCAL= 0
##$PSIGN= 0
##$REVERSE= no
##$SF= 200.129724274929
##$SI= 16384
##$SIGF1= 3
##$SIGF2= 2
##$SINO= 400
##$SIOLD= 16384
##$SREGLST= <1H.CDCl3>
##$SSB= 0
##$STSI= 0
##$STSR= 0
##$SW_p= 3205.1282051282
##$SYMM= 0
##$S_DEV= 0
##$TDeff= 0
##$TDoff= 0
##$TI= <>
##$TILT= no
##$TM1= 0
##$TM2= 0
##$TOPLEV= 0
##$USERP1= <user>
##$USERP2= <user>
##$USERP3= <user>
##$USERP4= <user>
##$USERP5= <user>
##$WDW= 1
##$XDIM= 8192
##$YMAX_p= 0
##$YMIN_p= 0
$$ End of Bruker specific parameters
$$ ---------------------------------
##NTUPLES= NMR FID
##VAR_NAME=  TIME,          FID/REAL,        FID/IMAG
##SYMBOL=    X,             R,               I
##VAR_TYPE=  INDEPENDENT,   DEPENDENT,       DEPENDENT
##VAR_FORM=  AFFN,          ASDF,            ASDF
##VAR_DIM=   8192,          8192,            8192
##UNITS=     SECONDS,       ARBITRARY UNITS, ARBITRARY UNITS
##FACTOR=    0.0002768,     1,               1
##FIRST=     0,             0,               0
##LAST=      2.2672688,     0,               0
##MIN=       0,             -576731,         0
##MAX=       2.2672688,     565954,          0
$$ Real data points
##PAGE= N=1
##DATA TABLE= (X++(R..R)), XYDATA
$$ [...]
2210A460j348j474K674k302L46J637k426J551N72j877K234j397j006L019k254
2225e91k05K414k987J185K034l293J663R08k747K446n34j416K162j409l08J923
2241A245k301J189J096k698K084k81j797K773j194j608L339k137p09K423k185
2256g61L91J329k280J234L05j585K446j220n66K449k641O99J642k772J602J118
2272A390k795K196K18k527K662j001j455K312j658N2J519j964J226M50j839J919
2288G05l41j775L198j831q99K838k810L48K229k789J026J406k668K003j05j800
2304a265K342j609l23J991k252Q85J364k517J773P14k554K539m31k046K741j338
2320A4o97K017j872P7J553k171J394J39j523K053j153r83K523k141R0K248k582
$$ plain form
2210 1460 112 -1362 1312 -990 -644 993 -1433 118 690 -1187 1047 -350 -1356 1663 -591
2225 -591 -796 1618 -1369 -184 1850 -1443 220 1128 -1619 827 293 -1123 1039 -370 -678 1245
2241 1245 -1056 133 1229 -1469 615 334 -1463 1310 116 -1492 1847 -290 -999 1424 -761
2256 -761 -370 959 -1321 -87 218 -1367 1079 -141 -707 1742 -899 -200 1442 -1330 272 1390
2272 1390 -1405 791 1009 -1518 1144 143 -1312 1000 -658 -606 913 -1051 175 625 -1214 705
2288 705 364 -1411 1787 -44 -943 1895 -915 -567 1662 -1127 -101 1305 -1363 640 535 -1265
2304 -1265 1077 -532 -855 1136 -1116 -231 1133 -1384 389 1103 -1451 1088 657 -1389 1352 14
2320 14 -683 1334 -538 -461 1092 -1079 315 454 -1069 984 -169 -1152 1371 -770 -680 1568 -1014
2337a014O05J917k641J407O42k003K078r25j144K028j245n23J833k062J085Q85
2353I23k458K068J25k034K851j170j725L278k033n13K072k031P64J157k393J586
2369D67K0k010K366j066n34K038k158L55J990k750J206J441k988K340ok022K513
2386A202j051j003J771j449O3J400k022J483K68k160K208n02j428K163j150o52
2402h59K490k306N6J776j910P60Q42j723J374j27j459K088j464r5J742k107P76
2419a46J266k254J641J41k109K268k48j949K358q49r90J892j566O00R69k353J626
2436B97n9j263J811j207o50J932j424k10K087k296P59J389k466J719L72j799J894
2453H86o74j068J977j754K33J453k207Q72J134k181K032j84j939K372r52q49K075
$$ plain form
2337 -1014 -409 1508 -1133 274 916 -1087 991 66 -1078 950 -295 -818 1015 -1047 38 923
2353 923 -1535 533 658 -1376 1475 305 -1420 1858 -175 -688 1384 -647 117 1274 -1119 467
2369 467 487 -1523 843 -223 -757 1281 -877 -522 1468 -1282 -76 1365 -1623 717 711 -1311 1202
2386 1202 151 -852 919 -530 -467 933 -1089 394 662 -1498 710 208 -1220 943 -207 -859
2402 -859 1631 -675 -619 1157 -753 7 849 -874 500 373 -1086 1002 -462 -557 1185 -922 -146
2419 -146 1120 -1134 507 648 -1461 807 559 -1390 968 119 -871 1021 -545 55 1024 -1329 297
2436 297 238 -1025 786 -421 -1071 861 -563 -773 1314 -982 -223 1166 -1300 419 791 -1008 886
2453 886 212 -856 1121 -633 -400 1053 -1154 -282 852 -1329 703 519 -1420 952 0 -849 1226
2470A226j448m41J735j774P70O61j542J687m61j323J826j219n65J989j779L63
2486b95J283k379J424J062k320J705L0j390J716r26n28J638j571O42Q23j991J390
2503C13L88k016J989m09j531K166j467l53K066j759o9J853j970O40P87j485J352
2520D95m38q85J804j255o1J542k309R45J150k360J469P69k079J802l31j236J913
2537I35r70l02J071j379Q24M81j270J225l16j219J910j024j029K160j536l06J906
2554A161k100N09J596k149Q89N55j300J490o81n46J277j271M24J048j661Q13O13
2571F67j685J665o7j617J951q90q25J826j406k91J755j591L20P17j283J339o14
2588b9p57J617r32o26J844j914N68J331j948Q89Q01j845J585k00j376J787p61
$$ plain form
2470 1226 -222 -663 1072 -702 68 729 -813 874 413 -910 916 -303 -868 1121 -658 -295
2486 -295 988 -1391 33 1095 -1225 480 510 -880 836 -90 -618 1020 -551 91 914 -1077 313
2503 313 701 -1315 674 265 -1266 900 -567 -920 1146 -613 -682 1171 -799 -159 628 -857 495
2520 495 57 -828 976 -279 -340 1202 -1107 -162 988 -1372 97 866 -1213 589 258 -978 935
2537 935 -35 -337 734 -645 179 660 -610 615 299 -920 990 -34 -1063 1097 -439 -745 1161
2554 1161 -939 -430 1166 -983 -94 461 -839 651 -30 -576 701 -570 -146 902 -759 54 667
2571 667 -1018 647 580 -1037 914 24 -801 1025 -381 -672 1083 -508 -188 529 -754 585 -29
2588 -29 -786 831 -101 -727 1117 -797 -229 1102 -846 43 844 -1001 584 384 -992 795 34
2605C4o67J332j129N36O94j631J180P7j366J791n46j424K115j452l01J800j676
2622f33M51R99j488P20M52j253J445o44p60J600j283J74J357j808O62J077k258
2639a190J409L84j629J400n3j028J384q68n37J510j411O85O06j323J144n3j210
2656g80J640j091p49J887j384RR89j448P97P29j346J095p8q33R72m20l58J207
2674H38j242j27J464j804J136K48j360J432k08j407J595l51q96J233q80JJ140
2691H12j296O56K63j005J267m35r39J799j354o03J790j514K46J193j614O72N46
2708D84j330J258o4j225J393o91k02J109j017L41O47j451J328L5j285J466r92
2725a96m11J251q63n25J657j373K63O68j133J012k04o95J135q29j81J265j235
$$ plain form
2605 34 -633 699 -430 106 800 -831 349 426 -940 851 305 -1119 996 -456 -757 1043 -633
2622 -633 -182 817 -671 49 501 -752 693 49 -711 889 -394 -220 1137 -671 -9 1068 -1190
2639 -1190 219 603 -1026 374 321 -707 677 -191 -728 782 -629 56 662 -661 483 430 -780
2656 -780 860 -231 -980 907 -477 -468 521 -927 -130 599 -747 348 270 -563 409 -11 -369 838
2674 838 -404 -531 933 -871 265 513 -847 585 377 -1030 565 214 -682 551 -329 -328 812
2691 812 -484 172 435 -570 697 262 -677 1122 -232 -835 955 -559 -313 880 -734 -62 484
2708 484 -846 412 348 -877 516 -175 -377 732 -285 56 703 -748 580 615 -670 796 -196
2725 -196 -607 644 -219 -744 913 -460 -197 471 -662 350 146 -549 586 -243 -424 841 -394
2742c94M5R81j449N62J350j727J002K61j504J193k99m21J242j035j64O74q48N39
2760HN82j117J080k24j222J561r20j85J298j228M1J149j298M36P07j301R30m00
2778a03o40J114l64m75J099j161L99Q48j459Q03N94j332R49q3p08J093n17o27
2796e70J470j070k9P28j310J109mj209J344n36n53J375j062J3R96j103m9J295
2814H35j530J024k5q95R13l0n73O12p46j48J194j330P77N29j495J170m7q48J330
2833G17n04r40J420r94p4J057j090J51Q32j319R24J20j120J475q66k35J028p04
2851a22N9R61j416N13O61j187Q92q1r23J175n23l39J013j264N58L55j289J149
2869A92L16j182J096k15j105J569o02n01J224j018r8J039j171N95L84j219R65
$$ plain form
2742 -394 -349 632 -817 -255 1095 -632 370 631 -873 320 21 -400 842 -193 -357 317 -531 8
2760 8 590 -527 553 329 -893 668 -252 -437 861 -367 -326 823 -475 -39 668 -633 297 -103
2778 -103 -743 371 7 -468 631 -530 -131 717 -742 61 655 -677 272 189 -519 574 57 -570
2796 -570 900 -170 -199 529 -781 328 324 -885 459 -77 -630 745 -317 -304 692 -411 -460 835
2814 835 -695 329 304 -591 322 292 -281 331 -415 -563 631 -699 78 607 -888 282 235 -613 717
2833 717 213 -727 693 -301 -375 682 -408 -257 575 -744 180 300 -820 655 -211 -446 582 -122
2851 -122 -63 898 -518 -5 656 -531 361 280 -643 532 9 -330 683 -581 -23 332 -957 192
2869 192 508 -674 422 207 -898 671 69 -432 792 -226 -324 715 -456 139 523 -696 269
2886B69q4q54R84m65k01J110j132O32L35j581J382L74j634R03J73r44J381l77
2904B71p08J242j166L53N05j036P06L12j035R60l23n70J345j217k24J362j240
2921d63L43P87j180O83J24j060J172k22n18P26p22n7O83q81N93M11j308J190O
2940C07j150J474k11j094J509p66o16R96j012P87J38p29O23J76j270J342q50l69
2958g15J425j039J60P35j066L82N68o18L21K48r10J034n34m33R60q67J48Q98j517
2977h20J040j16p02Q23J10j268J567m13o30J168j101M1R21r47J90O59j259R91
2995B54k42n11J072j013J42R94j187L82P13j380J046J69j220J336m67n62P15o8
3013A73n07R05q35M13L47j014O68N3m74N38l81n34J356r98l6J110j378J97J077
$$ plain form
2886 269 185 -669 315 -150 -351 759 -373 259 594 -987 395 769 -865 38 211 -733 648 271
2904 271 -437 805 -361 -8 497 -539 167 479 -556 404 81 -489 856 -361 -585 777 -463
2921 -463 -120 667 -513 170 294 -766 406 184 -334 392 -330 -387 296 -585 8 419 -889 301 307
2940 307 -843 631 420 -674 835 69 -547 449 -563 224 362 -367 256 432 -838 504 -346 -715
2958 -715 710 -329 -169 566 -500 -118 450 -168 153 401 -509 525 -9 -442 518 -349 -201 697 -820
2977 -820 220 104 -598 225 335 -933 634 221 -409 759 -342 -301 620 -327 -137 522 -737 254
2995 254 12 -499 573 -440 -298 696 -491 -109 604 -776 270 439 -781 555 88 -474 241 173
3013 173 -334 571 -264 149 496 -518 150 203 -271 267 -114 -648 708 -290 -326 784 -594 -397 680
3032F80j149O61P8o52O49k59m11J048q54Q4M96j035O96N07j436R92N48j168J077
3051E52k03r45J135p83N7Q49j104M15N15p69Q18n04m51Q74o29k00J035j075K7
3070c86J141j216M44K91p40Q10J32r63P00M2m01O45r98J63Q51q56N66L54j052
3089d73P28r2n61P19n76k26Q66o83P0Q37q79P08k19o16N45p6m53P80m81j37J004
3110G85j309N21L59q41O67L39q74O91j71n66J125r33j32R58q59o8P53r94P21N2
3130B24p13J052m02q38J097q09l23R97l56J11M81j128Q14J73r58R25j37m19Q85
3149F76r48J00P02j217L67J031j433Q61K18p30Q12n46k68J122j114J05P87j154
3167f29Q04K02r16P51k12m60J011n26m89Q96m46m75R44o83L20K43j017J022k92
$$ plain form
3032 680 -469 192 270 -382 267 8 -403 645 -209 -125 371 -664 32 539 -897 95 643 -525 552
3051 552 349 -596 539 -244 -187 662 -442 -27 488 -281 537 33 -418 456 -173 -373 662 -413 -386
3070 -386 755 -461 -17 274 -466 344 476 -487 213 255 -146 499 -499 -336 515 -341 225 579 -473
3089 -473 255 163 -398 321 -255 -481 385 -298 -228 609 -270 438 219 -397 148 72 -381 399 -82 -219 785
3110 785 -524 -3 356 -485 182 521 -353 338 167 -399 726 -207 -339 619 -240 -308 445 -549 172 224
3130 224 -489 563 161 -677 420 -389 -712 285 -71 40 521 -607 207 380 -578 347 210 -209 676
3149 676 -272 -172 530 -687 -320 711 -722 139 357 -373 439 -107 -375 747 -367 -262 525 -629
3167 -629 175 377 -539 212 0 -460 551 25 -464 432 -14 -489 455 -228 92 335 -682 340 48
3186D8n65J229o34m42J000o40p8N10q62M23M47j219P21M32q59J090q30l45Q72
3205B98j88k26N40j050Q66mq16J026m33o51J451r83j2N77j070O35R05j324R43
3224D84k13o69P80j08q59Q29m57m5J132j215K75P81j212N91L01j183J248l44p28
3243f12J044n36j7P71j153L19L03n97M99M39q49Q20p67k08J010n98K66O19j221
3262d68R37L01j323Q13J09q76P79j91l54O59p10k0P76n74J36J90m19M26K04j077
3282f82J290o42j29J062j307J56J025j174L20N85r29P17j5r21J097n57L1P31j100
3301d42K40O42p51L83L99r16J001m62n22R70n66m65J121j096L97O24q82K76N31
3320D82q17O68l69o80J283p33j9O90r15K44O49q45K29N82j080J270k72o96N87
$$ plain form
3186 48 -517 712 78 -364 636 -4 -82 428 -434 -11 436 -783 -62 370 -489 601 -229 -574 298
3205 298 110 -116 424 -626 240 236 -580 446 13 -638 813 -170 -182 395 -675 -40 865 -459 484
3224 484 271 -398 382 274 -585 244 -213 -258 874 -341 -66 715 -497 94 395 -788 460 116 -612
3243 -612 432 -104 -121 650 -503 -184 119 -478 21 460 -389 431 -336 -544 466 -132 134 753 -468
3262 -468 469 770 -553 260 369 -507 272 81 -273 386 -324 -344 432 -142 -6 184 -235 191 395 -682
3282 -682 608 -34 -163 899 -408 -252 773 -401 -81 504 -425 292 277 -644 453 -104 -73 658 -442
3301 -442 -202 440 -311 72 471 -445 556 94 -428 542 -24 -489 632 -464 -67 557 -325 -49 482
3320 482 -335 333 -36 -716 567 -166 -185 505 -410 -166 483 -362 -133 449 -631 639 367 -329 258
3339B58m41l18P97l94J23M40r39P66J71j262J109j42l96O11m98j54P42p93K76
3358d4K50q34Q08o3o17Q23k78l93Q91o43K2K03p44N77O77j047N75L2p54Q73j91
3379A23m98N76m11l8Q83j016M02L20j083Q31j00n43J169n94m01J097r04J3O89
3398E15p68N83n0p08N46r5o84Q40o10j9P40q07K93O83j275P81O35j096P28O9l75
3419g4O45o61k50Q43o36J12M87r66L22M26q15J032m96m19R08n17m22Q83n99J00
3439i7P92r70L38L28q77P90j66n24Q16l79j98N36o94L86L14n73K60Q9q07P42j40
3460c4l48Q69m30k73R61j091N5O65p71L59L45q60P89m51j70O92m86R0N27o40K99
3481I7K66p30L83K69p68R69k14p12R44n15p8K45n52L14O41q75M96K59r84Q69n82
$$ plain form
3339 258 -183 -501 296 -98 25 465 -474 292 463 -799 310 168 -228 383 -115 -269 473 -320 -44
3358 -44 206 -628 180 117 -500 323 45 -348 543 -100 -78 125 -619 -42 635 -412 163 195 -559 314 123
3379 123 -375 201 -210 -248 635 -381 21 341 -742 89 -11 -554 615 21 -380 717 -187 -174 515
3398 515 -253 330 280 -428 118 23 -661 179 -431 -450 290 -517 -224 459 -816 -35 600 -496 232 301 -74
3419 -74 571 -90 -340 503 -133 -21 466 -500 -178 248 -567 465 -31 -450 458 -59 -481 402 -197 -97
3439 -97 695 -275 63 391 -486 304 138 -386 430 51 -147 389 -305 81 395 -178 82 171 -636 106 -34
3460 -34 -382 487 57 -216 745 -346 -291 374 -397 -38 307 -553 236 -215 -385 307 -179 -89 438 -202 97
3481 97 363 -367 16 285 -483 486 272 -440 504 -11 -89 156 -396 -82 559 -316 180 439 -545 324 -258
3502b58k67Q21m31j43P62o80K13P8n22R10k62o53P55n30m57P92n29K24Q63j184
3522d98M63L14p38P18K4p28Q51k17l66L51l79R8M72n49K77N8n28O77n69l7M97
3543A91k42kM10l95J46N30n93k20N94p92Q41m19k26P86p93k2P37p27R5O07r99
3564d93O39J79p94O11j62l83J051p70j14O75m55k60K93k87L11J28n55P51m12l23
3584c70O64n32j16O62o42J04N95p23M88M5q60J053k33n85Q44k74l95O37n78N8
3604a58M03q09O46J42m01L24N0l93M39j73m03R50n71j49M69o01M81K4n94K19J59
3625E4n12O78m38L1M93n29L43P1n38P46j29n99O68l27l59N25l81J24O05r03K70
3646a07L97n97M77l31l12P51m27J24N03p20j83Q53r27O70N4l13L20Lo21N99m2
$$ plain form
3502 -258 -525 296 -135 -278 484 -196 17 95 -427 483 221 -432 323 -207 -664 128 -401 -177 686 -498
3522 -498 -35 279 -459 259 283 -445 406 189 -177 174 -205 -107 365 -184 93 151 -377 300 -269 -306 191
3543 191 -51 -53 357 -38 108 638 45 -175 419 -373 468 49 -177 609 -184 -206 531 -196 -101 506 -493
3564 -493 146 325 -469 142 -20 -403 648 -122 -236 439 -16 -276 17 -270 41 169 -386 365 -47 -370
3584 -370 294 -238 -354 308 -334 -230 365 -358 130 175 -685 368 135 -450 394 120 -275 362 -216 -158
3604 -158 245 -564 82 224 -177 147 197 -196 243 70 -333 617 46 -103 366 -235 246 270 -324 -105 54
3625 54 -458 220 -218 -187 306 -223 120 191 -347 399 270 -329 339 12 -347 178 -203 -79 526 -377 -107
3646 -107 290 -307 170 -161 -473 278 -149 -25 478 -242 -425 428 -499 171 225 -88 232 235 -386 213 171
3667A71n04P61n40k8M25p42M54P3k91N84o5n30O49n36k75Q22m08R8K04m60L80
3688B42j59m20P44l18n41Q48m63l04O03j95j90M60m55K11J70n53L05J48m63M88
3708A58k53P5J01l82L58L52q48N13J30n82N47J8m82M74n16J20M85m94L08M02j025
3729e41P48O8n95L26jj61O64p28o7P22q50P09p2n98K66K63n66P92m84l3K71k16
3751h3k9L02q27N81L11n81L67n6m0J53L9n99O49m69L38K67n60M11J49p56Q24k34
3773A57l55M81l67j37N98m38K1L14p26M18K53o47O17k01k89N47p0n23L68k33L0
3794a82N81p27P8J27L4J48J07n00R23o18k1L85l77J04L05m43J91o8k32L95k96
3815h6j53K20K63n46P22q38L09N89n97N1J26k78N33j97l73M04j50l66N27j94J00
$$ plain form
3667 171 -333 428 -112 -140 285 -457 -3 70 -221 363 298 -232 417 -119 -394 428 20 118 322 -138 242
3688 242 83 -337 407 89 -452 396 -67 -371 232 37 -153 307 -148 63 233 -320 -15 133 -330 158
3708 158 -95 -20 81 -301 57 409 -439 74 204 -378 169 187 -295 179 -337 -217 268 -226 82 484 -541
3729 -541 207 275 -320 6 5 -156 508 -220 -287 435 -415 294 222 -376 -110 153 -413 379 -105 -138 133 -83
3751 -83 -112 190 -637 -56 255 -326 41 -15 -55 98 137 -462 187 -282 56 323 -237 174 323 -433 391 157
3773 157 -198 283 -84 -221 377 -61 -40 274 -452 -34 219 -428 189 -12 -301 246 176 -347 21 -212 -182
3794 -182 399 -328 -250 -123 -89 59 166 -334 589 -29 -50 335 -42 62 367 -76 115 47 -185 210 -86
3815 -86 -239 -19 244 -302 420 -418 -109 480 -117 -66 60 -218 315 118 -255 149 -1 -367 160 -34 66
3836F6J21k94J92J54o14N54J41l42L99o47L6L60n99K79N82m83L03l90m4j0J63
3857g3o3M40o18L92J59j13Q5R0k62j6J6l74O10k96k59Q20q62r8O52m27J35M07
3879C45n64K96j01o8M15m56j86N50j34k25K46m85L71J44l70M83q9k68M24k26K1
3900A23M5l99p9M83l46J21L60n84L20mj73K85q1k67M57m80O2K95k55KL43j76J69
3923B21k88l50P29l97P4M68l78J10j46l07M59P7n32O25k43m13L49n5l1J74l24
3944a78J25J15l93M31l6k38N18l64j89N46n72K31r8m9j95O15m44R9lj02J5K39
3966G3m79O25m26j1K99j79j20M99o04L43K19o57O85k81l9K38l12j16M52j69j23
3987h3L54l28j87M11j80j2K9l6J95l71K10O2J2o6J49l93L64M5l01K29k14J53J7
$$ plain form
3836 66 187 -107 85 239 -375 179 320 -22 377 -270 -234 126 -473 -194 388 -95 208 -182 -226 -236 -73
3857 -73 -136 304 -314 78 237 124 209 299 37 21 37 -337 273 -23 -282 538 -324 -422 230 -197 -62 345
3879 345 -219 77 -24 -92 323 -133 -319 231 97 -128 118 -367 4 148 -222 261 172 -96 328 102 123
3900 123 168 -231 -310 173 -173 -52 308 -276 44 40 -133 152 71 -196 261 -219 -157 138 -117 -115 228 52 221
3923 221 -67 -417 312 -85 -11 457 79 189 43 -264 195 272 -260 365 122 -291 58 3 -28 146 -178
3944 -178 -53 62 -331 100 64 -174 344 -20 -209 337 -235 -4 -102 -151 -346 269 -175 -76 -79 -181 -166 73
3966 73 -406 219 -207 -218 81 -98 -218 281 -323 20 239 -418 267 -14 -53 185 -127 -243 209 40 -83
3987 -83 271 -57 -244 167 -13 -25 4 -32 163 -208 2 64 76 10 159 -234 130 175 -126 103 -111 42 59
4010E9k33j37L73m59N34J25n76M95j97k24L48j11j75M80n00k27N41l43J2Q8p4
4031b01P1J48k64K88k18J11L32m41J10J70j87L89O5o11N21k26N6j46m9J45J43
4052B06m74RM86m97P6M53k58R1o4j93K46l59L11J78r5j48N81o68p9L92m27L03
4074G0j88J51L7J8m25O08k62j34K7j22P4K36j35M69m68k84L19p3j02L29l13l0
4096a98L82k85J81j62L8L90m59Q1j55j46K32J59j42R1K91l09P1Ok52J10J16k21
4118a81M60n36l3O17l27%R3l54N58m36K17J75m39J37K71m14M24R1l33j59K51k65
4140a83L98l14L9J65P6k13L00l26k14J74n3J50J84l54J99J92l72K56L0k98O20
4161D56m44k03N52n56k9O2K45M9M7l51L65k71j00M68k29k39L51l63L23j4k25j09
$$ plain form
4010 59 -174 -311 62 -397 137 262 -314 181 -16 -240 108 -3 -178 302 -198 -425 116 -227 -215 -127 -201
4031 -201 -130 18 -246 42 -176 -65 267 -174 -64 106 -81 308 373 -238 283 57 113 -33 -82 63 206
4052 206 -268 -259 227 -270 -194 259 1 92 28 -165 81 -278 33 211 116 -32 549 -119 -198 194 -233 70
4074 70 -118 33 70 88 -337 271 9 -125 -98 -220 -146 90 -45 424 -44 -328 -9 -82 -184 145 -168 -198
4096 -198 184 -101 80 -82 -44 346 -113 -32 -187 -333 -101 58 -84 7 298 -11 60 66 -186 -76 40 -181
4118 -181 279 -257 -290 327 0 0 93 -261 297 -139 78 253 -186 -49 222 -192 232 323 -10 -169 82 -183
4140 -183 215 -99 -60 105 181 -32 268 -58 -272 -98 -151 -1 183 -171 28 220 -152 104 134 -164 456
4161 456 12 -191 361 -195 -224 -162 83 132 179 -172 193 -78 -178 290 61 -178 173 -190 133 119 -106 -215
4183b15K19j87L81l28J44K8k53R5K95m93L81J98n79O54m29j8L3j0o3M28l29j10
4205a58L45l31m1K52J52k45J72l50L04j97J4J00J53l44L76l60K67j33j58J39k24
4226b67K8L57K8j3J42p55K90N88q12L45J12L11q3l43k07M62m9j88J97j77k0M51
4248C97n15L26j07m9k2k6j38L77l25N7K56m24J04K67n73J73M06n11L00N5l0j40
4270a42R7n5O67p02N1K09k75K91j33r2n4j7M2K40J0j64j5r7J19L06m54L48J32
4293C12o22K71J40k66K09j08p7J51j80r3K05R2J43k36j99L40j37o1L34n87K66
4314a03O1q7O8L30k28K8J33l31L13l69R6K46o9j80K24j70l7K50l16K04l7L6r1
4337b9r5O1O6%k05L77j36J9n1m22N24K83o03J57K30k59J99k17p5K2n8K20J70j56
$$ plain form
4183 -215 4 -183 198 -130 14 42 -211 -116 179 -314 67 265 -314 340 -89 -107 -74 -84 -147 281 -48 -158
4205 -158 187 -144 -185 67 219 -26 146 -204 100 -97 -83 17 170 -174 202 -158 109 -24 -182 -43 -267
4226 -267 -239 118 146 133 275 -480 -190 398 -414 -69 43 354 271 -72 -279 183 134 -54 143 -34 -54 397
4248 397 -118 208 101 52 30 4 -134 243 -82 -25 231 -193 -89 178 -395 -222 184 -327 -27 28 -2 -142
4270 -142 -45 -100 567 -135 -84 125 -150 141 8 -84 -138 -155 -113 127 137 -27 -42 -139 -20 286 -168 180 312
4293 312 -310 -39 101 -165 44 -64 -141 10 -170 -263 -58 34 177 -59 -258 82 -55 -116 218 -369 -103
4314 -103 -42 -129 -61 269 41 69 202 -129 184 -185 -89 157 88 -92 132 -38 -75 175 -141 63 26 62 -29
4337 -29 -124 -63 3 3 -202 175 39 58 7 -415 109 392 -211 -54 176 -83 116 -101 -176 -154 -212 8 178 22
4361B2J47K3j55j25K63J0Ql00RJ75k40j0L89n43N07pl74L01kj67L15n32L95j86
4385g7P8Q7K66l54jj8m4K86j87r7L4j28M9K13l04L51j23j36K20J50m6m55R8l5
4409a73ONK60n3j62P9J71n2oN3k71L16k44j43L33l1O6j4j70r8J13r6j52N26m25
4434a62R2M2j54M46l13K67K9Q6l21o3L05j64k15K14Ol26M05p6L2J2j44n2k38K37
4458e5j40L47J0j26L3J83k10O4q0r0N0J1j4L00k68J01k82O8K23k04L2J52p9K78
4482C04m32k99M33K33m19J13j22L11j55J09k46j59L21J30k66j25L80%r6q8J85
4503A12l43J54q6L48j67j61j08M23p0n1l1K9k71K79k99K55J14j46L2m0Nl18K22
4526a18o9K88R6l84J09L08Ml14J60j52L11l02J44n1J00k9P0k06K33k45kK5r7J16
$$ plain form
4361 22 169 192 37 -88 175 185 193 -107 -98 77 -163 -173 216 -327 180 173 -201 100 98 -69 246 -286 109 -77
4385 -77 1 88 354 0 -1 -19 -63 223 36 -61 -27 -155 -106 107 -197 154 31 -105 115 265 219 -236 -138 -173
4409 -173 -167 -162 98 45 -117 -38 133 81 75 128 -143 173 -71 -214 119 88 154 140 -30 -128 -15 -111 -263 263 -162
4434 -162 -70 -28 -182 264 -49 218 247 333 12 -51 254 90 -125 89 95 -231 174 98 130 142 -2 -54 -292 -55
4458 -55 -195 152 162 36 69 252 42 106 26 -64 -14 -3 -17 283 15 116 -166 -98 125 -79 -47 105 26 304
4482 304 -128 -427 6 239 -180 -67 -189 122 -33 76 -170 -329 -8 122 -144 -269 111 111 15 -73 112
4503 112 -231 -77 -163 185 18 -143 -251 172 102 51 20 49 -222 57 -242 13 127 -19 13 -27 -22 -340 -118
4526 -118 -187 101 197 -187 -78 230 234 -80 80 -72 239 -63 81 30 130 101 171 -35 198 -47 -49 -24 -121 -5
4550eQ0r2J74m3k82q7K04J81k89J0K44j44K18k62N6J94j51j09N23l92j79L76k63
4573c8L30m00K77k40N14p44L16k9Q7k0j67pJ57J8J0j52L44l55O1j84k8L9J80k44
4597b75J10L82k93K31k7L0k35J83j30l1J94k46K06l33J4K87j17J07k47M11k86
4618f5K19j81J25k27M09r3K8j72P9j34%k5J78j13j33L30j47l59K80m6J72K04m80
4641a51L66j67J5l84L02k32M82l52m5K70k39kK9N2L92m40J32k30%J33M8J8Q8J72
4665B57l43L6J85k80J23K2p0J73j01j47Q5j19L81k88j85J70K51jpl5k01J1J11
4688B8l39J65j1p2K45l74K86J98k17j04L1J81K68j39l48J33J69l22L53k3k74Q5
4710h1K06j57j70J84P2J58l61K0M61k58j57O3j48M27m59L13l65L16k68M78l12
$$ plain form
4550 -5 75 -17 157 114 -168 -255 -51 130 -159 -149 95 -49 169 -93 -37 157 6 -103 420 28 -151 225 -38
4573 -38 292 -108 169 -71 443 -301 15 -14 73 53 -114 -121 36 54 64 -88 256 -99 -38 -222 -250 -211 -31 -275
4597 -275 -165 217 -76 155 128 158 -77 106 -24 -55 139 -107 99 -234 -220 67 -50 57 -190 221 -65
4618 -65 154 -27 98 -129 280 187 215 43 122 -12 -12 -37 141 28 -105 225 78 -281 -1 -47 125 329 -151
4641 -151 215 48 63 -321 -19 -251 231 -121 -166 104 -135 -137 -108 -56 336 -104 28 -202 -202 -69 -21 -3 85 257
4665 257 -86 -50 135 -145 -22 0 -70 103 2 -145 -60 -179 202 -86 -271 -101 150 149 142 107 -94 -83 28
4688 28 -311 -146 -157 -229 16 -358 -72 126 -91 -195 -164 17 285 146 -202 -69 100 -222 131 108 -166 -81
4710 -81 125 -32 -202 -18 54 212 -149 -129 332 74 -83 -20 -168 259 -200 113 -252 64 -204 274 -38
4731c8j63J98r9L59j60j4k21J55Nj30j31M7J76J12j91o6J07J81n0O1O6k11J4J87
4755A94l6k87L42m27O45n02K71k26n4r4K09q3p4J06J38j0k47k2L16k62k10L99
4777H6l04L5J35k49K22J13R1j17Q2r3J7q6o9K49j37L68l36k4N9L07n44Q6K73o
4801A58j64J50l63K55k83J45J25L2P2M9m52K24p9j03M34k98J88j11O0k62L96k71
4823i8K53j04%j27M2j24K40k80L43o0k90K75j50J01Q1l12J80N3K73l83K40k47
4845i4j48J64J76l94J36J74l45J27L00O1k22J08p8M3k93K53K9R9Rk37J98o8q6
4868h8P0j32j62N48n64M97n9j51l7p1K36n5M6j80O5J49k5L53l79l63K25J28k78
4891b27J26j8K7L78k50k09lJ08M10m17r5J46j05J37K15m99L00L20l65J97j90r2
$$ plain form
4731 -38 -201 -3 -102 257 97 83 -138 17 22 -108 -239 -192 -16 96 -95 -161 -54 127 77 138 204 -7 7 194
4755 194 158 -129 213 -214 431 -71 200 -26 -80 -174 35 -48 -122 -16 122 112 -135 -157 159 -103 -313 86
4777 86 -218 -183 -48 -297 -75 38 129 12 94 1 18 -68 -137 112 -25 343 7 -17 42 349 -195 -109 164 158
4801 158 -6 144 -219 36 -247 -102 23 55 127 176 -276 -52 -131 -234 200 -98 90 -21 39 -223 173 -98
4823 -98 155 51 51 -76 -34 -158 82 -198 145 85 -205 70 -80 21 102 -210 -30 23 296 -87 153 -94
4845 -94 -242 -78 98 -296 -160 14 -331 -204 96 157 -65 43 -35 8 -285 -32 -3 96 105 -132 66 -2 -88
4868 -88 -18 -150 -312 236 -328 169 110 -41 -78 -149 87 32 78 -102 -37 112 87 440 61 -302 -77 51 -227
4891 -227 -101 -119 -92 286 36 -173 -176 -68 342 -75 -170 -24 -129 8 223 -276 24 344 -21 176 -14 -106
4913a06L18k46L19m97J82P0J40k14k89K43J45j9r6j31J30j86M28j37J49m27P0
4934a54J49Q0j80K11p2k71J37J15p4J48Q6l35J90p7j52N0N28m42K62k01J42K5
4956A65k16K38l64J28J97l54K18p4J47m11J31j22J72J66P5k59L16q4lJ01k49K14
4978A32j52J6r3k7l3L56m75L64n9m06L66k23J23K05j50J52j24J19j43J32k00N95
5000D75j78k56J7k5j20J96k30%J6J28k58K53n4J92k7j7l00K34j56K72k80J50j67
5023a35J72k33M03j06k57j73J62K32L1j00J26j58k32K54k04M12o5l85J47N10m95
5044i4J74O2l73M14k99k3P8j36K89m13K10K04L14l92J47l73L37P4r2l08M94j28
5066A66j78M3j08lnM3K38n58N23p9o3p4KJ18l64M45j36J81n8j31N6K73n29K99
$$ plain form
4913 -106 212 -34 285 -212 -30 40 180 -34 -323 -80 65 46 -50 -181 -51 -237 191 54 203 -224 -154
4934 -154 -5 75 -105 106 34 -237 -100 15 -59 89 175 -160 30 -47 -199 -149 379 -63 199 -2 140 165
4956 165 -51 187 -177 -49 148 -206 12 -62 85 -326 -195 -317 -145 21 96 -163 153 69 66 167 -82 132
4978 132 -20 -4 -97 -124 -157 199 -276 88 29 -377 -11 -234 -111 94 -56 96 -28 91 -52 80 -120 475
5000 475 297 41 58 33 -87 109 -121 -121 -105 23 -235 18 -36 156 129 112 -188 46 -110 162 -118 32 -135
5023 -135 37 -196 207 101 -156 -329 -167 65 96 -4 122 -36 -268 -14 -218 194 129 -256 -109 401 -94
5044 -94 80 142 -231 183 -116 -139 -61 -197 92 -321 -111 93 407 15 162 -211 126 200 108 -200 294 166
5066 166 -12 31 -77 -80 -85 -42 196 -362 161 82 19 -55 -53 65 -299 146 10 191 133 2 58 331 -198 101
5090A01O3j60J09k28J6j37K34J71j55j29O6l6Q3L20l82J45J10l04j8J86k03L11
5112A63j58k87L26k7j76J31q8j17M33l39L86r3o06N23P6q5m30L80j02L21q4j65
5134a8Q0n8K3J57j44J23l28L32J13l16j29J11j23J66K43m14J08m7M1p5l3J05L28
5157B45mn58K04J87K1O1n18L26K58k82L00j89l01K45jj74K82k03K51l0j78J83
5179A25o0j87M56o60J36K63j35M61k08k30R4j38PQ6Q3k53L07n1l22N61j15l19
5201i9K2j27j4M23k51J07n1j34K32Kk21K39R1l36J32j58L9J38R5L8j16j06%J71
5225A16r2Qk27L21j38M3n7q8r5L21k7k25M04l50k9k7J56j43K42l01O1J56m90M25
5249c6j15J62J13Kp4P1k94K38m8n3M4M6M4j74J6K64J59k72J3lj64J09Q2j25p8
$$ plain form
5090 101 164 4 113 -115 -99 -236 -2 169 14 -115 -49 -85 -2 318 -64 81 191 -113 -131 55 -148 163
5112 163 5 -282 44 17 -159 -28 -116 -233 200 -139 247 154 -452 71 147 62 -368 12 -90 231 147 -18
5134 -18 62 4 27 184 40 163 -165 167 280 -36 -165 -54 -177 -11 232 -182 -74 -121 -80 -155 -188 -83 245
5157 245 241 -317 -113 74 95 156 -362 -36 222 -60 240 51 -250 -5 -6 -180 102 -101 150 120 -58 125
5179 125 65 -122 334 -326 -190 73 -62 399 191 -39 55 -83 -76 10 93 -160 147 96 -226 335 220 -99
5201 -99 -77 -204 -218 205 -46 61 10 -124 108 110 -111 128 219 -117 15 -143 -104 34 129 167 51 -55 -55 116
5225 116 24 32 -195 126 -12 31 -26 -114 -209 112 85 -140 264 -86 -115 -142 14 -129 113 -188 -127 29 -461 -36
5249 -36 -151 11 124 126 52 123 -171 67 19 -34 10 56 100 -74 -58 206 365 93 106 103 -61 48 130 5 -73
5274g3J97k75M45l38J8K10k24o8J85j52NM4J5N3J61l56J95o9j12N13k44L3j12
5297E1k41K07N2j43J43j15n1K88l75K08j2l0m2L8j05J35K7k31J82J20j98L96j28
5320A76k49Q4k87J9K82q0rJ96k50L19k93K5L72l99K78J58k33r1K01j67k0L08o89
5343c49M20q3k9J48j72j09L79j85o7J20j28M1K04n66P84l02n3J65k70K0q1J57
5365D4n6J48k06m1L92n12K4M03k34L68l37l7L26k18KQ0m1j69j6K02J50l26L8P9
5389F3j34K42j13j23J49R9l5J6q6l93M64l32O7L78k09r9K09l58P4M34q30P78m62
5412b01K3J46Oj93L01Q1k23L45l32l5J61l53L17j08J68q5j48KJ70j50J49P9k79
5435a59J60q8N6K03j50k91M05K16n38M66l29q6L51l85L3J36o1J30mj98L45l16
$$ plain form
5274 -73 124 -151 294 -44 -26 184 -40 -108 77 -75 -70 -26 -11 42 203 -153 42 -27 -139 374 130 163 51
5297 51 -190 17 69 -74 69 -46 -97 191 -184 24 12 -18 -60 -22 -127 8 35 -196 -14 106 -92 304 176
5320 176 -73 11 -276 -257 25 -55 -64 132 -118 201 -92 -67 305 -94 184 342 109 18 219 52 32 340 -349
5343 -349 71 -12 -41 107 -65 -174 205 20 -47 73 -55 -14 190 -376 408 106 53 218 -52 -32 -113 44
5365 44 -12 136 -70 -111 281 -231 -207 196 -38 330 -7 -44 282 64 66 146 105 -64 -80 122 272 -54 -16 63
5389 63 -71 171 58 -65 84 183 148 164 78 -315 149 -183 -116 262 53 -46 163 -195 -121 313 -517 261 -201
5412 -201 -178 -32 -26 -219 82 163 -60 285 -47 -82 79 -274 43 -65 103 18 -130 -128 42 -108 41 120 -159
5435 -159 1 -87 -31 172 22 -269 136 352 -186 280 -49 -135 216 -169 -136 0 -61 69 65 -133 212 -104
5457a04k23N19m03J8J50q1K64n5k56M48r8k44R4k4MJ15k49O6OJ81j88K09k45N8
5481c8o2j05M36n43J48K32m0j17L77n75J85J48l32M13k13J43j46K9L5J2j83L15
5503A19mk46J91k81p8N85j4n37M04l45P5L0k49K75M36l66J86k2q9L0j76J76J5
5526A15l73J0N37n77L05J36m13N73l84j19L26k04j7K94n58Q9N00k83K75L9l55
5547h4O2j20m7L32k91j4L08j15L6L66n43j5L33l51K87j19l06M79l54j9K65k26
5569a36J80j63j30L34P6j15j01J18k33L87l02n0M48l24j44K91l34J09j12N8K10
5590F7n2k19K01k1k46M42m77M43R4r7j6m7J87j29l41N17M3l77J17Q3j33j38K13
5613A14j68J36k50q4L12k07j24M10k76N0J58k48K6K54l71L23p9l20P09m85p3L97
$$ plain form
5457 -104 -327 192 -211 -193 -43 -124 140 85 -171 277 179 -65 29 5 9 124 -125 -59 -53 128 -60 149 -96 -38
5481 -38 -100 -205 231 -312 -164 68 28 -89 288 -287 -102 46 -286 127 -86 57 -89 -60 -25 -13 -196 119
5503 119 115 -131 60 -221 -299 286 272 -265 139 -206 -131 -101 -350 -75 361 -5 181 159 70 100 -76 100 115
5526 115 -258 -248 289 -288 17 153 -260 313 -71 -190 136 -68 -85 209 -349 -260 240 -43 232 271 -84
5547 -84 -22 -142 -189 143 -148 -162 146 31 67 433 -110 -125 208 -143 144 25 -281 198 -156 -175 90 -136
5569 -136 44 -119 -249 85 161 46 -55 63 -170 217 -85 -135 313 -11 -155 136 -198 -89 -201 -143 67
5590 67 15 -204 -3 -24 -270 172 -305 138 232 135 119 72 259 130 -211 306 349 -28 89 172 39 -99 114
5613 114 -54 82 -168 -252 60 -147 -271 139 -137 -87 71 -177 -151 103 -268 55 -24 -344 365 -120 -193 204
5635B04j94k12N11p3j03J64l31N6k3j72K01Q7j63K39n66M59j10J0j24L62l61K88
5657A49j89j62N42j42k03R1j6k16K70k87K42Q7p03N86m6l21L36j15J92k8k23n5
5679b11K46j00J24j5j08K6M4j36l9P1j80L65j08K4K65k46L44l18j82J70Pj45K11
5702A09Pk55O16n81j24K93k74n0M67l59L23j31k71J33j60j80P26n01M89k28q2
5723c3P5J73l93M98l64lR7J71l68R3m3L72L7l08L12k71k44J7J69o2O03m74n5L19
5747C18m59q8L13k92L07L4m44K14ro7J92j15r0M42n84O87k35j57K4l7k61M04j55
5770e8l17J033r45K21L03l79Q9L17l6J2K6l51L31o37K89O87p19L0R9j58J76K75
5792B88m88J80k56K47J89k34J56L78n06J9K95k82K10l00k48N11k21j64J89q0n
$$ plain form
5635 204 10 -202 309 236 133 297 -34 22 -1 -173 28 115 -48 191 -375 84 -26 -16 -140 222 -139 149
5657 149 -40 -202 340 198 -5 86 70 -146 124 -163 79 166 -537 49 3 -318 18 -97 95 67 -156 -211
5679 -211 35 -65 59 44 -64 -38 6 -130 -169 -98 -278 87 -21 3 268 22 366 48 -134 36 43 -102 109
5702 109 116 -139 477 -104 -228 65 -209 -259 208 -151 172 41 -230 -97 -257 -437 289 -212 277 49 -33
5723 -33 42 215 -178 320 -44 -47 50 221 -147 -54 -97 275 312 4 316 45 -199 -182 -13 -75 528 54 -1 318
5747 318 -141 -229 84 -208 99 133 -311 -97 -106 -173 19 -96 -186 256 -328 359 124 -33 -9 -46 -307 97 -58
5770 -58 -375 658 -287 -66 237 -142 -53 264 228 240 266 -85 246 -391 -102 585 -134 -104 -5 -163 13 288
5792 288 -200 -20 -276 -29 160 -74 82 460 -46 -27 268 -14 196 -104 -352 159 -62 -226 -37 -117 -122
5813a22L86m67m7N78m88M90j69m27M16J33k11R6n06M16K57n42J68p5j68L02j34
5834a14K6J12j21%L23m52J23L68j66r3K07k22J21l4k23K93m41O4M88l89J5N25
5856D10m50K99j44m92N24J5m62N45k62k52N50m26M1K63j83J69J5k37K69P8o41
5877c71O03k38L5K38k10K52j86j40J14lj34O9O0o5J1MKJ66j69J7j32r1M1K07j32
5902e2K62j13n48M02P0k66L88k39j11M68k22K84l79Pk8o7K53J40m26K60l2l72
5924c21O3N43n27J53L07l44K15l10N2K40j13J35L20l17k3K93r02O52j2q2P0j77
5946h5j6L25n99L54J05l06J01N8J63O2r1j41K38l94J12J14J0L8L84o15K29M7m09
5969c16M54J54l64K4J03k52M75n05K17J16j69R1K34n23J62K48j05R1k42k38M97
$$ plain form
5813 -122 264 -203 -250 328 -160 330 161 -266 150 283 72 168 -338 78 335 -207 -39 -114 -282 20 -114
5834 -114 -88 24 -97 -97 226 -226 -103 265 99 6 213 -9 112 78 -145 148 -293 -229 259 -130 -115 410
5856 410 -40 259 115 -377 147 162 -300 245 -17 -269 281 -145 -104 159 -24 145 160 -77 192 270 -371
5877 -371 232 -6 29 267 57 309 123 -17 97 94 -40 29 89 24 35 39 41 207 38 55 -77 -168 -127 80 -52
5902 -52 210 97 -451 -49 21 -245 143 -96 -207 261 39 323 -56 -49 -77 -144 109 249 -177 83 51 -321
5924 -321 -258 285 -242 -89 218 -126 89 -221 -169 71 -42 93 413 96 73 366 -536 116 104 22 92 -85
5946 -85 -101 224 -375 -21 84 -222 -121 -63 100 162 71 -70 168 -226 -114 0 10 48 432 -183 46 93 -316
5969 -316 138 292 -72 -48 55 -197 278 -227 -10 106 -63 28 262 -261 -99 149 44 135 -107 -345 152
5990A52L4j75K44k11L0O7n03K96J53l49M51n53K90R6j90K6K28m58L21M33n36K73
6012A19j57j04M4k3P3K98m85K32J23j13j36R8j91K84J20l58M88n38K60K96l89
6033e9J71L12p93N28Ql60M52m04q7N45n18J4K85k77J59J9k61N58j25m06M83l54
6055a10j57N62j44l22J57J27l85K81j42J52J44j95l1n0P4K37l61L11p7k50K0L7
6077a22k18L10K66o12K14M31m19L16p9l72L11R1N0P1m47L40J1n18N50k27P3R1
6099A11k06n8K19k33J69r9j22K33J3l42O39l60r3M68m82OJ84p9p3K53k29J00J02
6122A21n22N28j33J26J58o05K79J92m00K00K56l87L15q3j92K46R5k60L12m57L00
6143H9k25p0J37L51n84M91j27j90J94k49P7K97l89P4M38m89L52k60j53M71l41
$$ plain form
5990 152 186 11 255 44 74 141 -362 -66 87 -262 189 -364 -74 22 -168 -142 86 -372 -51 382 -154 119
6012 119 -38 -142 -98 -121 -48 250 -235 -3 120 7 -129 -31 -222 62 182 -176 312 -226 34 330 -59
6033 -59 112 424 -369 159 167 -193 259 -145 -232 313 -205 -191 94 -183 -24 -5 -266 292 167 -239 244 -110
6055 -110 -267 295 151 -171 -14 113 -272 9 -133 19 163 -32 -63 -113 -39 198 -163 148 71 -179 -159 -122
6077 -122 -340 -30 236 -376 -162 269 -150 166 87 -285 26 117 167 238 -209 131 142 -376 174 -53 20 111
6099 111 -95 -153 66 -167 2 -97 -219 14 27 -315 324 -36 -129 339 -143 -137 47 -32 -105 148 -81 19 121
6122 121 -401 127 -6 120 278 -327 -48 144 -256 -56 200 -187 128 45 -147 99 194 -66 246 -211 89
6143 89 -136 -206 -69 282 -302 189 62 -128 66 -183 -106 191 -198 -124 314 -175 177 -83 -236 235 -106
6164a06m6L10q8j96L23j22m61O76l12lk7j82L70q1m68O06j60r3M12l15j48J91
6186H0j95K01K31o29L02j05M6L65k96J89J04n81L67j03k72N00l33R9K10j44j15
6207g9J44j39M3J18j68N6j2j23K23n1l74L02r1N7L5k13k76O65l20J87J94l29K86
6230A35n2l29K51K65k33K51p48M10J78m11L12J1l58N97j94k51K86j60k17N22m85
6251b20L53j8k06J11L9l09L52r7k84L66j51P0M35l18j58K15m71L28m2K1J72J36
6273C24l88R5l41L14Q8m07K91J5k93L36K87m67K24L6k59L68l63P1M32n93K43J71
6295A84m13K91J8m56M10j73j54P66o32L4K94k12J32J50l41M19k21j62K46j23m4
6316A3O98p93l6J90m07O31k17j98J78K3k09L79l04m30O96n51L47J29j87n6M0p3
$$ plain form
6164 -106 -152 158 70 -126 197 75 -386 290 -22 -25 -52 -234 136 55 -413 193 33 -60 352 37 -111 80
6186 80 -115 86 317 -312 -10 -115 -69 296 0 189 293 -288 79 -24 -296 204 -129 -30 180 36 -79
6207 -79 65 -74 -31 87 -81 -25 -37 -160 63 12 -362 -60 -151 -94 -59 -272 -548 117 -203 -16 178 -151 135
6230 135 83 -246 5 270 37 288 -460 -50 128 -283 29 40 -318 279 85 -166 120 -40 -257 265 -220
6251 -220 133 115 -91 20 59 -250 102 5 -279 87 -64 6 441 123 -35 180 -291 37 -5 16 188 324
6273 324 -64 31 -310 4 92 -315 -24 -9 -302 34 321 -146 78 114 -145 223 -140 -69 363 -230 13 184
6295 184 -229 62 80 -376 34 -139 -293 473 -159 -125 169 -43 89 239 -102 317 96 -66 180 57 13
6316 13 711 -82 -118 72 -335 296 79 -119 59 82 -127 252 -52 -482 214 -337 10 139 -48 -104 -64 -137
6338a37J29M38p81K55L09k77J58k30n4K39j06o7K88n20N79k84m4K00K9j99M45
6359C70l90j7K25o06O13m1k70K82j70j60L75j94k01M95m39J94K94l85L9J46l03
6380a43L15m38J51K93n5j00L18j78j34J10m68M66j1m19K66J47j52J09m7j28L29
6401B31k14j58L95l60OK13l71K74rj72J69K8j77N04k55l54N42m48L08k61j54K50
6423a3n6k74M75n11K56L91o32M62K90o23J95J08k46L84n9l00J40n1K4K99j35m1
6445H3L11m64K32Rk72N8m33L57L36m42p8N49n96M84j00k86O76k78n58O29j35k23
6467a41L07r3j67M59o64K55K52n77P09j73k86L37l76j13M84m00J83l5j65L10o2
6488D4k63L37L9k09J78j91K38J55l45j12J65j24O6k0mJ7N5o8J89l60QL03j71l8
$$ plain form
6338 -137 -8 430 -351 -96 213 -64 94 -136 -190 49 -57 -124 164 -356 223 -61 -105 95 124 -75 370
6359 370 -20 -37 188 -418 195 154 -116 166 -4 -164 211 17 -184 311 -128 66 360 -25 14 160 -143
6380 -143 172 -266 -115 178 123 23 341 163 29 139 -329 137 126 -293 -27 120 -32 77 30 -98 231
6401 231 17 -141 254 -106 -100 113 -258 16 7 -165 4 32 -145 359 104 -250 292 -156 152 -109 -263 -13
6423 -13 -69 -343 132 -379 -123 268 -364 98 388 -235 -40 68 -178 206 147 -153 -13 -64 -40 259 124 83
6445 83 394 -70 162 171 -101 -43 -476 -119 217 -225 -303 246 -350 134 34 -252 424 146 -412 217 82 -141
6467 -141 166 73 -94 365 -299 -44 208 -369 340 167 -119 218 -158 -271 213 -187 -4 -39 -204 106 44
6488 44 -219 118 157 -52 126 -65 173 328 -17 -129 36 -88 -22 -42 -46 -29 26 -42 147 -213 -205 98 -73 -111
6512a11J18j06K87P3m37L18l06J89K84n91J90L32j35k20L74m64K22J45l96L90
6532A56j49j26L69j47l62M91l56n6K59l63L20J22Q0k45j02j49K11j95k7L20j77
6553a26K70M4m74M10k57j30N23l29J21L55m46J0L66m53L27k41j61K46j17J53J60
6574B51l53j25O39l96N6J08j42J05m6l2o4J71n29K53%n4L55k88l4K78l03J44j1
6597a7k41K26J27j44L67l58l56P60p22N23L2l45J41J67k09K0kK0j55O9MO45p56
6620b04K65J38l98L61j30k34M3K18k11L15l04nJ7k9lM54k82M2J57l00L31l43o9
6643a71O39o75J18K22l79K11J08k27K08j08J10q1j00j04L11j51j14L67m36K26
6663b6L25p04N79k05k57L68k50j72P25l29p8L26n44K20j49K09K2J72m56L40l2
$$ plain form
6512 -111 7 -99 188 261 -176 142 -164 25 309 -282 -92 240 105 -115 259 -205 17 162 -234 156
6532 156 7 -119 250 103 -259 232 -124 -180 79 -284 36 158 238 -7 -109 -258 -47 -242 -269 51 -126
6553 -126 144 188 -286 124 -133 -263 260 -69 52 407 -39 -29 337 -116 211 -30 -191 55 -62 91 251
6574 251 -102 -227 412 16 72 180 38 143 97 65 1 172 -357 -104 -104 -158 197 -91 -125 153 -150 -6 -17
6597 -17 -258 -32 95 -49 318 -40 -396 364 -358 165 197 -148 -7 160 -49 -29 -31 -11 -166 -97 -93 552 -204
6620 -204 61 199 -199 162 32 -202 -159 59 -152 163 -141 -146 -129 -158 -161 293 11 53 210 -90 241 -102 -171
6643 -171 468 -207 -89 133 -246 -35 73 -154 54 -54 56 -25 -125 -229 82 -69 -183 184 -252 -26
6663 -26 299 -405 174 -31 -288 80 -170 -342 383 54 -24 302 -242 -22 -171 38 60 232 -224 116 84
6684H4k40J07Q8J37K6k84N22n56j47J63J73l13M85k73o7M02k07k82K17k47K23
6705A1m8n1K87l89M4N22n45P9L23n73N11J2l22K77K38m82L75m29P6R5J4j82K94
6728A37k86K20K82n55M90k89l00M65k27j12J72n4K03O7l19K02p7k96K69O0o0K65
6750B57l37K15j34j49J8L30r7l4N8l56J24Q9j25M56j42k95N05n37j71M99l84J70
6772d0j50P9J4J66j56K68k22j31O37l69j52K82j77L7K76n53O6j36L84r5k25L11
6794A14N2j95j26K29j38J03K14k47O2o3k35L98j72lj1J2O2K53j89pQ1n50N77j24
6818I7k56K29j89K60J12j82j65K27m63L63J28j10J9J42m82N12l54k3J66m76Q80
6839D35m39l16N53q7m97O13l65k83M38n9J75O9m70J42K26l09R3J42l44K86L77
$$ plain form
6684 84 -156 -49 39 176 202 -82 440 -116 -263 -100 73 -240 245 -28 -95 307 100 -182 35 -212 11
6705 11 -37 -88 199 -190 -146 376 -169 -90 233 -340 171 183 -139 138 376 -106 269 -160 -84 11 25 -157 137
6728 137 -149 71 353 -202 288 -1 -301 164 -63 -175 -3 -57 146 213 -106 96 19 -277 -8 52 -8 257
6750 257 -80 135 1 -148 -130 200 103 69 127 -229 -105 -16 -141 315 173 -122 383 -154 -325 174 -210 -40
6772 -40 -190 -111 -97 69 -87 181 -41 -172 465 96 -56 226 49 86 362 -191 -125 -261 123 28 -197 114
6794 114 166 -29 -155 74 -64 39 253 6 68 5 -230 168 -4 -7 -18 -6 56 309 120 113 194 -356 221 97
6818 97 -159 70 -119 141 253 71 -94 133 -330 33 161 51 70 212 -270 242 -112 -135 31 -445 435
6839 435 -4 -320 233 146 -351 262 -103 -386 52 -7 168 237 -233 -91 135 -174 -81 61 -283 3 380
6860C80j24J31o19J84J65l67K44K16m11K98n9k34L74j16l6N1j28N6R5l22J96J81
6882A55j62n4J61k23L95k83o1P7K38k67J34m03M28j6k16J39J17n03N10j70j3N05
6904D88o03J89J21k58K43j0m62L74j15j63K95j43j32J53j47P6J98j56o1kj08R8
6926a25N0m6K28m03J06N99m94j28L81k79J96j19Q1J45k73R3j86J21J12O8j51Q8
6948F4O8j22L6m1l7J09n8J77K19m84m07N54l21K65J07k20k69N59l99P6P3k26N25
6971B48o37K63N42m43J0j25j45L69K32k47j23j56J1L92m42P9L24n13K21m7L0R
6993a48J52O5l3k12J87K32k17J06R8l77K69j03j62M56r1m44L95k57j41L73j63
7014a5j21N60n30k06N95n71M39l6rp5P6N9N8k90j58J34j43J47Q5j68O0q6J72K49
$$ plain form
6860 380 256 387 -232 -48 117 -250 -6 210 -201 97 38 -196 178 62 26 77 -51 5 100 -222 -26 155
6882 155 -7 -61 100 -123 272 -11 -72 5 243 -24 110 -293 135 119 -97 42 159 -344 166 -4 -17 488
6904 488 -115 74 195 -63 180 170 -292 82 -33 -196 99 -44 -176 -23 -170 -94 104 -52 -113 -115 -223 -125
6926 -125 -75 -121 107 -296 -190 409 -85 -213 168 -111 85 -34 47 192 -81 12 -174 -53 59 127 -24 64
6948 64 132 10 46 5 -32 77 19 196 415 -69 -476 78 -243 22 129 -91 -360 199 -200 -124 -51 -277 248
6971 248 -389 -126 416 -27 -17 -142 -287 82 314 67 -56 -212 -201 191 -251 -172 152 -361 -140 -187 -157 -148
6993 -148 4 69 36 -176 11 243 26 132 230 -147 122 19 -143 313 222 -222 173 -84 -225 148 -15
7014 -15 -136 424 -106 -312 283 -288 151 115 106 31 107 166 224 -66 -224 -90 -233 -86 -1 -169 -109 -195 -23 226
7038B26m24J46K63l78K28m6k90K84j4l3p3J37l0J75n6k2J69l24j20L73l17J17
7060ioK16K3j12k49M47m22J00M23p83N19j26l50L81j27m3M18l39r8J75J43OQ8
7083B75k41N8k2k65L17J1k68j5J50J04J22j82K9q1m88M48j44L3K33m5l14L53j56
7106h8J25J39n5Kr9p2J19K52m47J49l9k68L14J72l17j90L16k96M57j99O3k0j05
7129h7J55rk08L14j88M7K79k58J83m33K87ML7k67L51n9o6L23m43kK88j82k4J66
7153B08l28Q2J50q6J9k11K18Q2r2l7J75m81M17P4j37L4R2l84J80K80l60K04J8
7176A17l38K85o2M8J57k55m1L14k41P4L7j94K26l06l8K43l8n9J40o5J38j58j23
7199a39J97k63K06K76k26l10L57j28j54M40q7nM0k42KP8L4P7q9k96L79j61j71
$$ plain form
7038 226 -198 -52 211 -167 61 15 -275 9 -5 -38 -111 26 -4 171 115 93 262 -62 -182 191 -126 -9
7060 -9 -15 201 224 112 -137 310 -112 -12 411 -372 147 21 -329 52 -75 -118 300 -39 -137 38 181 187 275
7083 275 34 92 70 -195 122 133 -135 -150 0 104 226 44 73 -8 -496 -48 -192 -159 74 29 -285 68 -88
7106 -88 37 176 121 123 24 -48 71 323 -124 25 -14 -282 32 204 -113 -303 13 -283 174 -25 38 18 -87
7129 -87 68 59 -149 165 -23 24 303 45 228 -205 82 86 123 -144 207 148 82 405 -38 -40 248 66 42 208
7153 208 -120 -38 112 26 45 -166 52 134 42 5 180 -301 116 190 53 87 179 -205 -25 255 -105 99 117
7176 117 -221 64 2 50 207 -48 -89 225 -16 58 95 -99 127 -179 -217 26 -12 -71 69 4 142 -16 -139
7199 -139 58 -205 1 277 51 -259 98 -30 -184 256 169 164 204 -38 -36 42 76 153 64 -232 147 -14 -185
7222a85K74l39L28p1l6J91k96K83j59k9m7K07k06j57L64k8j2J42m17K72L4j44
7244c1L13m12K73j65m5j18J53O6j61K77l72M98m31K30J10o4l46N23j23p8J47r7
7266A47m22K71p9J12q6p6R4Q2L11j80j51J6O2j47K91N9m33J93j37J01j07Q0j85
7289a84K81q8k19K36P3l9kJ9K4k84K47M5n9J50j32l01M19q2k92K53n0m1J1J53
7313A38k85L66l30L24j47j79j3L28k72j00L08k04K8J84l03L94m25Q9K77l41L3
7334a30J84K9j87p0J34J28k33J8L78p62P42K29p83M62k0k54J78j32K78K95m76
7355Hl17N25l14K28r2q2K08m2k05J84p8K90m04j66J95K46l27K78o8k09L04m3j04
7378A5j09J03l22N85j34j45J82lj04J12k55J75k06k2M10m45M6L22j26r7o4j95
$$ plain form
7222 -185 89 -250 78 7 -29 162 -134 149 -10 -39 -86 121 -85 -242 122 94 82 224 -193 79 113 -31
7244 -31 282 -130 143 -22 -67 -185 -32 34 -127 150 -222 276 -155 75 185 121 -225 298 175 97 244 147
7266 147 -275 -4 -83 29 -57 -133 -39 43 354 174 23 39 101 -46 245 304 -129 64 -73 28 -79 1 -184
7289 -184 97 9 -210 26 99 60 58 77 101 -183 64 109 50 200 68 -233 186 104 -188 65 15 -26 -15 138
7313 138 -147 219 -111 213 66 -113 -126 202 -70 -170 138 -66 -38 146 -157 237 -188 -99 178 -163 -130
7334 -130 54 83 -104 -174 -40 88 -145 -127 251 -511 231 460 -323 139 119 -135 43 -89 189 484 8
7355 8 -309 216 -98 130 38 -44 164 122 -83 101 23 313 -91 -257 -62 184 -143 135 67 -142 162 119 15
7378 15 -94 9 -313 272 138 -7 175 172 68 180 -75 100 -106 -128 282 -163 -117 205 79 -18 -82 -277
7400b77M04l3r6J22j72N0j00J47l5L84o80K60J44l99K59o8K38J41k56k30K80J18
7422B01l99K26k76J08K62l42M53r9m00K41p6L7J63j64M7L9k4kQ5p8K37j94j20
7445g5J62k03J70J19k14R7O9l08J59L06n30M86m16r2J73L56k99l0MJ96k87R2O7
7468Bk7k72J29L14k96L39k48k50L67J49j1j80m9K7R2j86j41M34k80K19L5k21K15
7491A61j73L52k58p6r4K94O1j17j56q7K00n8l49M00k90r2K67k8K50j41k61K65
7513G0K11m95K71q1j78K36j16o5N85m78j27P9J20r1L50j85j84J08r8j16Q3l2L38
7536B05j96k9O8m9P9p6j19K33j39l24J27L1J24K81k18l4J43k78J10L21k72J17
7558A05j97j79K67j51J12O9j69J79LPq2N5j01J67j98J66N4q7j44J17j39N19j65
$$ plain form
7400 -277 127 94 -2 120 -52 -2 -102 45 10 394 -286 -26 118 -281 -22 -90 148 289 33 -197 83 201
7422 201 -198 28 -248 -140 122 -220 233 134 -266 -25 -101 -64 99 -65 -18 21 -3 -5 80 2 239 45 -75
7445 -75 87 -116 54 173 -41 56 125 -183 -24 282 -248 238 -178 -270 -97 259 -40 -70 -66 130 -157 -65 2
7468 2 -25 -297 -168 146 -150 189 -59 -309 58 207 196 16 -33 -6 86 -100 -241 193 -87 132 167 -54 161
7491 161 -12 340 82 6 -88 206 267 150 -6 -93 107 49 -300 100 -190 -282 -15 -43 207 66 -195 70
7513 70 281 -214 57 -24 -202 34 -82 -147 438 -40 -167 -88 32 -59 291 106 -78 30 -68 -184 -101 -133 205
7536 205 9 -20 48 -1 78 2 -117 116 -23 -347 -220 -189 -65 216 -2 -36 107 -171 -61 260 -12 105
7558 105 -92 -271 -4 -155 -43 26 -143 36 39 46 -36 19 -82 85 -113 53 107 20 -124 -7 -146 373 208
7581B08k66L18m94M09j41o3LL13m32K55K4q4J75k21J0j28J88q9L54m38J67J9j49
7604f2kj9J23Q8k69P5j84M32n24N98k95m7K0J8j06L93l00O4J63N9m5n27K44M30
7628C27k61l97M80l52L83k88K56l17L48j65q3p6j02O15m72K17j31j00K42k54p0
7649b00Q8K39J58j81M9k98K45j18q2J30j9J56pr8J57j33n6J41k98J61p3j03K26
7672H4J11k76m1J01J65J29l81o5LL1J77R7L6j12l1j72j08K83nk2J50j28N3R2j65
7697FJ6J38J15l07J43j7O5j45K83k27k34L15r5p5j1M4R2R4k13L46m58j58L15J21
7721A53k45n3J50j02K82l40K15o3k67K83k05J18J05m1O1j19k29L56o1J8J12j73
7743d5k18K79K3j2J90j64J90k66k1K5j69K62J2l09q2N10l27k0L02k41r6J79J11
$$ plain form
7581 208 -58 260 -234 175 34 -29 -26 287 -145 110 134 50 225 4 14 -114 74 -15 339 -99 68 87 -62
7604 -62 -64 -83 40 128 -141 -66 -250 182 -342 256 -39 -86 -66 -48 -154 239 -61 3 166 225 180 -347 -103 327
7628 327 66 -331 149 -203 180 -108 148 -169 179 14 -69 -145 -247 368 -104 113 -18 -118 124 -130 -200
7649 -200 -112 127 285 104 153 -145 100 -18 -100 30 11 167 160 62 219 86 30 171 -127 34 -39 -142 84
7672 84 195 -81 -122 -21 144 273 -108 -173 -170 -139 38 135 171 59 28 -144 -252 31 26 4 154 26 79 171 6
7697 6 22 160 275 -32 111 94 159 14 297 70 -164 151 56 -19 -30 14 106 200 -13 333 -125 -283 32 153
7721 153 -92 -145 5 -97 185 -155 60 -3 -270 13 -192 -74 31 -10 51 -68 -297 59 -2 16 128 -45
7743 -45 -263 16 39 27 217 53 243 -23 -44 -19 -188 74 86 -223 -305 205 -122 -142 160 -81 -177 2 113
7766A13j30mr0N0k32K39L6J04N5n0q9K2K84l56j98M64n94L42M33o29M84l27j15
7789a88pN4j24M64l34r8L02l85L34j27n3J85J71q4J47k8l86J44J95KJ01r2l30
7812a37J17m7L15j36l83K64k51L57q6m9j67K49j90J36J65k15J33l10K87N3l11
7833b06J12L31k92J42J13j50J3j4k11M61l75k31L96j44j4n1J06p0J09R0l6r6j13
7856a30K82j05j14K03j72j08K89K22l45J77k55J41J33m35J66j66L36J39l97pj0
7877a56L6K26m3j96K39k87n7J80J46q3K67m82M31j12m4Q3k20Q0j85K89P7k58o1
7900a30J55N7k7J17l8p4j34J58k11K85j45L1qJ49j32j88L6K71j20l35Q0J66j52
7923a89J04M7J51j24k02L79J93m60K30j04j45J94r4k75N2M66l98K57k35L3L87
$$ plain form
7766 113 -17 -21 -111 -61 -293 -54 -18 86 141 91 2 24 308 -48 -246 218 -376 -34 399 -230 254 -73 -188
7789 -188 -195 -141 -265 199 -135 -233 69 -316 18 -109 -162 23 194 110 257 229 -157 -13 182 184 285 193 -137
7812 -137 -20 -67 248 112 -271 -7 -258 99 13 -36 -203 46 -144 -8 157 -58 75 -235 52 105 -206
7833 -206 -94 237 -55 87 200 50 63 49 -162 299 -76 -307 89 -55 -69 -120 -14 -84 25 115 79 -17 -130
7856 -130 152 47 -67 136 -36 -144 145 367 22 199 -56 85 218 -217 -51 -217 119 258 -139 -146 -156
7877 -156 -120 106 63 -133 106 -181 -238 -58 88 5 272 -210 221 109 65 148 -72 8 -177 112 189 -69 -130
7900 -130 25 82 55 172 134 60 -74 84 -127 158 13 44 36 185 53 -135 -99 172 52 -283 -203 -37 -189
7923 -189 -85 -38 113 -11 -213 166 359 -101 129 25 -120 74 -20 -295 -243 223 -175 82 -153 -120 267
7944B67j73j98K98K7j97q3J06L16q1l55R0P3q2O7q7P9K14k41L4j31j41J91K98
7967B91j25j91j27J07M9k01J40j40j17N09L9l12K0J55q3l7l2k05L02J15r6k5n0
7990a4J73j0m60K42K7oj4j17J12J75q8K52M7m31K03k02N1J42l6J05m9J57q0j59
8014B0k36J62K27m14M78k98j08J94k6J31K1k01N3n4J25Q8r4p2L2l56N67j78j10
8037d9N5M1p0j14L1K30j00J11j92K96j2k92L28k94m5K19J09l75J60j76L8J56l16
8060b61J89J53Q5k42qj40J51M71m94J10Q0J27l19k44K26l3j45L09P9j74m9J62
8082C3k08L42J4o9p5j8O3l66L37L2k92J21K62k76k0O8j7N9Po6n3M34l31J20j51
8107e0J98p8j59J5J30J89j68m9j16O1K11m53N22j01k1L7m17M9N27k75J83j75n07
$$ plain form
7944 267 94 -104 194 221 24 -59 47 363 282 -73 17 90 8 75 -12 67 281 40 74 -57 -198 -7 291
7967 291 166 -25 -152 -45 4 -197 -57 -197 -314 195 234 -78 -58 97 14 -23 -55 -260 42 157 61 36 -14
7990 -14 159 149 -311 -69 -42 -48 -62 -179 -67 108 20 272 319 -112 91 -111 -60 82 46 151 102 259 179 20
8014 20 -216 -54 173 -241 237 -61 -169 25 -1 130 151 -50 3 -51 74 162 68 -4 28 -328 239 61 -49
8037 -49 6 47 -23 -137 -106 124 24 135 -57 239 227 -65 263 -31 -76 143 252 -123 37 -139 -101 55 -261
8060 -261 -72 81 166 -76 -84 -224 -73 398 -96 14 94 221 -98 -342 -116 -149 -294 15 94 -80 -129 33
8082 33 -175 167 181 112 37 19 82 -284 53 85 -207 -86 176 -100 -120 -52 -69 -10 -3 -69 -122 312 -19 101 -50
8107 -50 148 70 -89 -74 56 245 77 28 -88 -27 184 -269 253 152 131 168 -249 -200 327 52 235 60 -447
8130d47P66m59J56K05m12J17P5l69N60q5j13J29Rk3j97nP4n4L1o9J57j13L00j8
8154B15r2J20q8j46O2j79J93L51k31k96K56k58L08m38Q3J68J47l28K36Jk32K77
8176A29k86J21q6J34k8K12j78J44Jm24L86j26lJ74k48
$$ plain form
8130 -447 319 -140 16 221 -191 -74 1 -368 192 107 -6 123 132 109 -88 -93 -19 -73 -42 -111 46 -67 233 215
8154 215 123 243 155 9 71 -108 85 436 205 -91 165 -93 215 -223 -140 28 175 -153 83 84 -148 129
8176 129 -157 -36 -122 12 -16 196 18 162 163 -261 125 -1 -4 170 -78
8191g8
$$ Imaginary data points
##PAGE= N=2
##DATA TABLE= (X++(I..I)), XYDATA
0@%%%%%%%qJ6j6J6k4L2m0N6p2Q8j06J30j60J92k31K76l25L80m44N20o01O90p94
30d25R13j044J187j345J520j715J930k164K419k701L013l352L720m122M563n045
46b648N570o142O767p457Q218r052R971j0997J2144j3429J4886j6549J8468k0716
60a0966K3390k6631L0651l5798M2659n2302O6940r2048J46501m66486L62586N77458
72E65954j019368J97532N81577l90952k64142O27972m4382o03970J91148N59958
82D01327m01712k48916M09714j12193k54174M07204q564l91943J13286K98120
92B12149j02599k43178Q9038K23268k52094o4976M27061j89877m31612M28338
102I5518K85369m84803j31606M22304o2299m05450K55620K85304n31359l1056
$$ plain form
0 0 0 0 0 0 0 0 0 -8 8 -8 8 -16 16 -24 32 -40 48 -58 72 -88 104 -127 149 -176 204 -240 280 -321 369 -425
30 -425 488 -556 631 -714 806 -909 1021 -1143 1276 -1425 1588 -1764 1956 -2166 2397 -2648
46 -2648 2922 -3220 3547 -3910 4308 -4744 5227 -5770 6374 -7055 7831 -8718 9750 -10966
60 -10966 12424 -14207 16444 -19354 23305 -28997 37943 -54105 92396 -374090 -11504 565954
72 565954 -453414 -255882 325695 -65257 -329399 298573 254191 -349779 -158631 401327
82 401327 -385 -249301 160413 48220 -205954 201250 192686 -199257 -85971 212149
92 212149 109550 -133628 -44590 178678 -73416 -138392 288669 98792 -332820 95518
102 95518 380887 -103916 -235522 186782 124483 -280967 -25347 259957 -271402 -302458
112c02458O32123k92091m08016M95030L4041l89893K82231J56357l89706L3462
122a48920L68560j55404k96329K82682J36546l68804J49542L11826l93818r7595
132b11714M11773j13958k53447J46406R2489q0865m2355R8011N0205j71247L6914
143c7788K05506j44086j30130J39016M573q0410K0640L7535l9450o6003J36784
154D6187N9287k30185R1979J98572k47387P822K52550k27566j11021K94688l7669
165I7257k33093J12167J62881j55715q9608K20505n5562k44068K20718J06563
175A42045k95571R3432J78073j92676K1441J48961j11205n1418R8334K6389q5900
186b8095l5956J06871l0475j02854J24265J2276j35152Q9800O6943p5685n606
$$ plain form
112 -302458 329665 37574 -370442 124588 158629 -231264 50967 207324 -182382 -148920
122 -148920 219640 64236 -232093 50589 187135 -181669 -32127 279699 -114119 -211714
132 -211714 200059 86101 -167346 -20940 71549 -9316 -51671 46340 96545 -74702 -37788
143 -37788 167718 23632 -106498 32518 37091 -43319 -22679 14856 -24594 -90597 46187
154 46187 105474 -124711 -32732 165840 -81547 -73725 178825 -48741 -159762 134926 97257
165 97257 -135836 -23669 139212 -16503 -106111 114394 58832 -185236 35482 142045
175 142045 -153526 -60094 117979 -74697 -53256 95705 -15500 -66918 31416 57805 -28095
186 -28095 -64051 42820 12345 -90509 33756 46032 -89120 680 67623 -8062 -13668
197a3668J3079L9912j4800p8489R7183J0888j44265J18226P4058j69135M5423
208b1588J09893r3864l3625P4108o80q8203J8847J15900j04960q1294J88034m9793
220C2775j52368J76400J0517j74232J08773P3078j24609l202Q0849j0144p3578
231e5741L4942Q5804r8040k5167J42021p7081p6754J25632l0695o9776O6187l199
243A8133k3178K88K576M2820n0264k4867R2967n5519n5404R6080k9961n9101N5888
256A0458P462k5652j3907K3944L9322p5224N921R9317r8651l0701J28264p6770
268f217o1002J08337k4100o2256M4710K7282k7300l5088N0911K9206r5726M2350
280h893P9348j13809J1621R9912q6712j7521P5086l5810k2459J8651J3381l601
$$ plain form
197 -13668 -589 39323 24523 -53966 43217 54105 -90160 28066 102124 -67011 -21588
208 -21588 88305 -5559 -39184 34924 34244 -53959 -35112 80788 -24172 -105466 82568 32775
220 32775 -119593 56807 67324 -106908 1865 74943 -49666 -52868 27981 17837 -55741
231 -55741 -20799 65005 -33035 -58202 83819 6738 -70016 55616 24921 -44855 21332 18133
243 18133 -5045 -4757 -2181 40639 -9625 -34492 58475 2956 -52448 43632 13671 -45430 10458
256 10458 17920 -7732 -21639 2305 41627 -33597 -27676 71641 -27010 -57711 70553 -6217
268 -6217 -67219 41118 17018 -45238 -528 26754 -546 -35634 15277 44483 -51243 -8893
280 -8893 70455 -43354 -31733 68179 -18533 -36054 39032 3222 -19237 -586 12795 9194
292I194m3575M0087L1787q3135L6576N6456q2748K0142N1895n0106K858J9287
304H718j938M295l4278L3349K4345p5395M3834M4649q8990L0229N3762o4041M425
317a7036L3391j3407r631r413L6381p763n7779O8091J1184r0503O5832L2416q6165
330d4402M0435L6719n1563O971J9350L846j8052j7621N1349j9833n1513P4175
342B9861q522o8114O8934O293n5636L7753O946j8766M945r536K4461j6550l2586
355c0517N7808j8811m9847O3503r135m5336M3003k552k0011R224n972K1443k0267
368g467k2405N9627l0449l9703P4927k4921m7643O2064j0043l5951K5845J976
380E857l255j3072K397L6399m1173o756O4708n0938k0458O8294m1714k3790M6699
$$ plain form
292 9194 -34381 5706 37493 -45642 -9066 47390 -35358 -15216 36679 -13427 -10569 8718
304 8718 6780 11075 -23203 10146 34491 -40904 2930 47579 -41411 -11182 42580 -21461 -17036
317 -17036 16355 2948 -6683 -16096 20285 12522 -45257 22834 34018 -56485 9347 41763 -44402
330 -44402 -3967 32752 -18811 -11840 7510 11356 -6696 -24317 27032 7199 -44314 29861
342 29861 21339 -46775 22159 28452 -27184 10569 17515 -1251 3694 -5842 18619 2069 -30517
355 -30517 27291 8480 -41367 22136 13001 -32335 10668 8116 -11895 -2671 -8643 12800 -7467
368 -7467 -29872 29755 -694 -40397 34530 9609 -38034 24030 13987 -21964 3881 5857
380 5857 2602 -10470 -8073 28326 -12847 -19603 45105 -5833 -26291 42003 289 -23501 23198
393B3198k3156j0710J1865o071J5197k2219k21L9202m2472l571M9091m3986o147
406b0000L8756k8997J246J1718j0257J9277k1394R25L9807m5835N67N1261n1477
419a4403l907M7701l6615n281K6289j0225J334q866J1759J4515m3346K3144K8466
432C0565o2950K3772L6584n8607J8504L0203l7362J4011R483j0885J1909j7564
444a2337J1603J4288l6787K3824J6143l9880K7732R811k8678K4847n785q905K1507
457A7383k7733J0158K3632m3017K2115K5649m5967K3294K2446l4398J3133P927
469A4622j1712K449j3670J4845l845l3097L8396k282m6123M8126J360m5663M3974
482G380L26l3447K9389l229j1404J2316j0149J2918j505j5220K9083j4610j6089
$$ plain form
393 23198 42 -10668 1197 -4874 10323 -11896 -12117 27085 -15387 -18958 30133 -13853 -20000
406 -20000 18756 -10241 -8995 2723 -7534 11743 -9651 -8726 31081 -14754 -14187 37074 -14403
419 -14403 -18310 29391 -7224 -12505 13784 3559 4893 -3973 7786 22301 -21045 2099 30565
432 30565 -32385 -8613 27971 -30636 -12132 18071 -19291 -5280 4203 -6682 5227 -12337
444 -12337 -734 13554 -23233 591 16734 -23146 4586 14397 -14281 10566 4781 -4124 17383
457 17383 -10350 -192 23440 -19577 2538 28187 -17780 5514 27960 -6438 6695 14622
469 14622 2910 5359 -8311 6534 2689 -30408 7988 5706 -40417 7709 9069 -36594 7380
482 7380 7706 -25741 3648 419 -10985 1331 -8818 4100 2595 -12625 16458 1848 -14241
495a4241L5105k3396r357L1140k9426N513K4294l2673J9933J4777l2676K8399
507A7392M702l0219K4553l344j8460J3603j0082M59k09j4137K3936j4749j9535
520b6090M2378k2879k3168M9419k5815k2372M6615k1435j5528L1285j2480m438
532d508R569m593P180j4012K972J8081l1673J0227K3896l8584J8583K3022l8841
545a8681K4151J5215l3262K5415K951k5003K2598o792j3241J5023j1585K232L310
558B331j2092J6683j1812r327K9463k6044o182L8070l4879j201L9811l5466Q87
571i758L3681k8215J115J8316j6150J647q56J121K127j8880J8662M761l1177L0788
585G182M669l6648L5653L031l6154L3434j638k6713K6246n686j2961J4980q125
$$ plain form
495 -14241 20864 -2532 -11889 19251 -10175 -4662 19632 -13041 6892 21669 -11007 17392
507 17392 22094 -8125 16428 13084 -5376 8227 -1855 -1396 -1605 -15742 8194 -6555 -26090
520 -26090 16288 -6591 -29759 19660 -6155 -28527 18088 -3347 -18875 12410 -70 -4508
532 -4508 5061 468 7648 -6364 -3392 14689 -16984 -6757 17139 -21445 -2862 20160 -18681
545 -18681 5470 20685 -12577 12838 15789 -9214 13384 6592 -6649 8374 -3211 -979 2331
558 2331 -9761 6922 -4890 -14217 15246 -10798 -16980 21090 -13789 -14990 24821 -10645 -9758
571 -9758 23923 -4292 -3177 15139 -1011 636 -220 901 3028 -15852 2810 7571 -23606 7182
585 7182 11851 -24797 10856 13887 -22267 11167 9529 -17184 9062 3376 -9585 5395 -2730
598b730J671K159q180J3968j2390l938K2597k4816K809K7711l2860R633K7644
611B3278l6313J4357K2262l3662J3770J3290k4033R788L466q158L576o955J1060
624E726l547j6994K7910j0557k3951L7772j4337k5838L9468j5352k1588L3606
636A2318j3044j2635K0514r480j799M680n083Q828j0944J236J6331k2772Q669
649c181J9097l0432J5674J7003l3300K0538J1031l0662K1154M886k3291J8291
661F808q80j0962R811m814M333k430q393J8450j4265j0546L0011k3348j0310L5491
675A8956k6215q654L3143k3662n131K3574j7116N13Q400p489O114p018L171J0264
689H850j9764J2115J1033k7045J9159P830k8966K3623K209k5002K4718l803j7659
$$ plain form
598 -2730 -1059 1100 -7080 6888 -5502 -9440 13157 -11659 -8850 18861 -13999 -4366 23278
611 23278 -13035 1322 23584 -10078 3692 16982 -7051 2737 6203 -1955 1621 -5334 5726
624 5726 2179 -14815 13095 2538 -21413 16359 2022 -23816 15652 300 -21288 12318
636 12318 -726 -13361 7153 -2327 -4126 554 -4529 4299 -6645 -5409 10922 -11850 -3181
649 -3181 15916 -14516 1158 18161 -15139 5399 16430 -14232 6922 11808 -11483 6808
661 6808 5928 -5034 4777 -37 4296 1866 -6527 11923 -2342 -12888 17123 -6225 -16535 18956
675 18956 -7259 -15913 17230 -6432 -11563 12011 -5105 -4592 3808 -3681 2433 -4585 -1414 8850
689 8850 -10914 1201 12234 -14811 4348 12178 -16788 6835 9044 -15958 8760 4957 -12702
702a2702K1746p416q315J4651r555K320K392p224J1944j0828l280K0211k2255
715h311M19K5231k8717L963K4936k9163O096J9721k3450P033R293j1799O973l194
729i69Q32O408j4373J2039M465k2034K0853J68k3733K4841m100j9816K4654q945
743B90j1793K1236j2704k823J3854j3066N742L508r702J1741p349l243J5223j7881
757f967M506J6114k5369J0951J4499k7658J4654J0688k3943J4570M787j5249J1971
770C554k826k881O120r907R780M04j5405J9514m999j7302K5137j0179j4634K4757
784A1133j2907p786J9263j4577R09J0902j3200Q529J147r740J3986q412l403J4718
798A0562j5837M199J2577k0804J1699P451k2306J7769J508j9775J9348l776j2844
$$ plain form
702 -12702 9044 1628 -6687 7964 -1591 729 3121 -4103 7841 -2987 -6267 13944 -8311
715 -8311 -7892 17339 -11378 -7415 17521 -11642 -5546 14175 -9275 -2242 7051 -4748 2225 -969
729 -969 -137 6271 -8102 3937 8402 -13632 7221 7389 -16344 8497 4397 -15419 9235 290
743 290 -11503 9733 -2971 -5794 8060 -5006 736 4244 -5458 6283 -1066 -4309 10914 -6967
757 -6967 -2461 13653 -11716 -765 13734 -13924 730 11418 -12525 2045 6832 -8417 3554
770 3554 728 -2153 3967 -5940 3840 4244 -11161 8353 3354 -13948 11189 1010 -13624 11133
784 11133 -1774 -9560 9703 -4874 -3965 6937 -6263 2266 3413 -6327 7659 -753 -4156 10562
798 10562 -5275 -1076 11501 -9303 2396 9847 -12459 5310 6818 -12957 6391 2615 -10229
811a0229J6112p483l518R628r684P271P5j0547J6509q289j0071K2146j4594p311
825i985K2929j7662k787J8873j7119K853J0074j3199Q523J6p405J2209r316r81
839b977J3368j6410O113J0263j9386J2033M756j8359J6569k303j4165J7768q552
852a282p695J6061j2156L07J0440j2570P630K110j0079J3596p560n586J7855j5682
866d611p27J8138j9823L995J5324k0122P739Q569j5228R874k58p187J0083q627
880b861J883Q863j5501R594O119j8266J5015R33j6853J7604m579j2002J6938r061
894b174m775J3283j2225L052P891j2587R173N98r700J3195p175m248J4498j3509
908d703K618J3133j8418Q444R605j9127J2258M130j5975J3454k133q427J1059
$$ plain form
811 -10229 5883 -1600 -5118 4510 -5174 2097 2172 -8375 8134 -155 -10226 11920 -2674 -9985
825 -9985 12944 -4718 -7505 11368 -5751 -2898 7176 -6023 2500 2516 -4889 7320 -1996 -2977
839 -2977 10391 -6019 94 10357 -9029 3004 7760 -10599 5970 3667 -10498 7270 -1282
852 -1282 -8977 7084 -5072 -4765 5675 -6895 735 2845 -7234 6362 -1198 -6784 11071 -4611
866 -4611 -5338 12800 -7023 -3028 12296 -7826 -87 8482 -6746 3128 2870 -4317 5766 -2861
880 -2861 -978 7885 -7616 1978 8097 -10169 4846 5779 -11074 6530 1951 -10051 6887 -2174
894 -2174 -6949 6334 -5891 -2839 5052 -7535 1638 2236 -7464 5731 -1444 -5692 8806 -4703
908 -4703 -2085 11048 -7370 1074 10679 -8448 3810 7940 -8035 5419 3286 -5141 5918
921E918p868N75O667j2100R688R71j4033J6722m675j3101J9708r120q878J8226
935H700j1806k862J3296j2374L215O033j0871R446k460p179J2931r070j627J2952
949H324j4186M866R735j6088J0496M793j6245J4489o93j3103J4800n206p421J2480
963G041q991m52O793r975P393m97r043J3932q023o483J8001j3368k953J7186j5756
978e195J018J4104j5336M570O185j1075Q121j696n033R604r477K008Q726j4105
992g581Q207O472j6229J3290J623j4854J6035l909j0202J4904p706n210J1947
1005F787j0226J482O319j0229P172p85o910J1264p881k262J3476j3917L184J2465
1019I939j6989P009R998j7072R134N042j3322R951j149o281P781o318J737M679
$$ plain form
921 5918 -1950 -1375 5292 -6808 2880 3851 -10182 6540 1865 -11236 8472 -648 -9526 8700
935 8700 -3106 -5968 7328 -5046 -1831 4202 -6669 2777 317 -6862 6069 -3001 -4628 8324
949 8324 -5862 -996 8739 -7349 3147 7940 -8305 6184 5491 -7612 7188 1982 -5439 7041
963 7041 -1950 -2402 4391 -5584 1809 1312 -7731 6201 -1822 -8305 9696 -3672 -6625 10561 -5195
978 -5195 -4177 9927 -5409 -839 5346 -5729 2392 696 -4337 5267 -4210 -2202 6524 -7581
992 -7581 626 7098 -9131 4159 5782 -9072 6963 3054 -7148 7756 50 -5160 6787
1005 6787 -3439 -1957 4362 -5867 1305 520 -6390 4874 -3007 -5269 8207 -5710 -2526 9939
1019 9939 -7050 -41 9957 -7115 2019 7061 -6261 3690 2541 -3740 4041 -2277 -540 4139
1033D139j0577R446N32j2352J4984l766j1730J7755p753q470J6403j0051l633
1046e073J1713j0504K012N385r279P337j542n622R950q313K7J0276j2814N573
1060h74Q216j5498J0500N030j5685J3130R13j3027J2802k828p285R961o108l62
1074a115M629p697P077k226p210J3035p584o179J6417j2197l499J6238j3425o15
1088d351J2468j2542L104N742r115O268j398l787P391p629K137O895j2434Q085
1102H34M624j3891J1920R27j3015J4592l199r676J3882o538n206J0992p820J25
1116a449N279p227N712j776m779R731q547j055J2326j3712K249J2407j6061N302
1130a600J0249j5411O874O002j0989O770j33m457N700n587K747L483r806Q671
$$ plain form
1033 4139 -6438 3008 3540 -8812 6172 2406 -9324 8431 678 -7792 8611 -1440 -5073
1046 -5073 6640 -3864 -1852 3533 -5746 1591 49 -5573 4377 -3936 -3909 6367 -6447 -874
1060 -874 7342 -8156 2344 7374 -8311 4819 5732 -7295 5507 2679 -4606 5355 -753 -1115
1074 -1115 3514 -4183 2894 668 -6542 6493 -1091 -7270 9147 -3050 -6549 9689 -3736 -4351
1088 -4351 8117 -4425 -1321 4421 -4694 1574 176 -3611 3780 -3849 -1712 5183 -7251 834
1102 834 5458 -8433 3487 4414 -8601 5991 2792 -6884 6998 460 -4746 6246 -1574 -1449
1116 -1449 3830 -3397 2315 539 -4240 5491 -3056 -4111 8215 -5497 -3248 9159 -6902 -1600
1130 -1600 8649 -6762 112 6114 -4875 1895 1762 -2695 3005 -2582 165 3648 -6158 2513
1144B513N78j1575J3101k261j0863J4940n955p074J3568q222k424R692q907K017
1158h72N042p596N844j768m210Q133p397N40Q097j1915N378P186j4410R035N310
1173F397j4462J0882J951j1273J0053j423n420O721m242R04K467o941P732k322
1187A024p422J2676o909o677J4536q966m186J3049r973n54R580r751L206M033
1201C666p366O137j850l332P101p187J413O709j0848O421L720j1910J0038Q71
1215C583j1431J1941j899q512J1541m774m188Q452o012M55L465n865O228l016
1229c2m353R693p856k167J1669j1465L50J1349j2396L097Q188j1128N423L393
1243C765p233N799j752k571O254o644K551M536r717O921J645j0319J0320j666
$$ plain form
1144 2513 3091 -8484 4617 2356 -8507 6433 478 -6596 6972 -1250 -3674 6018 -2889 -872
1158 -872 4170 -3426 2418 650 -3560 4573 -2824 -2284 5813 -6102 -724 6462 -7948 1087 6397
1173 6397 -8065 2817 4768 -6505 3548 2125 -3295 3426 -816 88 2555 -4386 3346 1024
1187 1024 -6398 6278 -631 -7308 7228 -1738 -5924 7125 -2848 -3402 6178 -3573 -367 3666
1201 3666 -3700 2437 587 -2745 4356 -2831 -1418 5291 -5557 864 4584 -7326 2712 3583
1215 3583 -7848 4093 2194 -6318 5223 449 -3739 4713 -1299 -844 2621 -3244 2984 -32
1229 -32 -4385 5308 -2548 -4715 6954 -4511 -4161 7188 -5208 -2111 6077 -5051 372 3765
1243 3765 -3468 2331 579 -1992 4262 -2382 169 4705 -5012 1909 3554 -6765 3555 1889
1257A889q357J1388m537n884J0738o504k093Q132p389K382L222o286N432j836
1271B97l319P387p008J51Q165j1020L621P747j2154O202N136j1117P324J752p859
1286d695P120j738k594N185n217K623K531p196P125q72q194J0383l813o446J1111
1301E313o365l646R589p465k37P162q048L851K436o083N949k262l103P010o082
1316a981P73O147r290M520M230j0390P814J626r611R082j139o545P988l251k514
1331b541N790n235K498K036n847O336j788n838R496n590l546J0029p884j641Q752
1346E027q387J482N645p765M857R30n043N674k679j954O230o218J742M454q108
1361d113N490K271q624P572l90p398Q680l228m350Q215n409r97N639n770K580
$$ plain form
1257 1889 -6468 4920 383 -5501 5237 -1267 -3360 4772 -2617 -235 2987 -3299 2133 297
1271 297 -3022 4365 -2643 -2492 5673 -5347 -1726 6021 -6133 69 5205 -5912 1412 3164 -4695
1286 -4695 2425 687 -1907 3278 -1939 684 3215 -3981 3144 2272 -5922 4461 648 -5798 5313
1301 5313 -1052 -4698 4891 -2574 -2811 4351 -3697 154 2590 -3493 2456 194 -2909 4101 -1981
1316 -1981 -1208 4939 -4351 169 4399 -5991 1823 3449 -6162 2920 1781 -4764 3224 -27 -2541
1331 -2541 3249 -1986 512 2548 -3299 3037 1249 -4589 4907 -683 -4229 5800 -2084 -3725 5027
1346 5027 -3360 -1878 3767 -3998 859 1789 -3254 2420 -259 -2213 4017 -2201 -459 3995 -4113
1361 -4113 1377 3648 -4976 2596 2206 -5192 3488 260 -4090 4125 -1284 -2281 3358 -2412 168
1376A68K251n142N290j961l370P567o194j405P911q181J147O511q902L891M263
1391C844q178N181O27m864N475k552j146M578n493K975L016p425O171P51p639
1406d679Q378k507n660Q593m656k929P344n793M99M611o323L702P64m212N274
1421B406k927k030O306n826O88O015q103L408M331q380M915K090p461O522q67
1436A087m429N416k936q80M294m861K920J492n492O310j596n138P831l939l562
1451c483P932n688j461O666o496J292M297n883L268N51m079N200k845j233N137
1466C175n784J994M389p610M837K253p531O348K93o527O845k003l738N820l870
1481a109l08L991m804K737R82m434N725k803l041P158n445j122P173o908R17N659
$$ plain form
1376 168 2419 -2723 2567 606 -2764 4803 -1391 -2796 5115 -3066 -1919 4592 -4310 -419 3844
1391 3844 -4334 847 1474 -3390 2085 -467 -1613 2965 -2528 447 3463 -3962 2209 2960 -4679
1406 -4679 3699 1192 -4468 4125 -531 -3460 3884 -1909 -1410 3201 -3122 580 1344 -2868 2406
1421 2406 -521 -2551 3755 -2071 -1383 4632 -3471 -63 4268 -4112 803 2893 -4568 1954 1087
1436 1087 -3342 2074 -862 -1742 2552 -2309 611 2103 -3389 2921 1325 -3813 4018 79 -3483
1451 -3483 4449 -1239 -2700 3966 -2530 -1238 3059 -2824 444 995 -3084 2116 -729 -1962 3175
1466 3175 -2609 -615 3774 -3836 1001 3254 -4277 2071 2364 -4163 2682 679 -3059 2761 -1109
1481 -1109 -1417 2574 -2230 507 1489 -2945 2780 -23 -3064 4094 -1351 -2473 4700 -2208 -1291 4368
1497D368p296K219L922o292M017P1m252M962k577r17M255m848K258K764o098N043
1513A599O97o111O569j331n021P247l831k311N893m730m7L832m819K720L76l445
1529b713M942k966j448N724n558L83N958p478K767M267o978L741K289o206M548
1544A272m38l532M694k623n59L421m598K553J618n387N425o78m850P082l108l397
1560c105O770m408j281N587n433Q79L478m558K454K99l201M215k619k96L918n141
1576b442K081L654o707M091K712o884N208O91n835N992j813l289M947l074l16
1591i84K496l715K794L60l781N186k251l013O489m573j529O606n583LN380o183
1607b298K211K704m998L424m84k635L757k717J58K775m399K659K216n848M665
$$ plain form
1497 4368 -2928 -709 3213 -3079 938 1009 -3243 1719 -858 -1775 2480 -2368 -110 2654 -3444 1599
1513 1599 2296 -3815 2754 1423 -3598 3649 -182 -2493 3400 -1330 -1377 2455 -2364 356 732 -2713
1529 -2713 2229 -737 -2185 3539 -2019 -1636 4322 -3156 -389 3878 -3100 641 2930 -3276 1272
1544 1272 834 -2698 1996 -627 -1186 2235 -2363 190 1808 -3579 1846 1168 -3682 3400 292 -3105
1560 -3105 3665 -743 -2024 3563 -1870 -991 2487 -2071 383 682 -2519 1696 -923 -1219 2699 -2442
1576 -2442 -361 3293 -3414 677 3389 -3495 1713 2404 -3431 2561 748 -2541 2406 -668 -984
1591 -984 1512 -2203 591 951 -2830 2356 105 -2908 3581 -992 -2521 4085 -1498 -1495 3885 -2298
1607 -2298 -87 2617 -2381 1043 559 -2076 1681 -1036 -878 1897 -2502 157 2373 -3475 1190
1622A190Q86o030O516j151m497O023k854j984M725l717O2K553l721K560M3k830
1638b226M170k312j791N105m738J25M892n793K084L677o153L258K232n193M059
1653A396k45l209L938k533k93K978m348K598J130m762N046o44m655O458k642l022
1669b809O121l791j770N411m458O09K710l901K658j46k395L440k513n61L763m761
1685b393J602L542n856L313K604o155M460P11m758M733j160k537L999k662o4K223
1701A602l470K427M11l710M859k145k949N871l673j763N809m873J42M486m809
1716a785J916K121m151K809R8k468L157k668J25K868m397K255K197n351M013R84
1732A723n359N266k12m202N035j959k120L922k561j5K085l316K532k06k754M267
$$ plain form
1622 1190 2076 -3954 2562 1411 -3086 2937 83 -1901 2824 -893 -831 1722 -1999 561 604 -2226
1638 -2226 1944 -368 -2159 2946 -1792 -1667 3225 -2568 -484 3193 -2960 298 2530 -2663 1396
1653 1396 1151 -2058 1880 -653 -946 2032 -2316 282 1412 -3350 1696 1052 -3603 2855 213 -2809
1669 -2809 3312 -479 -2249 3162 -1296 -687 2023 -1878 780 634 -1761 1679 -834 -1395 2368 -2393
1685 -2393 -791 2751 -3105 208 2812 -3343 1117 1828 -2930 1803 643 -1894 2105 -557 -621 1602
1701 1602 -1868 559 970 -2740 2119 -26 -2975 2896 -777 -2540 3269 -1604 -1462 3024 -1785
1716 -1785 131 2252 -1899 910 1008 -1460 1697 -971 -846 2022 -2375 -120 2077 -3274 739 1723
1732 1723 -3636 1630 1418 -2784 2251 292 -1828 2094 -467 -482 1603 -1713 819 613 -2141 2126
1748B126k486j967N457m396j13M511n137J141L701n266K537J759l924L217o93
1763D67j760L062k437K29K138l812K410J208m662M446k53m347N460j901k976N160
1779B432k955j261M088l167K82K249l176K265j47k186L463k742m08L757m310O04
1795a212L904n208K204K652n087L578P83l736L209l75k070L247k485J66K311l697
1811a816K587N98l829M228j591k689M881k679j959M830l757k71M079m229J428
1826a89J845l080K535p47j925L605k580k76K951m187J882K280m923L218J295m890
1842c186M218J36l453M012j546j724L150k362P24J710l312K452j79k790M204j937
1858A17k073M552l658o84M187m053P06K914m060K081J487l459K905o62j607L171
$$ plain form
1748 2126 -360 -2327 3130 -1266 -1379 3132 -2005 -864 2837 -2429 108 1867 -2057 1160 467
1763 467 -1293 1769 -668 -439 1699 -2113 297 1505 -3157 1289 1036 -3311 2149 248 -2728 2432
1779 2432 -523 -1784 2304 -863 -581 1668 -1508 757 610 -1576 1887 -855 -1263 2494 -1816 -1212
1795 -1212 2692 -2516 -312 2340 -2747 831 1614 -2122 1087 712 -1358 1889 -596 -430 1881 -1816
1811 -1816 771 1369 -2460 1768 177 -2512 2369 -310 -2269 2561 -1196 -1467 2612 -1617 -189
1826 -189 1656 -1424 1111 364 -1561 2044 -536 -812 2139 -2048 -166 2114 -2809 409 1704 -3186
1842 -3186 1032 1168 -2285 1727 181 -1543 1607 -755 -31 1679 -1633 819 640 -2150 2054 117
1858 117 -1956 2596 -1062 -1746 2441 -1612 -906 2008 -2052 29 1516 -1943 962 300 -1307 1864
1874A864k516L57K495m177K381J254m220L457Ql836M502j000l015M318k346o29
1890a103K885k960J156J444l000K599l71k440L907k562j480M448l684L07L152
1905B298m405J609K299l891K234P15k295K688j121j377L037k464K52K283l610
1920a748K405O38l466L647p71k981M281k239j814M179k788m30K759k979J171J392
1936A256k813K719q10j815L068k165l69L474m056J231K655m649K666J239m060
1951b429L388l85k701L518j610j111L047k962J062J663l156K678j69k909M123
1966B047j731k394M061k477r67L751l669N43K721l656J874P63k474K758r58j386
1982a194K896k399J1K731l490J670J732m169K865M70l146L406p45k789L572k079
$$ plain form
1874 1864 -652 -295 2200 -1977 404 1658 -2562 895 903 -2933 1569 569 -2446 1872 -474 -1103
1890 -1103 1782 -1178 -22 1422 -1578 1021 650 -1790 2117 -445 -1925 2523 -1161 -854 2298
1905 2298 -2107 -498 1801 -2090 144 859 -1436 1252 131 -1246 1791 -673 -421 1862 -1748
1920 -1748 657 1295 -2171 1476 705 -2276 2005 -234 -2048 2131 -657 -1087 1672 -1307 -136 1256
1936 1256 -1557 1162 352 -1463 1605 -560 -929 2545 -1511 -280 2375 -2274 392 1631 -2429
1951 -2429 959 574 -2127 1391 -219 -1330 1717 -1245 -183 1480 -1676 1002 833 -2076 2047
1966 2047 316 -2078 1983 -494 -1461 2290 -1379 -836 1885 -1771 103 866 -1608 1150 192 -1194
1982 -1194 1702 -697 -686 2045 -1445 225 1957 -2212 653 1123 -2023 1383 638 -2151 1421 -658
1998f58l18K529k799J192J166l074L098m73k451L669k213r55L371k896k58L226
2014B156l975J586J722l463K519L25k494K733j283q76K463k395P62J970l554K396
2030E92P68l238L250m98k892L883j745j996L641k355k65K216k676J649P22k706
2046a650K892j284j419L299k401k30L008l716J171K577m181K629R89l658K610
2061F36n9k296L008j300j121K308k233R54J234k783K546%k700L470j444j681L593
2078B132k629p78L190k858K48K267l049J688L33k248K886j254j195K575k177K41
2094f28K587l743J981J656l718K914L63l443L459q55k298L283k136j13J921k499
2110a269J148R06k367K566o06k338L660k316r34L488k629O4K567l328J022J888
$$ plain form
1998 -658 -976 1553 -1246 -54 1112 -1962 1136 663 -1788 1881 -332 -1287 2084 -812 -1070 2156
2014 2156 -1819 -233 1489 -1974 545 870 -1624 1109 -174 -1050 1413 -982 -220 1750 -1804 592
2030 592 1360 -1878 1372 874 -2018 1865 120 -1876 1765 -590 -855 1361 -1315 334 1056 -1650
2046 -1650 1242 -42 -1461 1838 -563 -793 2215 -1501 -330 2247 -1934 695 1684 -1974 636
2061 636 577 -1719 1289 -11 -1132 1176 -1057 -103 1131 -1652 894 894 -1806 1664 220 -1461 2132
2078 2132 -497 -1275 1915 -943 -695 1572 -1477 211 544 -1704 1182 -72 -1267 1308 -869 -628
2094 -628 1959 -1784 197 1853 -1865 1049 1412 -2031 1428 573 -1725 1558 -578 -691 1230 -1269
2110 -1269 -121 785 -1582 984 378 -1960 1700 -616 -1550 1938 -691 -627 1940 -1388 -366 1522
2126A522l050J645P37k331K767j679n22K111k350N92J657k778K060R34l319L236
2142A232n77k585L740j474j901L226k245O0J773k657J729M42k352K518j177j252
2158a500L047k243m38L288l210O07K371l546J832J245k929K146l23j899K853j679
2174c78m39K043k300J043J319k985K384R2k623L412j210k014L373j925j024L184
2190A952k802N60J599k672J409N03j929K459j403p64K590k562M53K281k886J078
2206a34J771l381K445P02k887K881j016j536K585j837m20K131k411R38P38j939
2222a370K286p02j662K793j531j164L187k416k35K611l097J225J214k125J511
2237E25J11j728J964r67o45K002k329Q07J834l182J948P03k737K738r4k266K465
$$ plain form
2126 1522 -1528 117 854 -1477 1290 -389 -911 1200 -1150 -558 1099 -1679 381 1315 -2004 1232
2142 1232 655 -1930 1810 336 -1565 1661 -584 -524 1249 -1408 321 763 -1589 929 -248 -1500
2158 -1500 1547 -696 -1134 2154 -1056 -449 1922 -1624 208 1453 -1476 670 347 -1552 1301 -378
2174 -378 -817 1226 -1074 -31 1288 -1697 687 779 -1844 1568 358 -1656 1717 -208 -1232 1952
2190 1952 -850 -290 1309 -1363 46 549 -1380 1079 -324 -1088 1502 -1060 -607 1674 -1212 -134
2206 -134 1637 -1744 701 1403 -1484 1397 381 -1155 1430 -407 -827 1304 -1107 -169 569 -1370
2222 -1370 916 214 -1448 1345 -186 -1350 1837 -579 -814 1797 -1300 -75 1139 -986 525
2237 525 636 -1092 872 -95 -740 1262 -1067 -260 1574 -1608 340 1043 -1694 1044 950 -1316 1149
2254A149r22j535K691j817k07J813k199J189P12k168K203p86j729L106k097k16
2270h13K239k579Q56K061k964J155J128k416K099Lj864K167j507l1J707k260J204
2287A85P35k521K263k84k125K921p33j824K754j471r47K465k329O54J493k098
2303h62J233J29j630K133j205o71K306k311K47J988k780J369J203k674J983P45
2319A203k766K441m67j325K434j856J44J446k426J595J61j796J967k96k012K607
2335A054j168j114K850k360K08K068k504J099J021k139J880l44j287K097j428
2350f7o83J976k208P07J403k373J403N76k406K672n6k205K355j041p61J999j864
2367e73N07Q09j644J432m7j597K186q52j451K491j842m82K413k359M92J803k632
$$ plain form
2254 1149 227 -1308 1383 -434 -641 1172 -1027 162 874 -1294 909 123 -1606 1500 -597 -813
2270 -813 1426 -1153 -297 1764 -1200 -45 1083 -1333 766 769 -1095 1072 -435 -466 1241 -1019 185
2287 185 920 -1601 662 378 -1747 1174 441 -1383 1371 -100 -1047 1418 -911 -257 1236 -862
2303 -862 371 500 -1130 1003 -202 -873 1433 -878 -631 1357 -1423 -54 1149 -1525 458 1203
2319 1203 -1563 878 411 -914 1520 -336 -192 1254 -1172 423 584 -1212 755 459 -1553 1054
2335 1054 -114 -1228 1622 -738 -530 1538 -966 133 1154 -985 895 551 -736 1361 -67
2350 -67 -750 1226 -982 -275 1128 -1245 158 734 -1672 1000 944 -1261 1094 53 -708 1291 -573
2367 -573 -66 743 -901 531 484 -1113 1073 221 -1230 1261 -581 -1063 1350 -1009 -517 1286 -1346
2384a346J386R64k066J639j86j298J673j239n4J668k119J001J245k592J678K90
2400F44k137K610r07j479K521j562n30J932j601M12J195j733J012j09j247K008
2416A029j275q40K412k204M60J483k105J129R70k348J735j32j492K119q84n57
2432e00J508j601M07J320k105J516K06k035K180q26j572K845j489r83K427j844
2448e46j6J658k040J047O59j963J730j74j006J899j756o7J999k196P18Q66k071
2465a259J417N62k211K004j07j229J891j257n66J745j742O96Q50j884J751j84
2481D77j293J659q01j051K376k008p8J856k029M82J347k212J323L22j592J859
2497F37o22p82J780j311j91J388j954J194J159k555J500L73j801J901p28j128
$$ plain form
2384 -1346 40 1004 -1062 577 391 -907 766 -473 -527 1141 -978 23 1268 -1324 354 644
2400 644 -1493 1117 210 -1269 1252 -310 -840 1092 -509 -97 1098 -635 377 268 -979 1029
2416 1029 -246 -1086 1326 -878 -418 1065 -1040 89 1059 -1289 446 314 -1178 941 57 -500
2432 -500 1008 -593 -186 1134 -971 545 751 -1284 896 70 -1502 1343 -146 -1129 1298 -546
2448 -546 -562 1096 -944 103 762 -1201 529 355 -651 1248 -508 -575 1424 -772 -54 812 -1259
2465 -1259 158 720 -1491 513 406 -823 1068 -189 -755 990 -752 -56 794 -1090 661 477
2481 477 -816 843 42 -1009 1367 -641 -719 1137 -892 -410 937 -1275 48 370 -1222 637
2497 637 15 -767 1013 -298 -489 899 -1055 139 1298 -1257 243 616 -1185 716 -12 -1140
2513a140K130j463l83J725j590N58Q15j538J390j40j315J963r54o90J832j992
2529g92N63J359k220R33J339k443J596K4j431J611m25n27J339j532L93J076j509
2546f46J135J90j642J825m35j516K160j061r93K011j780L29J452j802R15J96j412
2563a074J406m35o12J725j167l94J596j568J83J267j859J434K48j916J750l88
2579A96j166J729r79l58J284j168J62J060j392J132p6j416K002p43j152J928j336
2596b93m51J907k201Q90R91j608O11R01j703J387l66o96J469j397M20Q08j539
2613h70R32R09k092J512K04j472J777q33r00J573r98l21J318j478N81M76j037
2630g19J260l23j125J602j075l28J828j509K3J202j536N50P86j604J056J39j218
$$ plain form
2513 -1140 990 -473 -856 869 -721 -163 652 -886 504 364 -951 1012 58 -632 1200 -792
2529 -792 -229 1130 -1090 -157 1182 -1261 335 359 -1072 539 114 -413 926 -606 -213 863 -646
2546 -646 489 679 -963 862 427 -1089 1071 10 -983 1028 -752 -423 1029 -773 142 338 -1074
2563 -1074 332 -103 -715 1010 -157 -551 1045 -523 -340 927 -932 502 750 -1166 584 196
2579 196 -970 759 -220 -578 706 -462 -300 760 -632 500 424 -992 1010 267 -885 1043 -293
2596 -293 -744 1163 -1038 -148 843 -765 -154 747 -956 431 65 -631 838 -559 -139 669 -870
2613 -870 62 971 -1121 391 595 -877 900 67 -833 740 -258 -579 739 -739 -158 318 -719
2630 -719 541 218 -907 695 -380 -708 1120 -389 -366 836 -700 -150 636 -968 88 227 -991
2647i91J736q91k13J234j370K47J119j782J524k16j432J803n04j014J530j090
2663c10k63J438j262K87P87j566J100L64j521J474l89j174J882j148j77J426j510
2680e62L77Q72j512J279K71j724J303j80q41J103o79m10J412j130M03N38j560
2697a040J281J39j244J519o66q11J881j041o01J448j328K85O66j165O43K74r91
2714g51J413q10p14J335q63L63P46j640J013M25j351J386o8j376J479n57q88J452
2732E94q09j65J238j353M19L46q41J225l81j013J684q54m05J380j720Q9J627j445
2750c84L48N37j287J170j32p84J171r87q9J022j222N84Q06j418P95L59j324J347
2768E12k78r48J416q61m40J349r62j46J378j703R38p8r28J225m97q16J546j035
$$ plain form
2647 -991 745 -146 -359 875 -495 -248 871 -911 613 397 -1035 768 264 -750 780 -310
2663 -310 -573 865 -397 -110 677 -889 211 575 -946 528 139 -1035 847 -301 -478 948 -562
2680 -562 -185 687 -825 454 725 -999 304 124 -717 386 -293 -703 709 -421 -18 520 -1040
2697 -1040 241 380 -864 655 -11 -822 1059 18 -583 865 -463 -178 488 -677 -34 240 -751
2714 -751 662 -148 -862 473 -390 -27 719 -921 92 517 -834 552 484 -892 587 30 -858 594
2732 594 -215 -380 858 -495 -76 270 -571 654 273 -740 944 90 -315 1065 -655 -566 1061 -384
2750 -384 -36 501 -786 384 252 -532 639 -348 -437 585 -637 -53 753 -665 130 489 -835 512
2768 512 234 -714 702 -159 -599 750 -212 -358 1020 -683 255 177 -751 474 -23 -839 707 -328
2786c28k21J208j339O58P36j327J112L8j179J054l14q28J454j120L4P83r60O07
2804F8N23j373Q32J81j187J696p54p66J584p32r3P44j200M95O69j589J295m6r24
2823e77J168m58p87J332j095L55P83j445Q87M78j285R70K30j063J108l72m94Q39
2841E74j009L21N48j162Q58K16q20P12l16l95J204j038m53J504j260K17J084j342
2859e57Q49K93j088R39k16o27J190q39k61Q62j092K36J160j541P51L36j173J201
2877D23k44p32J239j016k56J213j123K91J109j521P38P1r91J529r10k26Q87q65
2895c84p8J169j318M07P07j028Q32k2o24J070n50q21J255n84k57O35q59O49M82
2914F81j504J419l10r40J290q31p30J661j146Q1J142j353K72Q53j045Q76r9o35
$$ plain form
2786 -328 -549 659 -680 -22 714 -613 499 537 -642 412 98 -730 724 -396 -362 421 -539 68
2804 68 591 -782 50 231 -956 740 -14 -780 804 72 -21 723 -477 18 687 -902 393 347 -577
2823 -577 591 133 -654 678 -417 -62 721 -724 163 641 -644 326 556 -507 601 229 -265 574
2841 574 -435 -114 434 -728 130 346 -474 238 -78 -473 731 -307 -760 744 -516 -299 785 -557
2859 -557 292 585 -503 436 220 -407 783 -56 -317 545 -547 -311 849 -692 59 395 -778 423
2877 423 179 -553 686 -330 -586 627 -496 -205 904 -617 121 192 -799 730 -180 -406 481 -384
2895 -384 -462 707 -611 -204 503 -525 307 285 -339 731 181 -640 615 31 -226 409 -450 199 681
2914 681 -823 596 286 -654 636 -195 -925 736 -410 -329 813 -540 -268 585 -460 416 317 -318
2932c18R62q68j75J264j372L67Q48j430R38Q3r96J253k10r07R51m81k08Q69p92
2951b22K69N48j397J128j32p16Q75n61m73R72l82o44J396r52j0P68r35M93L71
2970C96o79O52j52o50Q86n95j44P22o78K12O88j484J113R2j133J076n09m00J436
2989H49o90o31J054q17L51M12q10N54K40j052J151o65n75J433j202j51J347j452
3007f54O57M98j217Q82Op08R75m44l97J138r17K4Q30q21L50K13j268J148m2r23
3027f70J269m28p02J058n64k42P31q11K74M65p28N83J3r51J314n37k51Q75j137
3046d39K41P70j295J046J38j226J106j46p20J031q49l22R63p52O64M91j311Q42
3064B32J13j000J161n09o11J195p21l04J172j127L98O27j508O44N51p14R49l91
$$ plain form
2932 -318 644 -224 -399 865 -507 -140 708 -722 216 299 -697 556 346 -561 390 -91 -299 570 -222
2951 -222 47 595 -802 326 194 -522 353 -208 -681 291 -91 -735 661 -291 -301 467 -468 25 396
2970 396 -283 369 217 -433 453 -142 -286 436 -242 -30 658 -826 287 379 -754 322 -187 -587 849
2989 849 159 -472 582 -235 116 528 -282 272 512 -540 611 -54 -629 804 -398 -549 798 -654
3007 -654 3 501 -716 166 172 -536 439 -5 -402 736 -181 -157 673 -148 202 415 -853 295 253 -670
3027 -670 599 171 -531 527 -37 -279 452 -359 -85 380 -348 235 248 -703 611 74 -177 698 -439
3046 -439 -198 572 -723 323 461 -765 341 195 -525 506 -343 -665 298 -454 210 701 -610 232
3064 232 345 -655 506 -3 -614 581 -140 -444 728 -399 -1 626 -882 -238 313 -401 548 157
3082A57n56Q66r24L89R40j047K80O37j367O19J60p49O89O1n21R39p37l95J094
3101E35j026M92M50q31N70N0p78R82m41n29J007p97n1Q43r19L42N45j019P67j24
3121F8m84R02l65l52Q82r78L06N36p41M57K64j124J167m75o89J204m98n91Q60
3140C49l93k03Q87r70J79K84n80O50J1o48J050q55k15J163j011L40O52j313P29
3159A06L00q75N05K71q54J088o62n3Q50j182M82O72j131N60L19q49Q43k51o98
3178e59P75m72r5P63q66J63O70q28N68J99r54R43pm35Q76r91k86J228j178L16
3198a70N55j120P60L14q72J029l38o33Q45m22k28Q26p91J02M67p82M28K25o01
3217d06R36p53j47J222j036p5P71p45K23M52r48J081l31o80P95k60n31Q13l85
$$ plain form
3082 157 -399 467 -457 -68 872 -175 105 742 -625 -6 154 -595 94 155 -366 573 -164 -559 535
3101 535 -491 1 451 -380 190 240 -538 444 3 -526 481 -316 -367 476 -443 -101 444 -575 192 68
3121 68 -416 486 121 -231 651 -327 -21 515 -226 231 495 -629 538 63 -626 578 80 -511 349
3140 349 -44 -247 640 -330 -151 133 -447 203 214 -434 616 -239 -454 709 -302 38 690 -623 106
3159 106 406 -469 36 307 -547 541 -121 -174 676 -506 -24 648 -483 77 396 -453 390 139 -559
3178 -559 216 -256 -351 412 -454 -291 379 -449 119 318 -636 307 300 -135 741 -250 -536 692 -486 -170
3198 -170 385 -735 25 339 -533 496 158 -475 370 -52 -280 546 -245 -143 324 -458 -30 195 -406
3217 -406 530 -223 -370 852 -184 -259 512 -233 -10 442 -506 575 244 -436 359 99 -432 381 -4
3236dr3O68j526J130N19j005N48p2p04Q92k84p65J587j213p1R87j091N72L0n38
3256d33P99j35p26J170o60l75J267j220N10N02j080N72O2o45Q08j54p08N48m22
3275c20J26P23j047L08K95p01P78J85r92J084l83n58J218j135J34Q46q65Q5R03
3294F84q76L51J46q85Q92k98m04R16p80L02M93j270O14O50j073R78l92n72Q73
3313C49j87o55R06m87k63P41p87M60R7q50Q39J74j059J195o08k03Q71o03j18R79
3333G91j327K57O90r99Q10J7o93P53l26k21O45n38jP83j305N38M42r56J001k92
3353F9n55R19l73l84P39n01q3P81j200M78P33r23O75m03m97R80n81l08J165j170
3373d39J94N86r86O81N55r79N97n7o38R39o84N2M03n09K05M88q60L72K07j048
$$ plain form
3236 -4 -97 571 -955 175 694 -311 237 165 -539 353 69 -696 891 -322 -393 594 -497 75 105 -433
3256 -433 366 231 -495 675 15 -360 907 -313 197 699 -381 191 253 -392 416 262 -446 102 -320
3275 -320 -194 529 -518 -210 85 -616 162 347 -645 439 56 -502 716 -419 -285 561 -304 -219 684
3294 684 -192 159 305 -580 312 14 -390 526 -254 48 541 -729 -115 535 -538 440 48 -524 349
3313 349 162 -493 413 -74 -337 404 -383 77 174 -676 163 337 -722 473 -135 -338 533 -70 -188 791
3333 791 -536 -279 411 -588 222 239 -454 299 -27 -248 397 -141 -142 641 -664 -126 316 -640 361 69
3353 69 -486 433 60 -324 415 -86 -169 612 -588 -110 623 -300 375 -28 -525 455 -126 -434 731 -439
3373 -439 -245 341 -645 36 591 -388 209 152 -486 453 -231 -179 224 -285 -80 408 -452 -80 127 -921
3393i21J340j78p09Q68o88n4J007r61Q2N62o41M84l8n80P69j99k84Q82r58J10
3413a07O35r16K72P31j055M28K41q06O75J48m71M94n64L18L59p06L40O04j091
3432d71O76Q9j109J140l64l69J046r19o5Q40q73J72N94n61L68R1n18M08k71j59
3452b55N25p79L26N53j023O09N32j031O30K29r10J082n43J26L38o14qN13q56M79
3472g7O41r51O44p1o35R02m62q3N77n49n9M39p34N59J73r56P65j53l37P55n01
3493a13k11O91o86K99N16q96L35L98q97R35l71k65L06k49N2N23n72J2O21r00P38
3514B66K2p20O24J0n78P77m35l75O07k69l3Q06j063M27J49n87P91l32n49Q92o58
3535b28J58M10o35K22K24q28P84n1o36Q73j85k96N26m40j08O23o43J88O55q55
$$ plain form
3393 -921 419 241 -468 400 -288 -342 665 -296 -214 348 -293 191 153 -427 342 143 -141 741 -217 -107
3413 -107 528 -388 -116 615 -440 -12 229 -577 98 246 -225 269 -295 23 382 -324 16 620 -471
3432 -471 205 294 -815 325 -39 -408 638 -281 -346 494 -379 -207 387 -174 194 285 -233 175 -96 -255
3452 -255 270 -509 -183 370 -653 -44 488 -543 87 316 -594 488 -55 71 409 -205 -213 300 -556 -77
3472 -77 564 -387 257 186 -449 453 -9 -92 485 -64 -123 316 -418 141 314 -642 123 -30 -367 388 -113
3493 -113 -324 367 -319 -20 496 -400 -65 333 -564 371 0 -265 41 -208 -156 367 -205 -193 428 -472 266
3514 266 288 -432 192 202 -376 401 -34 -409 198 -71 -104 702 -361 66 215 -372 419 87 -462 430 -228
3535 -228 -70 340 -295 -73 151 -677 107 56 -580 293 108 -188 338 -102 -210 413 -230 -42 613 -242
3555b42N51n4p23O60J3o66R10p09L75N38j257N47M85q23N38K42o69N54j01n92
3575d23O62l34m5L87l82J61J37m07M43j78j75J1L28o90R38p45r0Q12r98P88M0
3596B40m52K29j13J66M4r2l37M70m29L95L95j133P69J88q76P42j09o16R66o05
3616a58j81R07o51R0L23o16N58J38o21M12k49l95P46k29l15O01p98M89M26q58
3636c81L53L54p10P76k40l77M49o7m09R03o50J14L48r62N53J14k99J59j9m77O94
3657B26n12Q5O09m92M9N08q57M97J07m68L46k27j25N27l25k49M53l94J68N92p89
3678b71L59K7l14M48n18L14M17n40L4K91j53m5J79n99N90kl64L61k68lM23m40
3700g4q8N77o75J60L94k06J1J9m44N56j79l22O76m34k6M45p17K09L75m52L48j29
$$ plain form
3555 -242 309 255 -468 192 205 -461 449 -260 115 653 -604 -57 428 -395 143 385 -284 270 169 -423
3575 -423 239 -95 -140 247 -135 26 163 -244 199 21 -154 -143 185 -505 433 -312 -402 410 -588 200 240
3596 240 -212 17 -96 70 114 22 -315 155 -274 121 516 -617 152 340 -536 206 97 -519 447 -158
3616 -158 -339 568 -83 7 330 -286 272 410 -211 201 -48 -443 303 74 -241 360 -438 51 477 -381
3636 -381 -28 326 -384 392 152 -225 224 157 -252 651 1 115 463 -499 54 168 -131 28 9 -468 226
3657 226 -286 -201 408 -84 -35 473 -384 113 220 -248 98 -129 -254 273 -52 -301 152 -242 -74 518 -271
3678 -271 88 115 -199 249 -269 45 462 -78 -44 247 94 49 228 -371 219 217 -147 214 -54 -57 366 -74
3700 -74 -162 415 -260 -100 294 88 99 118 -326 230 51 -271 405 -29 -55 390 -327 -118 257 -195 153 24
3722B4k85K81j35j38K64j64J74L07o81M49L25o99N97l84j29L99l30K0M51n68n0
3743b72M96o70O00R7p35M29J02j56K59j40j59N79r12K88N65n70M60Om34L47K7
3764B07p02Q77n06q2L89p29O75r9n12L98L16o42O61j31k37M20l99J17J10m90L43
3785a6L96q72N31K15n40M33j33k42O62m11l45M94n40M5N39m04N29l75m43P17k43
3806ck76N88k44l04K82m7J99j20j83L75o2m98P69l89l37L70l02O4K05j42Q7M02
3828D34q09M21J60l09K57j20n88M67k70J75M26o25L17K99m75M72nn31M66J72o85
3849c51L93K57m37M28n61N00k62j92M67m98J55J71j62l3J38L9pJ96k93R8J35n05
3871c24N51k88l3K94k04l70O81m88J64L6m76L43J18l78M94m9j84K64k17j42M47
$$ plain form
3722 24 -261 20 -115 -253 11 -153 21 328 -353 96 421 -278 319 -65 -194 205 -125 -105 346 -222 -272
3743 -272 224 -446 154 251 -484 -55 47 -109 150 10 -149 430 -482 -194 371 -199 261 267 -167 180 207
3764 207 -495 382 -124 -206 183 -546 129 30 -482 -84 232 -410 251 120 -117 303 -96 21 131 -359 -16
3785 -16 380 -492 39 254 -286 147 14 -228 434 23 -322 172 -368 -323 216 -188 341 -34 -477 240 -3
3806 -3 -279 309 65 -239 43 -4 195 75 -108 267 205 -293 476 87 -250 120 -182 -118 87 -55 32 434
3828 434 -375 46 206 -103 154 34 -554 -87 -357 -182 244 -381 -64 235 -240 232 227 -304 162 334 -351
3849 -351 42 299 -138 290 -271 229 -33 -225 242 -256 -101 70 -92 -125 13 52 45 241 -52 46 181 -324
3871 -324 227 -61 -94 200 -4 -374 307 -181 -17 19 -457 -114 4 -374 120 71 -113 151 -66 -208 239
3892B39m10M40l0l12K20j0n43N24j80j93M74l49K36Rl32O4K46k89J20J05k97o1
3914c29M07l39L96q2j91L88m41M0L95m39J65q4k8J97K44m81K65m6k06N48l29j51
3936a01K80l13K40k60K38p2L5k39L51k67l9K93l59J09K56m01L36l0q1L52n48o4
3958b84J20Q7p4L45n30L03J84m49J96k71K81L48n20K31K77o15M90q8r8R0J10m45
3980c12J96K81n54M44J2k44L94j36l9J6m51L67K21m67O48l07k39K35k79j7L95
4001A64l46J30L39m03r4L79l80RL12l84M24j63k44N21l14j2N06j144Q39l2m94
4022c87O47n05J15N34m21j82L56l37K70r8l14L65k74n3L33rl61N29j36k50L39
4043A61j05l5k5j55K66J2m73N04pl85L43m45K32M72k13o3P1m75L26M8j58J78j70
$$ plain form
3892 239 -171 269 239 -73 147 137 -406 118 -62 -255 219 -130 106 115 -217 -153 93 -196 -76 29 -268 -329
3914 -329 78 -261 135 53 -138 250 -191 -151 244 -195 -30 -114 -142 55 299 -182 83 37 -169 379 50 -101
3936 -101 179 -134 106 -154 84 12 47 -192 159 -108 -147 146 -213 -104 152 -249 87 57 -24 328 -220 -284
3958 -284 -164 -77 -151 194 -336 -33 151 -298 -102 -373 -92 256 -264 -33 244 -371 119 31 -67 23 133 -312
3980 -312 -116 165 -389 55 67 -177 217 81 42 58 -393 -26 195 -272 376 69 -170 65 -214 -231 164
4001 164 -182 -52 287 -116 -210 169 -211 -202 110 -274 150 -13 -257 264 -50 -62 444 -700 139 107 -387
4022 -387 260 -245 -130 404 -17 -199 157 -180 90 -8 -322 43 -231 -284 49 40 -321 208 72 -178 161
4043 161 56 21 -4 -159 107 119 -354 150 143 -242 101 -344 -112 360 147 84 155 -320 6 54 -104 74 -96
4066i6j48L83k00k54N83o59N69J99n33N66n71o7L68j60l69O18l71L05p9j61P3
4087dJ93l22J00K13j94J98p4l80L60k32K32K8k39J50J52n59N20r7j11K88l77j05
4109b60O02n27K59K23l70k2J55j92J63J04j85L11l87PM39n26J44j5j03k3K48n12
4131d67N53L6k42K12l55K36K86k01o4K03k46J22m7l03O26l34L5O8j16k64J75J51
4153F4q8J70k07n6O0K7J36J8j99J64j34M06l09R0P7J21l91o7K84k76J09j83o6
4176b50M55l99Q1R4L1k41M11l38J02J25k40L71k42L6K11l32J95J85o33M42J38
4197B02l95jM41m58J55k20R7K58J23j80L41n55R6K42l39L78p0r8K02j9m04K84
4219H0l57K11L23k74nL16l94J30j56K06J63p2k13J04j06o9K70q1k17o2K78j95
$$ plain form
4066 -96 -244 139 -61 -315 268 -391 178 377 -156 410 -161 -228 140 -20 -389 229 -142 163 84 -77 -4
4087 -4 189 -133 -33 180 -14 184 110 -270 90 -142 90 118 -121 29 181 -378 142 45 -66 222 -155 -260
4109 -260 342 -185 74 297 -73 -95 60 -132 31 135 -50 261 -126 -119 320 -206 -62 -77 -180 -203 45 -467
4131 -467 86 122 -120 92 -263 -27 259 58 -6 197 -49 73 26 -277 349 15 50 118 2 -262 -87 64
4153 64 -24 146 -61 -117 -57 -30 106 124 -75 89 -45 361 52 142 219 340 -51 -118 166 -110 -1 -184 -250
4176 -250 205 -194 -113 -19 12 -229 182 -156 -54 71 -169 202 -40 -4 207 -125 70 255 -378 64 202
4197 202 -193 -194 247 -211 -56 -276 -179 79 202 22 363 -192 -96 146 -193 185 115 17 219 200 -204 80
4219 80 -277 -66 257 -17 -22 294 -100 30 -126 80 243 171 -42 62 -44 -113 157 76 -141 -203 75 -120
4241a20m2m9L35j96N6J23k43J92j28j70J07J36J37M0O4l88L40k7m22K22j4J18
4263G1K63l57m6K88l15J24J41l54J54p2J11K2J60j02J7r8j26N4k07L03l4j55J00
4286e8L4j7m8K38m46J31q6N88k43k64J32r1j12L75q9k48J8K09J04j72j04l2K51
4309G0J08j46J37o4J56l97R0J73n0MJ23l94j2L62m41K45m5l65P07k39j97L8j60
4332b97O54k03j07j75K42k21L23j00m68J92K7j27L18p6j33L85k5M1K2l23N3K8
4354C0R0j79J61Ok6j59jK86m14K29N3j77J0qR5j01L16l50M79k54l09K95l17M0
4378b05J21p1J82j32n5K01j85RK69K9j66R0j67K2N9j06O5o5J90q8l56M16M2k23
4402a24K18K06k35J29m9j08k88J75Q7k9l28M87j76K53m8j22p8j80L93k07k1KJ3
$$ plain form
4241 -120 -162 -211 124 -72 -16 107 -136 56 -72 -242 -135 1 138 178 242 -146 194 167 -255 -33 -47 71
4263 71 334 -23 -69 219 -96 28 169 -185 -31 -103 8 30 190 88 105 7 -119 -65 -272 31 -3 -158 -58
4286 -58 -24 -41 -89 149 -297 -166 -252 336 93 -171 -39 -130 -242 133 44 -204 -186 23 127 -45 -149 -181 70
4309 70 178 32 169 105 261 -136 -46 127 77 81 204 -190 -202 160 -281 -36 -81 -446 261 22 -175 -137 -297
4332 -297 357 154 47 -128 114 -107 216 116 -352 -160 -133 -260 58 -18 -151 234 209 250 272 -51 2 30
4354 30 120 -59 102 108 82 -77 -78 208 -206 23 76 -101 -91 -99 -4 -105 211 -139 340 86 -223 72 -245 -205
4378 -205 -84 -155 27 -105 -160 41 -144 -135 134 163 -3 87 -80 -58 1 -105 -40 -105 85 -3 -359 57 99 -124
4402 -124 94 300 65 194 145 37 -251 -76 11 -18 -346 141 -35 218 170 48 -30 -210 183 -24 -45 -43 -30
4425c0J08j89L8k2j1K45l49J47O2J60k14N7K62k07Q2o9l0j55L74j13M7j09k8k70
4449b14K03J53j19l1j05K3k24L68j04J61j65J94j19K26%k01j11j22K13J42l54
4470a86m2L83j47m8q3n8L33m40L99j26K71l85K45r4K88n07k8N41m53K00J38j77
4492B4p6q4j42N86m87K20j46J41J32n09K73j54J65J05j40J59j95J69Q5j85K29
4513A70j15j77J98k10rK23j66j50J84J46O4L7j76R1r5j30J9j8K73k40L8N3K6K0
4537E6J47k06j99K64j12j53K82M9n6n3J02j73l5K72l05J36j51j9j07n3M6J16M03
4560B51N8m76K47k7j83JJ4Q8K03l86j1J31n2jK11P1j57L45n71K25j15j04J33K21
4584A16r4J34M3j12k40K7r5J75O8J84l63K7P3J20n5k78O0M13P8l44L22j92L6n3
$$ plain form
4425 -30 78 -111 -73 -95 -106 139 -210 -63 -1 159 -55 2 264 57 139 70 40 -115 259 146 193 84 56 -214
4449 -214 -11 142 23 -8 -113 -90 -314 54 -50 111 -54 140 21 247 247 46 -65 -187 26 168 -186
4470 -186 -228 155 8 -40 -123 -181 152 -288 111 -15 256 -129 116 22 310 -197 -225 316 -137 63 201 24
4492 24 -52 -136 -278 308 -179 41 -105 36 168 -341 -68 -222 -57 48 -92 67 -128 41 126 -59 170
4513 170 55 -122 76 -134 -143 80 -86 -236 -52 94 158 195 19 110 15 -115 -96 -114 159 -81 -43 10 36 56
4537 56 203 -3 -202 62 -50 -203 79 128 72 19 121 -52 -87 185 -120 16 -135 -154 -261 -314 -268 -152 251
4560 251 309 -167 80 53 -130 -129 -115 -27 176 -210 -221 -90 -142 -143 68 139 -18 327 -244 -19 -134 -238 -105 116
4584 116 22 156 199 87 -153 -126 -221 -46 22 206 -157 -130 -57 63 8 -270 -210 203 281 -63 259 67 103 50
4608E0O8k96J42P4j09p2N6J98L9j96n9J84k66L12k11P4L3j72P5J60j72J23J56
4631A91m03J70p5P5J96r2k70J14P3o3MJ43l1K30k76j95k03M05J43j64K13k99K82
4654A68k16o6L30K3q3k93o9L12j95K61K06k0l09J48l18P0j80L33l4k36L15m9j27
4677b9J80j04k01N4J83K7j70K31l57K17J23l35J98k03J1O2N1J48r5j54K94p7J6
4700G0N3k23J82J25no1j89j32J24q6j75O32l94K34j09m0K08k17l4J95o7m28N13
4723A76l20J80j2J94k55O8k12J71l8j58MN43j53J2k80q1L61k75J06R6j43K12m6
4746A50k84J49o5j63M35m44L08ok08J62K38l24K06o6L0j17j14K6J43k82m2L75
4768A07j15R0j47R2p0K9O7K28l42j98K62M4k4Q9m04L55k61K38L1l7J46j46O1k78
$$ plain form
4608 50 118 -178 -36 38 -71 -143 -87 111 150 -46 -105 79 -187 125 -86 -12 21 -151 -76 84 -88 35 191
4631 191 -212 -42 -117 -42 154 62 -208 -94 -21 -84 -80 63 32 262 -14 -209 -412 -7 136 -28 185 -114 168
4654 168 -48 -114 216 239 156 -137 -206 106 -89 172 378 358 49 197 -121 -51 -231 102 68 -168 147 98 -29
4677 -29 151 47 -154 -100 83 110 -60 171 -186 31 154 -181 17 -186 -175 -113 -62 86 -9 -163 131 54 70
4700 70 123 -100 82 207 202 141 -48 -180 -56 -142 -317 315 -79 155 46 6 214 -3 -37 158 91 -337 176
4723 176 -144 36 24 218 -37 31 -181 -10 -48 -206 -202 341 188 200 -80 -161 200 -75 31 127 -16 196 150
4746 150 -134 15 -50 -213 222 -222 86 80 -128 34 272 -52 154 88 118 1 -113 -87 56 -226 -268 107
4768 107 -8 82 -65 27 -43 -14 53 281 -61 -259 3 47 23 112 -292 63 -198 40 71 34 180 34 95 -183
4792a83L1j29N23j14k84K03kl5J09j99o1K65k50M0J53j6k18J89Q5k86K07j25K77
4815A80m79L48n3O2j13K43k89N0M3Q9J06k44K39m08R6k40O47l62o6M51l59k4J86
4838A03j96L56j30k63K12j30L9q8nJ87k1J3J4K34k58J4o6K91l86L09m0j35j67
4861a13L01k47k75K06K60o6p5r5j70L42J59k92R5o9k3m8M22l84K38n06K69qoL26
4885B41N8j96J64l01J13n6j62J86M6l65M92pj13k20K46p1j54J07K54l07k48M47
4907A54J28l16j11L16k56L44k01P5k48O5L22j03K5l3m2k9M2k5j18Pj37P5P7k12
4931b01J78J08k08K14N4l14L18l92K42j50J60p9M47l80J26k7l1P0j82j73J71K54
4953B05l02k5k09M52J6j3J5Mk17P7P0j40K03j25O1M1n9L8J3l91N8N51n96P4L06
$$ plain form
4792 -183 -152 -281 242 128 -156 47 45 10 119 -80 -141 124 -126 -86 67 51 -167 22 107 -179 28 -97 180
4815 180 -299 49 -4 58 -55 188 -101 -51 -8 81 187 -57 182 -226 -130 -370 277 -85 -151 300 -59 -83 103
4838 103 -93 263 133 -130 82 -48 -9 -97 -102 85 64 77 91 325 67 81 15 306 -80 229 189 54 -113
4861 -113 188 -59 -334 -128 132 66 -9 -104 -274 68 227 -65 30 -39 -62 -110 312 -72 166 -340 -71 -79 -85 241
4885 241 299 103 267 -34 79 23 -139 47 93 -272 220 213 100 -120 126 55 -99 8 262 -45 -293 154
4907 154 282 -34 -145 171 -85 259 58 133 -115 -50 272 169 194 161 119 90 132 107 -11 -4 -141 -66 11 -201
4931 -201 -23 85 -123 91 145 -169 149 -243 -1 -151 9 -70 377 -3 123 96 65 135 -47 -220 -49 205
4953 205 -97 -122 -331 121 137 124 139 143 -74 3 73 -67 136 11 72 113 54 92 105 -286 -228 323 -273 -199 107
$$ [...]
8191a3
##END NTUPLES=NMR FID
##END=
