##TITLE=1H_Tos-5-03.02
 CDCl3, 24 sc, 
 3.2.2020
##JCAMPDX= 6.0         $$ Bruker NMR JCAMP-DX V2.0
##DATA TYPE= NMR FID
##DATA CLASS= NTUPLES
##ORIGIN= UXNMR, Bruker Analytische Messtechnik GmbH
##OWNER= root
$$ XWIN-NMR		Version 3.5
$$ Mon Feb  3 13:52:30 2020 Russian Standard Time (UT+4h)  she@DPX200
##.OBSERVE FREQUENCY= 200.1315
##.OBSERVE NUCLEUS= ^1H
##.DELAY= (6, 6)
##.ACQUISITION MODE= SIMULTANEOUS
##.ACQUISITION SCHEME= undefined
##.AVERAGES= 8
##.DIGITISER RES= 18
##SPECTROMETER/DATA SYSTEM= spect
##.PULSE SEQUENCE= zg30
##.SOLVENT NAME= CDCl3
##.SHIFT REFERENCE= (INTERNAL, CDCl3, 0, 15.7039)
##AUDIT TRAIL= $$ (NUMBER, WHEN, WHO, WHERE, WHAT)
$$ ##TITLE= Audit trail, XWIN-NMR		Version 3.5
$$ ##JCAMPDX= 5.01
$$ ##ORIGIN= Bruker BioSpin GmbH
$$ ##OWNER= she
$$ F:/spectra/data/she/nmr/H-F/1/audita.txt
$$ ##AUDIT TRAIL=  $$ (NUMBER, WHEN, WHO, WHERE, WHAT)
(   1,<2020-02-03 13:51:35.32 +0400>,<she>,<DPX200>,
      <created by zg, POWCHK disabled, PULCHK disabled
       configuration hash MD5:
       00 E9 B6 7A A2 85 ED C7 34 08 36 98 17 FE 4E 26
       data hash MD5: 16K
       68 11 56 63 86 BE D6 0F 1D 24 4D D3 84 5A DC 12>)
$$ ##END=
$$ 
$$ hash MD5
$$ AA 42 A6 8D 94 E1 97 BD 66 CE F6 62 EB 96 56 BC
##$RELAX= 
##$RELAX= 
##$RELAX= 
##$RELAX= 
##$RELAX= 
##$RELAX= 
$$ Bruker specific parameters
$$ --------------------------
##$DU= <F:/spectra>
##$EXPNO= 1
##$NAME= <H-F>
##$PROCNO= 1
##$TYPE= <nmr>
##$USER= <she>
##$AMP= (0..31)
100 100 100 100 100 100 100 100 100 100 100 100 100 100 100 100 100 100 
100 100 100 100 100 100 100 100 100 100 100 100 100 100 
##$AQSEQ= 0
##$AQ_mod= 1
##$AUNM= <au_zg>
##$AUTOPOS= <>
##$BF1= 200.13
##$BF2= 200.13
##$BF3= 200.13
##$BF4= 200.13
##$BF5= 200.13
##$BF6= 200.13
##$BF7= 200.13
##$BF8= 200.13
##$BYTORDA= 1
##$CFDGTYP= 0
##$CFRGTYP= 5
##$CHEMSTR= <none>
##$CNST= (0..31)
1 1 145 1 1 1 1 1 1 1 1 1 1 1 1 1 1 1 1 1 1 1 1 1 1 1 1 1 1 1 1 1 
##$CPDPRG= <>
##$CPDPRG1= <>
##$CPDPRG2= <>
##$CPDPRG3= <>
##$CPDPRG4= <mlev>
##$CPDPRG5= <mlev>
##$CPDPRG6= <mlev>
##$CPDPRG7= <mlev>
##$CPDPRG8= <mlev>
##$CPDPRGB= <>
##$CPDPRGT= <>
##$D= (0..31)
0 1.2 0 0 0 0 0 0 0 0.06 0 0.03 0 0 0 0 0.0002 0 0 0 0 0 0 0 0 0 0 0 0 
0 0 0 
##$DATE= 1580723494
##$DBL= (0..7)
120 120 120 120 120 120 120 120 
##$DBP= (0..7)
150 150 150 150 150 150 150 150 
##$DBP07= 0
##$DBPNAM0= <>
##$DBPNAM1= <>
##$DBPNAM2= <>
##$DBPNAM3= <>
##$DBPNAM4= <>
##$DBPNAM5= <>
##$DBPNAM6= <>
##$DBPNAM7= <>
##$DBPOAL= (0..7)
0.5 0.5 0.5 0.5 0.5 0.5 0.5 0.5 
##$DBPOFFS= (0..7)
0 0 0 0 0 0 0 0 
##$DE= 6
##$DECBNUC= <off>
##$DECIM= 24
##$DECNUC= <off>
##$DECSTAT= 4
##$DIGMOD= 1
##$DIGTYP= 9
##$DL= (0..7)
0 120 120 120 120 120 120 120 
##$DP= (0..7)
150 150 150 150 150 150 150 150 
##$DP07= 0
##$DPNAME0= <>
##$DPNAME1= <>
##$DPNAME2= <>
##$DPNAME3= <>
##$DPNAME4= <>
##$DPNAME5= <>
##$DPNAME6= <>
##$DPNAME7= <>
##$DPOAL= (0..7)
0.5 0.5 0.5 0.5 0.5 0.5 0.5 0.5 
##$DPOFFS= (0..7)
0 0 0 0 0 0 0 0 
##$DQDMODE= 0
##$DR= 18
##$DS= 0
##$DSLIST= <SSSSSSSSSSSSSSS>
$$ [...]
##$SUBNAM2= <"">
##$SUBNAM3= <"">
##$SUBNAM4= <"">
##$SUBNAM5= <"">
##$SUBNAM6= <"">
##$SUBNAM7= <"">
##$SUBNAM8= <"">
##$SUBNAM9= <"">
##$SW= 24.9337058887773
##$SWIBOX= (0..15)
0 0 2 0 0 0 0 0 0 0 0 0 0 0 0 0 
##$SW_h= 4990.01996007984
##$TD= 16384
##$TD0= 1
##$TE= 0
##$TE2= 300
##$TE3= 300
##$TEG= 300
##$TL= (0..7)
0 120 120 120 120 120 120 120 
##$TP= (0..7)
150 150 150 150 150 150 150 150 
##$TP07= 0
##$TPNAME0= <>
##$TPNAME1= <>
##$TPNAME2= <>
##$TPNAME3= <>
##$TPNAME4= <>
##$TPNAME5= <>
##$TPNAME6= <>
##$TPNAME7= <>
##$TPOAL= (0..7)
0.5 0.5 0.5 0.5 0.5 0.5 0.5 0.5 
##$TPOFFS= (0..7)
0 0 0 0 0 0 0 0 
##$TUNHIN= 0
##$TUNHOUT= 0
##$TUNXOUT= 0
##$USERA1= <user>
##$USERA2= <user>
##$USERA3= <user>
##$USERA4= <user>
##$USERA5= <user>
##$V9= 5
##$VALIST= <valist>
##$VCLIST= <CCCCCCCCCCCCCCC>
##$VD= 0
##$VDLIST= <DDDDDDDDDDDDDDD>
##$VPLIST= <PPPPPPPPPPPPPPP>
##$VTLIST= <TTTTTTTTTTTTTTT>
##$WBST= 1024
##$WBSW= 4
##$XGAIN= (0..3)
0 0 0 0 
##$XL= 0
##$YL= 0
##$YMAX_a= 518370
##$YMIN_a= -373328
##$ZGOPTNS= <>
##$ZL1= 120
##$ZL2= 120
##$ZL3= 120
##$ZL4= 120
##$ABSF1= 10
##$ABSF2= 0
##$ABSG= 5
##$ABSL= 3
##$ALPHA= 0
##$AQORDER= 0
##$ASSFAC= 0
##$ASSFACI= 0
##$ASSFACX= 0
##$ASSWID= 0
##$AUNMP= <proc_1d>
##$AZFE= 0.1
##$AZFW= 0.1
##$BCFW= 1
##$BC_mod= 2
##$BYTORDP= 1
##$COROFFS= 0
##$CY= 11.3945322036743
##$DATMOD= 1
##$DC= 2
##$DFILT= <>
##$DTYPP= 0
##$F1P= 16.9975609425685
##$F2P= -3.02152046262296
##$FCOR= 0.5
##$FTSIZE= 0
##$FT_mod= 4
##$GAMMA= 1
##$GB= 0.15
##$INTBC= 1
##$INTSCL= 1
##$ISEN= 128
##$LB= 0.24
##$LEV0= 0
##$LPBIN= 0
##$MAXI= 10000
##$MC2= 0
##$MEAN= 0
##$ME_mod= 0
##$MI= 1.114404
##$NCOEF= 0
##$NC_proc= 0
##$NLEV= 6
##$NOISF1= 3.799351
##$NOISF2= 2.8
##$NSP= 1
##$NTH_PI= 0
##$NZP= 0
##$OFFSET= 15.70392
##$PC= 1
##$PHC0= -9791.878
##$PHC1= 22.20081
##$PH_mod= 1
##$PKNL= yes
##$PPARMOD= 0
##$PSCAL= 0
##$PSIGN= 0
##$REVERSE= no
##$SF= 200.130013532006
##$SI= 16384
##$SIGF1= 3
##$SIGF2= 2
##$SINO= 400
##$SIOLD= 16384
##$SREGLST= <1H.CDCl3>
##$SSB= 0
##$STSI= 0
##$STSR= 0
##$SW_p= 3612.71676300578
##$SYMM= 0
##$S_DEV= 0
##$TDeff= 0
##$TDoff= 0
##$TI= <>
##$TILT= no
##$TM1= 0
##$TM2= 0
##$TOPLEV= 0
##$USERP1= <user>
##$USERP2= <user>
##$USERP3= <user>
##$USERP4= <user>
##$USERP5= <user>
##$WDW= 1
##$XDIM= 8192
##$YMAX_p= 0
##$YMIN_p= 0
$$ End of Bruker specific parameters
$$ ---------------------------------
##NTUPLES= NMR FID
##VAR_NAME=  TIME,          FID/REAL,        FID/IMAG
##SYMBOL=    X,             R,               I
##VAR_TYPE=  INDEPENDENT,   DEPENDENT,       DEPENDENT
##VAR_FORM=  AFFN,          ASDF,            ASDF
##VAR_DIM=   8192,          8192,            8192
##UNITS=     SECONDS,       ARBITRARY UNITS, ARBITRARY UNITS
##FACTOR=    0.0002004,     1,               1
##FIRST=     0,             0,               0
##LAST=      1.6414764,     0,               0
##MIN=       0,             -373328,         0
##MAX=       1.6414764,     518370,          0
$$ Real data points
##PAGE= N=1
##DATA TABLE= (X++(R..R)), XYDATA
$$ [...]
$$ plain form
2745 -3701 -4036 -1314 2134 3268 1199 -2032 -3619 -2644 794 2425 2659 64 -2625 -3142 -1254 1770
2761 1770 2590 990 -1869 -3181 -1597 1434 2638 1306 -1471 -2705 -1339 796 2466 1392 -439
2776 -439 -2192 -2058 226 2252 2625 591 -2044 -2996 -895 1730 3347 1906 -1186 -3406 -2232 1151
2792 1151 3127 2669 192 -2237 -2217 -433 2077 2697 1519 -1086 -2407 -1832 548 2995 2410 -237
2808 -237 -2420 -2244 116 2629 2948 292 -1973 -2350 -311 2021 2950 1554 -574 -2312 -1469 855
2824 855 2802 2514 87 -2365 -2442 29 2436 3544 1168 -1740 -2982 -1183 1615 3381 2463 -339
2840 -339 -2472 -2030 750 2631 2895 1165 -1353 -2617 -892 1526 3118 2278 -942 -2489 -1946 919
2856 919 2750 2204 12 -1760 -2151 -371 2060 2176 408 -1589 -2645 -1458 769 2169 1202 -1247
$$ packed form
2745c701l35K722L448J134k069l231j587R75L438J631K34k595k689n17J888L024
2761A770Q20j600k859j312J584L031J204j332k777j234J366K135J670j074j831
2776d39j753J34K284K026L73k034k635r52K101K625J617j441l092k220J174L383
2792A151J976m58k477k429K0J784K510O20j178k605j321N75K380K447n85k647
2808b37k183J76K360K513L19k656k265l77K039K332R29j396k128j738Q43K324
2824H55J947k88k427k452p7K471K407J108k376k908j242J799K798J766r18k802
2840c39k133M42K780J881K64j730k518j264J725K418J592q40l220j547N43K865
2856I19J831n46k192j772l91J780K431J16j768j997j056J187K227J400r67k449
$$ plain form
2872 -1247 -3103 -2915 -544 1723 1525 -556 -3230 -3382 -1426 1020 1632 288 -2212 -3626 -2908 -457
2888 -457 1324 1231 -863 -3040 -3343 -1567 1047 1984 279 -2243 -3260 -2212 531 1850 1202 -1260
2904 -1260 -2324 -1939 108 1453 1713 -15 -1115 -1714 -457 1800 2462 1343 -931 -1758 -361 1922
2920 1922 3233 2487 141 -1363 -1225 1341 2866 3204 901 -855 -1634 -180 2248 3459 2702 23
2936 23 -1324 -1429 926 3037 3089 1088 -989 -1778 -129 1936 2354 1070 -612 -1434 -699 1107 1820
2953 1820 1159 -281 -1592 -1280 347 1756 1087 -307 -2127 -2074 -470 1647 1639 -118 -2323 -2923 -1380
2970 -1380 938 2138 677 -1434 -2920 -2541 -282 1832 2103 -100 -2630 -3120 -1192 1317 2523 1218
2986 1218 -1372 -2477 -1527 559 2004 1463 -428 -2241 -1931 222 1893 1781 99 -2035 -2359 -182
$$ packed form
2872a247j856J88K371K267j98k081k674j52J956K446O12j344k500j414P18K451
2888d57J781r3k094k177l03J776K614R37j705k522j017J048K743J319o48k462
2904a260j064L85K047J345K60j728j100n99J257K257O62j119k274q27J397K283
2920A922J311p46k346j504J38K566J525L38k303j756p79J454K428J211p57k679
2936B3j347j05K355K111N2k001k077p89J649K065M18j284j682q22P35J806P13
2953A820o61j440j311L12J627J409o69j394j820N3J604K117qj757k205o00J543
2970a380K318J200j461k111j486L79K259K114K71k203k530m90J928K509J206j305
2986A218k590j105R50K086J445n41j891j813L10K153J671j12j682k134l24K177
$$ plain form
3002 -182 2131 3046 1410 -1681 -3101 -2009 1482 3941 2990 -685 -3490 -3128 -80 3229 3920 1584
3018 1584 -2176 -4008 -2511 958 3903 3317 -95 -3683 -4546 -1174 2735 3679 1330 -2497 -4321 -2692
3034 -2692 610 3068 2197 -1021 -3927 -3523 -832 2384 2809 -234 -3411 -4283 -1782 2096 3789 1783
3050 1783 -2111 -4836 -3184 775 4268 3845 -367 -3998 -4873 -917 3346 5244 2599 -1517 -4858
3065 -4858 -3613 998 5054 5157 1419 -2845 -4263 -1019 3090 5260 3828 -484 -3160 -2058 1207
3080 1207 4441 4073 1465 -1761 -2198 241 3417 4352 2041 -1183 -2736 -759 2315 4435 3061 -675
3096 -675 -3209 -2725 1006 3871 4176 290 -3271 -4263 -1458 2206 3833 2478 -1677 -4667 -3771 -263
3112 -263 3400 3613 572 -3601 -4753 -2724 1166 2717 1486 -1592 -3965 -3371 -596 1844 1515 -551
$$ packed form
3002a82K313R15j636l091j420J092L491K459r51l675k805L62L048L309O91k336
3018A584l760j832J497L469K945n86l412l588q63L372L909R44k349l827j824J629
3034b692L302K458q71l218k906M04K691L216M25l043l177q72K501L878J693k006
3050A783l894k725J652L959L493m23m212l631q75L956M263J898k645m116l341
3065d858J245M611M056J03l738m264j418L244M109K170j432m312k676J102L265
3080A207L234l68k608l226m37K439L176R35k311l224j553J977L074K120j374l736
3096f75k534M84L731K865L05l886l561r92K805L664J627j355m155k990Q96L508
3112b63L663K13l041m173j152K029L890J551j231l078k373N94K775K440l29k066
$$ plain form
3128 -551 -2825 -3068 -1100 1108 1674 -217 -2700 -3128 -1050 1210 2399 911 -2162 -3843 -2280 731
3144 731 2900 2299 -696 -3526 -3325 -745 2691 3531 1792 -1804 -3471 -2305 1123 3346 3448 389
3160 389 -2662 -2763 -316 2442 3287 1703 -1128 -2303 -1048 1362 2433 1622 -549 -2198 -1110 1268
3176 1268 2369 1986 -495 -2089 -2026 319 2938 3088 391 -2452 -3506 -819 2486 3828 2216 -1140
3192 -1140 -3549 -2930 388 3315 3818 837 -2512 -3868 -1487 1716 3586 2425 -709 -3262 -2654 16
3208 16 3010 2904 539 -2201 -2529 -561 2093 2667 791 -1636 -2587 -783 2071 3378 1847 -1384
3224 -1384 -3417 -2183 1138 3875 3382 257 -3243 -3685 -686 3402 4765 2274 -1973 -4164 -2996
3239 -2996 878 4071 4011 502 -3601 -4168 -1400 2357 4178 2434 -1897 -4366 -2910 837 3330 2937
$$ packed form
3128e51k274k43J968K208N66j891k483m28K078K260J189j488l073j681J563L011
3144G31K169o01k995k830K01K580L436Q40j739l596j667J166L428K223J02l059
3160C89l051j01K447K758Q45j584k831j175J255K410J071q11k171j649J088K378
3176A268J101l83k481j594O3K345K619J50k697k843j054K687L305J342j612l356
3192a140k409O19L318K927N03k981l349j356K381L203J870j161l134k553O08K670
3208A6K994j06k365k740l28J968K654N74j876k427r51J804K854J307j531l231
3224a384k033J234L321K737m93l125l500m42K999M088J363k491m247k191J168
3239b996L874L193o0l509m103n67K768L757J821j744m331k469J456L747K493l93
$$ plain form
3255 2937 -45 -3286 -3180 -780 2293 3016 335 -2568 -3767 -1915 1692 3389 1406 -1960 -4842
3270 -4842 -3533 409 3633 3158 -437 -4290 -5070 -1705 2210 4327 1969 -2387 -4992 -4011 469 3772
3286 3772 3996 294 -3956 -4860 -1724 2345 4310 2639 -1498 -4018 -2960 862 3651 3242 24 -2947
3302 -2947 -3428 -535 2964 3557 1552 -1765 -3482 -1477 1730 4198 2697 -962 -3444 -2742 721 3981
3318 3981 4279 671 -2578 -3986 -1182 2966 4900 3201 -868 -3914 -2858 901 4290 4370 1227 -2600
3334 -2600 -3768 -1181 2492 4167 2916 -735 -3418 -2534 833 3290 3256 254 -2470 -2775 -743 2586
3350 2586 3314 1323 -1592 -3259 -1583 1536 3400 2238 -1186 -3097 -2825 221 3089 2950 522 -2533
3366 -2533 -3496 -1154 1967 3467 2114 -1456 -3589 -2730 -73 2994 2972 119 -2842 -3277 -1295 1659
$$ packed form
3255B937k982l241J06K400L073P23k681k903j199J852L607J697j983l366k882
3270d842J309L942L224m75l595l853p80L365L915K117k358m356k605R81M480L303
3286C772K24l702m250r04L136M069J965j671m137k520J058L822K789m09l218k971
3302b947m81K893L499N93k005l317j717K005L207K468j501l659k482P02L463L260
3318C981K98l608l249j408K804M148J934j699m069l046J056L759L389Q0l143l827
3334b600j168K587L673J675j251l651k683Q84L367K457l4l002k724l05K032L329
3350B586P28j991k915j667J676L119J864j162l424j911K72L046K868j39k428l055
3366b533r63K342L121J500j353l570k133Q59K657L067k2k853k961m35J982K954
$$ plain form
3382 1659 3208 1323 -1323 -3429 -2296 579 2228 1881 -739 -2822 -2665 -663 1895 1845 103 -2344
3398 -2344 -3028 -1169 1414 2899 1040 -1581 -3662 -2522 461 2495 2276 -428 -3043 -2966 -705 2006
3414 2006 2819 970 -1624 -3169 -2041 738 2666 2557 -263 -2621 -2652 -219 2128 2686 945 -1904
3430 -1904 -2418 -869 1692 2964 1905 -792 -2485 -1636 1175 2877 2635 421 -2244 -2304 -263 2418
3446 2418 3217 1320 -1395 -2913 -1591 1603 3211 2274 -65 -2511 -2305 -155 2639 3104 966 -1725
3462 -1725 -2931 -1211 1766 2894 1855 -784 -2883 -2142 613 2721 2503 453 -2176 -2817 -861 2013
3478 2013 3009 1372 -1901 -3050 -1678 1376 3250 2576 -297 -2730 -2579 -303 2761 3126 1417 -1970
3494 -1970 -3002 -1819 1287 3068 2485 -605 -2916 -2517 -107 2697 2737 489 -2078 -2966 -1137 1618
$$ packed form
3382A659J549j885k646k106J133K875J649l47k620k083J57K002K558n0j742k447
3398b344o84J859K583J485j859k621k081J140K983K034k19k704k615P7K261K711
3414B006Q13j849k594j545J128K779J928j09k820k358l1K433K347N58j741k849
3430a904n14J549K561J272j059k697j693Q49K811J702k42k214k665o0K041K681
3446B418P99j897k715j518J322L194J608r37k339k446K06K150K794M65k138k691
3462a725j206J720K977J128j039k639k099P41K755K108k18k050k629o41J956K874
3478B013R96j637l273j149J372L054J874o74k873k433J51K276L064L65j709l387
3494a970j032J183L106J781n83l090k311L99K410K804M0k248k567q88J829K755
$$ plain form
3510 1618 2729 1387 -1276 -3154 -2382 185 2740 2369 -91 -3130 -3181 -777 2107 2995 1243 -1989
3526 -1989 -3770 -2446 841 2780 2141 -631 -3228 -3466 -728 1921 2936 986 -2019 -3081 -2427 705
3542 705 2823 1779 -765 -2972 -2408 -375 2231 2487 155 -2030 -2827 -1153 1288 2745 1149 -1244
3558 -1244 -2884 -2129 707 2799 2348 42 -2542 -2557 -294 2351 3125 1437 -1484 -2913 -1840 1456
3574 1456 3300 2625 18 -2155 -2227 -187 2309 3319 1645 -1121 -2090 -1000 1505 2759 2351 111
3590 111 -1488 -1328 306 2561 2247 934 -1338 -1986 -293 1928 2602 1457 -897 -2413 -1367 959
3606 959 2816 2194 210 -2580 -2322 -206 2120 2975 1143 -1594 -2922 -1420 903 2653 1991 -452
3622 -452 -2601 -2561 -625 1531 1762 657 -1874 -2840 -1770 534 1780 1274 -648 -2244 -1954 -259 1363
$$ packed form
3510A618J111j342k663j878P72K567K555l71k460l039n1K404K884Q88j752l232
3526a989j781J324L287J939o39k772k597k38K738K649J015j950l005j062O54L132
3542G05K118j044k544k207N64K033K606K56k332k185p97J674K441J457j596k393
3558a244j640P55K836K092m51k306k584j5K263K645P74j688k921j429J073L296
3574A456J844o75k607k173p2K040K496J010j674k766r69J090K505J254m08k240
3590A11j599J60J634K255l14j313k272o48J693K221O74j145k354j516J046K326
3606I59J857o22j984k790K58K116K326Q55j832k737j328J502K323J750o62k443
3622d52k149M0J936K156K31j105k531r66J070K304J246n06j922j596K90J695J622
$$ plain form
3639 1363 1272 272 -1823 -1964 -734 955 1891 847 -1632 -2548 -1373 586 1994 1748 -371 -2469
3655 -2469 -2334 -602 1663 2417 998 -1466 -2760 -1805 561 2470 2078 -93 -1664 -2405 -839 1377
3671 1377 2151 1069 -986 -2144 -1265 644 1890 1246 -209 -1762 -1312 152 1570 1455 420 -968
3687 -968 -1470 -375 956 1763 801 -944 -1872 -1075 886 1992 1515 -7 -1887 -1638 -248 1749 2042
3704 2042 778 -574 -1917 -1324 773 2085 1876 95 -1015 -1723 -576 1438 1457 1138 -514 -1479 -826
3721 -826 417 1440 1377 217 -407 -721 273 1022 1255 522 -860 -622 331 960 1589 673 -414 -880 -209
3740 -209 616 1620 1152 -393 -952 -1089 110 1459 1727 505 -833 -1457 -542 517 1112 808 -136 -1129
3758 -1129 -1356 -164 718 696 288 -597 -1278 -398 -239 607 291 -195 -678 -768 -38 99 193 -571 -1245 -1071
$$ packed form
3639A363r1j000k095j41J230J689R36j044k479r16J175J959J408k46k119k098
3655b469J35J732K265P54j419k464j294R55K366J909l92k171j571p41J566K216
3671A377P74j082k055j158Q79J909J246o44j455j553M50J464J418j15j035j388
3687i68n02J095J331Q07r62j745r28P97J961J106m77j522j880K49J390J997K93
3704B042j264j352j343N93K097J312k09j781j110p08J147K014J9l19j652r65O53
3721h26J243J023o3j160o24l14R94P49K33p33j382K38R53O29O29r16j087m66O71
3740b09Q25J004m68j545n59j37J199J349K68j222j338o24R15J059N95l04r44r93
3758a129k27J192Q82k2m08q85o81Q80J59Q46l16m86m83r0P30J37R4p64o74J74
$$ plain form
3778 -1071 -242 341 496 -662 -970 -1290 -356 260 477 176 -909 -1268 -963 20 803 940 -213 -1072 -1215
3797 -1215 -303 257 644 381 -600 -951 -1005 -108 916 725 -146 -356 -820 -129 528 490 18 -507 -551 172
3817 172 858 900 300 -364 -511 169 571 787 504 -188 -697 -276 381 930 1260 215 -520 -521 -59 511 1120
3838 1120 910 52 -622 -684 118 824 1227 269 -100 -680 -169 612 1274 799 -134 -405 -232 163 787 595
3858 595 159 -197 -430 -118 560 705 325 -291 -664 -154 547 832 617 -414 -628 -509 168 539 547 351
3878 351 -622 -872 -152 152 551 310 -368 -993 -628 -334 214 477 270 -541 -810 -542 -140 118 414 139
3898 139 -834 -677 -651 -57 426 75 27 -635 -469 -229 313 133 -397 -160 -491 -284 -260 -10 -132 -50 -402
3919 -402 -213 -24 -280 -372 -347 -43 -396 73 -225 -289 45 -219 -11 -208 -137 -173 270 -194 -76 -233 -519 -169
$$ packed form
3778a071Q29N83J55j158l08l20R34O16K17l01j085l59L05R83P83J37j153q59j43
3797a215R12N60L87k63r81l51n4Q97J024j91q71k10m64O91O57l8m72n25m4P23
3817A72O86M2o00o64j47O80M02K16k83o92n09M21O57N49L30j045p35jM62N70O09
3838A120k10q58o74o2Q02P06M03r58l69n80N11P81O62m75r33k71J73L95O24j92
3858E95m36l56k33L12O78J45l80o16l73N10P01K85k15j031k14J19O77L71Qj96
3878C51r73k50P20L04L99k41o78o25L65K94N48K63k07q11k69K68M02K58K96k75
3898A39r73J57K6N94M83l51m8o62J66K40N42j80n30K37l31K07K4K50j22Q2l52
3919d02J89J89k56r2K5L04l53M69k98o4L34k64K08j97P1l6M43m64J18j57k86L50
$$ plain form
3941 -169 -330 371 456 175 -472 -588 -206 407 569 589 181 -439 -896 -470 355 764 572 12 -467 -605 -77
3962 -77 967 1043 557 -416 -1124 -421 132 1194 968 478 -618 -683 -266 698 1127 851 -234 -964 -426 16
3982 16 1248 914 199 -477 -536 62 947 1085 459 -582 -736 -412 691 905 836 -126 -1377 -1212 209
4001 209 1685 1463 449 -1113 -1589 -1022 780 1916 1518 -207 -1379 -1443 -443 743 1610 788 -488
4018 -488 -1650 -1433 254 1271 1340 -46 -1542 -1635 -1033 445 1098 545 -959 -1318 -1093 214 971 764
4036 764 -311 -1531 -1209 -268 779 687 241 -1443 -1711 -880 540 921 441 -697 -1808 -1551 -65 1379
4054 1379 1271 177 -1485 -2051 -848 448 1697 1230 -542 -1623 -1789 -277 1447 1513 532 -680 -1444
4071 -1444 -852 446 1508 998 -148 -723 -944 49 813 1040 299 -572 -774 263 1115 1112 388 -22 -885
$$ packed form
3941a69j61P01Q5k81o47j16L82O13J62K0m08o20m57M26Q25M09j92n60m79j38N28
3962g7J044P6m86r73p08P03N53J062k26m90j096o5M17R64M29k76j085p30N38M42
3982A6J232l34p15o76n9N98Q85J38o26j041j54L24J103K14o9r62j251J65J421
4001B09J476k22j014j562m76N67J802J136l98j725j172o4J000J186Q67q22j276
4018d88j162K17J687J017O9j386j496r3O02J478O53n53j504l59K25J307P57k07
4036G64j075j220L22R41J047r2m46j684k68Q31J420L81m80j138j111K57J486J444
4054A379j08j094j662n66J203J296J249m67j772j081j66J512J724O6r81j212p64
4071a444N92J298J062n10j146n75k21R93P64K27p41q71k02J037Q52lp24m10q63
$$ plain form
4090 -885 -442 759 1567 785 -255 -970 -732 319 1277 1446 330 -920 -1289 -458 806 1482 1279 236
4108 236 -1034 -961 -91 1036 1474 495 -689 -954 -723 225 772 881 180 -610 -583 -79 446 326 143 -316
4128 -316 -434 143 677 686 -418 -730 -406 131 815 880 115 -565 -766 -464 675 1099 698 -651 -1019 -1342
4148 -1342 -522 710 1289 432 -441 -911 -1272 118 834 819 -268 -585 -901 -196 728 254 116 -293 -412
4167 -412 207 66 364 -297 -825 -836 26 533 635 10 -1095 -1341 -715 368 1131 712 -245 -1342 -1713
4186 -1713 -262 804 1318 852 -1037 -1569 -1311 202 1359 1118 -12 -1046 -1466 -662 949 1197 371
4203 371 -476 -1385 -677 471 1031 365 -637 -736 -596 403 1164 1145 -241 -918 -870 198 1672 1526 355
4222 355 -1109 -1495 -345 1085 2303 1556 -84 -1295 -1446 -282 2086 2161 955 -654 -1681 -1055 798
$$ packed form
4090h85M43J201Q08p82j040p15K38J051R58J69j116j250l69Q31J264O76k03j043
4108B36j270P3Q70J127M38r79j184k65K31R48N47J09p01p90K7N04N25j20j83m59
4128c16j18N77N34Rj104l12L24N37O84O5p65o80k01L02J139M24m01j349l68l23
4148a342Q20J232N79q57q73m70l61J390P16j5j087l17l16P05R24m74j38m09j19
4167d12O19j41K98o61n28j1Q62N07J02o25j105k46O26J083P63m19r57j097l71
4186a713J451J066N14m66j889n32K58J513J157k41j130j034m20Q04J611K48q26
4203C71q47r09P08J148N60o66j002r9J40R99P61j9j386o77M8J068J474j46j171
4222C55j464l86J150J430J218p47j640j211j51J164K368P5j206j609j027O26J853
$$ plain form
4239 798 2113 1813 12 -1550 -1377 -177 1721 1714 941 -868 -1113 -539 758 1751 1026 -333 -1384 -1126
4257 -1126 328 1233 1146 -67 -1752 -1541 -354 1452 1844 611 -1268 -2581 -1280 630 2183 1516
4273 1516 -573 -2107 -2023 -536 1680 2288 675 -1110 -2514 -1970 582 1791 1690 -274 -2406 -2320 -689
4290 -689 852 1509 494 -1290 -1905 -1108 401 1344 907 -1001 -1934 -1494 -15 1482 1643 -87 -1625
4307 -1625 -1873 -739 1512 2036 438 -1167 -2179 -1369 704 2217 1761 -393 -1939 -2023 -599 1589
4323 1589 2066 1125 -1297 -2230 -1302 532 2246 1866 44 -1730 -1619 -216 1597 2015 867 -1025 -1498
4340 -1498 -944 1073 1844 1255 -355 -1661 -1366 375 2020 1704 195 -1433 -1652 -109 1673 1990 928
4357 928 -1122 -2128 -1240 807 2192 2024 42 -1717 -2270 -241 1793 2622 1411 -1038 -2204 -1432
$$ packed form
4239G98J315l00j801j562J73J200J898pp73j809k45N74J297R93p25j359j051K58
4257a126J454R05q7j213j685K11J187J806L92j233j879j313J301J910J553o67
4273A516k089j534Q4J487K216O08j613j785j404N44K552J209j01j964k132Q6J631
4290f89J541O57j015j784o15P97J509R43m37j908r33M40J479J497J61j730j538
4307a625k48J134K251N24j598j605j012Q10K073J513m56k154j546q4J424K188
4323A589M77r41k422r33R28J834J714l80j822j774J11J403J813M18j148j892m73
4340a498N54K017P71n89j610j306K95J741J645l16j509j628k19J543J782L17j062
4357I28k050j006Q88K047J385j68j982j759n53K029K034Q29j211k449j166P72
$$ plain form
4373 -1432 892 2232 1890 151 -1431 -1919 -339 1692 2058 1044 -894 -1918 -789 995 1726 1214
4389 1214 -399 -1649 -1482 253 1709 1861 -1 -1613 -2010 -339 1275 1986 937 -1307 -2071 -1861
4405 -1861 303 1904 1567 56 -1901 -2026 -591 1260 1950 889 -946 -2451 -1655 580 1915 1503
4421 1503 -221 -1600 -2150 -513 1011 1341 409 -1003 -1871 -999 658 1305 865 -782 -1992 -1610 245
4438 245 1555 1316 -158 -1295 -2002 -668 1377 1473 887 -1314 -2287 -1200 441 1894 1372 -302 -1833
4455 -1833 -1723 -171 1464 2122 912 -1001 -1906 -1101 684 1685 1474 -270 -1456 -1138 -123 1367
4471 1367 1753 690 -1168 -1582 -504 997 1858 965 -413 -1325 -816 409 1785 1748 242 -1404 -1057
4488 -1057 -30 1753 1910 935 -757 -1651 -530 824 1914 1543 -250 -1464 -1422 157 1639 1808 571
$$ packed form
4373a432K324J340l42j739j582m88J580K031L66j014j938j024J129J784P31n12
4389A214j613j250J67J735J456J52j862j612l97J671J614P11j049k244p64K10
4405a861K164J601l37j511j957j25J435J851O90j061j835j505P96K235J335m12
4421A503j724j379n50J637J524L30r32j412q68Q72J657O47m40j647j210L82J855
4438B45J310k39j474j137p07J334K045R6n86k201r73J087J641J453n22j674j531
4455a833J10J552J635O58j210j913r05Q05J785J001k11j744j186L18J015J490
4471A367L86j063j858m14J078J501Q61q93j378r12N09J225J376l7j506j646L47
4488a057J027J783J57r75j692q94J121J354J090l71j793j214M2J579J482J69j237
$$ plain form
4505 571 -978 -1439 -434 962 1873 1311 -682 -1814 -1215 322 1182 1610 -201 -1457 -1325 -247 1122
4522 1122 1696 926 -1144 -1887 -1126 691 1386 1254 -255 -1595 -1569 -331 1373 1151 73 -1538 -1699
4539 -1699 -993 645 1401 495 -870 -1956 -1682 -42 1438 1394 -229 -1438 -1972 -773 750 1490 692
4556 692 -952 -1819 -1328 481 1353 1421 -31 -1786 -1843 -482 1511 1474 448 -1216 -1614 -1060 863 1438
4574 1438 1049 -391 -1567 -1270 164 1289 1596 628 -1222 -1439 -670 965 1991 998 -605 -1860 -1294
4591 -1294 243 1888 1584 27 -1027 -1530 -149 1046 1779 917 -785 -1410 -1151 817 1817 1489 -86
4608 -86 -1447 -1518 -166 1598 1902 634 -1011 -1775 -689 846 1432 1294 -303 -1456 -1136 258 1393
4625 1393 1239 275 -1258 -1438 -636 1019 1644 959 -772 -1646 -1383 294 1578 1383 102 -1026 -1338
$$ packed form
4505E71j549m61J005J396R11n62j993j132N99J537Q60M28j811j256J32J078J369
4522A122N74p70k070p43P61J817O95j32j509j340K6J238J704k22j078j611j61
4539a699P06J638P56r06j365j086K74J640J480m4j623j209n34J199J523P40p98
4556F92j644q67M91J809Q72O8j452j755n7J361J993l7j026j664l98N54J923N75
4574A438l89j440j176K97J434J125L07r68j850k17P69J635J026r93j603j255N66
4591a294J537J645l04j557j054n03J381J195P33q62j702o25K59J968J000l28j575
4608h6j361p1J352J764L04j268j645p64J086J535N86j38j597j153L20J394J135
4625A393j54r64j533j80Q02J655O25o85j731q74K63J677J284j95j281j128l12
$$ plain form
4642 -1338 -374 1200 1569 687 -736 -1629 -1158 469 1742 1295 -43 -1653 -1561 -235 1430 1525 282
4659 282 -1630 -1601 -767 904 1595 1039 -365 -1413 -1031 23 1457 1308 -199 -1256 -1694 -747 1142
4676 1142 1414 435 -715 -1741 -1202 356 1432 827 -615 -1338 -1306 -424 742 1227 225 -1403 -1871
4693 -1871 -993 366 1283 984 -473 -1588 -1519 -349 1128 1247 -12 -1384 -1568 -780 606 1335 754
4710 754 -653 -1505 -1313 218 1198 1327 59 -1113 -1212 -376 1114 1907 672 -133 -1231 -691 794 1457
4728 1457 1286 -152 -923 -898 200 1396 1754 595 -710 -1495 -573 829 1595 1182 -189 -1183 -1053 488
4746 488 1639 1352 342 -897 -960 -561 910 1372 720 54 -835 -812 551 1122 911 89 -571 -1019 -14
4765 -14 807 1063 117 -837 -1085 -835 438 1063 525 -546 -1139 -881 63 523 924 128 -1076 -1319 -779
$$ packed form
4642a338R64J574L69q82j423q93M71J627J273m47j338j610R2J326J665R5j243
4659B82j912K9Q34J671O91n56j404j048L82J054J434j49j507j057m38R47J889
4676A142K72r79j150j026N39J558J076o05j442p23L2Q82J166M85j002j628m68
4693a871Q78J359R17k99j457j115O9J170J477J19j259j372j84P88J386P29n81
4710G54j407q52J92J531R80J29j268j172r9Q36J490P93j235q05j098N40J485O63
4728A457j71j438p71K5J098J196L58j159j305p85R22J402P66m13j371r94J30J541
4746D88J151k87j010j239o3L99J471M62o52o66q89K3J363N71k11q22o60m48J005
4765a4Q21K56r46r54k48K50J273O25n38j071n93K58R44M60M01p96j204k43N40
$$ plain form
4784 -779 401 969 628 -644 -1347 -692 130 826 808 -387 -1414 -1269 -410 670 530 386 -599 -1051 -548
4803 -548 124 861 276 -456 -1084 -1012 -236 928 719 195 -970 -1213 -334 636 761 230 -554 -991 -703 286
4823 286 697 423 -62 -1207 -1025 -449 637 1002 339 -831 -1104 -629 598 948 344 -548 -1142 -620 -77
4842 -77 660 662 100 -869 -1053 -273 771 1126 708 -403 -994 -764 508 1076 818 -52 -787 -1130 16 878
4862 878 1072 560 -266 -1015 -296 722 1098 854 105 -720 -915 141 901 1157 227 -663 -682 -147 687 942
4882 942 972 -481 -563 -189 341 1319 1041 271 -841 -918 -195 453 1286 551 -360 -827 -652 533 899 745
4902 745 -188 -940 -616 -210 854 892 445 -424 -783 -729 387 1188 839 -574 -1010 -923 33 915 917 -154
4922 -154 -973 -984 -159 529 722 251 -649 -1534 -732 -178 587 654 -484 -967 -1287 -175 710 753 121 -779
$$ packed form
4784g79J180N68l41j272p03O55Q22O96j8j195j027J45Q59J080j40j44r85m52N03
4803e48O72P37n85p32o28P2P76J164k09n24j165k43Q79R70J25n31p84m37K88R89
4823B86M11k74m85j145J82N76J086L65o63j170k73M75J227L50o04q92n94N22N43
4842g7P37Kn62r69j84P80J044L55m18j111n91K30J272N68k58q70p35l43J146Q62
4862H78J94n12q26p49P19J018L76k44p49q25j95J056P60K56r30q90j9N35Q34K55
4882I42L0j453q2L74N30R78k78p70j112p7P23O48Q33p35r11m67J75J185L66j54
4902G45r33p52L24M06J064L8m47q69l59N4J116Q01l49j413m36Q7R56Q82Kj071
4922a54q19j1Q25O88J93m71r00q85Q02N54P65O7j138m83l20J112Q85M3o32r00
$$ plain form
4942 -779 -1238 -860 -70 761 710 -432 -569 -800 -38 401 626 289 -572 -471 -706 400 839 190 -230 -1061
4962 -1061 -861 245 569 720 -90 -439 -769 -174 548 562 241 -536 -814 -206 424 750 582 -51 -639 -628
4982 -628 17 364 648 355 -543 -713 -118 416 855 531 -225 -340 -349 402 531 781 343 -142 -373 -124 724
5003 724 675 240 -230 -555 -280 577 679 300 -166 -542 -324 298 989 674 204 -633 -615 -325 668 1019 289
5024 289 -199 -597 -772 -119 774 752 17 -455 -817 -172 394 518 97 -176 -208 -642 127 243 168 -140 -362
5045 -362 -660 -6 537 397 -270 -1221 -725 45 262 529 -17 -708 -947 -305 185 539 410 -510 -572 -992
5065 -992 -258 430 527 251 -364 -990 -635 210 707 462 -216 -684 -817 21 176 399 103 -468 -363 -208
5085 -208 127 -118 104 -83 -614 -163 192 445 302 -333 -515 -476 75 520 773 -105 -434 -691 124 422
$$ packed form
4942g79m59L78P90Q31n1j142j37k31P62M39K25l37q61J01k35J106M39o49m20q31
4962a061K00J106L24J51q10l49l30N95P22J4l21p77k78O08O30L26j68o33n88J1
4982f28O45L47K84k93q98j70N95N34M39l24p56j15rP51J29K50m38m85k31K49Q48
5003G24m9m35m70l25K75Q57J02l79m66l76K18O22O91l15m70q37J8K90R93L51p30
5024B89m88l98j75O53Q93k2p35m72l62O45N66J24m21k73l2m34P69J16p5l08k22
5045c62k98O54N43j40o67r51M96P70K17K67n46o91k39O42M90L54j29r20o2m20
5065i92P34O88R7k76o15o26L55Q45M97k45o78m68j33Q38J55K23k96n71J05J55
5085b08L35k45K22j87n31M51L55K53j43o35j82L9N51M45K53q78l29k57Q15K98
$$ plain form
5105 422 526 368 -260 -697 -232 -72 1169 497 101 -515 -903 -482 580 753 156 -367 -611 58 210
5124 210 505 431 204 -409 -100 -48 431 565 286 -368 -271 507 423 570 -57 -563 -251 63 940 888 400 -466
5146 -466 -391 -194 91 881 620 622 -366 -408 -257 343 879 315 43 -398 -438 93 463 685 295 -89 -427 36
5168 36 253 445 503 -546 -368 -54 393 44 55 -112 -488 -335 53 657 471 -109 -857 -886 -264 624 582
5189 582 226 -837 -990 -575 384 767 465 -195 -1122 -622 -434 350 779 376 -391 -949 -666 -15 693 489
5209 489 -252 -611 -779 -182 496 280 -221 -381 -484 -122 544 353 247 -416 -852 -536 195 931 843 -249
5229 -249 -721 -598 62 1085 1290 252 -414 -950 -711 506 869 720 34 -814 -835 -375 806 1194 714
5248 714 -593 -877 -435 483 933 606 -430 -767 -507 -108 607 475 267 -648 -587 -50 397 753 202 -520
$$ packed form
5105D22J04j58o28m37M65J60J241o72l96o16l88M21J062J73n97n23k44O69J52
5124B10K95p4k27o13L09N2M79J34k79o54R7P78q4J47o27n06L12L14Q77n2m88q66
5146d66P5J97K85P90k61Kr88m2J51O00N36n64k72m41m0N31L70K22l90l84l38M63
5168C6K17J92N8j049J78L14M47l49J1j67l76J53L88O04j86n80p48k9O22Q88m2
5189E82l56j063j53M15R59L83l02o60r27N00J88P84M29m03p67n58K83O51P08k04
5209D89p41l59j68N97O78k16n01j60j03L62O66j91j06o63m36L16P31P36q8j092
5229b49m72J23O60J023K05j038o66n36K39J217L63j49o86q48k1M60J181L88m80
5248G14j307k84M42R18M50l27j036l37K60L99P15j32k08r15O1N37M47L56n51p22
$$ plain form
5268 -520 -983 -243 526 1085 929 -192 -762 -915 -229 990 827 478 -646 -1093 -601 258 882 563 -102
5287 -102 -990 -1000 -390 420 1111 381 -409 -1020 -683 87 509 384 -508 -1018 -842 -89 573 532 60 -583 -670
5308 -670 -66 568 788 86 -96 -904 -576 190 1146 474 -463 -1065 -686 -231 652 872 -265 -662 -1152 -853
5328 -853 -110 968 542 42 -788 -973 84 666 887 72 -542 -872 -168 488 776 -63 -525 -857 -191
5347 -191 365 448 2 -154 -416 -546 -264 601 499 145 -616 -681 -241 581 1066 615 -283 -655 -384 347 1102
5368 1102 651 21 -788 -807 -190 557 1105 837 33 -526 -628 386 883 755 119 -575 -455 114 751 818
5388 818 382 -270 -517 -58 649 789 502 -27 -704 -527 386 697 667 164 -901 -727 -267 1079 1013 592
5408 592 -590 -855 -452 372 931 793 -536 -643 -800 -158 205 1058 501 -608 -1478 -863 231 979 893
$$ packed form
5268e20m63P40P69N59j56j121n70j53O86J219j63l49j124m47M92Q59O24l19o65
5287a02q88j0O10Q10O91p30p90o11L37P70M22j25q92n10J76P53O62m1m72o43q7
5308f70O04O34K20p02j82q08L28P66R56o72r37o02L79M55Q83K20j137l97m90K99
5328h53P43J078m26n00q30j85J057N82K21q15o14l30P04O56K88q39m62l32O66
5347a91N56Q3m46j56k62j30K82Q65j02l54p61o5M40Q22M85m51q98l72K71P31P55
5368A102m51o30q09j9O17P47N48k68q04n59j02J014M97j28o36o94J20N69O37O7
5388H18m36o52k47M59P07J40k87n29o77J77R13L11l0n03j065J74M60J346o6m21
5408E92j182k65M03Q24N59j38j329j07j57O42L63Q53n57j109q70O15J094P48q6
$$ plain form
5427 893 -298 -814 -1018 -76 675 717 272 -698 -1266 -535 401 639 260 -330 -924 -855 155 754 540 -62
5447 -62 -953 -1067 -262 599 1148 320 -795 -961 -720 259 766 707 -230 -1142 -1054 -226 656 952 459 -577
5467 -577 -1131 -983 306 1251 735 -372 -931 -842 -163 590 1046 385 -716 -1091 -657 356 740 758 -279
5486 -279 -962 -363 384 764 880 -299 -708 -864 170 644 1130 349 -743 -1100 -690 220 1000 407 163
5505 163 -523 -694 -32 906 951 579 -434 -937 -272 194 954 617 -251 -618 -629 173 932 932 160 -742 -879
5526 -879 -124 601 1104 642 -208 -820 -366 248 840 799 371 -1025 -928 -169 885 1022 247 -317 -691 -379
5546 -379 318 828 565 -177 -816 -857 -148 696 800 184 -914 -724 -512 568 780 438 -163 -1121 -506 162
5566 162 803 689 113 -631 -1013 -513 314 564 282 -410 -828 -731 506 744 617 -276 -1131 -818 -434 511
$$ packed form
5427H93j191n16k04R42P51M2m45r70n68P31R36K38l79n90n94O9J010N99k14o02
5447f2q91j14Q05Q61N49q28j115j66K41R79N07n9r37r12Q8Q28Q82K96m93j036
5467e77n54J48J289R45n16j107n59Q9O79P53M56o61j101l75M34J013L84J8j037
5486b79o83N99P47L80J16j179m09j56J034M74M86p81j092l57M10R10P80n93k44
5505A63o86j71O62R38M5l72j013n03O65M66P60l37q68l67j1Q02P59%p72r02j37
5526h79P55P25N03m62q50o12M54O14N92m1m28j396R7P59J054J37p75n64l74L12
5546c79O97N10k63p42o39m1P09Q44J04o16j098J90K12J080K12l42o01r58O15O68
5566A62O41j14n76p44l82N00Q27K50k82o92m18R7J237K38j27q93q55L13L84R45
$$ plain form
5586 511 860 106 -887 -801 -419 29 787 768 -85 -795 -779 13 575 714 146 -697 -1007 -730 397 678 463
5607 463 -96 -659 -513 216 637 688 -92 -307 -666 -374 426 1138 543 -86 -382 -293 600 810 726 59 -429
5628 -429 -364 247 530 613 222 -544 -556 -331 482 774 305 71 -719 -547 46 878 854 177 -499 -514 -110 462
5650 462 753 512 -354 -591 -334 205 1034 779 59 -591 -644 5 1016 1209 439 -641 -731 -141 657 766
5670 766 255 -205 -823 -308 276 814 488 115 -558 -613 -248 229 512 182 -790 -693 -739 418 717 494 -220
5691 -220 -806 -813 351 397 715 337 -506 -844 -355 430 805 300 -335 -736 -719 -72 189 651 94 -907 -1054
5712 -1054 -479 165 673 360 -470 -836 -517 247 670 421 -352 -717 -554 -173 270 847 245 -751 -1007 -595
5732 -595 237 839 726 -391 -928 -804 201 643 592 226 -254 -727 -422 343 833 609 -248 -1144 -812 123
$$ packed form
5586E11L49p54r93Q6L82M48P58j9q53p10J6P92N62J39n68q43l10K77J127K81k15
5607D63n59n63J46P29M21N1p80k15l59K92Q00P12n95o29k96Q9Q93K10q4o67m88
5628d29O5O11K83Q3l91p66j2K25Q13K92m69k34p90J72N93Q32k4o77o76j5M04N72
5650D62K91k41q66k37K57N39Q29k55p20o50n3O49J011J93p70j080r0N90P98J09
5670G66n11m60o18N15N84N38l26l73o73n5L65M77K83l30r72R7m6J157K99k23p14
5691b20n86pJ164M6L18l78q43l38M89P85L75n05o35m01J7O47K61M62n57j001j47
5712a054N75O44N08l13q30l66L19P64M23k49p73l65J63L81M43N77o02r96k56M12
5732e95Q32O02j13j117n37J24J005M42n1l66m80m73L05P65M90k24q57q96L32R35
$$ plain form
5752 123 557 1056 -134 -705 -693 -340 461 564 487 -287 -928 -347 46 465 584 155 -758 -591 -112 623
5772 623 778 190 -258 -699 -485 205 772 742 -28 -563 -516 90 308 743 180 -448 -1041 -581 318 804 483
5793 483 106 -587 -891 83 457 712 93 -585 -720 -365 454 740 316 -326 -441 -633 329 702 706 254 -497
5814 -497 -464 -154 465 893 374 -303 -462 -445 370 791 374 -116 -368 -742 -254 314 494 140 -319 -497 -218
5835 -218 262 429 538 -194 -439 -475 -161 671 548 83 -582 -452 -199 221 638 11 -264 -407 -523 150
5855 150 608 487 154 -62 -261 -201 542 699 210 -20 -451 -157 376 412 208 136 -678 -496 119 369 598
5876 598 115 67 -386 -404 382 497 412 147 -252 -290 430 808 480 108 -508 -352 112 550 663 190 -386
5897 -386 -430 -98 27 653 645 91 -566 -453 99 595 630 470 -266 -603 44 334 242 194 15 -442 -190 155
$$ packed form
5752A23M34M99j190n71J2L53Q01J03p7p74o41N81L93M19J19m29r13J67M79P35
5772F23J55n88m48m41K14O90N67l0p70n35M7O06K18M35n63o28n93M60Q99M86l21
5793D83l77o93l04R74L74K55o19o78j35L55Q19K86m24o42j15j92R62L73Mm52p51
5814d97L3L10O19M28n19o77j59J7Q15M21m17m90k52l74M88N68J80l54m59j78K79
5835b18M80J67J09p32k45l6L14Q32j23m65o65J30K53M20M17o27k75j43j16O73
5855A50M58j21l33k16j99O0P43J57m89k30m31K94N33L6k04p2q14J82O15K50K29
5876E98m83m8m53j8P86J15q5k65l99l8P20L78l28l72o16J56M64M38J13m73n76
5897c86m4L32J25O26qn54o57J13N52M96L5j60p36l37O47K90r2m8j79m57K52L45
$$ plain form
5919 155 337 331 9 -183 -488 -209 352 407 456 -242 -570 -217 147 445 593 -334 -495 -551 -226 310 321 72
5941 72 -129 -404 -395 7 350 196 -260 -296 -290 -226 -8 293 310 -470 -712 -76 44 26 -65 -108 -564 -285 -252 174
5965 174 108 -261 -302 -345 -478 88 -25 193 -146 -670 -316 665 187 196 -504 -614 -514 202 155 -96 298 -180
5987 -180 -380 -79 216 230 84 -36 -396 -45 -16 140 246 216 -166 -276 -199 427 163 143 -27 -554 -133 -124
6009 -124 6 35 12 -110 -209 327 383 334 -139 -324 -85 -158 -104 324 46 -154 -316 182 201 179 540 122 -217
6032 -217 -429 89 361 203 276 -214 -67 107 103 144 241 32 -328 -271 53 67 75 132 -502 -114 -198 261 198 158
6056 158 -6 -432 -125 11 269 367 0 -148 -281 -331 408 300 -82 -348 1 -42 -194 121 -77 -24 -143
6077 -143 -433 -68 126 273 19 -226 -308 -367 224 -32 123 -17 -272 -233 100 55 192 -321 21 -570 -55
$$ packed form
5919A55J82ol22j92l05K79N61N5M9o98l28L53L64K98J48r27j61n6L25N36J1k49
5941G2k01k75RM02L43j54m56l6OO4K18L01J7p80k42O36J20j8r1m3m56K79L3M26
5965A74o6l69m1m3j33N66j13K18l39n24L54R81m78Rp00j10J00P16m7k51L94m78
5987a80k00L01K95J4j46j20l60L51K9J56J06l0l82j10P7O26k64k0j70n27M21R
6009a24J30K9k3j22r9N36N6m9m73j85K39p3N4M28k78k00j62M98J9k2L61m18l39
6032b17k12N18K72j58P3m90J47J74mM1R7k09l60N7L24J4QN7o34L88q4M59o3m0
6056A58j64m26L07J36K58R8l67j48j33n0P39j08l82k66L49m3j52L15j98N3j19
6077a43k90L65J94J47k54k45q2n9N91k56J55j40k55L9L33m5J37n13L42n91N15
$$ plain form
6098 -55 -241 -4 344 -336 3 -132 35 121 200 -155 -95 19 -109 15 250 -34 60 -506 -151 -62 144 56
6120 56 271 -75 -324 -65 193 298 105 -115 -281 -113 116 254 250 41 -26 12 285 -147 123 178 102 -77
6142 -77 71 90 193 134 350 74 0 -65 304 205 323 -315 -82 298 117 184 -40 19 -175 468 -27 311 322
6165 322 262 55 -172 -99 -90 116 78 135 128 78 135 -332 173 263 103 -61 -291 -125 136 80 17 249 14 111 16
6190 16 -143 27 128 65 274 18 -245 -58 -54 112 30 41 -181 -80 420 114 -399 -147 24 -195 -242 -92
6212 -92 -155 -124 -541 -281 96 6 287 57 -352 -355 -169 141 263 84 -65 -280 -75 -51 9 239 -17 -60 -293
6235 -293 -503 -296 218 104 -62 -184 -166 -244 -3 65 47 35 -388 -239 242 397 219 -89 -18 -355 -217 104
6257 104 -90 66 -57 -470 -279 64 369 299 81 -289 -297 136 335 350 206 -179 -288 -308 -167 188 545 317
$$ packed form
6098e5j86K37L48o80L39j35J67Q6P9l55O0J14j28J24K35k84R4n66L55Q9K06q8
6120E6K15l46k49K59K58J05j93k20j66J68K29J38mk09o7L8K73m32K70N5p6j79
6142g7J48J9J03n9K16k76p4o5L69r9J18o38K33L80j81O7k24N9j94O43m95L38J1
6165C22o0k07k27P3RK06l8N7pn0N7m67N05R0j60j64k30J66K61n6o3K32k35R7r5
6190A6j59J70J01o3K09k56k63J87MJ66q2J1k22J01N00l06n13K52J71k19m7J50
6212i2o3L1m17K60L77r0K81k30m09lJ86L10J22j79j49k15K05K4O0K30k56m3k33
6235b93k10K07N14j14j66j22J8p8K41O8j8j2m23J49M81J55j78l08P1l37J38L21
6257A04j94J56j23m13J91L43L05p0k18l70qM33J99J5j44l85j09k0J41L55L57k28
$$ plain form
6279 317 -330 -241 -59 266 435 273 -222 -550 -338 40 397 -43 -119 -58 -164 -121 124 329 265 49 -27 -267
6301 -267 -182 420 513 299 -214 -197 56 300 297 147 -119 -157 13 236 154 296 -179 -128 -148 58 531 564 43
6324 43 -35 113 -39 293 396 127 -171 -265 108 160 304 291 -54 -394 -120 -84 458 257 310 -458 -239 -38
6346 -38 -167 527 131 -123 -438 -374 371 188 118 -173 -315 -255 -224 276 373 50 -182 -98 -626 5 227 354
6368 354 -3 -106 -259 81 172 -5 -175 -50 -146 -232 87 237 30 -233 -156 -21 166 74 301 39 -277 -85
6390 -85 124 152 178 -70 -186 -66 -325 348 348 194 -12 30 -149 -142 222 244 180 -322 -530 -255 88 424 223
6413 223 -136 -208 -438 126 203 359 97 -99 -164 -242 223 28 490 -90 -88 -352 -5 172 -28 145 -236 -441
6435 -441 -150 247 51 101 -273 -465 -164 180 480 122 -405 -206 -447 -79 18 -151 61 225 -205 -163 66
$$ packed form
6279C17o47Q9J82L25J69j62m95l28K12L78L57m40p6O1j06M3K45K05o4k16p6k40
6301b67Q5O02R3k14n13J7K53K44lj50k66l8J70K23q2J42m75N1k0K06M73L3n21
6324D3p8J48j52L32J03k69k98r4L73N2J44j3l45l40K74L6N42k01N3p68K19K01
6346c8j29O94l96k54l15O4P45j83p0k91j42O0L1N00R7l23k32Q4n28O31K22J27
6368C54l57j03j53L40R1j77j70J25r6q6L19J50k07k63P7J35J87r2K27k62l16J92
6390h5K09K8K6k48j16J20k59O73%j54k06M2j79PL64K2o4n02k08K75L43L36k01
6413B23l59p2k30N64P7J56k62j96o5p8M65j95M62n80Kk64L47J77k00J73l81k05
6435d41K91L97j96N0l74j92L01L44L00l58n27J99k41L68R7j69K12J64m30M2K29
$$ plain form
6456 66 258 130 -230 -357 -208 247 374 322 -158 -272 -118 -49 32 -63 64 -269 -571 -206 -117 120 267 226
6478 226 -390 -410 200 177 163 239 -300 -601 -115 109 251 -125 -186 -437 6 119 -72 279 8 -90 -351 28
6500 28 254 95 156 -84 -552 -285 117 105 145 38 -167 -239 -244 425 325 83 -53 -354 80 1 642 394 240
6523 240 -322 -14 183 128 400 -139 -143 -236 -70 247 513 239 -253 -3 16 268 370 456 -36 51 -332 223
6545 223 413 486 -22 -367 -243 -86 117 382 157 90 -352 -350 41 458 192 363 -231 -547 -67 197 438
6566 438 132 181 -140 -213 346 616 424 149 -390 -297 38 388 285 353 -9 -478 -467 52 289 194 207 -126
6588 -126 -426 -59 416 478 149 -243 -603 -375 -3 436 242 -186 -397 -301 -143 129 570 -23 -262 -663 -481
6609 -481 264 363 87 -59 -585 -560 -222 321 469 -28 -431 -544 -184 130 473 268 -331 -220 -400 273 227
$$ packed form
6456F6J92j28l60j27J49M55J27n2m80j14J54O9Q1r5J27l33l02L65Q9K37J47m1
6478B26o16k0O10k3j4P6n39l01M86K24J42l76o1k51M43J13j91L51k71r8k61L79
6500B8K26j59O1k40m68K67M02j2M0j07k05p2nO69j00k42j36l01M34p9O41k48j54
6523B40n62L08J97n5K72n39mr3J66L17K66k74m92K50J9K52J02Q6m92Q7l83N55
6545B23J90P3n08l45J24J57K03K65k25o7m42KL91M17k66J71n94l16M80K64K41
6566D38l06M9l21p3N59K70j92k75n39R3L35L50j03O8l62m69J1N19K37r5J3l33
6588a26l00L67M75O2l29l92l60K28L72M39j94m28k11R6J58K72M41n93k39m01J82
6609d81P45R9k76j46n26K5L38N43J48m97m03j13L60L14L43k05n99J11j80O73m6
$$ plain form
6630 227 408 401 -519 -121 -289 312 348 58 -337 -508 -284 69 644 427 6 -400 -182 42 488 383 298
6651 298 -322 -368 -112 10 320 306 222 -614 -188 -45 569 353 16 -275 -286 16 -39 315 134 -58 -330 -367
6673 -367 135 435 -1 231 -94 136 -169 211 504 201 -390 -230 -166 124 464 375 -93 -328 -313 -3 308
6694 308 267 -24 -159 -525 -191 407 414 36 -265 -533 -183 -94 742 232 26 -519 -486 -233 189 228 153 -100
6716 -100 -670 -139 60 309 376 -279 -468 -450 -436 87 51 172 -360 -510 -214 -7 -18 312 -371 -357 -250 187
6738 187 129 277 23 -181 -389 -61 273 246 160 -95 -133 -156 65 160 177 -223 -549 -404 -95 432 566 20
6760 20 -162 -408 -355 -88 378 215 -3 -653 -133 138 340 242 168 -327 -286 -332 -113 589 51 -87 -389 -259
6782 -259 139 439 231 -10 -293 -239 220 599 321 257 -216 -304 -76 478 507 579 -56 -152 -244 206 441 421 153
$$ packed form
6630B27J81pr20L98j68O01L6k90l95j71K24L53N75k17m21m06K18K24M46j05q5
6651B98o20m6K56J22L10j4q4q36M26J43O14k16l37k91j1L02n5L54j81j92k72l7
6673c67N02L00m36K32l25K30l05L80K93l03n91J60O4K90L40q9m68k35J5L10L11
6694C08m1k91j35l66L34N98Pl78l01k68L50Q9Q36n10k06n45L3K53M22L9p5k53
6716a00n70N31J99K49O7o55j89J8J4N23l6J21n32j50K96K07j1L30o83J4J07M37
6738A87n8J48k54k04k08L28L34k7q6k55l8k3K21R5J7m00l26J45L09N27J34n46
6760B0j82k46N3K67M66j63k18o50N20K71K02r8p4m95M1m6K19P02n38j38l02J30
6782b59L98L00k08k41k83N4M59L79k78o4m73q8K28N54K9P2o35r6r2M50K35k0k68
$$ plain form
6805 153 -24 -690 36 -116 145 241 -232 -375 -86 287 501 303 -158 -396 -60 -12 353 494 287 -170 -348
6826 -348 -131 134 535 261 -128 -210 -359 94 317 300 253 -337 -494 -371 204 301 165 101 -395 -354 -112 382
6848 382 329 335 -286 -376 -133 287 430 72 -236 -223 -390 -214 448 364 -64 -372 -238 -269 206 311 94 18 -242
6871 -242 -227 331 330 318 122 -524 -376 -195 348 389 -23 -319 -468 -361 280 307 120 -251 -366 -497 -21 460
6893 460 552 118 -45 -347 -97 13 -71 549 -17 -235 -82 -262 132 300 -66 -213 -347 -210 101 13 -5
6914 -5 -432 -485 -205 147 330 216 -105 -486 -313 -90 41 176 207 -43 -228 -301 -22 315 284 149 -125 -306
6936 -306 26 265 122 227 -210 -337 -123 85 315 329 -229 -484 -216 57 1 34 215 -129 -300 -173 -76
6957 -76 48 124 27 -249 28 17 373 -6 -72 -52 -411 97 260 345 215 -253 -151 -150 15 97 26 -252 -338 -440
$$ packed form
6805A53j77o66P26j52K61R6m73j43K89L73K14j98m61k38L36M8L65J41k07m57j78
6826c48K17K65M01k74l89q2j49M53K23j7m7n90j57J23N75R7j36o4m96M1K42M94
6848C82n3Oo21r0K43M20J43l58l08J3j67J76O62q4m28l08J34l1M75J05k17p6k60
6871b42J5N58jj2j96o46J48J81N43M1m12k96j49J07O41K7j87l71j15j31M76M81
6893D60R2m34j63l02K50J10q4O20n66k18J53j80L94J68l66j47j34J37L11q8j8
6914em27n3K80L52J83j14l21l81J73K23J31J35L1k50j85p3K79L37l1j35k74j81
6936c06L32K39j43J05m37j27K14K08K30J4n58k55K68K73n6L3J81l44j71J27R7
6957g6J24P6r7k76K77j1L56l79o6K0l59N08J63Q5j30m68J02JJ65Q2p1k78q6j02
$$ plain form
6981 -440 17 390 15 -104 -474 -292 -213 -181 66 221 -197 37 494 190 74 66 59 -208 -25 -76 176 -183
7003 -183 -11 210 -171 -70 -41 355 -64 -476 -187 -176 243 289 147 290 30 -300 157 4 305 -66 -42
7024 -42 -303 -83 311 394 116 19 71 -58 74 341 327 -62 -46 -118 193 180 423 181 -15 -85 -228 403 227
7047 227 127 -180 -94 -91 205 264 446 174 -71 -48 41 267 545 167 -208 -163 -97 -279 147 198 276 -40 -277
7070 -277 -77 81 -1 358 -105 -424 178 46 184 252 -92 -257 21 -32 218 251 83 -385 -91 205 209 172
7092 172 57 56 -560 -236 153 -125 101 -135 47 -259 -166 30 76 -46 -257 -281 -458 -74 -149 17 -102 -92
7114 -92 -255 -190 65 -283 41 -26 -204 -18 -13 345 198 -34 -295 -358 -78 186 197 -262 -48 -391 -115 153
7136 153 1 -12 -97 -293 -4 -200 90 155 -220 -81 -345 96 -50 61 147 -132 -170 -326 112 -105 73 51
$$ packed form
6981d40M57L73l75j19l70J82P9L2K47J55m18K34M57l04j16qpk67J83n1K52l59
7003a83J72K21l81J01K9L96m19m12K89J1M19M6j42J43k60l30M57j53L01l71K4
7024d2k61K20L94Q3k78r7N2j29J32K67j4l89J6p2L11j3K43k42j96p0j43O31j76
7047B27j00l07Q6LK96N9J82k72k45K3Q9K26K78l78l75M5O6j82M26N1P8l16k37
7070b77K00J58q2L59m63l19O02j32J38O8l44j65K78n3K50L3j68m68K94K96Ml7
7092A72j15jo16L24L89k78K26k36J82l06R3J96M6j22k11k4j77L84p5J66j19J0
7114i2j63O5K55l48L24o7j78J86NL58j47k32k61o3K80K64J1m59K14l43K76K68
7136A53j52j3q5j96K89j96K90O5l75J39k64M41j46J11Q6k79l8j56M38k17J78k2
$$ plain form
7158 51 -243 -11 -1 20 8 -123 73 -160 393 178 116 284 -174 -197 -221 17 37 204 211 -173 -324 78 343
7181 343 56 74 103 -10 -87 229 0 -118 5 94 -97 185 384 19 170 24 -22 23 113 153 -65 33 -212
7204 -212 22 101 -100 292 254 113 223 67 -76 77 316 -98 -128 31 -238 217 -144 -312 -184 -263 -16
7225 -16 -69 194 -113 -124 -247 191 288 -40 -145 -235 -166 40 -61 -244 -20 -66 -408 -97 187 51 -50 -158
7247 -158 -174 -130 151 -12 272 -171 -140 -93 -238 -144 472 -53 -420 -224 -74 410 210 203 -199 -321 -166 14
7269 14 248 360 -154 -96 -295 -151 185 97 236 155 -34 20 -70 269 251 -86 34 -239 -261 96 180 484 275
7292 275 -66 -161 106 369 338 301 170 -266 -275 233 611 291 -27 -85 -255 129 231 486 92 -30 2 102
7314 102 438 257 81 129 127 -100 13 519 157 220 320 -311 91 422 242 22 -282 -216 44 24 118 170 -10
$$ packed form
7158E1k94K32J0K1j2j31J96k33N53k15o2J68m58k3k4K38K0J67Pl84j51M02K65
7181C43k87J8K9j13p7L16k29j18J23Q9j91K82J99l65J51j46m6M5R0M0k18R8k45
7204b12K34P9k01L92l8j41J10j56j43J53K39m14l0J59k69M55l61j68J28p9K47
7225a6n3K63l07j1j23M38R7l28j05r0O9K06j01j83K24m6l42L11K84j36j01j08
7247a58j6M4K81j63K84m43L1M7j45R4O16n25l67J96J50M84k00pm02j22J55J80
7269A4K34J12n14N8j99J44L36q8J39q1j89N4r0L39j8l37J20k73k2L57Q4L04k09
7292B75l41r5K67K63l1l7j31m36rN08L78l20l18n8j70L84J02K55l94j22L2J00
7314A02L36j81j76M8kk27J13N06l62O3J00o31M02L31j80k20l04O6K60k0R4N2j80
$$ plain form
7337 -10 -329 -87 -97 117 138 -23 -233 -359 -57 171 162 7 -91 -243 -88 65 365 -84 87 -198 -272 -68
7359 -68 128 154 112 26 -351 -161 127 407 196 -138 -107 -351 -86 -49 -170 -74 -70 -136 -75 70 -132 174 110 -336
7383 -336 -216 -14 177 52 -55 -88 -1 41 -5 -58 -132 16 -88 -205 192 -82 -223 -156 -70 -320 -200 150 43
7406 43 106 -264 -266 -106 127 189 106 207 -258 -44 -18 100 214 103 -170 -332 -371 157 139 -85 -96 -247 -481
7429 -481 17 -101 49 89 -260 -3 41 70 210 -74 291 -132 137 -32 402 150 -160 -137 -17 285 342 416
7451 416 -108 230 167 -25 303 212 419 -193 -121 -137 -99 112 108 -12 126 8 102 -74 -22 227 162 -76 -199
7474 -199 120 187 135 23 84 -66 32 -11 288 299 -29 -111 130 238 120 159 263 -206 206 47 261 105 -37
7497 -37 -416 -275 -123 122 306 -37 -64 -61 -273 7 16 350 201 -149 -117 85 331 117 -45 -254 5 -80 -265
$$ packed form
7337a0l19K42j0K14K1j61k10j26L02K28rj55r8j52J55J53L00m49J71k85p4K04
7359f8J96K6m2q6l77J90K88K80k11l34L1k44K65L7j21R6Mo6O1J45k02L06o4m46
7383c36J20K02J91j25j07l3Q7M2m6n3p4J48j04j17L97k74j41O7Q6k50J20L50j07
7406D3O3l70kJ60K33O2q3J01m65K14K6J18J14j11k73j62l9N28j8k24j1j51k34
7429d81M98j18J50M0l49K57M4K9J40k84L65m23K69j69M34k52l10K3J20L02N7P4
7451D16n24L38o3j92L28r1K07o12P2j6L8K11mj20J38j18R4j76N2K49o5k38j23
7474a99L19O7n2j12O1j50R8m3K99J1l28q2K41J08j18L9J04m69M12j59K14j56j42
7497c7l79J41J52K45J84l43k7Lk12K80RL34j49l50L2K02K46k14j62k09K59q5j85
$$ plain form
7520 -265 158 15 -63 -145 113 48 215 94 -321 -98 21 97 26 57 -362 -386 49 2 -187 113 177 26 -107
7543 -107 -41 20 -44 74 -52 -90 2 9 -103 243 430 40 251 -65 -46 -1 123 -23 -310 -394 -5 486 181
7566 181 -108 -357 -60 -86 5 280 149 -130 -325 -168 207 220 294 -124 -497 -103 -190 199 364 2 89 -114
7588 -114 -429 63 -14 232 12 -207 -189 -96 140 99 -190 -176 -556 -176 242 42 27 35 -481 -207 -369 -126 -36
7611 -36 -17 -140 -653 -305 295 238 96 -102 -308 -404 71 295 177 -45 -430 -383 -152 327 200 42 -197 -112
7633 -112 -508 57 203 107 -2 170 -110 -45 234 28 -20 -379 46 -63 17 217 324 -26 -533 -87 -41 217
7655 217 393 391 13 -329 -6 361 314 182 -94 -295 -162 -63 340 500 172 123 -224 -47 149 245 -3 216
7677 216 -170 -140 -41 155 373 51 -300 92 294 329 -32 212 -34 -93 86 451 351 105 297 31 -203
$$ packed form
7520b65M23j43p8q2K58o5J67j21m15K23J19P6p1L1m19k4M35m7j89L00O4j51j33
7543a07O6O1o4J18j26l8R2Pj12L46J87l90K11l16J9M5J24j46k87q4L89M91l05
7566A81k89k49K97k6R1K75j31k79j95J57L75J3P4m18l73L94q7L89J65l62Q7k03
7588a14l15M92p7K46k20k19J8R3K36m1k89J4l80L80M18k00j5Qn16K74j62K43R0
7611c6J9j23n13L48O00n7j42j98k06r6M75K24j18k22l85M7K31M79j27j58k39Q5
7633a12l96N65J46r6j09J72k80O5K79k06m8l59M25j09Q0K00J07l50n07M46M6K58
7655B17J76kl78l42L23L67m7j32k76k01J33R9M03J60l28m9l47J77J96R6k48K19
7677B16l86L0R9J96K18l22l51L92K02L5l61K44k46n9J79L65j00k46J92k66k34
$$ plain form
7698 -203 207 387 229 23 -269 -184 -172 473 393 467 -16 13 84 -46 147 310 81 -281 -72 -423 149 683
7720 683 136 -82 -375 -23 173 397 304 120 -146 -315 -209 2 158 -99 -126 50 6 310 -35 -209 -29
7741 -29 -173 -310 139 216 202 122 -215 -327 -190 19 85 51 109 -160 -192 -19 -34 0 -162 -17 -193 132 -138
7764 -138 68 12 -128 -164 -233 -6 344 188 327 -131 -444 -161 113 105 -117 -112 -353 -47 153 -42 -26 -68 -205
7787 -205 0 221 270 31 -8 -271 -521 -45 -262 258 217 -34 11 -158 126 340 245 -187 -470 -111 82 180
7809 180 368 40 -211 -127 42 42 216 469 -88 -188 68 72 384 10 -395 -216 -174 39 162 602 224 19
7831 19 -77 -49 381 161 148 -19 -380 -154 -88 121 -28 -115 22 -360 -237 511 325 209 -32 -46 -156 9
7853 9 103 191 214 -306 -177 -88 -102 136 248 -96 56 -347 92 344 -24 123 -141 -353 -129 177 315 13
$$ packed form
7698b03M10J80j58k06k92Q5J2O45q0P4m83K9P1j30J93J63k29l62K09l51N72N34
7720F83n47k18k93L52J96K24r3j84k66j69J06K11J56k57k7J76m4L04l45j74J80
7741b9j44j37M49P7j4q0l37j12J37K09O6l4N8k69l2J73j5L4j62J45j76L25k70
7764a38K06n6j40l6o9K27L50j56J39m58l13K83K74qk22Nk41L06K00j95J6m2j37
7787b05K05K21M9k39l9k63k50M76k17N20m1k51M5j69K84K14r5m32k83L59J93R8
7809A80J88l28k51Q4J69%J74K53n57j00K56ML12l74m05J79M2K13J23M40l78k05
7831A9r6K8M30k20j3j67l61K26O6K09j49q7J37l82J23P48j86j16k41j4j10J65
7853IR4Q8K3n20J29Q9j4K38J12l44J52m03M39K52l68J47k64k12K24L06J38l02
$$ plain form
7875 13 -276 -113 -335 420 164 417 -138 -246 -311 182 11 -11 -86 -379 -594 -229 -148 330 206 -118 -234 -167
7897 -167 -139 135 58 -106 -506 -594 -163 203 237 87 -224 -190 -336 140 213 151 143 -106 -202 139 332 186 188 -196
7921 -196 -190 -120 214 131 334 -126 -183 -94 55 233 295 -116 37 -58 -159 152 361 19 -59 -198 -105 -156 254 139
7945 139 143 -299 -328 6 115 424 49 -65 -374 -137 232 207 255 -38 -126 -185 -31 339 165 121 -262 34 -11
7968 -11 241 216 105 155 99 -81 -182 -96 123 98 -324 -339 -242 -158 233 -131 -181 -307 22 2 343 133 13 -22
7992 -22 -113 31 35 68 -349 -144 -119 -213 46 188 105 149 -110 144 -47 111 62 138 -136 -223 -83 192 114 77 -102
8017 -102 -220 -107 259 338 180 144 -238 -263 23 119 301 52 -283 -325 -138 -249 135 260 -80 -47 126 -49
8039 -49 148 -152 95 -77 -96 -38 63 255 145 -67 13 -336 -169 -75 210 -89 -334 -146 -213 103 262 451
$$ packed form
7875A3k89J63k22P55k56K53n55j08o5M93j71k2p5k93k15L65Q1M78j24l24j16O7
7897a67K8K74p7j64m00q8M31L66L4j50l11L4j46M76P3o2qk49r6L41J93j46Kl84
7921a96OP0L34q3K03m60n7Q9J49J78O2m11J53r5j01L11K09l42p8j39R3n1M10j15
7945A39Mm42k9L34J09L09l75j14l09K37L69k5M8k93q8n9J54L70j74m4l83K96m5
7968a1K52k5j11N0n6j80j01Q6K19k5m22j5R7Q4L91l64n0j26L29k0L41k10j20l5
7992b2r1J44ML3m17K05K5r4K59J42q3M4k59K54j91J58m9P6k74q7J40K75p8l7j79
8017a02j18J13L66P9j58l6l82k5K86R6J82k49l35m2J87j11L84J25l40L3J73j75
8039d9J97l00K47j72j9N8J01J92j10k12Q0l49J67R4K85k99k45J88o7L16J59J89
$$ plain form
8061 451 -417 -282 -94 85 7 235 -82 165 -145 -256 118 66 155 -220 -257 76 30 61 -106 97 -128 83
8083 83 59 86 155 90 -158 -5 -43 177 88 195 -46 -70 -65 -72 114 54 -207 -76 -155 -27 171 238 -152 7 -200
8108 -200 -134 250 100 292 14 178 91 -151 86 308 267 -243 2 -210 -52 190 67 -52 -78 -55 180 116
8130 116 135 45 -61 -55 71 -141 84 55 -104 -148 -42 197 -193 139 171 -62 -2 -34 -7 284 -128 -167 -235 172
8154 172 -85 46 -39 -29 -182 265 187 332 508 88 26 -163 -172 -152 29 31 -127 -191 -549 -182 164 228 176 -299
8178 -299 -7 -133 -28 150 -307 -60 -230 -133 82 248 193 111 153
$$ packed form
8061D51q68J35J88J79p8K28l17K47l10j11L74n2Q9l75l7L33m6L1j67K03k25K11
8083H3k4K7O9o5k48J53l8K20q9J07k41k4NpJ86o0k61J31p9J28J98O7l90J59k07
8108b00O6L84j50J92k78J64q7k42K37K22m1n10K45k12J58K42j23j19k6K3K35o4
8130A16J9r0j06OJ26k12K25k9j59m4J06K39l90L32L2k33O0l2K7K91m12l9o8M07
8154A72k57J31q5J0j53M47p8J45J76m20o2j89rK0J81Kj58o4l58L67L46O4n2m75
8178b99K92j26J05J78m57K47j70R7K15J66n5q2M2
8191A53
$$ Imaginary data points
##PAGE= N=2
##DATA TABLE= (X++(I..I)), XYDATA
$$ plain form
0 0 0 0 0 -7 8 0 8 -8 8 -16 21 -24 32 -40 48 -56 64 -80 96 -109 129 -152 172 -201 231 -262 301 -342 384
29 384 -436 490 -550 617 -691 769 -857 952 -1059 1176 -1301 1443 -1598 1767 -1957 2172
45 2172 -2405 2677 -2985 3334 -3744 4232 -4814 5535 -6447 7645 -9304 11752 -15747 23418
59 23418 -43587 209134 518370 144366 -177261 -274136 -30899 224559 338250 225431 42714
70 42714 -120995 -146029 -40598 158896 282003 216510 -31443 -229621 -183505 87835 295874
81 295874 227093 -52370 -241991 -165112 79467 228465 157333 -39456 -163885 -136512 -11766
92 -11766 103434 151487 103350 -32443 -181211 -199997 -21423 224923 288059 69385 -231635
103 -231635 -304786 -72446 225148 300493 117524 -115343 -197325 -107098 47528 161614 186106
$$ packed form
0@%%%pJ5qQj6J6k4L7m5N6p2Q8j04J20j44J76k05K38k81L24l73M32m93N63o43P26
29C84q20R26j040J167j308J460j626J809k011K235k477K744l041L365l724M129
45B172m577N082n662O319p078P976r046J0349j1982J4092j6949K1056k7499L9165
59B3418o7005K52721L09236l74004l21627r6875K43237K55458J13691j12819j82717
70D2714j63709k5034J05431J99494J23107o5493k47953j98178M6116K71340K08039
81B95874o8781k79463j89621P6879K44579J48998p1132j96789j24429K7373J24746
92a1766J15200M8053m8137j35793j48768j8786J78574K46346O3136k18674l01020
103b31635p3151K32340K97594P5345j82969k32867q1982R0227J54626J14086K4492
$$ plain form
114 186106 110095 -34577 -151349 -128150 46396 228543 235497 42060 -158918 -158138 36503
125 36503 210582 188312 20075 -104007 -71763 48847 121223 93240 23061 -20523 -29300
136 -29300 -20940 13081 77622 113786 43786 -100811 -165399 -50381 139197 188623 30799
147 30799 -170592 -208624 -62884 96980 119374 16758 -90150 -127195 -108642 -67537 -11050
158 -11050 44917 44733 -45847 -163713 -188292 -78036 60785 78181 -42851 -167905 -163088 -52273
170 -52273 27919 -3689 -86039 -112184 -64198 -17336 -29098 -68592 -74317 -44352 -32004 -54816
182 -54816 -60445 -15509 24439 -17055 -107329 -126164 -23281 95389 89277 -36298 -138877 -106674
194 -106674 12194 87210 60539 -8572 -40753 -28345 -14769 -12302 10248 56484 73153 19516
$$ packed form
114A86106p6011j44672j16772K3199J74546J82147O954j93437k00978P80J94641
125C6503J74079k2270j68237j24082L2244J20610P2376k7983p0179m3584q777
136b9300Q360L4021O4541L6164p0000j44597o4588J15018J89578M9426j57824
147C0799k01391l8032J45740J59864K2394j02616j06908l7045J8553M1105N6487
158a1050N5967j84r0580j17866k4579J10256J38821J7396j21032j25054M817J10815
170e2273Q0192l1608q2350k6145M7986M6862j1762l9494n725K9965J2348k2812
182e4816n629M4936L9948m1494r0274j8835J02883J18670o112j25575j02579L2203
194a06674J18868P5016k6671o9111l2181J2408J3576K467K2550M6236J6669n3637
$$ plain form
206 19516 -57023 -65566 13771 92267 78930 -6058 -56296 -13084 61334 68212 -427 -52791
218 -52791 -19459 55506 75917 18587 -41518 -36962 6700 23232 6042 4633 31599 31400 -30191
231 -30191 -91499 -61430 45249 108788 46294 -77243 -126014 -55475 47070 72566 13281
242 13281 -49282 -55164 -26029 -10429 -13640 -3578 19836 15883 -29247 -64389 -36207 31880 58030
255 58030 3873 -65549 -60094 21292 82136 47039 -45129 -82455 -19287 68244 83668 24851
267 24851 -29104 -29356 -2648 11872 25048 57367 78011 36562 -48635 -81727 -5486 113024
279 113024 143288 48338 -71008 -88748 3104 98893 105584 38980 -18876 -23569 937 20673
291 20673 35788 53962 55782 16968 -37866 -44286 21105 91920 81282 -10184 -82162 -49216
$$ packed form
206A9516p6539q543P9337P8496j3337q4988n0238M3212P4418O878o8639n2364
218e2791L3332P4965K0411n7330o0105M556M3662J6532j7190j409K6966j99o1591
231c0191o1308L0069J06679O3539o2494j23537m8771P0539J02545K5496n9285
242A3281o2563n882K9135J5600l211J0062K3414l953m5130l5142K8182O8087K6150
255E8030n4157o9422N455Q1386O0844l5097r2168l7326O3168Q7531J5424n8817
267B4851n3955k52K6708J4520J3176L2319K0644m1449q5197l3092P6241J18510
279A13024L0264r4950j19346j7740R1852R5789O691o6604n7856m693K4506J9736
291B0673J5115J8174J820l8814n4834o420O5391P0815j0638r1466p1978L2946
$$ plain form
303 -49216 53874 108500 51278 -48978 -80976 -21817 50474 62844 26228 -8215 -23894 -36862
315 -36862 -39398 -339 65480 85285 12278 -92832 -115086 -18373 100563 115663 14492 -93543
327 -93543 -101625 -18401 60310 68439 22934 -21290 -39923 -39568 -22370 17477 58726 53928 -11035
340 -11035 -78196 -69295 18501 94426 71176 -30540 -97358 -54820 44983 88966 37550 -39283
352 -39283 -59622 -21593 17821 29099 28548 25545 1139 -46014 -65271 -12634 72626 96492 16996
365 16996 -87914 -103604 -11865 88884 94148 8780 -68914 -68911 -11714 35488 40388 23625 4690
378 4690 -18952 -42930 -39412 8497 62759 60161 -11716 -80863 -66039 22573 87169 53969 -36791
391 -36791 -80694 -34255 39327 57025 14465 -26294 -26952 -10643 -5463 -532 21558 39398 12508
$$ packed form
303d9216J03090N4626n7222j00256l1998N9159P2291J2370l6616l4443j5679j2968
315c6862k536L9059O5819J9805p3007j05110k2254R6713J18936J5100j01171j08035
327i3543q082Q3224P8711Q129m5505m4224j8633L55J7198L9847M1249m798o4963
340a1035o7161Q901Q7796P5925k3250j01716o6818M2538R9803M3983n1416p6833
352c9283k0339L8029L9414J1278n51l003k4406m7153j9257N2637Q5260K3866p9496
365A6996j04910j5690R1739J00749N264q5368p7694LN7197M7202M900j6763j8935
378D690k3642k3978L518M7909N4262k598p1877o9147J4824Q8612O4596l3200r0760
391c6791m3903M6439P3582J7698m2560m0759o58J6309N180M931K2090J7840k6890
$$ plain form
404 12508 -46233 -69065 -14578 64593 78491 3971 -78207 -77440 1091 67015 54218 -10034
416 -10034 -51247 -38308 -4775 10720 9893 11183 9797 -12619 -45413 -46427 1103 51394 41281
429 41281 -29145 -82349 -53375 26633 63801 16423 -55020 -67122 -15423 29180 19884 -14746
441 -14746 -25587 -12628 -10128 -23686 -19805 13582 34662 4889 -51622 -63421 -6094 58190
453 58190 52655 -17692 -70687 -46469 21975 54844 23350 -23639 -32916 -7658 11045 6971 2178
466 2178 12999 20123 -1581 -33010 -28426 20293 58370 33721 -32897 -61763 -14912 51800 57478
479 57478 -1639 -50050 -34120 15368 33300 8239 -16476 -10814 2859 -6333 -24059 -14803 18673
492 18673 29085 -8986 -55873 -50819 6429 48079 20516 -44694 -70546 -30147 23831 28648
$$ packed form
404A2508n8741k2832N4487P9171J3898p4520q2178P67P8531O5924j2797o4252
416a0034m1213J2939L3533J5495q27J290j386k2416l2794j014M7530N0291j0113
429D1281p0426n3204K8974Q0008L7168m7378p1443j2102N1699M4603r296l4630
441a4746j0841J2959K500j3558L881L3387K1080k9773n6511j1799N7327O4284
453E8190n535p0347n2995K4218O8444L2869l1494m6989r277K5258J8703m074m793
466B178J0821P124k1704l1429M584M8719L8077k4649o6618k8866M6851O6712N678
479E7478n9117m8411J5930M9488J7932k5061k4715N662J3673r192j7726R256L3476
492A8673J0412l8071m6887N054N7248M1650k7563o5210k5852M0399N3978M817
$$ plain form
504 28648 -13395 -46780 -37425 -9328 -1795 -15069 -18931 -4924 -1364 -25404 -49777 -32661 16979
517 16979 37845 -3834 -62629 -63188 -1494 49252 29436 -31329 -56036 -21367 22632 25086 -2504
530 -2504 -14795 102 9863 -3247 -14130 5775 38858 37615 -5365 -37498 -11826 47822 70445
543 70445 27663 -28843 -30732 21409 65186 53236 8760 -12468 6624 32517 34155 22026
555 22026 23351 35349 29390 -57 -13215 19526 66135 64879 7073 -40701 -19599 45773 76942
568 76942 39030 -18208 -29515 7521 39194 32603 8894 2433 10796 6989 -9782 -9703 19065
581 19065 42248 21397 -29291 -48646 -8296 46381 50065 -4206 -53296 -42497 10986 42819
593 42819 22516 -17546 -31110 -12939 3848 1360 -1499 10922 18931 -3004 -37812 -36034 14514
$$ packed form
504B8648m2043l3385R355K8097P533j3274l862J4007L560k4040k4373J7116M9640
517A6979K0866m1679n8795n59O1694N0746j9816o0765k4707L4669M3999K454k7590
530b504j2291J4897R761j3110j0883J9905L3083j243m2980l2133K5672N9648K2623
543G0445m2782n6506j889N2141M3777j1950m4476k1228J9092K5893J638j2129
555B2026J325J1998n959k9447j3158L2741M6609j256n7806m7774K1102O5372L1169
568G6942l7912n7238j1307L7036L1673o591k3709o461Q363l807j6771P9K8768
581A9065K3183k0851n0688j9355M0350N4677L684n4271m9090J0799N3483L1833
593D2819k0303m0062j3564J8171J6787k488k859J2421Q009k1935l4808J778N0548
$$ plain form
606 14514 58471 39386 -26010 -60158 -22440 41952 59683 18491 -26522 -26682 5320 25522
618 25522 19559 10841 15101 16708 -928 -19439 -4998 35794 54467 20383 -32312 -41682 6431
631 6431 55990 49604 -3147 -41907 -27125 15826 34771 15218 -11147 -15612 -6865 -9138 -16976
644 -16976 -8545 15637 18014 -19179 -59151 -50043 3986 38598 9975 -50401 -73168 -38255 8290
657 8290 13041 -20156 -46821 -42297 -25798 -24286 -30903 -24117 -8874 -12368 -42145 -63086 -42637
670 -42637 1325 17458 -17034 -61846 -64054 -21001 16896 8039 -30819 -49624 -29937 -2289
682 -2289 99 -15987 -19310 -4809 532 -16337 -30166 -11282 22779 27669 -7179 -39305 -24603
695 -24603 21505 43304 16826 -21497 -24133 7817 31959 21322 -1591 -3586 13412 20025 5901
$$ packed form
606A4514M3957j9085o5396l4148L7718O4392J7731m1192m5013j60L2002K0202
618B5522n963q718M260J607j7636j8511J4441M0792J8673l4084n2695r370M8113
631F431M9559o386n2751l8760J4782M2951J8945j9553k6365m465Q747k273p838
644a6976Q431K4182K377l7193l9972R108N4029L4612k8623o0376k2767L4913M6545
657H290M751l3197k6665M524J6499J512o617O786J5243l494k9777k0941K0449
670d2637M3962J6133l4492m4812k208M3053L7897q857l8858j8805J9687K7648
682b289K388j6086l323J4501N341j6869j3829J8884L4061M890l4848l2126J4702
695b4603M6108K1799k6478l8323k636L1950K4142j0637k2913j995J6998O613j4124
$$ plain form
708 5901 -5016 8265 30104 27471 -594 -18794 -868 31513 37515 8999 -19338 -12589 18908
721 18908 33181 12996 -12804 -10921 13123 22658 4233 -14641 -5997 16454 18516 -4566 -20514
734 -20514 -5712 18840 17237 -9380 -24459 -6341 20977 18606 -11201 -28387 -9810 19799
746 19799 21705 -5053 -24009 -11539 13355 17250 -1272 -13278 -1949 14336 10926 -6499 -10975
759 -10975 7029 25464 17149 -8434 -16029 7251 32758 27906 -2115 -16714 4407 33402 33165
772 33165 6245 -9593 5183 28056 28478 10348 2909 15515 26069 16014 -503 4494 29045
785 29045 39932 17574 -13362 -13120 19426 45197 32724 -1715 -17834 -715 22504 25219 9231
798 9231 -543 3651 8325 451 -7824 -407 17213 19677 -3763 -27150 -20241 11101 27617 6863
$$ packed form
708E901j0917J3281K1839k633k8065j8200J7926L2381O002k8516k8337O749L1497
721A8908J4273k0185k5800J883K4044R535j8425j8874Q644K2451K062k3082j5948
734b0514J4802K4552j603k6617j5079J8118K7318k371k9807j7186J8577K9609
746A9799J906k6758j8956J2470K4894L895j8522j2006J1329J6285l410j7425m476
759a0975J8004J8435q315k5583p595K3280K5507m852l0021j4599K1121K8995k37
772C3165k6920j5838J4776K2873M22j8130p439J2606J0554j0055j6517M997K4551
785B9045J0887k2358l0936K42L2546K5771j2473l4439j6119J7119K3219K715j5988
798I231r774M194M674p874q275P417J7620K464k3440k3387O909L1342J6516k0754
$$ plain form
812 6863 -27280 -32855 -4692 20340 11806 -16119 -27883 -14268 1466 787 -8807 -8055 -1048 -5273
826 -5273 -22485 -26617 -4190 22884 19512 -16953 -44884 -30708 11199 33974 15284 -20182 -32866
839 -32866 -15123 7250 12752 5913 1143 243 -5964 -15536 -11873 10571 29563 19039 -14413 -33083
853 -33083 -10973 27093 37224 7022 -25894 -23538 6892 27699 17588 -4817 -12603 -4492 2091
866 2091 1430 4563 13233 13455 -7001 -29262 -23572 12252 38980 23203 -21440 -47748 -27240 15004
880 15004 34186 14434 -17663 -30840 -21017 -5699 3045 6448 7597 -1233 -21424 -35555 -22269
893 -22269 11406 29792 8320 -31470 -45685 -16934 20422 23827 -6464 -31894 -25952 -1363
905 -1363 10441 2654 -8370 -9859 -8573 -12185 -12401 1215 17688 13102 -15618 -38281 -23303 18022
$$ packed form
812F863l4143n575K8163K5032q534k7925j1764J3615J5734o79r594P52P007m225
826e273j7212m132K2427K7074l372l6465k7931J4176M1907K2775j8690l5466j2684
839c2866J7743K2373N502o839m770r00o207r572L663K2444J8992j0524l3452j8670
853c3083K2110L8066J0131l0202l2916K356L0430K0807j0111k2405p786Q111O583
866B091o61L133Q670K22k0456k2261N690L5824K6728j5777m4643k6308K0508M2244
880A5004J9182j9752l2097j3177R823J5318Q744L403J149q830k0191j4131J3286
893b2269L3675J8386k1472l9790j4215K8751L7356L405l0291k5430N942K4589
905a363J1804p787j1024j489J286l612k16J3616J6473m586k8720k2663J4978M1325
$$ plain form
919 18022 40909 18344 -25125 -41991 -17513 19305 31765 14692 -7890 -16581 -12116 -4946 3744
932 3744 16379 23618 11352 -16146 -30574 -10589 26850 39627 12447 -23998 -27769 2563 29466
945 29466 23252 -3490 -16524 -5051 11769 13263 5284 1120 2749 -184 -7505 -4587 14064 27470
959 27470 13342 -19219 -33101 -8104 31242 42141 11828 -27376 -34337 -6283 23831 28894
971 28894 11636 -5958 -12494 -11580 -6768 4615 20391 25171 5422 -24063 -30158 -1783 32786
984 32786 33303 -1295 -30377 -21756 10706 28792 13889 -10975 -17280 -3815 9236 9670 4670
997 4670 3246 286 -9953 -16020 -3325 22470 30635 4832 -31871 -38770 -4220 36197 40546
1010 40546 4294 -32796 -35879 -7880 20472 25206 11998 -3688 -14626 -20224 -15800 4510 27542
$$ packed form
919A8022K2887k2565m3469j6866K4478L6818J2460j7073k2582q691M465P170Q690
932C744J2635P239j2266k7498j4428J9985L7439J2777k7180l6445l771L0332K6903
945B9466o214k6742j3034J1473J6820J494p979m164J629k933p321K918J8651J3406
959B7470j4128l2561j3882K4997L9346J0899l0313l9204o961K8054L0114N063
971B8894j7258j7594o536R14M812J1383J5776M780j9749k9485o095K8375L4569
984C2786N17l4598k9082Q621L2462J8086j4903k4864o305J3465J3051M34n000
997D670j424k960j0239o067J2695K5795Q165k5803l6703o899L4550M0417M349
1010D0546l6252l7090l083K7999K8352M734j3208j5686j0938n598M424K0310K3032
$$ plain form
1023 27542 28438 -1889 -35682 -34537 2965 36722 30081 -7569 -33012 -21054 9943 24726 11888
1036 11888 -7527 -13059 -6283 128 4265 9968 13019 3251 -16547 -23988 -3515 28758 36249 6070
1050 6070 -33210 -37785 -2835 35693 38955 7583 -24828 -28808 -8294 12999 21113 18309 8599
1063 8599 -7972 -24255 -22607 4036 34240 34487 -87 -35655 -32836 4246 34162 26643 -5403
1076 -5403 -24163 -14591 6323 13459 6231 -1302 -2364 -3373 -7235 -4854 7739 17153 7024 -16849
1090 -16849 -25801 -5278 25685 30564 2518 -29741 -30558 -229 27818 27256 3032 -16871 -17552
1103 -17552 -6180 4281 10955 16211 14185 -2188 -22172 -22983 3334 31435 29651 -1277 -27779
1116 -27779 -21260 8714 26223 15432 -6281 -12574 -1220 8751 6388 -180 297 4547 2481 -4243
$$ packed form
1023B7542Q96l0327l3793J145L7502L3757o641l7650k5443J1958L0997J4783j2838
1036A1888j9415n532O776O411M137N703L051r768j9798p441K0473L2273P491l0179
1050F070l9280m575L4950L8528L262l1372l2411l980K0514K1293Q114k804r710
1063H599j6571j6283J648K6643L0204K47l4574l5568K819L7082K9916p519l2046
1076e403j8760R572K0914P136p228p533j062j009l862K381J2593R414j0129k3873
1090a6849q952K0523L0963M879k8046l2259q17L0329K8047n62k4224j9903o81
1103a7552J1372J0461O674N256k026j6373j9984q11K6317K8101j784l0928k6502
1116b7779O519K9974J7509j0791k1713o293J1354R971k363o568M77M250k066o724
$$ plain form
1130 -4243 -3882 7607 14426 3291 -15713 -18147 2771 24190 20076 -7668 -28848 -20240 7151
1143 7151 22765 12226 -8503 -17729 -12152 -4724 -2328 847 7025 5595 -9810 -25757 -22154 1483
1157 1483 18918 9256 -18135 -31304 -16150 7213 10676 -6939 -21823 -16795 -2375 2466 -5395
1170 -5395 -12894 -11149 -6387 -7332 -9907 -5104 3510 2290 -12484 -25268 -17247 7696 22625 8886
1184 8886 -20227 -31880 -14532 13355 21973 7351 -11349 -15302 -7666 -154 4466 9316 12809
1197 12809 6118 -9944 -17968 -4828 19213 27222 8515 -15842 -17930 4148 24423 19805 -677
1210 -677 -12669 -4636 10297 15343 9077 2437 224 -839 -2543 1273 12021 19541 10197 -11412
1224 -11412 -21565 -6614 21268 31385 11632 -18398 -26830 -6808 17813 23346 8320 -6899
$$ packed form
1130d243L61J1489O819j1135j9004k434K0918K1419m114k7744k1180Q608K7391
1143G151J5614j0539k0729r226N577P428K396L175O178j430j5405j5947L603K3637
1157A483J7435r662k7391j3169J5154K3363L463j7615j4884N028J4420M841p861
1170e395p499J745M762r45k575M803Q614j220j4774j2784Q021K4943J4929j3739
1184H886k9113j1653J7348K7887Q618j4622j8700l953P636P512M620M850L493
1197A2809o691j6062q024J3140K4041Q009j8707k4357k088K2078K0275m618k0482
1210f77j1992Q033J4933N046o266o640k213j063j704L816J0748P520r344k1609
1224a1412j0153J4951K7882J0117j9753l0030q432K0022K4621N533j5026j5219
$$ plain form
1236 -6899 -11964 -9183 -3552 4424 13773 15025 1014 -18210 -21579 -1273 22794 23645 -529 -23175
1250 -23175 -19311 5050 21435 15068 -4181 -13501 -7377 3707 9608 9196 6368 1287 -5942 -9558
1264 -9558 -1014 16177 23917 10602 -13841 -22512 -3643 24176 31301 10840 -14515 -19384 -2012
1277 -2012 16895 20892 11741 1082 -4986 -7432 -4318 6911 19568 19721 1567 -18504 -17967 4617
1291 4617 25655 21049 -3043 -20917 -14182 6447 17489 10378 -3901 -11118 -8308 -2397 2359
1304 2359 5569 6131 -880 -12823 -17943 -7755 11410 17875 1900 -21795 -27440 -8557 14774
1317 14774 17459 -1441 -20141 -21178 -7878 3734 5827 1762 -3638 -10348 -15754 -13564 -381
1330 -381 13029 10841 -8276 -24786 -19254 3696 18970 10864 -10435 -20789 -11740 4949 11717
$$ packed form
1236f899n065K781N631P976R349J252j4011j9224l369K0306K4067Q51k4174k2646
1250b3175L864K4361J6385o367j9249r320O124J1084N901m12k828n081p229l616
1264i558Q544J7191P740j3315k4443q671J8869K7819P125k0461k5355m869J7372
1277b012J8907L997r151j0659o068k446L114J1229J2657J53j8154k0071N37K2584
1291D617K1038m606k4092j7874O735K0629J1042p111j4279p217K810N911M756
1304B359L210N62p011j1943n120J0188J9165O465j5975k3695n645J8883K3331
1317A4774K685j8900j8700j037J3300J1612K093m065n400o710n406K190J3183
1330c81J3410k188j9117j6510N532K2950J5274q106k1299j0354R049J6689O768
$$ plain form
1343 11717 5838 -3523 -7733 -6462 -3305 1911 8408 10683 2412 -10647 -14350 -1680 16875 20690
1357 20690 3647 -16333 -16824 1743 18913 17386 1757 -10914 -8768 142 6862 8188 7334 4218
1371 4218 -3779 -10820 -7299 6768 18071 11151 -8563 -19959 -10294 10527 18774 6816 -11319
1384 -11319 -16898 -6676 5754 8902 3235 -3712 -7619 -9220 -7591 -1256 7525 8751 -2746 -17079
1398 -17079 -18491 -2445 14649 13564 -4646 -20268 -16812 432 12367 7898 -4117 -10740 -8575
1411 -8575 -3090 904 4079 5792 2158 -7544 -13644 -6927 9336 17294 6810 -12239 -18169 -4624
1425 -4624 14012 17625 4904 -9636 -11627 -2378 7216 9803 6914 2208 -2752 -6817 -5472 4093
1439 4093 14303 14004 172 -14152 -12321 4590 19394 14625 -2797 -14125 -8050 6064 12614
$$ packed form
1343A1717n879r361m210J271L157N216O497K275q271j3059l703J2670J8555L815
1357B0690j7043j9980m91J8567J7170j527j5629j2671K146Q910O720J326q54l116
1371D218p997p041L521J4067J1303o920j9714j1396R665K0821Q247j1958j8135
1384a1319n579J0222J2430L148n667o947l907j601J629O335Q781J226j1497j4333
1398a7079j412J6046J7094j085j8210j5622L456J7244J1935m469j2015o623K165
1411h575N485L994L175J713l634r702o100O717J6263P958j0484j9049n930J3545
1425d624J8636L613j2721j4540j991R249R594K587k889m706m960m065J345R565
1439D093J0210k99j3832j4324J831J6911J4804m769j7422j1328O075J4114O550
$$ plain form
1452 12614 7367 -532 -3805 -3074 -1973 693 6264 9713 4374 -7522 -13085 -3528 12308 16545
1466 16545 3653 -13353 -15370 -742 13442 13331 1480 -8816 -8780 -2030 3785 6195 6165 4075
1480 4075 -2608 -9155 -8240 3037 14526 12902 -2216 -14837 -10913 5542 16067 10104 -3891
1493 -3891 -9798 -3950 4641 6967 3729 1043 654 -616 -3395 -1332 5721 10533 5260 -6761 -10725
1508 -10725 -694 12525 13836 1178 -11104 -9749 2232 11642 9106 298 -5339 -4143 -898
1521 -898 820 3101 6237 5999 -977 -9435 -9129 1886 12753 10288 -3817 -13178 -8418 4418 9744
1536 9744 3557 -5418 -5950 -1005 1643 -497 -2201 -283 2251 -801 -5847 -5163 2176 6305 840
1551 840 -8315 -9505 -252 8348 6062 -4767 -11265 -6587 3091 6643 1669 -4238 -4717 -1980 -1206
$$ packed form
1452A2614n247p899l273P31J101K666N571L449n339j1896n563R557J5836M237
1466A6545j2892j7006k017J4628J4184j11j1851j0296L6O750N815K410l0k090
1480D075o683o547R15J1277J1489j624j5118j2621L924J6455J0525n963j3995
1493c891n907N848Q591K326l238k686l89j270k779K063P053M812n273j2021l964
1508a0725J0031J3219J311j2658j2282J355J1981R410k536q808n637J196L245
1521h98J718K281L136k38o976q458L06J1015J0867k465j4105r361M760J2836N326
1536I744o187q975n32M945K648k140j704J918K534l052n046O84P339M129n465
1551H40r155j190R253Q600k286j0829o498M678R678L552m974n907m79K737P74
$$ plain form
1566 -1206 -2788 -1443 3121 4482 -1842 -9067 -8532 1595 8873 4622 -5214 -9892 -3525 4524 4798
1581 4798 -2187 -5683 -1845 3502 1971 -3181 -4506 208 3591 1113 -3449 -2570 1845 4000 -746
1596 -746 -5995 -4039 4339 8281 2526 -6086 -7984 73 7523 6461 -200 -3930 -1120 2354 1648
1611 1648 -915 536 4923 4847 -676 -5505 -2540 5250 8656 2670 -4893 -4066 3414 7691 3122 -4163
1627 -4163 -3514 3292 7220 3357 -3046 -3223 1192 3969 1929 -883 452 3075 1846 -3232 -5262
1642 -5262 310 7344 6735 -1780 -9465 -6832 2536 7490 3307 -4098 -5851 -2371 798 -70 -2295
1657 -2295 -1170 1538 161 -4763 -6807 -1974 3736 2753 -4488 -8261 -3825 3262 3602 -3347 -8903
1672 -8903 -5551 2026 4565 -352 -6020 -5934 -1763 808 -740 -1361 -53 608 -2397 -6246 -5180 2033
$$ packed form
1566a206j582J345M564J361o324p225N35J0127P278m251r836m678O367Q049K74
1581D798o985l496L838N347j531n152j325M714L383k478m562Q79M415K155m746
1596g46n249J956Q378L942n755q612j898Q057P450j062o661l730K810L474p06
1611A648k563J451M387p6n523m829K965P790L406n986p563Q27P480M277m569p285
1627d163O49O806L928l863o403j77M415K777k040k812J335K623j229n078k030
1642e262N572P034o09q515p685K633R368M954m183p405j753L480L169q68k225
1657b295J125K708j377m924k044M833N710r83p241l773M436P087L40o949n556
1672h903L352P577K539m917n668Q6M171K571j548o21J308O61l005l849J066P213
$$ plain form
1688 2033 7603 4075 -5544 -10072 -4118 5223 7701 1804 -4768 -4450 597 3025 1245 -58 1544
1703 1544 2821 811 -2575 -1500 3677 6660 2625 -4003 -4271 3109 9056 5599 -2504 -5840 -284
1718 -284 7042 7766 2332 -2781 -2738 739 2765 2792 3246 3873 1649 -2859 -5270 -983 7240 9704 2803
1735 2803 -6789 -8267 -387 7971 7745 205 -5367 -4231 942 3141 1881 795 835 38 -2344 -2849
1751 -2849 956 6127 4926 -1835 -7230 -3369 5906 9527 3373 -4965 -6735 -348 7228 7867 2680
1766 2680 -1942 -2427 -293 2089 4210 5815 5921 1134 -4707 -4685 3018 11098 10522 1517 -7998 -6123
1782 -6123 3449 10972 8598 178 -4685 -2913 1545 3691 4250 3476 1464 -1827 -4936 -2704 3883
1797 3883 7665 3136 -6057 -9742 -3547 5630 7605 212 -8147 -9578 -3355 2926 3611 -576 -4964
$$ packed form
1688B033N570l528r619m528N954R341K478n897o572L18N047K428j780j303J602
1703A544J277k010l386J075N177K983m035o628k68P380N947l457q103l336N556
1718b84P326P24n434n113M3L477K026K7M54O27k224m508k411M287Q223K464o901
1735B803r592j478P880Q358k26p540n572J136N173K199j260j086M0p97k382n05
1751b849L805N171j201o761n395L861R275L621o154q338j770O387P576O39n187
1766B680m622m85K134K382K121J605J06m787n841K2P703Q080n76r005r515J875
1782f123R572P523k374q420m863J772M458K146N59p74k012l291l109K232O587
1797C883L782m529r193l685O195R177J975p393q359j431O223O281O85m187m388
$$ plain form
1812 -4964 -6627 -6226 -4155 -8 2948 897 -5132 -11624 -9732 -375 6525 4110 -6353 -13071 -9989
1827 -9989 50 5615 2763 -4259 -8115 -7087 -2832 400 2019 1762 -1637 -6419 -8250 -3120 4935
1842 4935 7124 788 -7987 -9463 -1431 7025 7627 517 -6432 -6319 -351 4709 5351 2853 -902 -2994
1858 -2994 -3463 -218 4665 7910 4536 -2943 -7755 -3470 5925 11150 6423 -3914 -8888 -3699 5485
1873 5485 8991 5273 -1125 -4642 -3601 -9 3588 6086 4540 -976 -6347 -6268 1011 8586 7685 -984
1889 -984 -8944 -7826 765 8093 6533 -1170 -6990 -6305 -696 3532 4339 1401 -2651 -5743 -5333 -855
1905 -855 4756 6532 832 -7576 -10036 -2933 7046 9503 2093 -7802 -10149 -2827 5775 8134 3301
1920 3301 -2807 -5893 -4576 -272 5064 7724 4163 -3347 -8209 -5214 4296 11252 7757 -2289 -8868
$$ packed form
1812d964j663M01K071M147K956k051o029o492J892R357O900k415j0463o718L082
1827i989J0039N565k852p022l856J028M255L232J619k57l399m782j831N130Q055
1842D935K189o336q775j476Q032Q456O02p110o949J13N968N060O42k498l755k092
1858b994m69L245M883L245l374p479m812M285R395N225m727j0337m974N189R184
1873E485L506l718o398l517J041L592L597K498j546n516n371P9P279P575r01q669
1889i84p960J118Q591P328j560p703n820O85N609M228Q07k938m052l092M10M478
1905h55N611J776n700q408k460P103R979K457p410r895k347P322Q602K359m833
1920C301o108l086J317M304N336K660l561p510m862K995R510O956l495j0046o579
$$ plain form
1935 -8868 -5644 4267 10317 7364 -514 -5860 -4231 1103 6056 6509 3616 -1426 -5135 -4183 2122
1950 2122 8430 8244 90 -8829 -8417 862 10326 9668 422 -9179 -9261 -1258 6613 7948 2893 -3661
1966 -3661 -7975 -6686 -1086 6026 8278 2376 -7608 -11555 -5757 5285 10737 4800 -6496 -12200
1980 -12200 -6513 3660 8757 5235 -3054 -7710 -6227 -105 4996 6561 2769 -4183 -8361 -5542
1994 -5542 3344 10446 7866 -2246 -11176 -8527 3318 12586 10508 -343 -9241 -8768 -196 8458
2008 8458 10860 5300 -2540 -8358 -6902 1828 10739 12205 3655 -8008 -11541 -3059 9580 14342
2022 14342 6420 -5985 -11402 -5299 5433 11205 7117 -1519 -7740 -7035 -687 6805 9352 4094
2036 4094 -5247 -10897 -6975 4249 11964 8329 -4513 -14142 -10486 2106 11977 9407 -1753 -11495
$$ packed form
1935h868L224R911O050k953p878n346J629N334M953M53k893n042l709R52O305
1950B122O308j86q154q919M12R279R464o58r246r601q2Q003P871J335n055o554
1966c661m314J289N600P112K252n902r984l947N798J1042N452n937j1296n704
1980a2200N687J0173N097l522q289m656J483O122N101J565l792o952m178K819
1994e542Q886P102k580j0112q930K649J1845R268k078j0851q898M73Q572Q654
2008H458K402n560p840n818J456Q730Q911J466q550j1663l533Q482J2639M762
2022A4342p922j2405n417O103J0732N772m088q636o221P05O348P492K547n258
2036D094r341n650L922J1224P715l635j2842r629L656J2592R871k570j1160r742
$$ plain form
2050 -11495 -12046 -3820 5853 9950 5328 -4583 -12673 -11569 -1577 9951 11627 1820 -11630 -15740
2064 -15740 -6312 7373 12990 5225 -7952 -13598 -8448 2579 9035 7166 -902 -9093 -10245 -3953
2078 -3953 5022 9818 5477 -5525 -13070 -8573 3651 12348 8808 -3876 -13127 -10180 1379 10932
2092 10932 9546 505 -8786 -10488 -4513 5098 10900 8005 -1568 -10932 -11056 -860 10859 13406
2106 13406 3710 -9249 -13057 -4469 7828 13010 6206 -4492 -9813 -6268 2210 8561 8159 1863
2120 1863 -5390 -7988 -3315 5313 10334 6705 -3621 -9859 -6003 4801 11346 7627 -2906 -9469
2134 -9469 -6181 3022 9508 8216 1106 -5925 -7523 -2986 4662 9805 7216 -1485 -9204 -8734 505
2149 505 10208 10872 1868 -8259 -10435 -2359 7184 9354 3538 -4567 -7700 -4160 2039 6273 5490
$$ packed form
2050a1495n51Q226R673M097m622r911q090J104R992J1528J676r807j3450m110
2064a5740R428J3685N617p765j3177n646N150J1027O456j869q068q191j152O292
2078c953Q975M796m341j1002p545M497J2224Q697l540j2684r251K947J1559R553
2092A0932j386r041r291j702N975R611N802k895r573r364j24J0196J1719K547
2106A3406r696j2959l808Q588J2297N182o804j0698n321L545Q478O351m02o296
2120A863p253k598M673Q628N021l629j0326o238L856J0804O545l719j0533o563
2134i469L288R203O486j292p110p031j598M537P648N143k589q701p719M70R239
2149E05R703O64r004j0127k176Q076R543K170n816q105l133L540O199M234p83
$$ plain form
2164 5490 -375 -5683 -7052 -2095 4933 7903 2484 -6173 -9680 -3665 5872 9199 3309 -6321 -9686
2179 -9686 -4470 3751 8078 5050 -1895 -7872 -7554 -1895 5598 8792 4017 -4774 -10756 -6992 2747
2194 2747 10305 8142 -2003 -10139 -8930 243 8492 8284 928 -6756 -7504 -2943 4043 7419 4523
2209 4523 -1945 -7263 -6283 385 7924 8392 400 -8494 -9459 -915 8585 10507 2094 -7883 -10314 -3784
2225 -3784 5385 9807 5772 -2789 -8899 -7986 -968 8077 10224 3713 -7003 -12087 -6399 5392 12168
2240 12168 7741 -3651 -11667 -8872 1722 9918 8831 526 -7695 -8772 -2765 5006 9050 5401
2254 5401 -3108 -9108 -7441 1735 10507 9546 -90 -9729 -9812 -706 9822 11259 2971 -7118 -10296
2269 -10296 -4085 5884 11371 7917 -1644 -8781 -8494 196 9682 12460 5068 -6642 -11522 -5043 7172
$$ packed form
2164E490n865n308j369M957P028K970n419q657l507O015R537L327n890r630l365
2179i686N216Q221M327l028o945n977L18N659P493L194m775q791n982L764R739
2194B747P558k163j0145q136J209R173Q249k08p356p684p48M561O986L376k896
2209D523o468n318R80O668P539M68p992q894r65Q544R500J922q413r977k431O530
2225c784R169M422m035q561o110R13P018R045K147o511j0716n084N688J1791O776
2240A2168m427j1392q016K795J0594Q196j087q305q221j077O007P771M044l649
2254E401q509o000J667R176Q772r61r636r639q3R106J0528J437q288j0089l178
2269a0296O211R969N487l454r561p137K87Q690R486K778p392j1710m880O479J2215
$$ plain form
2284 7172 13820 9096 -2550 -10420 -8026 2487 10993 10470 2043 -6518 -8660 -3155 5902 10898 6831
2299 6831 -2730 -10001 -8125 1839 10762 9665 -642 -10589 -10777 -1830 8252 9874 2126 -7770 -11670
2314 -11670 -6633 2697 8958 6433 -3102 -11210 -11529 -3433 6638 9632 2149 -9451 -14212 -8538
2328 -8538 3478 9655 5390 -5341 -12718 -10389 -1205 7022 7188 74 -8000 -10952 -5592 3598 9385
2343 9385 5508 -4104 -11384 -8500 1249 9902 8832 -396 -9225 -9471 -1160 7858 10538 4000 -4860
2358 -4860 -8899 -5133 3808 10523 8655 664 -7597 -8400 -399 9116 11543 4680 -5561 -9726 -4158
2373 -4158 6265 11752 7515 -1712 -8175 -6116 1265 8436 8938 2657 -5299 -8344 -3727 5133 9962
2388 9962 6132 -2925 -9475 -6876 2490 9580 7981 -559 -8410 -8218 -1240 6883 8179 3103 -4770
$$ packed form
2284G172O648m724j1646p870K394J0513Q506n23q427q561k142N505R057M996m067
2299F831r561p271J876R964Q923j097j0307r947j88Q947J0082J622p748r896l900
2314a1670N037R330O261k525r535q108l19Q096J0071K994p483j1600m761N674
2328h538J2016O177m265j0731p377K329R184Q227J66p114q074k952N360R190N787
2343I385l877r612p280K884R749Q653j070r228q829k46Q311R018K680o538q860
2358d860m039L766Q941O715j868p991q261q03Q001R515K427o863j0241m165N568
2373d158J0423N487m237r227o463K059P381P171N02o281p956l045M617Q860M829
2388I962l830r057o550K599R366P090j599q540p851J92O978Q123J296n076p873
$$ plain form
2403 -4770 -8894 -5407 2248 8198 7011 -1138 -8289 -8407 -1241 7328 8942 2528 -6185 -9174 -3802
2418 -3802 4790 8677 4882 -2684 -7355 -5367 1468 7006 7600 1544 -5316 -7359 -2395 5547 9104
2433 9104 5267 -3262 -8094 -5004 3671 9059 7323 -415 -6398 -5976 107 6659 8123 3260 -3495
2448 -3495 -6932 -3538 3543 8077 6359 -965 -7144 -6559 158 7144 7595 1287 -5795 -7369 -2338
2463 -2338 4649 6597 2650 -3660 -7594 -5337 550 5545 4921 -804 -6874 -8355 -3029 4108 6610
2478 6610 1928 -5742 -9579 -5714 2166 6065 3702 -3363 -8236 -7083 -1588 4106 5428 625 -4907
2493 -4907 -7464 -4397 1973 6268 4024 -2485 -7176 -5535 589 6215 5790 111 -5471 -5588 -411
2508 -411 5188 6878 2771 -2216 -4971 -2482 3116 6703 6064 667 -4508 -4916 709 7279 8464 3416
$$ packed form
2403d770m124L487P655N950j187q149p151j18P166Q569J614o414q713k989N372
2418c802Q592L887l795p566m671J988O835N538N94o056o860k043M964P942L557
2433I104l837q529m832L090Q675N388j736p738n983M22O083O552J464m863o755
2448c495l437L394P081M534j718p324o179N85O717O986M51o308p082j574N031
2463b338O987J948l947o310l934K257N887M995o24n725o070j481N326P137K502
2478F610m682p670l837L865P880L899k363p065m873J153N495N694J322m803n532
2493d907k557L067O370M295k244o509m691J641O124N626m25n679n582j17N177
2508d11N599J690m107m987k755K489N598L587o39n397n175m08N625O570J185n048
$$ plain form
2524 3416 -3538 -5882 -1739 4974 8267 4978 -1060 -4935 -3771 1250 5846 6171 1991 -3634 -5647
2539 -5647 -2092 3311 6356 3459 -2159 -6191 -4337 1515 5694 4126 -1915 -5897 -5038 -767 3827
2554 3827 4035 105 -4314 -6114 -3237 1484 4926 3120 -2453 -7059 -6291 -343 4991 5067 -293 -6210
2570 -6210 -6995 -2540 3404 5183 1941 -3037 -6483 -4386 480 4434 4103 -68 -4764 -5599 -1617 3296
2586 3296 5237 2084 -3152 -5593 -2482 2956 5486 2941 -2047 -5058 -3103 1487 4738 3922 82
2601 82 -4207 -4529 -1500 3897 6114 3186 -2581 -6285 -3983 2335 6780 5267 -380 -5820 -5109 -446
2617 -446 4529 5924 2001 -3253 -5821 -3020 2027 5121 4238 -677 -4909 -5047 -421 4888 5451 1277
2633 1277 -4490 -5817 -1811 3572 5534 2275 -3094 -5551 -3239 1630 5007 4471 -231 -4937 -5504
$$ packed form
2524C416o954k344M143O713L293l289o038l875J164N021M596L25m180n625k013
2539e647L555N403L045k897n618m032J854N852M179j568o041l982Q59M271M594
2554C827K08l930m419j800K877M721L442j806n573m606P68N948N334P6n360n917
2570f210p85M455N944J779l242m978l446K097M866L954l31m171m696q35L982M913
2586C296J941l153n236k441L111N438K530k545m988l011J955M590L251q16l840
2601H2m289l22L029N397K217k928n767l704K302O318M445j513n647n440P11M663
2617d46M975J395l923n254k568K801N047L094q83m915m232j38M626N309N63m174
2633A277n767j327M006N383J962l259n369k457K312M869L377n36m702m706n67
$$ plain form
2648 -5504 -915 4854 6632 2984 -3644 -6662 -3742 2968 7078 5726 -343 -5888 -5315 -78 5265
2663 5265 6730 2740 -2714 -5388 -2991 2473 6290 5162 108 -4618 -4936 -143 5192 6123 2073
2678 2073 -3733 -5259 -1605 3509 5858 3055 -2314 -4948 -3385 1182 5069 4481 229 -4338 -5410
2693 -5410 -1738 3614 5799 2924 -3021 -6362 -4525 1423 5402 4261 -627 -5288 -5660 -1662 3055
2708 3055 4842 2076 -2628 -5706 -3936 83 3733 3659 -281 -4501 -5249 -1675 2773 3783 581 -3263
2724 -3263 -4507 -2645 1390 3099 1406 -1656 -4001 -3430 -383 2631 2662 -226 -3392 -4176 -1450 2332
2740 2332 3526 1340 -2716 -4258 -2688 1180 3320 2867 -708 -3338 -2996 -513 2686 3466 1300 -1777
2756 -1777 -2916 -1815 1245 2966 2425 -206 -2428 -1984 453 2933 2673 343 -1696 -1553 337 2591
$$ packed form
2648e504M589N769J778l648o628l018K920O710M110j352o069n545N73N237N343
2663E265J465l990n454k674K397N464L817j128n054m726l18M793N335R31m050
2678B073n806j526L654N114K349k803n369k634J563M567L887n88m252m567j072
2693e410L672N352K185k875n945l341J837N948L979j141m888m661l72L998M717
2708C055J787k766m704l078J770M019L650p4l940m220p48L574M448J010l202l844
2724c263j244J862M035J709j693l062k345N71L047L014L1k888l166p84K726L782
2740B332J194k186m056j542J570L868K140m53l575k630L42K483L199P80k166l077
2756a777j139J101L060J721n41k631k222M44K437K480k60k330k039J43J890K254
$$ plain form
2772 2591 2649 878 -1128 -1939 -205 2091 3122 2134 -320 -2369 -1689 1352 3596 3027 549 -2096
2788 -2096 -2432 137 2933 3685 1637 -1110 -2424 -1015 1341 3272 2604 181 -1607 -1834 -324 2086
2804 2086 2897 1055 -1739 -2399 -1157 1789 3223 1690 -1634 -2610 -1637 689 2371 1598 -806 -2427
2820 -2427 -2363 -575 1453 2218 727 -2389 -3264 -2184 742 2352 1670 -1682 -3682 -3210 -431 2157
2836 2157 2356 -212 -2925 -3669 -1951 820 2069 953 -1566 -3231 -2849 -144 1987 2238 -162 -2708
2852 -2708 -3256 -1011 1517 2711 710 -1740 -2640 -1254 940 2192 1504 -602 -2075 -1531 355 2421
2868 2421 2070 788 -1900 -2047 -253 2119 3329 1733 -680 -2329 -923 1465 3043 2214 -149 -1943
2884 -1943 -2084 -31 2398 2816 1250 -1223 -2448 -1698 1246 2715 2379 -463 -2004 -2161 73 2165
$$ packed form
2772B591N8j771k006q11J734K296J031r88k454k049O80L041K244n69k478k645
2788b096l36K569K796P52k048k747j314J409K356J931o68k423j788k27J510K410
2804B086Q11j842k794o60J242K946J434j533l324r76R73K326J682p73k404j621
2820b427O4J788K028P65j491l116q75J080K926J610o82l352k000M72K779K588
2836B157J99k568k713p44J718K771J249j116k519j665L82K705K131K51k400k546
2852b708n48K245K528J194k001k450r00J386K194J252o88k106j473N44J886K066
2868B421l51j282k688j47J794K372J210j596k413j649J406K388J578q29k363j794
2884a943j41K053K429M18j566k473j225P50K944J469l36k842j541j57K234K092
$$ plain form
2900 2165 2105 360 -1924 -2156 -784 1123 1835 937 -1084 -2258 -1342 416 1937 1581 -513 -2217 -2018
2917 -2018 -20 2242 2290 542 -1879 -2055 -688 1621 2681 1565 -665 -2539 -1203 896 2784 3081
2933 3081 747 -1199 -2029 -184 1856 2992 2105 -593 -1694 -908 1253 2629 2189 84 -915 -981 540
2950 540 1919 1820 599 -1144 -1374 -169 1363 1762 490 -1013 -1881 -1131 837 2203 1025 -1500 -2934
2967 -2934 -2124 152 2070 1543 -675 -2947 -3059 -1488 744 1636 316 -1848 -3612 -2968 -643 1279
2983 1279 1583 -961 -3154 -3298 -1355 740 1371 -199 -2185 -2913 -1312 622 1577 195 -2215 -2947
2999 -2947 -1852 604 2186 1826 -1002 -3389 -2665 77 2744 3568 987 -2366 -3596 -1256 2466 4724
3015 4724 3291 -388 -3278 -2971 517 4345 4926 2215 -1861 -3313 -1528 2237 5349 4005 59
$$ packed form
2900B165o0j745k284k32J372J907P12q98k021j174R16J758J521l56k094j704J99
2917b018J998K262M8j748k421j76J367K309J060j116k230j874J336K099J888K97
2933C081k334j946q30J845K040J136q87k698j101P86K161J376m40k105r99o6J521
2950E40J379r9j221j743k30J205J532L99j272j503q68P50J968J366j178k525j434
2967b934Q10K276J918n27k218k272j12J571K232Q92j320k164j764O44K325J922
2983A279L04k544k193j44J943K095O31j570j986p28J601J934R55j382k410p32
2999b947J095K456J582l60k828k387P24K742K667Q24k581l353j230K340L722K258
3015D724j433l679k890L07L488L828N81k711m076j452J785L765L112j344l946
$$ plain form
3030 59 -2465 -2613 611 3887 4436 1746 -1548 -2652 -522 2873 4520 2557 -875 -3311 -2031 1325
3046 1325 4034 3457 19 -3566 -3703 -540 3670 4506 1814 -3128 -4957 -3126 1356 4372 3215 -589
3062 -589 -4937 -5237 -1738 3013 4535 2093 -2684 -5541 -4121 282 3985 3287 -363 -4255 -4624 -1622
3078 -1622 2090 3728 1497 -2006 -3942 -2355 1153 3178 2285 -800 -3200 -2665 572 3228 3078 598
3094 598 -2888 -3443 -805 3248 4524 1974 -1929 -4268 -2698 1385 4416 3754 293 -3619 -4171 -957
3110 -957 3050 4588 2347 -1453 -4281 -3252 299 3317 3350 235 -2731 -3291 -1253 1455 2473 995
3126 995 -1758 -2749 -1606 611 2274 1015 -1240 -2946 -2017 330 2025 1657 -993 -3084 -3259 -221
3142 -221 2473 3023 801 -2945 -3990 -1988 1535 3631 2583 -667 -3220 -2958 -188 3031 3685 1405
$$ packed form
3030E9k524j48L224L276N49k690l294j104K130L395J647j963l432k436J280L356
3046A325K709n77l438l585j37L163M210Q36k692m942j829J831M482L016j157l804
3062e89m348l00L499M751J522k442m777k857J420M403L703o98l650l892l69L002
3078a622L712J638k231l503j936J587L508K025q93l085k400N35L237K656j50k480
3094E98l486n55K638M053J276k550l903k339J570M083L031o62l461l912n52L214
3110i57M007J538k241l800k828J029L551L018L3l115k966n60K038K708J018j478
3126I95k753r91J143K217J663j259k255j706R29K347J695l68k650k091j75L038
3142b21K694N50k222l746j045K002L523K096j048l250k553K62K770L219O54k280
$$ plain form
3158 1405 -1654 -3262 -1177 1356 3444 2772 -28 -1883 -1850 648 2744 2511 856 -1018 -1401 367
3174 367 2548 2862 908 -811 -1430 -243 2482 3433 2182 -825 -2637 -1572 1537 3772 3294 283
3190 283 -2545 -2939 -688 2760 4094 2281 -1406 -3418 -2705 756 3359 3492 636 -2777 -3698 -1354
3206 -1354 1807 2954 1260 -1742 -3352 -1998 374 2278 1573 -1419 -3128 -2822 -268 2151 1908 -548
3222 -548 -3328 -3696 -991 2190 2877 674 -2694 -4621 -2726 1233 3781 2499 -1354 -4157 -4497 -984
3238 -984 2923 3972 1115 -2751 -4785 -2999 1085 3430 3483 -382 -3678 -3482 -987 2929 3963 1414
3254 1414 -2182 -3646 -1637 1512 3448 2421 -811 -3293 -2237 803 3773 3497 265 -3106 -3448
3269 -3448 -526 3230 4336 2006 -2339 -4324 -2404 1791 5112 4218 -277 -4047 -4332 -803 3435
$$ packed form
3158A405l059j608K085K533K088o72k800j855L3K498K096k33j655j874l83J768
3174C67K181L14j954j719o19J187K725R51j251l007j812J065L109K235m78l011
3190B83k828l94K251L448J334j813l687k012P13L461K603J33k856l413r21K344
3206a354L161J147j694l002j610J354K372J904p05k992j709L06K554K419k43k456
3222e48k780l68K705L181O87k203l368j927J895L959K548j282l853k803l40L513
3238i84L907J049k857l866k034J786M084K345N3l865l296J96K495L916J034k549
3254A414l596j464K009L149J936j027l232k482J056L040K970k76l232l371l42
3269c448K922L756J106k330m345j985J920M195L321q94m495l770k85L529M238
$$ plain form
3284 3435 5135 2395 -2060 -4700 -2805 1397 4562 4060 25 -3429 -3949 -874 3231 4329 1751
3299 1751 -1613 -3488 -2022 1571 3688 2660 -469 -3293 -2931 192 3384 3671 584 -2764 -3472 -991
3315 -991 2642 4396 2238 -1758 -3880 -2466 975 4413 3829 325 -3568 -4160 -1287 2904 4428 2165
3331 2165 -1637 -4311 -3146 874 3684 3298 299 -3217 -3564 -1435 2282 3249 1078 -1518 -3516 -2111
3347 -2111 932 2967 2025 -1114 -3284 -2736 6 2526 2780 -128 -2756 -3649 -1504 1915 3130 1195
3363 1195 -1990 -4030 -2680 697 3356 3037 -195 -3077 -3564 -1534 1740 3161 1212 -2218 -3486
3378 -3486 -2934 546 2996 2401 -346 -2543 -2647 -379 1852 2692 811 -2071 -2943 -1490 1563 2633
3394 2633 1425 -1092 -2847 -1758 625 2660 2290 -39 -2677 -2724 -106 2299 3200 1204 -1620 -2991
$$ packed form
3284C435J700k740m455k640J895M202L165n02m035l454n20L075M105J098k578
3299A751l364j875J466L593K117j028l129k824L62L123L192K87l087l348p08K481
3315i91L633J754k158l996k122J414L441L438n84l504l893n92K873M191J524k263
3331B165l802k674J165M020K810l86k999l516l47K129L717R67k171k596j998J405
3347b111L043K035r42l139k170N48K742K520K54k908k628q93K145L419J215j935
3363A195l185k040J350L377K659l19l232k882m87K030L274J421j949l430j268
3378c486N52L480K450n95k747k197j04K268K231Q40j881k882q72J453L053J070
3394B633j208k517j755J089K383K035l70k329k638m7K618K405R01j996k824j371
$$ plain form
3410 -2991 -1695 1715 3229 2516 -514 -2800 -2515 -71 2855 3198 1220 -1659 -2517 -1043 1534 3165
3426 3165 2200 -594 -2303 -1656 599 2795 2561 568 -1771 -2469 -55 2501 3060 1593 -1312 -2660
3442 -2660 -1135 1360 3106 2501 -368 -2614 -2176 46 2943 3155 1017 -1744 -2572 -986 1888 3284
3458 3284 2255 -868 -2793 -2300 556 2796 2643 -48 -2424 -2678 -725 1829 2680 1062 -1743 -3139
3474 -3139 -2042 483 2508 1801 -761 -3123 -2985 -363 1942 2560 479 -2167 -3487 -1770 1070 2718
3490 2718 1599 -1098 -3309 -2789 -369 2544 2625 97 -2615 -3239 -1741 1504 2788 1177 -1443 -3384
3506 -3384 -2542 365 2597 2404 -391 -2377 -2724 -684 2326 2819 1106 -1937 -3053 -1898 1273 3138
3522 3138 2439 -698 -2833 -2577 -139 2905 3264 1055 -2061 -2912 -1367 1555 3531 2660 -635 -2659
$$ packed form
3410b991J296L410J514p13l030k286K85K444K926L43j978k879q58J474K577J631
3426C165r65k794j709O47K255K196k34j993k339o98K414K556N59j467k905j348
3442b660J525K495J746o05k869k246M38K222K897K12k138k761q28J586K874J396
3458C284j029l123j925M93K856K240j53k691k376k54J953K554Q51j618k805j396
3474c139J097K525K025p07k562k362J38K622K305O18k081k646j320J717K840J648
3490B718j119k697k211N20K420K913Q1k528k712o24J498L245J284j611k620j941
3506c384Q42K907K232j93k795j986l47K040L010M93j713l043j116J155L171J865
3522C138o99l137k135K56K438L044L59k209l116q51J545K922J976q71l295k024
$$ plain form
3538 -2659 -2350 367 3002 3232 975 -1669 -2584 -773 1794 3146 1840 -943 -2446 -1683 867 2612
3554 2612 2781 -37 -2361 -2323 -309 2219 2773 1267 -1519 -2776 -1558 1451 3027 2330 -487 -2991
3570 -2991 -2468 -344 2253 2902 1047 -1727 -2923 -1818 1355 3250 2157 -743 -2546 -2261 -100 2353
3586 2353 2681 729 -1710 -2481 -805 1166 2602 1217 -863 -2409 -1577 441 2006 2247 -507 -2331
3602 -2331 -2144 -340 1807 2174 656 -1870 -2782 -1269 1286 2671 1662 -679 -2836 -2453 46 2042
3618 2042 2790 705 -1869 -2966 -1353 833 2576 1427 -640 -2774 -2201 -256 1541 1667 211 -1885
3634 -1885 -2536 -1325 1049 1555 809 -1078 -2527 -1802 536 1760 1283 -930 -2154 -2055 -359 1474 2079
3651 2079 389 -1723 -2245 -1260 1136 2790 1885 -325 -2401 -1909 -59 2199 2739 1060 -1485 -2339
$$ packed form
3538b659L09K717K635K30k257k644r15J811K567J352j306k783j503P63K550J745
3554B612J69k818k324L8K014K528N54j506k786j257J218L009J576o97k817k504
3570b991N23K124K597O49j855k774j196J105L173J895j093k900j803K85K161K453
3586B353L28j952k439p71J676J971J436j385k080j546Q32K018J565K41k754j824
3602b331J87J804K147L67j518k526r12J513K555J385j009k341k157L83K499J996
3618B042P48k085k574j097J613K186J743j149k067k134N73J945J797J26j456k096
3634a885o51J211K374N06p46j887j449P25K338J224m77k213j224R9J696J833O05
3651B079j690k112n22R85K396J654r05k210k076M92J850K258N40j679k545q54
$$ plain form
3667 -2339 -1273 1084 2740 2028 77 -1660 -1713 134 2045 2076 906 -840 -1307 -299 1425 2376 1429
3684 1429 -196 -1296 -734 839 1814 1806 271 -1050 -1044 176 1785 2125 634 -997 -1537 -658 1019 2217
3702 2217 1560 -277 -1788 -1782 -217 1357 1956 648 -943 -1980 -1263 354 1640 1198 -380 -1145 -1397
3719 -1397 -339 823 991 9 -763 -1298 -729 118 856 646 -717 -1176 -1015 83 585 424 -416 -1336
3737 -1336 -1608 -101 907 994 -64 -1499 -1589 -800 403 965 807 -527 -1752 -1166 -206 954 1211 266
3755 266 -927 -1337 -855 179 1200 513 -426 -835 -951 -42 563 955 290 -583 -457 -265 411 742 369
3774 369 -432 -507 -347 274 705 383 -563 -854 -305 668 1036 487 -95 -903 -885 -147 854 1353 158 -733
3794 -733 -937 -352 518 1116 762 -11 -499 -539 152 752 751 653 -247 -486 -18 482 888 582 -126 -426 251
$$ packed form
3667b339J066K357J656p12j951j737n3J847J911L1j170j746m67J008J724R51r47
3684A429j625j100N62J573R75qj535j321OJ220J609L40j491j631n40Q79J677J198
3702B217o57j837j511OJ565J574N99j308j591j037P17J617J286m42j578p65k52
3719a397J058J162J68r82p72n35N69Q47P38k10j363m59J61J098N02j61q40r20
3737a336k72J507J008Q7j058j435r0P89J203N62j58j334j225N86R60J160K57r45
3755B66j193m10M82J034J021o87r39m09j16R09O05L92o65q73J26J92O76L31l73
3774C69q01p5J60O21M31l22r46k91N49R73L68n49n82q08J8P38J001M99j195q91
3794g33k04N85Q70N98l54p73m88m0O91O00jr8r00k39M68N00M06l06p08l00O77
$$ plain form
3815 251 510 724 895 200 -582 -127 550 798 747 -16 -247 -534 121 750 1178 713 -275 -583 -507 526
3835 526 1168 735 39 -765 -756 75 755 814 515 -191 -850 -833 99 925 744 16 -600 -667 -76 430 667 -31
3857 -31 -381 -441 -445 300 418 210 -357 -747 -630 -233 79 392 -155 -850 -1051 -750 204 347 -80 -781 -1149
3878 -1149 -955 -231 217 213 -115 -461 -1295 -603 191 654 371 -211 -984 -944 -420 338 410 -66 -332 -856 -429
3899 -429 128 436 210 208 -658 -456 -401 92 505 -54 -47 -81 -54 -125 196 202 81 125 270 184 100 -81 -31 -122 -93
3924 -93 -104 225 135 247 499 46 287 48 442 505 355 291 88 406 209 206 329 907 400 147 -196 -27
3946 -27 284 919 624 515 -201 -529 -163 246 1083 1139 86 -323 -700 -113 542 1277 1015 -252 -692 -1097
3966 -1097 133 632 1124 130 -371 -1150 -837 212 977 991 478 -627 -930 -331 661 894 143 -758 -1048
$$ packed form
3815B51K59K14J71o95p82M55O77K48n1p63k31k87O55O29M28m65r88l08P6J033
3835E26O42m33o96q04RQ31O80N9k99p06o59J7R32Q26j81p28o16o7N91N06K37o98
3857c1l50o0mP45J18k08n67l90J17L97L12L13n47o95k01L01R54J43m27p01l68
3878a149J94P24M48ml28l46q34O92P94M63k83n82p73M0N24P58P2m76k66n24M27
3899d29N57L08k26kq66K02N5M93M13n59Pl4K7p1L21Oj21M4J45q6q4j81N0r1K9
3924i3j1L29r0J12K52m53K41k39L94O3j50o4k03L18j97lJ23N78n07k53l43J69
3946b7L11O35k95j09p16l28L66M09Q37N6j053m09l77N87O55P35k62j267m40m05
3966a097J230M99M92r94n01p79L13J049P65J4n13j105l03N99R92K33p51r01k90
$$ plain form
3985 -1048 -288 133 481 431 -376 -1111 -1026 -39 734 940 242 -1360 -1666 -858 561 1280 858 -867 -1603
4004 -1603 -1753 -276 1325 1193 232 -1454 -1957 -1180 609 1611 1009 -194 -1592 -1735 -396 1174 1530
4021 1530 809 -682 -1429 -1337 54 1541 1250 -89 -1275 -1059 -204 849 1478 624 -888 -1042 -532 672
4039 672 1303 727 -649 -1471 -995 561 1542 1063 137 -1312 -1470 -385 1281 1943 901 -762 -1869
4056 -1869 -1351 353 1693 1851 493 -1266 -1342 -587 965 2039 1047 -280 -1587 -1493 -42 1211 1555
4073 1555 622 -846 -1043 -382 570 1480 887 -404 -1036 -410 366 1195 1001 -73 -480 -528 235 1235 1388
4092 1388 265 -724 -1081 74 1067 1597 894 -216 -1328 -1005 352 1745 1112 184 -1053 -1406 -765
4109 -765 634 1384 952 -192 -1482 -823 -662 358 904 418 -448 -970 -709 -20 511 322 -430 -627 -561
$$ packed form
3985a048P60M21L48n0q07p35Q5R87P73K06o98j602l06Q08J419P19m22j725p36
4004a603j50J477J601j32r61j686n03P77J789J002o02j203j398j43J339J570L56
4021A530p21j491p47R2J391J487k91j339j186K16Q55J053O29q54j512j54N10J204
4039F72O31n76j376q22M76J556R81m79r26j449j58J085J666O62j042j663j107
4056a869N18J704J340J58j358j759p6P55J552J074r92j327j307R4J451J253L44
4073A555r33j468j97O61R52R10n93j291o32O26P76Q29j94j074m07m8P63J000J53
4092A388j123r89l57J155R93N30p03j110j112L23J357J393o33r28j237l53O41
4109g65J399P50m32j144j290O59J61J020N46m86q66n22K61O89N31j89p52j97O6
$$ plain form
4128 -561 174 344 -95 -668 -1051 -602 135 827 298 -605 -1495 -1155 -109 815 875 -181 -1029 -1583 -646 276
4148 276 1168 729 -445 -1124 -1232 -86 640 822 273 -535 -1009 -554 -27 781 346 -338 -495 -275 -3
4167 -3 485 212 -418 -440 -102 791 1168 617 -350 -687 -748 524 1430 1404 483 -696 -1205 -112 772 1576 1240
4188 1240 84 -1148 -963 -50 1481 1821 891 -474 -1215 -584 496 1473 1095 -82 -701 -432 335 818
4206 818 836 405 -728 -796 54 773 1249 414 -911 -861 -762 909 1472 921 -607 -1759 -1016 212 1571
4225 1571 1678 344 -1572 -2009 -664 954 1717 1353 -506 -2154 -1587 -344 1626 2121 679 -1181
4241 -1181 -1957 -1051 833 1682 1176 -581 -1690 -1706 -94 1031 1227 -9 -1208 -1461 -509 1113 1513
4258 1513 254 -1071 -1828 -1038 756 1651 1010 -860 -1776 -1609 201 1967 1606 185 -1576 -2532 -1234
$$ packed form
4128e61P35J70m39n73l83M49P37O92n29r03q90L40J046R24O0j056q48n54R37R22
4148B76Q92m39j174o79j08J146P26J82n49q08m74M55N27Q08m35o84j57K20K72
4167cM88k73o30k2L38Q93L77n51r67l37o1J272R06k6r21j179n09J093Q84Q04l36
4188A240j156j232J85R13J531L40r30j365p41O31J080R77l78j177o19K69P67M83
4206H18J8m31j133o8Q50P19M76q35j325N0R9J671N63n51j528j152P43J228J359
4225A571J07j334j916m37J345J618P63l64j859j648N67J243J970M95j442j860
4241a181p76R06J884Q49n06j757j109j6J612J125J96j236j199k53R52J622M00
4258A513j259j325p57P90J794Q95o41j870r16J67J810J766l61j421j761r56J298
$$ plain form
4275 -1234 865 2054 1810 -560 -2327 -2375 -94 1596 2332 442 -1281 -2152 -1146 549 1586 1213
4291 1213 -308 -2151 -1561 -153 1503 1620 270 -1148 -1275 -627 1121 1939 602 -860 -1835 -1134 704
4308 704 1982 1584 -455 -1900 -1664 24 1916 2309 729 -1124 -2370 -1483 1269 2489 2077 -169
4324 -169 -2022 -1824 169 2125 2595 1051 -1014 -1851 -879 1079 2159 1473 -343 -1656 -1062 264 1584
4341 1584 1742 274 -1168 -1677 -528 1383 1694 891 -988 -1698 -898 911 1833 1759 -383 -1952 -1696
4358 -1696 -274 1733 2226 542 -1259 -2311 -1435 974 2164 1400 -440 -2199 -2247 -285 1645 2011
$$ packed form
4275a234K099J189k44k370j767m8K281J690P36j890j723q71J006J695J037l73
4291A213j521j843N90J408J656J17j350j418j27O48J748Q18j337j462r75P01J838
4308G04J278l98k039j445K36J688J892L93j580j853j246Q87K752J220m12k246
4324a69j853J98J993J956M70j544k065q37R72J958J080o86j816j313N94J326J320
4341A584J58j468j442n09J149J911L11q03j879p10Q00J809R22p4k142j569K56
4358a696J422K007M93j684j801j052Q76K409J190p64j840j759m8J962J930L66
$$ [...]
8191F5
##END NTUPLES=NMR FID
##END=
