##TITLE=1H_N2-03.09.20
 CDCl3, 8 sc, 
 4.9.2020
##JCAMPDX= 6.0         $$ Bruker NMR JCAMP-DX V2.0
##DATA TYPE= NMR FID
##DATA CLASS= NTUPLES
##ORIGIN= UXNMR, Bruker Analytische Messtechnik GmbH
##OWNER= root
$$ XWIN-NMR		Version 3.5
$$ Fri Sep  4 10:13:10 2020 Russian Standard Time (UT+4h)  she@DPX200
##.OBSERVE FREQUENCY= 200.1315066352
##.OBSERVE NUCLEUS= ^1H
##.DELAY= (6, 6)
##.ACQUISITION MODE= SIMULTANEOUS
##.ACQUISITION SCHEME= undefined
##.AVERAGES= 8
##.DIGITISER RES= 18
##SPECTROMETER/DATA SYSTEM= spect
##.PULSE SEQUENCE= zg30
##.SOLVENT NAME= CDCl3
##.SHIFT REFERENCE= (INTERNAL, CDCl3, 0, 15.7039)
##AUDIT TRAIL= $$ (NUMBER, WHEN, WHO, WHERE, WHAT)
$$ ##TITLE= Audit trail, XWIN-NMR		Version 3.5
$$ ##JCAMPDX= 5.01
$$ ##ORIGIN= Bruker BioSpin GmbH
$$ ##OWNER= she
$$ F:/spectra/data/she/nmr/H-F/1/audita.txt
$$ ##AUDIT TRAIL=  $$ (NUMBER, WHEN, WHO, WHERE, WHAT)
(   1,<2020-09-04 10:11:55.48 +0400>,<she>,<DPX200>,
      <created by zg, POWCHK disabled, PULCHK disabled
       configuration hash MD5:
       00 E9 B6 7A A2 85 ED C7 34 08 36 98 17 FE 4E 26
       data hash MD5: 16K
       B4 E2 85 0B FA 30 01 C4 D9 C0 05 22 92 05 FC 84>)
$$ ##END=
$$ 
$$ hash MD5
$$ A8 3A 87 9F 79 08 94 8F 75 E2 2F 6A 8C 66 DA 80
##$RELAX= 
##$RELAX= 
##$RELAX= 
##$RELAX= 
##$RELAX= 
##$RELAX= 
$$ Bruker specific parameters
$$ --------------------------
##$DU= <F:/spectra>
##$EXPNO= 1
##$NAME= <H-F>
##$PROCNO= 1
##$TYPE= <nmr>
##$USER= <she>
##$AMP= (0..31)
100 100 100 100 100 100 100 100 100 100 100 100 100 100 100 100 100 100 
100 100 100 100 100 100 100 100 100 100 100 100 100 100 
##$AQSEQ= 0
##$AQ_mod= 1
##$AUNM= <au_zg>
##$AUTOPOS= <>
##$BF1= 200.13
##$BF2= 200.13
##$BF3= 200.13
##$BF4= 200.13
##$BF5= 200.13
##$BF6= 200.13
##$BF7= 200.13
##$BF8= 200.13
##$BYTORDA= 1
##$CFDGTYP= 0
##$CFRGTYP= 5
##$CHEMSTR= <none>
##$CNST= (0..31)
1 1 145 1 1 1 1 1 1 1 1 1 1 1 1 1 1 1 1 1 1 1 1 1 1 1 1 1 1 1 1 1 
##$CPDPRG= <>
##$CPDPRG1= <>
##$CPDPRG2= <>
##$CPDPRG3= <>
##$CPDPRG4= <mlev>
##$CPDPRG5= <mlev>
##$CPDPRG6= <mlev>
##$CPDPRG7= <mlev>
##$CPDPRG8= <mlev>
##$CPDPRGB= <>
##$CPDPRGT= <>
##$D= (0..31)
0 1.2 0 0 0 0 0 0 0 0.06 0 0.03 0 0 0 0 0.0002 0 0 0 0 0 0 0 0 0 0 0 0 
0 0 0 
##$DATE= 1599199914
##$DBL= (0..7)
120 120 120 120 120 120 120 120 
##$DBP= (0..7)
150 150 150 150 150 150 150 150 
##$DBP07= 0
##$DBPNAM0= <>
##$DBPNAM1= <>
##$DBPNAM2= <>
##$DBPNAM3= <>
##$DBPNAM4= <>
##$DBPNAM5= <>
##$DBPNAM6= <>
##$DBPNAM7= <>
##$DBPOAL= (0..7)
0.5 0.5 0.5 0.5 0.5 0.5 0.5 0.5 
##$DBPOFFS= (0..7)
0 0 0 0 0 0 0 0 
##$DE= 6
##$DECBNUC= <off>
##$DECIM= 32
##$DECNUC= <off>
##$DECSTAT= 4
##$DIGMOD= 1
##$DIGTYP= 9
##$DL= (0..7)
0 120 120 120 120 120 120 120 
##$DP= (0..7)
150 150 150 150 150 150 150 150 
##$DP07= 0
##$DPNAME0= <>
##$DPNAME1= <>
##$DPNAME2= <>
##$DPNAME3= <>
##$DPNAME4= <>
##$DPNAME5= <>
##$DPNAME6= <>
##$DPNAME7= <>
##$DPOAL= (0..7)
0.5 0.5 0.5 0.5 0.5 0.5 0.5 0.5 
##$DPOFFS= (0..7)
0 0 0 0 0 0 0 0 
##$DQDMODE= 0
##$DR= 18
##$DS= 0
##$DSLIST= <SSSSSSSSSSSSSSS>
$$ [...]
##$SUBNAM2= <"">
##$SUBNAM3= <"">
##$SUBNAM4= <"">
##$SUBNAM5= <"">
##$SUBNAM6= <"">
##$SUBNAM7= <"">
##$SUBNAM8= <"">
##$SUBNAM9= <"">
##$SW= 16.880792210976
##$SWIBOX= (0..15)
0 0 2 0 0 0 0 0 0 0 0 0 0 0 0 0 
##$SW_h= 3378.37837837838
##$TD= 16384
##$TD0= 1
##$TE= 0
##$TE2= 300
##$TE3= 300
##$TEG= 300
##$TL= (0..7)
0 120 120 120 120 120 120 120 
##$TP= (0..7)
150 150 150 150 150 150 150 150 
##$TP07= 0
##$TPNAME0= <>
##$TPNAME1= <>
##$TPNAME2= <>
##$TPNAME3= <>
##$TPNAME4= <>
##$TPNAME5= <>
##$TPNAME6= <>
##$TPNAME7= <>
##$TPOAL= (0..7)
0.5 0.5 0.5 0.5 0.5 0.5 0.5 0.5 
##$TPOFFS= (0..7)
0 0 0 0 0 0 0 0 
##$TUNHIN= 0
##$TUNHOUT= 0
##$TUNXOUT= 0
##$USERA1= <user>
##$USERA2= <user>
##$USERA3= <user>
##$USERA4= <user>
##$USERA5= <user>
##$V9= 5
##$VALIST= <valist>
##$VCLIST= <CCCCCCCCCCCCCCC>
##$VD= 0
##$VDLIST= <DDDDDDDDDDDDDDD>
##$VPLIST= <PPPPPPPPPPPPPPP>
##$VTLIST= <TTTTTTTTTTTTTTT>
##$WBST= 1024
##$WBSW= 4
##$XGAIN= (0..3)
0 0 0 0 
##$XL= 0
##$YL= 0
##$YMAX_a= 177139
##$YMIN_a= -183303
##$ZGOPTNS= <>
##$ZL1= 120
##$ZL2= 120
##$ZL3= 120
##$ZL4= 120
##$ABSF1= 10
##$ABSF2= 0
##$ABSG= 5
##$ABSL= 3
##$ALPHA= 0
##$AQORDER= 0
##$ASSFAC= 0
##$ASSFACI= 0
##$ASSFACX= 0
##$ASSWID= 0
##$AUNMP= <proc_1d>
##$AZFE= 0.1
##$AZFW= 0.1
##$BCFW= 1
##$BC_mod= 2
##$BYTORDP= 1
##$COROFFS= 0
##$CY= 11.3945322036743
##$DATMOD= 1
##$DC= 2
##$DFILT= <>
##$DTYPP= 0
##$F1P= 16.9975609425685
##$F2P= -3.02152046262296
##$FCOR= 0.5
##$FTSIZE= 0
##$FT_mod= 4
##$GAMMA= 1
##$GB= 0.15
##$INTBC= 1
##$INTSCL= 1
##$ISEN= 128
##$LB= 0.24
##$LEV0= 0
##$LPBIN= 0
##$MAXI= 10000
##$MC2= 0
##$MEAN= 0
##$ME_mod= 0
##$MI= 1.114404
##$NCOEF= 0
##$NC_proc= 0
##$NLEV= 6
##$NOISF1= 3.799351
##$NOISF2= 2.8
##$NSP= 1
##$NTH_PI= 0
##$NZP= 0
##$OFFSET= 15.70392
##$PC= 1
##$PHC0= -9969.501
##$PHC1= 8.4009
##$PH_mod= 1
##$PKNL= yes
##$PPARMOD= 0
##$PSCAL= 0
##$PSIGN= 0
##$REVERSE= no
##$SF= 200.130013532006
##$SI= 16384
##$SIGF1= 3
##$SIGF2= 2
##$SINO= 400
##$SIOLD= 16384
##$SREGLST= <1H.CDCl3>
##$SSB= 0
##$STSI= 0
##$STSR= 0
##$SW_p= 3612.71676300578
##$SYMM= 0
##$S_DEV= 0
##$TDeff= 0
##$TDoff= 0
##$TI= <>
##$TILT= no
##$TM1= 0
##$TM2= 0
##$TOPLEV= 0
##$USERP1= <user>
##$USERP2= <user>
##$USERP3= <user>
##$USERP4= <user>
##$USERP5= <user>
##$WDW= 1
##$XDIM= 8192
##$YMAX_p= 0
##$YMIN_p= 0
$$ End of Bruker specific parameters
$$ ---------------------------------
##NTUPLES= NMR FID
##VAR_NAME=  TIME,          FID/REAL,        FID/IMAG
##SYMBOL=    X,             R,               I
##VAR_TYPE=  INDEPENDENT,   DEPENDENT,       DEPENDENT
##VAR_FORM=  AFFN,          ASDF,            ASDF
##VAR_DIM=   8192,          8192,            8192
##UNITS=     SECONDS,       ARBITRARY UNITS, ARBITRARY UNITS
##FACTOR=    0.000296,      1,               1
##FIRST=     0,             0,               0
##LAST=      2.424536,      0,               0
##MIN=       0,             -183303,         0
##MAX=       2.424536,      177139,          0
$$ Real data points
##PAGE= N=1
##DATA TABLE= (X++(R..R)), XYDATA
$$ [...]
2155A376m558N908l558k125L797j756r2L985m613N85K848n368O435j580k379L379
$$ 1376 -3182 2726 -832 -2957 840 -916 -1008 2977 -1636 -1051 1797 -3571 2864 1284 -1095 2284
2171B284l745k62M530k695Q37K547p417M678j22k275N887m385j095K209l275J581
$$ 2284 -1461 -1723 2807 112 949 3496 -3921 757 635 -1640 4247 -138 -1233 976 -2299 -718
2187g18M379n359K842n33n254O626l302Q54K782m336m8K959l900L381J783o031
$$ -718 3661 -1698 1144 611 -4643 1983 -1319 -465 2317 -2019 -2067 892 -3008 373 2156 -3875
2203c875N750l681n63N333m410P66J707l879K613K732m602N027l551k660N622
$$ -3875 1875 -1806 -2369 2964 -1446 -680 1027 -2852 -239 2493 -2109 2918 -633 -3293 2329
2218B329l567K151J985m553Q48J667l892N564q10l719N266o070J150L338k902
$$ 2329 -1238 913 2898 -1655 -807 860 -3032 2532 1722 -1997 3269 -2801 -1651 1687 -1215
2233a215K480L84m896K924O02l273O128m263n98L052m832L616J247l187J778N0
$$ -1215 1265 1649 -3247 -323 279 -2994 3134 -1129 -1727 1325 -3507 109 1356 -1831 -53 -3
2249cl758N801k702q76M187n939K918J459k501K910k19m110L740j364j024N910
$$ -3 -3761 2040 -662 -1538 2649 -3290 -372 1087 -1414 1496 1277 -2833 907 -457 -1481 4429
2265D429n320J507O59m143M018O79k170K631j877l256N405m069K377K263n180
$$ 4429 -891 616 1275 -2868 1150 1829 -341 2290 413 -2843 2562 -1507 870 3133 -2047
2280b047K852j029j468L341m69l161L815m073P20L930m577L377j290k816L127
$$ -2047 805 -224 -1692 1649 1180 -1981 1834 -2239 -1519 2411 -2166 1211 -79 -2895 232
2295B32k80j113K915k902j499M013m187L714M58l385K558k059p94L844r52j481
$$ 232 -48 -1161 1754 -1148 -2647 1366 -2821 893 1351 -2034 524 -1535 -2329 1515 563 -918
2311i18L010m875J793K702l355M207k126j882J893j178j00L822l481J33J962m295
$$ -918 2092 -2783 -990 1712 -1643 2564 438 -1444 449 -729 -829 2993 -488 -355 1607 -2688
2327b688M368p24j505K216k337q90K871j343K43K527m859K539k93j536L894k479
$$ -2688 1680 956 -549 1667 -670 -1560 1311 -32 211 2738 -2121 418 125 -1411 2483 4
2343Do91J152j753L7L963l500J321j15l518M127j756Q73J403k236r77K157j761
$$ 4 -687 465 -1288 -1251 2712 -788 533 418 -3100 1027 -729 144 1547 -689 -1666 491 -1270
2360a270J852J602m265K946k218j25K735j347R2N65k279L80K812k976L169j639
$$ -1270 582 2184 -2081 865 -1353 -1478 1257 -90 2 567 -1712 -1332 1480 -1496 1673 34
2376C4k245K898j916J561J005j453r58J628k323K670N33k401K476l262R30J469
$$ 34 -2211 687 -1229 332 1337 -116 -1074 554 -1769 901 1434 -967 1509 -1753 -823 646
2392F46n85N29O14k327M48J280j825L586k602m47R96j387J130J128j104k88O38
$$ 646 61 590 1204 -1123 -675 605 -1220 2366 -236 -683 313 -1074 56 1184 80 -208 430
2409D30k622K975k46n90J628l097R40L19m5Q61R62k501Q55m33r13L421k247L84
$$ 430 -2192 783 537 -53 1575 -1522 -582 -263 -308 553 1515 -986 -131 -564 -1477 1944 -303 81
2427H1m79r32P98J039M5o8j00k246K352r44P68R44j828L07n03L29O82J199k130
$$ 81 -398 -1330 -532 507 552 484 384 -1862 490 -454 314 1258 -570 -263 -766 -437 245 1444 -686
2446f86O29q37n26K387j368J105j279l88P2N82K30P27k41j851J119j421K163j48
$$ -686 -57 -894 -1420 967 -401 704 -575 -963 -891 -309 -79 648 407 -1444 -325 -1746 417 269
2464B69k22k07o33J61L06J318j063J145k030P19L08l49J545q84k91r60J038l84
$$ 269 47 -160 -793 -632 -326 992 -71 1074 -956 -237 71 -278 1267 383 92 -868 170 -214
2482b14J276l59p26l5j128J788l92P91r04j86o38N9J181m40J041j841M96q45R38
$$ -214 1062 703 -23 -58 -1186 602 210 1001 97 -89 -727 -668 513 73 1114 -727 -231 -1076 -138
2501a38O23k95L57j802R24q47J540j9r3n35q23N45l13J891j099K91q28l21Q84
$$ -138 485 190 547 -1255 -331 -1178 362 343 250 -285 -1108 -563 -876 1015 -84 207 -621 -942 -58
2520e8K08P59p70k44r52J137m33J346k1j484R23j519J278N61Nq17K6p92L46J325
$$ -58 150 909 139 -105 -1057 80 -353 993 972 -512 411 -1108 170 731 736 -81 -55 -847 -501 824
2540H24j094J633j885k00M26L1O98M04p75r36J031j580K382m01q18O19j625R70
$$ 824 -270 1363 -522 -722 -296 -265 433 837 62 -874 157 -1423 959 558 -260 359 -1266 -296
2558b96N27M1O9M02k027J285M35q66K225k053N7qj54N61J377j536lJ67j730K783
$$ -296 231 272 341 743 -1284 1 436 -430 1795 -258 -201 -209 -363 198 1575 39 36 203 -1527 1256
2578A256j125K52O38k218O95O04m04R88J70k638K136j048j21K311k356J014n20
$$ 1256 131 383 1021 -1197 -502 102 -302 686 856 -1782 354 -694 -815 1496 -860 154 -366
2595c66p57P95J281j556J265j186j352K631j824J727O52k275N10K91n81J978L5
$$ -366 -1123 -328 953 -603 662 -524 -1876 755 -1069 658 1310 -965 -455 -164 -745 1233 1268
2612A268k040K322l079J285J633j814J742j035j636J330P13j299K768k572o75
$$ 1268 -772 1550 -1529 -244 1389 -425 1317 282 -1354 -24 689 -610 2158 -414 -1089
2627a089J966k378K265M00j608M94k32j501K645p46p57J918l491J902N70j379
$$ -1089 877 -1501 764 1164 -444 50 -182 -1683 962 216 -541 1377 -2114 -212 358 -1021
2643a021K287r87j784J559m78o38L069k760N44O20k297K678n8j140J194r80j654
$$ -1021 1266 279 -1505 54 -424 -1062 2007 -753 -209 411 -1886 792 734 -406 788 -192 -1846
2660a846L143j827J039J304l370K138q50o92K447n17j626J656k024M32K712l327
$$ -1846 1297 -530 509 1813 -1557 581 -269 -961 1486 969 -657 999 -1025 -593 2119 -1208
2676a208K325r86j838K509q14l03J520j869o72K391k759K339N23l059K471j533
$$ -1208 1117 131 -1707 802 -12 -315 1205 -664 -1336 1055 -1704 635 1158 -1901 570 -963
2692i63k16K232q09q50J680k937R21K154k713L323j896j286J923j299N49K322
$$ -963 -1179 1053 244 -606 1074 -1863 -942 1212 -1501 1822 -74 -1360 563 -736 -187 2135
2708B135k596J75J477l042L342n57j381K305k491j72K133j593N26J441l351K406
$$ 2135 -461 -286 1191 -1851 1491 934 -447 1858 -633 -805 1328 -265 261 1702 -1649 757
2724G57l4j944L505k332m25J241j775R35J818k668J316j84k733L926j554k36J673
$$ 757 723 -1221 2284 -48 -473 768 -1007 -72 1746 -922 394 210 -2523 1403 -151 -387 1286
2741A286k907O50J168j364J494J072l902K954j632n31L219k311P57P21k389J213
$$ 1286 -1621 -971 197 -1167 327 1399 -2503 451 -1181 -1712 1507 -804 -47 674 -1715 -502
2757e02J617k341K506j188j966L196k393J269J333k282N26J147k292K504K79k837
$$ -502 1115 -1226 1280 92 -1874 1322 -1071 198 1531 -751 -225 922 -1370 1134 1413 -1424
2773a424L183k738P15K108k160J376j88k238J529P16j779L137k356j034K215k712
$$ -1424 1759 -979 -264 1844 -316 1060 872 -1366 163 879 -900 2237 -119 -1153 1062 -1650
2789a650K385N79j680Q77l68k281L128r51p00K479l695J454P96j623K039l20k110
$$ -1650 735 1314 -366 511 143 -2138 990 39 -661 1818 -1877 -423 373 -1250 789 469 -1641
2806a641J958q97p68L024k627O98P59k366K200K99j246J083q04j304K802j533
$$ -1641 317 -580 -1348 1676 -951 -253 506 -1860 340 639 -607 476 -328 -1632 1170 -363
2822c63K71J947l558J939j50o25K080m97j703J449j894K92K587k701K337q86j844
$$ -363 -92 1855 -1703 236 86 -539 1541 1044 -659 790 -1104 -812 1775 -926 1411 525 -1319
2839a319J510j76k40J499j332r27K020k630K165M24j796J672j609l50J740m34
$$ -1319 191 15 -225 1274 -58 -985 1035 -1595 570 994 -802 870 -739 -1089 651 217
2855B17o65J636k556R17J463k121K644j693r01J128m55R4J879j455l70J093k832
$$ 217 -448 1188 -1368 -451 1012 -1109 1535 -158 -1059 69 -386 -292 1587 132 -238 855 -1977
2872a977K947l80r09J376j727j20J488p81J65J474k703J149l6j105K565j676l9
$$ -1977 970 590 -319 1057 -670 -790 698 -83 82 1556 -1147 2 -34 -1139 1426 -250 -289
2889b89O20j071J72J535j442O99K25k242K756j395L33R13j423m7Q51o47O31J033
$$ -289 331 -740 -568 967 -475 224 449 -1793 963 -432 -99 814 -609 -656 195 -452 179 1212
2907A212k323J577j193j99K035j211M67N4j081J48J527j442J604p28j723J879
$$ 1212 -1111 466 -727 -926 1109 -102 365 419 -662 -514 1013 -429 1175 447 -1276 603
2923F03r44P66M95p95m58O44j244J477L35j451J772k027K95J005n03M60J84j251
$$ 603 -341 425 920 125 -333 311 -933 544 879 -572 1200 -827 -532 473 -30 430 614 -637
2941f37J39Q75q96J684j239o80R50j294J202L51j58l34O64j627J471o6n86J084
$$ -637 -498 377 -519 1165 -74 -754 196 -1098 104 455 297 -37 627 -1000 471 405 -181 903
2959I03j609M87j08K97L94K90r33j18K64m10J711j310N39l90p49P73K20K07m04
$$ 903 -706 -219 -327 -30 364 654 -279 -397 -133 -543 1168 -142 397 7 -742 31 251 458 54
2978E4K43j167J123o34K33J043j415O44o51N85J38N75q20k16j38l51J028k86O65
$$ 54 297 -870 253 -381 -148 895 -520 124 -527 58 196 771 -49 -265 -403 -754 274 -12 653
2997F53n11o33pK40M42K76K92j393Q79q30J084O3n67O24j073K98nR56p16O39r21
$$ 653 142 -491 -498 -258 184 460 752 -641 238 -592 492 555 -12 612 -461 -163 -168 788 72 711 -210
3018b10j37N74l62R80r41K91p49L21K46P4N44q82L20j031J138k75M35k00m56L8
$$ -210 -347 227 -135 845 -96 195 -554 -233 13 87 631 -251 69 -962 176 -99 336 136 -320 -282
3038b82m46R24j16L94o97mk42K61P17k65L73j185O81l45J18Q00n75o2m52J72l0
$$ -282 -728 196 80 474 -223 -227 -469 -208 509 244 617 -568 113 -232 -114 686 111 49 -403 -231 -261
3059b61Q58o71M06m79n06Q94k54M58l65j80k91N10k82M79L86j182P85r67P23J55
$$ -261 597 -74 332 -147 -653 241 -13 445 80 -100 -391 119 -163 316 702 -480 305 -662 61 216
3079B16P3j78j00m42q7R72q98J267j063k17M58j47M56L69m60o65Q72j236J518
$$ 216 289 111 11 -431 -518 454 -444 823 -240 -457 1 -146 310 679 219 -446 426 -810 708
3098G08P0j079R86j109M04L07K29k12K49r39Q4N04p82J665j290l3R6n11R62M28
$$ 708 778 -301 685 -424 -20 287 516 304 553 -386 -302 202 -580 1085 -205 -238 -142 -653 309 737
3118G37p70R7N4j211J458l47j15P63j393L28J95R9L33N17j676R64l75l44J576
$$ 737 -33 64 118 -1093 365 18 -97 666 -727 -399 -204 -105 228 745 -931 33 -342 -686 890
3137H90j416O37j50q20P76N84p56Q26l54j230J751j398J108L56j293O56l7l11
$$ 890 -526 111 -39 -859 -83 501 -255 571 217 -1013 738 -660 448 804 -489 167 130 -181
3155a81Q95K08j379J325j515M46J022j351J157k87q67N14L47p47J483j054q45
$$ -181 714 922 -457 868 -647 -201 821 -530 627 340 -527 -13 334 -413 1070 16 -829
3172h29J273j343J343J23j054N35k90o96J190n6q35J711k324Q76O11q58J173l29
$$ -829 444 -899 444 567 -487 48 -242 -938 252 196 -639 1072 -1252 -376 235 -623 550 221
3190B21r09O06j49p23K020j581K14P03j692J632k4p63O39k71p51J196n04j77J496
$$ 221 -688 -82 -231 -954 1066 -515 -301 402 -1290 342 318 -445 194 -77 -828 368 -136 -313 1183
3209A183k426J275J01n73J100k47q55O61k72m35J817j795J195m9j674J430l70
$$ 1183 -1243 32 133 -440 660 413 -442 219 -53 -488 1329 -466 729 680 -994 436 66
3226F6j69R54q45o16J374j508P94J239k307J568q18m04J204n31n14J093r26j72
$$ 66 -103 851 6 -610 764 -744 50 1289 -1018 550 -268 -672 532 1 -513 580 -346 -518
3244e18J452j992K055q68j214J310q79J53J269j017m08J160j761J546L15j159
$$ -518 934 -1058 997 129 -1085 225 -654 -501 768 -249 -657 503 -1258 288 603 -556
3260e56J294j495P9Q88n21K85Q63j731Q41M63j409K134j105k00N00o74K00J023
$$ -556 738 -757 -678 210 -311 -26 837 -894 -53 410 -999 1135 30 -170 330 -344 -144 879
3278H79j194N12O53j984J968p25m78J340j467J8R31q87M49Q88k062J643o94p63
$$ 879 -315 197 850 -1134 834 109 -369 971 -496 -478 453 -434 15 903 -1159 484 -210 -973
3296i73K131j292J73L70j125M65R28j048J003k59j711J933q65K36J273j597L60
$$ -973 1158 -134 39 409 -716 -251 677 -371 632 373 -1338 595 -270 -34 1239 -358 2
3313BK92q56Q95N34j718J791j232k42J475j343P59m2r46P49K91j108J577j045
$$ 2 294 -562 333 867 -851 940 -292 -534 941 -402 357 315 -631 118 409 -699 878 -167
3331a67o44J698j625Q76O08j239M80J94j026J370j19j043J653k106Q51R13j164
$$ -167 -811 887 -738 138 746 -493 -13 181 -845 525 406 -637 1016 -1090 -239 674 -490
3348d90J161k36j190P38K05r56J691r84k65Q89j622R90L71l91N73p0j344J594
$$ -490 671 435 -755 -17 188 -768 923 -61 -326 563 -1059 -69 302 -89 484 414 -930 664
3366F64n20l62J305j768Q88j75m33R27j09r35Q61m02o90J717j425O69K36j188
$$ 664 144 -218 1087 -681 207 32 -401 526 417 -518 343 -59 -749 968 -457 212 448 -740
3384g40Q49L9k25O85n07j026J498j161N94Q59j361R29m11n84Q41K00m40O89j122
$$ -740 109 148 -77 608 101 -925 573 -588 6 865 -496 433 22 -562 279 479 39 728 -394
3403c94j46J357j508J335k12j100Q00k14j11R81o75n36P60j196Q36M32r70J144
$$ -394 -540 817 -691 644 432 -668 132 -82 -193 788 113 -423 337 -859 -23 409 -561 583
3421E83r69lM27kk12Q13j177J62O91j095J648q03k20K45l33k06J055o07M7O11
$$ 583 -386 -389 38 36 -176 637 -540 -378 313 -782 866 63 -157 88 -245 -451 604 -3 44 655
3441F55j550J199k32j70O55p64J95n4N9L52M57j010N75j99q00J411p51K66K6o37
$$ 655 -895 304 72 -98 557 -207 -12 -66 -7 345 802 -208 367 168 -632 779 28 294 320 -317
3461c17N3M91n61N86J25j027Q87o30N84P1n01O9L05o03M08N60q83Q72p16j25Q10
$$ -317 -264 227 -334 252 377 -650 237 -393 191 262 -239 -170 135 -468 -60 500 -383 489 -227 -352 458
3482D58n01M62j17n99n1O33o30P09k11k12J48n79O21K90k41j56J05o36M56L20
$$ 458 -43 419 302 -297 -348 285 -345 364 153 -59 89 -490 131 421 180 24 129 -507 -51 269
3502B69n10Q20p60q9M08l51O60j11j80m37K33n70R33k96L6J3m64M59k03L46j68
$$ 269 -241 579 -181 -270 138 -213 447 336 156 -281 -48 -618 315 19 55 68 -396 63 -140 206 38
3523C8J33p79M42L4k7Q10o38k5k63J40O8L23j42m2j31k47O91l03K03j87m12K72
$$ 38 171 -608 -166 -132 -159 651 13 -12 -275 -135 -67 256 114 72 -59 -306 385 82 285 98 -314 -42
3545d2p7J13J78L65q94N17k29K77R5j07o0n13M37j95M73l44J42k44q8l5n3M98
$$ -42 -119 -6 172 537 -357 160 -69 208 303 196 136 -377 60 -135 338 -6 136 -108 -196 -231 -284 214
3567B14m49L90l93j82J99J63L52n07L16q45P38k45K59K02o19L61m69N68o6K50
$$ 214 -235 155 -238 -420 -221 -58 294 -213 103 -742 -4 -249 10 212 -407 -46 -515 53 -13 237
3587B37k36m04L35k70P51k67J21n96M54j44R0Q7p6O2k19P8m02O36k09P5j30l18
$$ 237 1 -403 -68 -338 413 146 267 -329 125 -19 71 158 82 144 -75 3 -399 237 28 103 -27 -345
3609c45M21k8k8J21k48kJ15L8j55P14j049O49m64j66N76k67J60l2j94j92O19m95
$$ -345 76 48 20 141 -107 -109 6 44 -111 603 -446 203 -261 -427 149 -118 42 10 -184 -376 243 -252
3631b52J54R4n45P26o44M19K57j94k63K81m33L50L60p34O04p20K33J80k1O5q6
$$ -252 -98 -4 -549 177 -467 -48 209 15 -248 33 -400 -50 310 -424 180 -540 -307 -127 -148 -83 -169
3652a69k26J00M76o71Q79l93k47K70l65L16K76j95N4Q9o82P03M7l70P24j093L36
$$ -169 -395 -295 181 -490 389 -4 -251 19 -346 -30 246 51 105 194 -488 215 262 -108 616 -477 -141
3673a41J02J24L55k09m83L27m4n53J209r34O1L81n55M16J76k82K43j42q09R52
$$ -141 -39 85 440 231 -252 75 31 -522 687 -247 -186 195 -360 56 232 -50 193 51 -758 194
3693A94m63l3Q16q02K67p3k09M10K69r68O55l87j93Q00n90L42K0o13K64L76j06
$$ 194 -269 -302 514 -288 -21 -94 -303 107 376 -592 63 -324 -517 283 -307 35 55 -558 -294 82 -24
3714b4M88o40k83Q60j060J020L2o10K83j11k88M08L76r61J045j203M53L57o73
$$ -24 464 -176 -459 401 -659 361 393 -217 66 -45 -333 75 451 -510 535 -668 -215 142 -531
3733e31R85k18n85K58N1l49Q56p34J25N58q84L65L57m56N40l04n50P08j99j32
$$ -531 454 236 -349 -91 -40 -389 467 -267 -142 416 -468 -103 254 -202 338 34 -516 192 -7 -139
3753a39O18q24N13n0q00J057r9l18K25O6m65P17o46L47J01q63N76K14k04N41k97
$$ -139 479 -345 168 118 -682 375 276 -42 183 249 -216 501 -145 202 303 -560 16 230 26 567 270
3774B70q24J025p11J25N95o66M78l36m08N97k22k42O21l17m50Q49j070J128k98
$$ 270 -554 471 -240 -115 480 -186 292 -44 -452 145 -77 -319 302 -15 -465 384 -686 442 144
3793A44m55O36n28L2O66m19m47Q48j094P64R1m93N85o12j52N28L4k25N19q65N4
$$ 144 -311 325 -203 -171 495 76 -371 477 -617 147 238 -255 330 -282 -434 94 128 -97 422 -443 -389
3814c89Q04q99J132m62m37N19o63K38P45n05J93l8q97O60K65l16Q95j099J90L01
$$ -389 415 -484 648 186 -251 268 -395 -157 588 83 276 238 -659 1 266 -50 845 -254 -64 237
3834B37n33L77M38r16M12L88r47J086m74kJ43l85M37J02m83K16j44o00J028m10
$$ 237 -296 81 519 -397 15 403 -544 542 68 66 209 -176 261 363 -120 96 -48 -648 380 -30
3854c0R0K82m53j7K69k93J60M37q96O79m14o73J386o48K27L0k48j56N84o23O88
$$ -30 60 342 -111 -128 141 -152 8 445 -451 228 -186 -859 527 -121 106 136 -112 -268 316 -307 381
3875C81l44m01M65n33J45O60o10L14J67o16K11M91o65J013q17l25P11n48N00L6
$$ 381 37 -364 101 -432 -287 373 -237 77 244 -372 -161 330 -335 678 -139 -464 247 -301 199 235
3895B35n56K62K15o82J081l69k41O76j189Q74j08n87O78O4q53O47m8m62R51p86
$$ 235 -321 -59 156 -526 555 186 -55 621 -568 306 198 -389 289 353 -500 147 99 -363 588 -198
3915a98K52J1n34P54j16l00K27j44m51R86o95M8L49n68M36j18m4K43n4l47L32
$$ -198 54 65 -469 285 169 -131 96 -48 -499 487 -208 -160 189 -379 57 -61 -105 138 84 -263 69
3936F9l23J97M62p20M23k78l7L89l1j88J34j91m04P66m97M73O6m77J95j19k26
$$ 69 -254 -57 405 -315 108 -170 -207 182 151 -37 97 -94 -498 268 -229 244 310 -167 28 -91 -317
3957c17N64M2o25P16j037N98K00p14Q71m65j37K48L1K9N02o16O6L08o84R47l83
$$ -317 247 289 -336 380 -657 -59 141 -573 298 -167 -304 -56 -25 4 506 -110 -44 264 -420 527 144
3978A44k56K88k38j13N24k87k08K49n32N81P0l34N28k79k63J84l08K68K79m53
$$ 144 -112 176 -62 -175 349 62 -146 103 -429 152 222 -112 416 137 -126 58 -250 18 297 -156
3998a56K69J00o18N42R4j22J16j51l48L95j1q0K78p15M05l85l0N41j30o2j50N3
$$ -156 113 213 -405 137 231 109 225 74 -274 121 110 30 308 -407 -2 -387 -417 124 -6 -68 -218 -165
4020a65J98L48o91L07k03j92K74Q8O4k12L4o2R4N5J56Kl23K19l76K57K26j71K29
$$ -165 33 381 -310 -3 -206 -398 -124 -36 28 -184 -150 -212 -118 -63 93 95 -228 -9 -385 -128 98 -73 156
4043A56j21k32l3L57l97P55n00k46M83l40K78n0k42o9K00l69O42j63l30M26l99
$$ 156 35 -197 -230 127 -270 485 -15 -261 222 -118 160 110 -132 -201 -1 -370 272 109 -221 205 -194
4064a94K77J1r6J7K05m25K19l2J0K45n07K17p7k01K29K80k1j53J03j65P3j10P0
$$ -194 83 94 -2 15 220 -205 14 -18 -8 237 -270 -53 -130 -331 -102 178 157 4 107 -58 15 -95 -25
4087b5J55j20N5p8Jj2L07m58K40j21p3K87l43K55k16P0k01L07p1j45L38k93K51
$$ -25 130 10 65 -13 -12 -24 283 -175 65 -56 -129 158 -185 70 -146 -76 -277 30 -41 -186 152 -141 110
4110A10j93J31N0J85n16J16K75m91L85O2j80L6J37k38M06k45j37q7j2K55k11J82
$$ 110 -83 48 98 283 -233 -117 158 -333 52 114 -66 -30 107 -131 275 30 -107 -194 -206 49 -162 20
4132B0P6j02Qj32M62n17M62l47k40K43j10L92p0o9k88K79m2J09Q8j43j7j66J04
$$ 20 96 -6 2 -130 332 -185 277 -70 -310 -67 -177 215 145 76 -212 67 25 134 222 79 62 -104 0
4155@l9k4L42l96J68q9J6j21L39l06Q1m6q3K83j41J20k39j5l03M79j18L52k13
$$ 0 -39 -63 279 -117 51 -38 -22 -143 196 -110 -29 -75 -158 125 -16 104 -135 -150 -453 26 -92 260 47
4178D7k31J83j81J79K84l22L29k71k88K47K76m17L14l77J74O0K30L5j01m9j32
$$ 47 -184 -1 -182 -3 281 -41 288 17 -271 -24 252 -165 149 -228 -54 6 236 271 170 121 -11
4199a1J92l04L6O3mK24l39L65j69M6j55j82q5N21k5k99N14m48J10L3r5Q9k0N3
$$ -11 181 -123 -87 -24 -28 196 -143 222 53 99 -56 -238 -323 198 173 -126 388 -60 50 83 -12 77 57 110
4223A10k02L62m88N42k2m11K28p7j26K17k57J58J21k38J30J7q8M39n41k1P5k39
$$ 110 -92 270 -218 324 302 -109 119 42 -84 133 -124 34 155 -83 47 64 -24 415 -126 -147 -72 -311
4245c11L00K00j72r7j48nM52k13L21m33M0J21kj23nL01l59M23l94j9K67o0o8L8
$$ -311 -11 189 17 -80 -228 -233 219 6 327 -106 -66 55 53 -70 -75 226 -133 290 -104 -123 144 84 16 54
4269E4l16N22j94j31L68l07j41L78n49L16J04l10O9J44m1K51j78j76K47o27M90
$$ 54 -262 260 66 -65 303 -4 -145 233 -316 0 104 -206 -137 7 -34 217 39 -137 110 -517 -27
4290b7L36n12L77j26k37K90k06Q2K93o59N08J23n04M81O0m51L10k85j25N14p8
$$ -27 309 -203 174 48 -189 101 -105 -23 270 -389 119 242 -262 219 279 -172 138 -147 -272 242 164
4311A64j83L36n39K78k6M6J07l69K45k6Qk26M14l86J67K14n77M18j67o0K89m1
$$ 164 -19 317 -222 56 30 76 183 -186 59 33 41 -185 229 -157 10 224 -353 65 -102 -162 127 86
4333H6m05M42l32K50J71m81M77j78j76K34m7j43L47k53J62n9O2Q4j35l03L45j81
$$ 86 -319 123 -209 41 212 -269 208 30 -146 88 41 -102 245 -8 154 95 157 241 106 -197 148 -33
4355c3P5J58m29M3M38m29O68l97m50O02n09J45K26O7m03K00m1j02L84m25M12m63
$$ -33 42 200 -229 -186 252 -177 491 94 -356 246 -263 -118 108 175 -228 -28 -69 -171 213 -212 200 -263
4377b63K28Rq3L10P1m42R0J97m31N12q5j88K63k48J07P6j06J65J64m76K57j94
$$ -263 -35 -26 -109 201 272 -170 -80 117 -314 198 113 -75 188 -60 47 123 17 182 346 -130 127 -67
4399f7n0N13n17p8J76j50K27oK02j87p0j06K10l17N1O3K63j35J8k58K41N3j20
$$ -67 -117 396 -121 -199 -23 -173 54 48 250 63 -7 -113 97 -220 -169 -106 157 22 40 -218 23 76 -44
4422d4K80l71K73j42J51j09O7j60j09K13k84L51l03K2K29k32L21j62j83K16R3
$$ -44 236 -135 138 -4 147 38 105 -55 -164 49 -235 116 -187 -165 64 -168 153 -9 -192 24 117
4443A17k61K34r1pL40m03K31J74o67M73p4j83J02o5j07M61p53M54M0O1Q6N0k95
$$ 117 -144 90 -1 -8 332 -71 160 334 -333 140 66 -117 -15 -80 -187 274 -479 -25 15 76 162 212 -83
4466h3J76j22j6L49k17k27M66n19K26J85m52M75J25l75j4J18j33M8r4J32nk06
$$ -83 93 -29 -45 304 87 -140 326 -193 33 218 -234 241 366 -9 -23 95 -38 10 -84 48 43 -163
4488a63L28j26o8L2J61k12K96m74L88l1l14L75l33K05Q4j09n1P4j04K84M5n05
$$ -163 165 39 -29 3 164 -48 248 -226 162 131 -183 192 -141 64 148 39 -12 62 -42 242 287 -218
4510b18J55K71k90k6K7M5J76j83j92Oj3L69N8k54K29j32l5J76m16K60p3K1j26
$$ -218 -63 208 -82 -108 -81 -36 140 -43 -235 -229 -242 127 185 -69 160 28 -7 169 -247 13 -60 -39 -165
4533a65K05q3J96k36M4J33O8Jl1m2k9k3j69J83K20l67L07k56j27L5K20j28J37
$$ -165 40 -43 153 -83 -39 94 162 163 132 90 61 38 -131 52 272 -95 212 -44 -171 -136 84 -44 93
4556I3k24k1K73q6K16k99J0K85k59K32j66M0Qj85j64J17K92n9k30J01L8j69J81
$$ 93 -131 -152 121 35 251 -48 -38 247 -12 220 54 94 102 -83 -247 -130 162 103 -127 -26 12 -157 24
4579B4K7j1j14J62o3j09M0R9P5j33J41k42K85m6K00m21J16j70O0P7N8k00R5O7
$$ 24 51 40 -74 88 25 -84 -44 55 130 -3 138 -104 181 135 335 -86 30 -140 -80 -3 55 -145 -50 17
4603A7j25M6JJ71ol97J10K78q5n2J13j87J76Q0L5k39J81k09k12L34j37K7q2N9
$$ 17 -108 -62 -61 110 104 -293 -183 95 10 -42 71 -116 60 140 175 -64 117 -92 -304 30 -107 -80 -162 -103
4627a03l3L22l13L31k03K83l25j21M36j02n7k91J64j36j19k7L22o0J6j32J55n2
$$ -103 -136 186 -127 204 1 284 -41 -162 274 172 115 -176 -12 -148 -267 -294 28 -32 -16 -148 7 -45
4649d5j04L09k27nqM10k92P5J33l71J56n2J49k78K21M8j88J38j4q3MN2jK37k19
$$ -45 -149 160 -67 -72 -80 330 38 113 246 -125 31 -21 128 -150 71 119 -69 69 55 -28 -24 28 27 264 45
4674D5k25K74L6j17j01O0j57K75j62J88l16kJ36k9J60Jk9o0J36Pn0j35J3K13l78
$$ 45 -180 94 130 13 -88 -28 -185 90 -72 116 -200 -202 -66 -95 65 66 37 -23 113 120 70 -65 -52 161 -217
4699b17K68n2R2N0N8k78K14m6n14M49o4J89k77o7L40j59j53J46O0j13J9lP5j08
$$ -217 51 -1 91 141 199 -79 135 89 -425 24 -40 149 -128 -195 145 -14 -167 -21 39 -74 -55 -58 17 -91
4723i1J7j63K31L8j1R0p1j81KJ91j4k02L99j08k74L90k84j4P7j15O3j04M6K10
$$ -91 -74 -237 -6 32 21 111 40 -141 -139 52 38 -164 235 127 -147 243 -41 -55 22 -93 -30 -134 -88 122
4747A22L1k96J31J1m5j91M15l51J36j67K89J21l24K05q8j74J50K12k30j25Q5j1
$$ 122 153 -143 -12 -1 -46 -237 178 -173 -37 -204 85 206 -118 87 -1 -175 -25 187 -43 -168 -83 -94
4769i4J76p3R3J33j30j15o0L04k75J44j19J15q9m6K30k61J03jK6l65K98k80N77
$$ -94 82 9 102 235 105 -10 -70 234 -41 103 -16 99 10 -36 194 -67 36 35 61 -304 -6 -286 291
4792B91k26j22lQPJ08l42M80j86m4LJ41rj80K72j91Qj65N37l90L18l58k3M0J03
$$ 291 65 -57 -60 -52 -45 63 -279 201 15 -29 -26 115 106 -74 198 7 15 -150 387 -3 315 -43 -66 -26 77
4817G7J23j75k72K82l9K3J1O5J6j88k5k7J84L7j03j48L00l85J12K49P9l44P9Q1
$$ 77 200 25 -247 35 -4 19 30 95 111 -77 -102 -129 55 92 -11 -159 141 -244 -132 117 196 -148 -69 12
4841A2J62J51j73J47k76m2j04K11o4j55J74J40j86k09L21j54M3N1j60J68j64j69
$$ 12 174 325 152 299 23 -19 -123 88 24 -131 43 183 -3 -212 109 -45 -2 49 -111 57 -107 -276
4863b76N45k39o6M3p8K58j97L4K71l95J61j90J69m7j15K83j78J16l27o2L54K7
$$ -276 269 30 -36 7 -71 187 -10 24 295 -100 61 -129 40 -7 -122 161 -17 99 -228 -290 64 91
4885I1O5k22J01K9lO5k32K63P5l24L72j63Jl03R2JO9m4q7J74j6J05j34jJ36j43
$$ 91 156 -66 35 64 61 126 -106 157 232 -92 280 117 118 -185 -93 -92 -23 -67 -154 20 4 109 -25 -26 110 -33
4911c3J25N9j56K95k26j23k00K93k99lK62n9J39J13j52j40K79j46J73l07K70m19
$$ -33 92 151 -5 290 64 -59 -259 34 -265 -268 -6 -65 74 187 35 -105 174 28 201 -106 164 -255
4933b55K15K64k24J49j46r9K65r3j69j88O25m50K76k59J60j31J56k78L60r7J2
$$ -255 -40 224 0 149 3 -96 169 76 -93 -281 344 -106 170 -89 71 -60 96 -182 178 81 93
4954I3j93J1K39k00j31O8K3j9K15j55K1J28J62j37p3pJ60k73P0J48m16p0N21j55
$$ 93 -100 -89 150 -50 -181 -113 -90 -109 106 -49 -28 100 262 125 52 45 205 -68 2 150 -266 -336 185 30
4978C0J47j16q6j00J91j08P6l4M3j49J90j07R6J56j58j91j02L22m9J0n9j88M15
$$ 30 177 61 -25 -125 66 -42 34 0 43 -106 84 -23 73 229 71 -120 -222 100 51 61 2 -186 229
5001B29l3k15n4K3O5k18J50J08k4J02l54K89q5n9K72j2j21pl3qk31K47l33L63
$$ 229 196 -19 -73 -50 15 -203 -53 55 31 133 -221 68 -17 -76 196 184 63 56 23 15 -216 31 -302 61
5025F1%M9j03j45K58j61N2j5l8OL2o1p3K48k17K21n32K56J62K60j47j84r4J80
$$ 61 61 110 7 -138 120 -41 11 -4 -42 -36 -4 -65 -138 110 -107 114 -418 -162 0 260 113 -71 -165 15
5049A5Q4j38K39j88j43L48l03K52j3j10j88J33r4lL6O3J7q5m3M2R5r5J99k52n6
$$ 15 99 -39 200 12 -131 217 -86 166 153 43 -145 -12 -106 -109 -73 -10 7 -78 -121 -79 16 -79 120 -132 -188
5074a88K57J7k12J20K16n4m11L38q0j98J78m1o4K06l0j18K78l21J69q1j45K37
$$ -188 69 86 -126 -6 210 156 -255 83 3 -195 -17 -58 -122 84 54 -64 214 -107 62 -19 -164 73
5096G3j13J30j03J19l6k89O4J57K25l38J34P9j31k1J56j70J14j04K0Q4P2k85K14
$$ 73 -40 90 -13 106 70 -219 -155 2 227 -111 23 102 -29 -50 106 -64 50 -54 -34 50 122 -163 51
5119E1j87J49j42l4J64j28L23j94J64j89n7J37j74K91p6p8J29k86j36M59j97K50
$$ 51 -136 13 -129 -163 1 -127 196 2 166 -23 -80 57 -117 174 98 20 149 -137 -273 186 -11 239
5141B39m8k94Q1O7j52J55j84J55K62j39j06j90L7J03N7m4J73k94K66P2n69K86
$$ 239 191 -103 -22 45 -107 48 -136 19 281 142 36 -154 -117 -14 43 -1 172 -122 144 216 -353 -67
5163f7j39L72k6j27L2j01m9J54P9j60O8K2o8J86j4k30J33j50Q9j25m1M58m74K74
$$ -67 -206 166 140 13 45 -56 -105 49 128 -32 36 58 -10 176 162 -68 65 -85 4 -121 -162 296 -178 96
5187I6j52O5j9J30k23p9M85j81j09k47J54N5L39k87o8Q3Q2k6l02K67R7j26j64
$$ 96 -56 9 -10 120 -103 -182 303 122 13 -234 -80 -25 314 27 -41 42 124 98 -204 63 160 34 -130
5210a30J81L8n0p8k29K02J37k03L04k90j9J35k12P1J75k31J77rR6J00r7k82L18
$$ -130 51 89 39 -39 -268 -66 71 -132 172 -118 -137 -2 -214 -143 32 -199 -22 -31 65 165 68 -214 104
5233A04j76J71q3k03J69j11K54k68J37m4J14J85m6l5j20k6R5J4J16k59j22K12
$$ 104 -72 99 16 -187 -18 -129 125 -143 -6 -50 64 249 203 168 48 22 117 131 247 -12 -134 78
5255G8r7m9L35m42K00l7P4k03J42N7j47K19j25K57m03K76j02M1K04m01O4O4j08
$$ 78 -19 -68 267 -175 25 -12 62 -141 1 58 -89 130 5 262 -141 135 33 74 278 -123 -59 5 -103
5278a03j49L50j05j7P4j37L63k41J04k04M7o9Q0j40J54L9j84J89n7j58J77J08
$$ -103 -252 98 -7 -24 50 -87 276 35 139 -65 -18 -87 -7 -147 7 46 -138 51 -6 -164 13 121
5300A21l8j55K43n0J62k64l6k5M5J86j25k67J36j4J24Q2k85L24R3k36j0Nr9K02
$$ 121 83 -72 171 121 283 19 -17 -42 3 189 64 -203 -67 -81 43 125 -160 164 257 21 11 16 -83 119
5324A19k4j09Q2l7k2M2j89J68Q0k0l06K66r2l7j21J59Ql29K36J89k28N0J47j98
$$ 119 95 -14 68 31 9 51 -138 30 110 90 -216 50 -42 -79 -200 -41 -33 -362 -126 63 -165 -115 32 -166
5348a66j56P8K8J19K6J85J37m54K65j06N7J39l25L03j28j77L86j10k06J33j18
$$ -166 -322 -244 -216 -97 -71 114 251 -203 62 -44 13 152 -173 130 2 -175 211 101 -105 28 -90
5369i0n3J27j17J83M7q2j58K00J41k23K48j26l91L39l1J12l2k12K94l54K41p6
$$ -90 -143 -16 -133 50 97 15 -143 57 198 -25 223 97 -294 45 14 126 94 -118 176 -178 63 -13
5391a3Q8l6m5no7J54j95K95l17J75k2r3J55J33j18j01M7j8jR1m0r0Mk08J86J06
$$ -13 75 39 -6 -11 -78 76 -119 176 -141 34 12 -81 74 207 89 -12 35 17 16 107 67 -23 -19 -227 -41 65
5417F5n8J43J9p7p3J1L2m4J64p7l5j81J33j07O4j57L10k34p2J64P8l07K78KK06
$$ 65 7 150 169 92 19 30 62 18 182 105 70 -111 22 -85 -21 -178 132 -102 -174 -10 68 -239 39 41 247
5442B47j85k86N73l51k8J10J35l4Ml62N1L37m67J23J87j63N6o5l8L08j15L4j45
$$ 247 62 -224 349 -2 -30 80 215 181 185 -177 -126 211 -256 -133 54 -109 -53 -118 -156 152 37 71 -74
5465g4k21J50R7N3J77k36j37M70j38j94N1k42M36j80lJ5p8k22J49p0Q3K06l88
$$ -74 -295 -145 -48 5 182 -54 -191 279 141 -53 -2 -244 192 12 9 24 -54 -276 -127 -197 -114 92 -296
5488b96J56J64p3M6L9m1m7Q3J16n0j43o5J22J12k14K54j76J18j07J87j37j5j92
$$ -296 -140 24 -49 -3 36 -5 -52 31 147 97 -46 -111 11 123 -91 163 -13 105 -2 185 48 33 -159
5511a59K25k22J49M0j02L51k84j77K14N6l19J32j13J07K73l20L26j95j08K17k72
$$ -159 66 -156 -7 33 -69 282 -2 -179 35 91 -228 -96 -209 -102 171 -149 177 -18 -126 91 -181
5532a81Q2M0M9J42M8m40L42O5k09J48k00K66j05j5kJ67m08K51J36j39J06l36R9
$$ -181 -99 -59 -10 132 180 -260 82 147 -62 86 -114 152 47 32 30 197 -211 40 176 37 143 -193 -94
5555i4n6J30J82o8l81L20J03l44P4J38kO1j13KK87l07J50j34j04K01r1O9J66j89
$$ -94 -150 -20 162 94 -287 33 136 -208 -134 4 2 63 -50 -48 239 -68 82 -52 -156 45 -46 23 189 0
5579@j42Q2n3J07Q1k72N53n10K51j4k58J71j04j94M27l4j79o4j2J19O2j92K70
$$ 0 -142 -60 -113 -6 75 -197 356 -154 97 83 -175 -4 -108 -302 125 91 -88 -152 -164 -45 17 -175 95
5602I5J40m50KJ54L3Q6J97m26L92p8q1%J05%J01m60J38K29l22K13N3k40K26j47
$$ 95 235 -215 -213 -59 -26 60 257 -169 223 145 64 64 169 169 270 -190 -52 177 -145 68 121 -119 107 -40
5626d0R0j10K0K02k74L9J45j04o8K55j5m3kk39L2K83L9l05J24k15J32l1J53j05
$$ -40 50 -60 -40 162 -112 -73 72 -32 -100 155 140 97 95 -144 -112 171 210 -95 29 -186 -54 -85 68 -37
5650c7L13k50qk0Mj07J05r4q5J46J56Nr4Q1K0pj03r2Q4j04L6n3J27Q3j02j59K10
$$ -37 276 26 18 -2 2 -105 0 -94 -179 -33 123 128 34 115 135 128 25 -67 17 -87 -51 -104 23 106 4 -155 55
5677E5J00l00J7J47j61M4K81k21K34j30l30M10j14n8k4N8L0O3k24J79p1P2M1l05
$$ 55 155 -145 -128 19 -142 -98 183 -38 196 66 -264 146 32 -26 -50 8 38 101 -123 56 -15 57 98 -207
5701b07K17j50J18J20p7NKL4j38M2K41r2j6k1p9N9n5J89R8k70k12P3qJ17n5J02
$$ -207 10 -140 -22 98 21 26 28 62 -76 -34 207 115 99 78 -1 58 3 192 290 20 -192 -119 -127 -10 -65 37
5727C7j63K9NO3K27l90jO6J06L5p9R1O0j48L6j0K14J44j92m02L26j09O3rN6o4
$$ 37 -126 -97 -92 -29 198 -192 -193 -127 -21 14 -65 26 86 -62 -26 -36 178 322 130 -272 54 -55 8 -1 55 -9
5753il5K5%K98k57j11O5R8r8k28K86L9j87J21k91M59o0j13J29J7j69J90q6j61
$$ -9 -44 -19 -19 279 22 -89 -24 74 -24 -252 34 73 -114 7 -284 175 115 2 131 148 -21 169 83 -78
5777g8K26j19p5O0k77J23j8M9K22j46j30K50L1l19L14J3j6j24M6mn0J49k22J88
$$ -78 148 29 -46 14 -263 -140 -158 -109 113 -33 -163 87 118 -201 113 126 110 -14 32 28 -22 127 -95 93
5801I3m3J02k45n5K13j03J41l31J32J46j88j23M52l41J35J13l93L69J49j65l45
$$ 93 50 152 -93 -148 65 -38 103 -228 -96 50 -138 -261 191 -150 -15 98 -295 74 223 58 -287
5822b87L14k20J51J34l0J52k90J51J16j46L9K18l32K38j99j19R8M9r1o7L5J14
$$ -287 27 -193 -42 92 62 214 -76 75 191 45 84 302 -30 208 9 -110 -12 37 -54 -121 -86 28
5844B8j94J04m6R2o6O2J51P7j34j78l2J1J12M8P4k56Q7Pr5J35q4J60K50n0j84
$$ 28 -166 -62 -108 -16 -82 -20 131 208 74 -104 -136 -125 -13 35 109 -147 -60 -53 -148 -13 -97 63 313 263 79
5869G9r3k09M68k07l30K92j69J11J76nk9j36J06k7j44P3P9R8l10J81j03Q9N0j29
$$ 79 -14 -223 245 38 -292 0 -169 -58 118 113 84 -52 54 27 -117 -44 35 133 -177 4 -99 -10 40 -89
5893h9J65n2l71N60l22K70j12l15L36l21M3K88j23l44M09k59L85j71J0K00j29
$$ -89 76 24 -347 213 -109 161 49 -266 70 -251 -208 80 -43 -387 22 -237 148 -23 -13 187 58
5914E8j69K8J50L35m29j60l47L42n6K60K00n25O53k81k78K04L2L9K6j67J10J34
$$ 58 -111 -83 67 402 -27 -187 -534 -192 -248 12 212 -313 340 59 -219 -15 17 56 82 -85 25 159
5936A59k13L11l39N8L01l28j34K4M2n2K15j38R3o1MJ48r3N7pJ5k45J56p1J16J68
$$ 159 -54 257 -82 -24 277 -51 -185 -161 -119 -171 44 -94 -1 -62 -58 90 -3 54 47 62 -183 -27 -98 18 186
5961A86j72J02k83L26l17K66j32K07q4p0M8k68K67p8J39j91n7J82k14K47j8r4
$$ 186 14 116 -167 159 -158 108 -24 183 99 29 77 -191 76 -2 137 -54 -111 71 -143 104 86 -8
5983hm27N16n2q5L21k82Nj95N6K71o4l06M42j97k15L79j63K33j99J7jR9o8N0j92
$$ -8 -435 81 29 -56 265 -17 -12 -207 -151 120 56 -250 192 -5 -220 159 -4 229 30 47 46 145 77 127 -65
6008f5J77j22j20L00Nk12K44l39Ko5K19o9N8J69j37j8j03K59R7m15J05L6j05M39
$$ -65 112 -10 -130 170 175 -37 207 -132 -130 -195 24 -45 13 182 45 27 -76 183 280 -135 -30 6 -99 340
6032C40k56k40L12k09J14r2j94K05r3j67L51K18k65QJ56R3k27j68KR7L8j75O1
$$ 340 84 -156 156 -53 61 -31 -225 -20 -113 -280 71 289 24 32 188 281 54 -114 -112 -15 23 -152 -91
6055i1N8L27k18j7J08j3N0l2p1O1j99j43jO7p8L69l49R5J84m13M18n9l63M95k99
$$ -91 -33 294 76 59 167 154 204 172 101 162 -37 -180 -181 -114 -192 177 -172 -77 107 -306 112 53 -310 185 -114
6080a14J99K3l72L04j79q6M2J62K67j86P9j93j0j33R1lJ01m7j38L0J62n2k08L39
$$ -114 85 108 -264 40 -139 -225 -183 -21 246 60 139 -54 -64 -197 -106 -109 -8 -55 -193 -163 -1 -53 -261 78
6104G8n8j32J39Lj23N8R8m4MJ18j19N3k5J94k48j05K99l66M47m14K85J5j55N0
$$ 78 20 -112 27 30 -93 -35 63 19 23 141 22 75 50 244 -4 -109 190 -176 271 -143 142 157 2 52
6128E2J95k99k5q0n3K18J42k07L41m61p7L63k06J48K4k36K22k01L11k60O6J95
$$ 52 247 -52 -77 -157 -210 8 150 -57 284 -177 -254 109 -97 51 75 -161 61 -140 171 -89 -23 172
6150A72q9r7k20K64j61J4J93l38L51l55L56R8k80O4O8j36J94k56j4K06l66K71
$$ 172 83 -14 -234 30 -131 -117 76 -262 89 -266 90 188 -92 -28 40 -96 98 -158 -172 34 -332 -61
6172f1n1J26k3M8p8J26P7j92K07p2l5j95j87L99n4J8j24J30Qo1M5k9J65k63J35
$$ -61 -112 14 -9 39 -39 87 164 -28 179 107 72 -123 -310 89 35 53 -71 59 67 6 51 22 187 -76 59
6197E9o8m3K9j7J20r5J98r5J18l19J94k31NK33k8m7J79j90nj00J12j7r4l4J2p5
$$ 59 -9 -52 -23 -40 80 -15 183 88 206 -113 81 -150 -145 88 60 13 192 2 -3 -103 9 -8 -102 -136 -124 -199
6223a99Q2R0j28N9P4o3j74K14k20K56L39l40k12qJ96k6P8k37K41J4j56J47J48
$$ -199 -117 -27 -155 -96 -22 -85 -259 -45 -265 -9 330 -10 -222 -230 -34 -60 18 -219 22 36 -120 27 175
6246A75p3o2M0j65L73l18K85n4k85K38k42J47j5K1Q0k82J93pq3m4L0N7K04m42
$$ 175 102 40 80 -85 288 -30 255 201 -84 154 -88 59 44 65 145 -137 56 49 -34 -78 -48 9 213 -229
6270b29N00k02k38J98k7Q7l36K78j69N3Q1K53M8k80J04k36K45j88J95k40J41k0
$$ -229 271 69 -169 29 2 89 -247 31 -138 -85 -4 249 297 17 121 -115 130 -58 137 -103 38 18
6292A8k66K23o5P6j22J37J38k48K69%k22K4J11j42M99l85j57M51m76K59j29N8
$$ 18 -248 -25 -90 -14 -136 1 139 -109 160 160 -62 -38 73 -69 430 45 -112 339 -137 122 -7 51
6314E1R7J23l35j12L11k58J29l8K66k46n9J13j94J63J24r5P2o7j41L88k41j30
$$ 51 148 271 -64 -176 135 -123 6 -32 234 -12 -71 42 -152 11 135 40 112 45 -96 292 51 -79
6336g9J06j84L48q4k23K72k25n9N0J29r7J24j97p2M9j1K80r6j18M9r4p9N74n02
$$ -79 27 -157 191 107 -116 156 -69 -128 -78 51 -46 78 -119 -191 -142 -153 127 31 -87 -38 -132 -211 363 -139
6360a39K18j35k39K45R5r4j4JJ5l0l5K1J73n4k47J90L7J17j12K42l93M38n56L07
$$ -139 79 -56 -295 -50 45 -49 -63 -62 -47 -77 -112 -91 82 28 -219 -29 8 125 13 255 -138 300 -256 51
6384E1j90J27P6j56K30Q2n53L77K27n82M11m37L94P8J89n16J96J01kk30M4K76
$$ 51 -139 -12 64 -92 138 220 -333 44 271 -311 100 -337 57 135 324 -192 4 105 103 -127 -83 193
6406A93q0l32J58j3J47j61J65O6j54j56J22K26l08L33k49R7p1k80R9K93j27J17
$$ 193 113 -219 -61 -74 73 -88 77 143 -11 -167 -45 181 -127 206 -43 54 -17 -297 -198 95 -32 85
6428H5o3J66k3k36K03r6j20K11j01J5J3k9K9Q9k43J79J38l52J81p6k47M20j88
$$ 85 22 188 165 -71 132 36 -84 127 26 41 54 25 54 143 -100 79 217 -135 46 -30 -277 143 -45
6451d5J77j27r2J2K68m84L25j90J43K58l29k35M46j94o3K99j83k07M69m87L80
$$ -45 132 5 -87 -75 193 -291 34 -156 -13 245 -84 -319 127 -67 -130 169 -14 -221 248 -239 141
6472A41n84M63Q1o1k21J57J87j61P9l71M60l83Q5K82l67K16L5k0n4J76Nq4j91
$$ 141 -443 20 101 40 -181 -24 163 2 81 -290 170 -213 -128 154 -213 3 38 18 -36 140 145 61 -130
6495a30p2J65R6j47M1L2n2M4k35K86q8m2M16l95M9J48k15P7K16J3m27J77M2J76
$$ -130 -202 -37 59 -88 -47 -15 -67 -23 -258 28 -60 -102 314 -81 -32 116 -99 -22 194 207 -220 -43 -1 175
6519A75m30J99L09m08M54j68j05q7K78m28J51m5j30M83m83K47k6j71K17j35RK79
$$ 175 -255 -56 253 -155 299 131 26 -61 217 -211 -60 -105 -235 248 -235 12 -14 -185 32 -103 -94 185
6541A85j74k7Q1p2o7J00l1l7J29o3O0q9N1k8j2qn0j74M06j34O7q8J95j90p1J5
$$ 185 11 -16 65 -7 -74 26 -5 -42 87 24 84 -5 46 18 6 -2 -52 -226 180 46 113 25 220 30 -41 -26
6567b6N8J62k82R5J01j28j02K21j34K60l08J3K59m67K77k18J33r3N2j35K20K28
$$ -26 32 194 -88 7 108 -20 -122 99 -35 225 -83 -70 189 -278 -1 -219 -86 -179 -127 -262 -42 186
6589A86k80L7l5K48r8k90N47l26j13J38J52l55K59K29j29K32n61L46k63J14j32
$$ 186 -94 -57 -92 156 58 -232 315 -11 -124 14 166 -189 70 299 170 402 -159 187 -76 38 -94
6610i4R9rR8j43m3J78m85L89N6j43K29j74N2K69k73j02L00m58L01K99o05L45j31
$$ -94 5 -4 94 -49 -92 86 -399 -10 46 -97 132 -42 10 279 6 -96 204 -254 47 346 -259 86 -45
6633d5J02p1K1N3R8l8m4J90o33K78np6L42n5P1k05n2p0K90m05L58l40K67n3M3
$$ -45 57 -14 7 60 158 120 76 266 -367 -89 -94 -170 172 117 188 -17 -69 -139 151 -254 104 -236 31 -22 21
6658B1L27m74Q5JR7j63K48l0l13K48o3m7K62k79J07J23n83N43j25p0o1J13o4p6
$$ 21 348 -126 -41 -40 57 -106 142 112 -201 47 -16 -63 199 -80 27 150 -433 110 -15 -85 -146 -33 -97 -173
6682a73r3L42r9J34k23L68k64k36J09J02K43k06J93Lj11j85J48n0J89k89k13N16
$$ -173 -266 76 -23 111 -112 256 -8 -244 -135 -33 210 4 197 200 89 -96 52 2 191 -98 -311 205
6704B05k46N2k5K24k99l1K68j10J23m67N91m32PJ47M3j45K76j48l31M01o0O0p9
$$ 205 -41 11 -14 210 -89 -120 148 38 161 -306 285 -147 -140 7 50 -95 181 33 -298 103 43 103 24
6727B4j34K61k87L75l43J80O8j22J6j48K01j87K71j95j48J70k82N34j15k32k11
$$ 24 -110 151 -136 239 -104 76 144 22 38 -110 91 -96 175 -20 -168 2 -280 254 139 -93 -304
6748c04N16l77J33j52J83n7m3M35l36J46k02J90k39K19k59L0J72k21K67n16K85
$$ -304 212 -165 -32 -184 -1 -58 -101 334 -2 144 -58 132 -107 112 -147 -117 55 -166 101 -415 -130
6769a30L7m7K36l8j53K13O8M8j26j49j14j64L52n5l0L0j65K71q1K47k12J37Ml34
$$ -130 -93 -140 96 58 -95 118 186 234 108 -41 -155 -319 33 -22 -52 -22 -187 84 3 250 38 175 179 -155
6793a55L39q9q0p9K20k72r8K53k2R8j98M5l6m6K50j04j50J79j66j81L57K8K9o1
$$ -155 184 95 15 -64 156 -116 -214 39 17 115 -83 -38 -74 -120 130 26 -124 55 -111 -292 65 93 122 61
6817F1l55L22mP9k27K07l00J37L32k77J1R6Q3q0m6OK5k4j78N8J26o6J45r2o5K1
$$ 61 -294 28 24 103 -124 83 -217 -80 252 -25 -14 82 165 85 39 45 70 46 -132 -74 52 -14 131 39 -26 -5
6843emL9J21k93J22j25K14j6k53L81p1l12j39N46k78J74m1k46L36pj81J3J12k82
$$ -5 -9 30 151 -142 -20 -145 69 53 -200 181 110 -202 -341 205 -73 101 60 -186 150 143 -38 -25 87 -195
6867a95J36N2j14J9N1R1JNk07K70j23J36j48k7O6k01r3N09k48P6J76k10r8J98
$$ -195 -59 -7 -121 -102 -51 40 41 46 -161 109 -14 122 -26 -53 13 -188 -281 228 -20 56 232 22 -76 122
6891A22j68K03k82K5J96l06J36M4M1j32R6k51L52K21j29l08K34l1l3k07K27p9
$$ 122 -46 157 -125 -100 96 -210 -74 -30 11 -121 -25 -276 76 297 168 -140 94 63 30 -177 50 -29
6913b9k4N3J4J53l14M2P6k82K59o7J10o3J0M44m03J22j70N0N2P1L8j82k7L1J86
$$ -29 -53 0 14 167 -147 -105 -29 -311 -52 -119 -9 -72 -62 382 -21 101 -69 -19 33 104 142 -40 -67 -36 150
6938A50l14K9Q8j98K42k68L86k61pK29k25J07J93k10j22M28O2j33n3r0j02j21
$$ 150 -164 -135 -47 -245 -3 -271 115 -146 -153 76 -149 -42 151 -59 -181 247 309 176 123 33 -69 -190
6960a90K48j1j31L13l31J03o2J61L7j32R5k5J05k08N4j68K50J09k5k97L77m36
$$ -190 58 47 -84 229 -102 1 -61 100 137 5 100 75 180 -28 26 -142 108 217 192 -105 272 -164
6982a64J19P8l1K7N4j37j91M27l40J02j75L10l7Q6j87o9J07j03K22k03N02k60
$$ -164 -45 33 2 29 83 -54 -245 182 -158 -56 -231 79 42 128 -59 -128 -21 -124 98 -105 397 137
7004A37k21M15n01K41qk07N40n89J56J22p2j37K21l87L80m0q1K41m5k28p7J85
$$ 137 -84 331 -170 71 63 -144 396 -193 -37 85 13 -124 97 -290 90 50 -31 210 165 -63 -140 45
7026D5j40L14k85J06k11j19L88p5J02K48n08qM7J58k54L63k47K30j11k9j17J55
$$ 45 -95 219 -66 40 -171 -290 98 23 125 373 -135 -143 -96 62 -192 171 -76 154 43 14 -103 52
7048E2oO7k81J70j52J94j61J90j90n9K72j43m8K09o0J21k12p9J56j55j30L18j45
$$ 52 46 113 -168 2 -150 44 -117 73 -117 -176 96 -47 -95 114 54 175 -37 -116 40 -115 -245 73 -72
7071g2M7O5k24J7L3J39J99j31q5n9L1q8K93j62l5j56K27K87m37K5L94l42R6J19
$$ -72 -25 40 -184 -167 -134 5 204 73 -12 -71 -40 -128 165 3 -32 -188 39 326 -111 -86 308 -34 62 181
7095A81k97j63M23k15j09J48J8M1k60K52k92J45n9J43L6J03k11M31j73k99J66
$$ 181 -116 -279 144 -71 -180 -32 -14 27 -233 19 -273 -128 -187 -44 -8 95 -116 315 142 -157 9
7116IJ01l84M25p3j51J54r9J2O5r0N9O5k31jJ01L2k49K91q4M17m91j37L59k00
$$ 9 110 -274 151 78 -73 81 -18 -6 59 -31 28 93 -138 -139 -38 -6 -255 36 -48 369 -122 -259 100 -100
7140a00J17n6L40k38j39j04K64J48l50k1o1J65j48K8M32k26m69M15J58k43M11
$$ -100 17 -39 301 63 -76 -180 84 232 -118 -139 -200 -35 -183 -155 277 51 -418 -3 155 -88 323
7161C23n53J11K52j71L2q2J93j51J34p9j14J21J83j51j83J80m9j89J37L5L5j41
$$ 323 -230 -119 133 -38 -6 -88 105 -46 88 9 -105 16 199 48 -135 45 -4 -193 -56 -21 14 -127
7183a27M20k33J50j50n4n6j45L55J9l6j50L9J0J52m72K05K58l86M62l55L0n6N1
$$ -127 293 60 210 60 6 -50 -195 160 179 143 -7 32 42 194 -278 -73 185 -201 261 -94 -64 -120 -69
7206f9J69po7k10M85k73J2j02P7m7J1R4Km9j23J12lO7L3j32jj9Q3q7r7K22j36
$$ -69 100 93 26 -184 301 28 40 -62 15 -32 -21 73 75 26 -97 15 12 79 112 -20 -21 -40 43 -44 -141 81 -55
7233e5P0K15k84j55L39j89P0N7j41J47J92j85j70J58l2j8K07k59J14nq7K1j61
$$ -55 15 230 -54 -209 130 -59 11 68 -73 74 266 81 -89 69 37 19 226 -33 81 76 -11 10 -151
7256a51J79n2q4O7p4J52K9j22J18p4j56J29K75r3k71J14J04J6j44J72J71m39P
$$ -151 28 -24 -108 -41 -115 37 66 -56 62 -12 -168 -39 236 143 -128 -14 90 106 -38 134 305 -134 -127
7279a27Jn5J6O9p6J71k69L94Rl65L77l21K71k0q5J68k0Nj50L2j22M7J66Nj07J54
$$ -127 -126 -181 -165 -96 -172 -1 -270 124 133 -232 145 -176 95 75 -10 158 138 143 -7 25 -97 -50 116 121 14 168
7305A68k20J1M3o2P3J13J4j75j45J60K39l95K05J34l6Ll04J40n1o6P0j1J58j13
$$ 168 -52 -41 2 -60 13 126 140 -35 -180 -20 219 -176 29 163 127 130 -174 -34 -85 -151 -81 -92 66 -47
7329d7J2K0J02j18P6j36P8J14j69Q8q5j37J83J46j88j10M15k11R4j57r5J9M0K07
$$ -47 -35 -15 87 -31 45 -91 -13 101 -68 20 -65 -202 -19 127 -61 -171 244 33 127 -30 -125 -106 -66 141
7353A41k51J64k7j51P5q2R7J39j44K23j04q5Q0k01N1M9K07j43o0P8k81J86J25
$$ 141 -110 54 27 -124 -49 -131 -34 105 -39 184 80 -5 75 -126 -75 -26 181 38 -22 56 -225 -39 86
7376H6R4k43K2j30J87M9oK9r4J95j16j65J33J7j20k9Q3J68j26J49l52L52k89K84
$$ 86 180 -63 -41 -171 16 65 59 88 -6 189 73 -92 41 58 -62 -91 -8 160 34 183 -169 183 -106 178
7400A78O6l15k4N2J86k50L4k49O47m23J92j75l0K07k23KL54J5k54k11N4J40l3
$$ 178 244 -71 -95 -43 143 -107 -73 -322 325 -98 94 -81 -111 96 -127 -125 229 244 -10 -221 -167 -27 -60
7423f0j30J25L2Q7l33K09J56j08q1R8o5MJ83j08n1K03k68J31q9J32j0o5n5J05
$$ -60 -190 -65 -33 54 -279 -70 86 -22 -103 -5 -70 -66 117 9 -42 161 -107 24 -65 67 57 -8 -63 42
7447D2m2J27j28J44j34j60J00Pp8J59r0J58j32o3J67P0k91J30R3j51j11q9J04
$$ 42 0 127 -1 143 9 -151 -51 -44 -122 37 -53 105 -27 -90 77 147 -144 -14 79 -72 -183 -272 -168
7470a68K16k06J70J04Kk4j20k8J46k25oL60m82L53j76J29M2n2k06K96o0j38J47
$$ -168 48 -158 12 116 118 94 -26 -54 92 -133 -139 221 -261 92 -84 45 87 35 -171 125 65 -73 74
7493G4o5j7R7l58K67j16j58K91p8JK1J0J13j26J33r4J18j35P1j80J51J87p9l40
$$ 74 9 -8 89 -269 -2 -118 -276 15 -63 -62 -41 -31 82 -44 89 -5 113 -22 49 -131 20 207 128 -212
7517b12M93j87j07j52P8J44L8n9j87J40j85M57l96L13q1m90K44L95j13k88J63
$$ -212 281 94 -13 -165 -87 57 95 36 -151 -11 -196 261 -135 178 97 -393 -149 246 133 -155 8
7538Hk82K92J35k65M5o1J01l7J77j22J72l01K2J75j39J61j39R1J19l18K10j92
$$ 8 -274 18 153 -112 -67 -128 -27 -64 113 -9 163 -138 -116 59 -80 81 -58 33 152 -166 44 -148
7560a48J5M35l34R7j06j15J46K3j7l5Q1m8K72n6j59k71j4R4q8L87k52J38K5j16
$$ -148 -133 302 -32 65 -41 -156 -10 13 -4 -39 42 -6 266 210 51 -220 -234 -140 -228 159 -93 45 70 -46
7584d6J28k23K12j26K0j9n7L46k51j21J06j15M47j99k16J81K3j78P3l1j2K78l22
$$ -46 82 -141 71 -55 -35 -54 -111 235 -16 -137 -31 -146 301 102 -114 67 90 -88 -15 -46 -58 220 -102
7607a02K41j38k34J49J28%k7j68J76j69M7J10J8j78m8L02m32K82O2j6L7oj60J99
$$ -102 139 1 -233 -84 44 44 17 -151 25 -144 -97 13 31 -147 -195 107 -325 -43 19 3 40 34 -126 73
7631G3R7l00L3j3L21j59k63J54JJ53l21J70j42J83k55P4M24l51j19M08j84L00
$$ 73 170 -130 -97 -110 211 52 -211 -57 -56 97 -224 -54 -196 -13 -268 -194 230 -121 -240 168 -16 284
7653B84k23l09M80j93k6QO5k26J42K0k18K75J09k16KK6J05m19J84J02j46j35L35
$$ 284 61 -248 232 39 13 21 86 -140 2 22 -196 79 188 -28 -26 0 105 -314 -130 -28 -174 -309 26
7676B6k33J84N4Ql5J16q3M4%r7N8j47J32k17K21j9K48q9k09L8K1n0j83J13Q3J9
$$ 26 -207 -23 31 39 4 120 37 81 81 -16 42 -105 27 -190 31 12 260 171 -38 0 21 -29 -212 -99 -16 3
7702Cjj86K65q5M0m6n1j02q5P3J71kk27J14J77j27j25K83J10k67J80k59K89k18
$$ 3 2 -184 81 -4 36 -10 -61 -163 -248 -175 -4 -6 -233 -119 58 -69 -194 89 199 -68 112 -147 142 -76
7726g6J55j70jN9K15l16J54k6R4r8o3K63k86M1K04l6k85L05j6k46J71M2J14k05
$$ -76 79 -91 -92 -33 182 -134 20 -6 88 -10 -73 190 -96 -55 149 113 -172 133 117 -129 42 84 198 -7
7750gl1J76Qjk25L51l19m9K24l8r3J06j26k09L09r6R4k74K2J09JJ45p9j63Q4Q5
$$ -7 -38 138 146 145 -80 271 -48 -97 127 89 -4 102 -24 -233 76 -20 74 -200 -178 -69 -68 77 -2 -165 -81 4
7776Dj98l4J33R9O6k92J87J42j73J08k80K13K24j03P9m0j71M1o2J5p5r0K32j71
$$ 4 -194 -228 -95 4 70 -222 -35 107 -66 42 -238 -25 199 96 175 135 -36 5 -57 -42 -117 -207 25 -146
7800a46N9l4L59k55OK3K02k56q2J17j43K50M9k72K5J90n9N9K2p4J34k86J09J93
$$ -146 -87 -121 238 -17 -11 12 214 -42 -124 -7 -150 100 149 -123 -98 92 33 92 114 40 174 -112 -3 190
7824A90l78K14j36j9J87J38q1j00j08P6J45n06L09L7j11K75k04j40K93k54J61
$$ 190 -188 26 -110 -129 58 196 115 15 -93 -17 128 -378 -69 -32 -143 132 -72 -212 81 -173 -12
7845a2P0l5Q2j53J40j54m9K00k27K39j77N5J22q9J02l41L52k03j17K15j72ql7
$$ -12 58 23 105 -48 92 -62 -111 89 -138 101 -76 -21 101 12 114 -227 125 -78 -195 20 -152 -160 -197
7868a97K05Q3J19k77J39k05L08Kj77m25L01J75K0j15j18K42j4j01Q0K0K2k79j87
$$ -197 8 91 210 -67 72 -133 175 177 0 -425 -124 51 71 -44 -162 80 66 -35 45 65 87 -192 -379
7891c79M82q4j3N4j89L08Rl13J14p8P3J11J54k03k03K85l0%k26J5j32K4N1J10
$$ -379 103 19 6 60 -129 179 188 -125 -11 -89 -16 95 249 46 -157 128 98 98 -128 -113 -245 -221 -170 -60
7915f0j22J17J07j54J28K00j43j46J66j37p4j16R9J57K71k86o0J4J14j6J3K4l26
$$ -60 -182 -65 42 -112 16 216 73 -73 93 -44 -118 -234 -135 22 293 7 -53 -39 75 59 72 96 -230
7938b30R8m0J15M9p4L21j42k66J87O3p4K91l07l3J19k7R2j28P3l0J84l33K00j76
$$ -230 -132 -172 -57 -8 -82 239 97 -169 18 81 7 298 -9 -42 77 50 142 14 87 57 241 -92 108 -68
7962f8K92j48r2Q4r1r3J04N8j60N5K7J71k36Q0J4k14N6j0J04L4j70R1r5J59J61
$$ -68 224 76 -16 68 -23 -116 -12 46 -114 -59 -32 139 -97 -17 -3 -217 -161 -171 -67 -33 -203 -112 -207 -48 113
7987A13k46J42L0rp4q4O7Pj22L78k62N6j05J23m7k3p5P8p3J87J2K2l7o8O0p8J49
$$ 113 -133 9 39 30 -44 -128 -61 -54 -176 202 -60 -4 -109 14 -33 -56 -131 -53 -126 61 73 95 58 -10 50 -28 121
8014A21j94o5K55K4Mo7k71N9q0J78j69K54m3j3k78M52J29j95J2j73J96k12K6J65
$$ 121 -73 -138 117 141 145 78 -193 -134 -214 -36 -205 49 6 -7 -285 167 296 101 113 -60 136 -76 -50 115
8038A15k45J53K2k3o4J1j39N45m91J8K07k59R8M6kk1P2k55L4M2O1n0N7K04j59
$$ 115 -130 23 45 22 -42 -31 -170 375 -116 -98 109 -150 -52 -6 -8 -29 43 -212 -178 -136 -75 -125 -68 136 -23
8063b3L0K63j25l6J61j62q0j2j34K02o9K03j73L6j7j30J68k6P8k08l2N6Q7j30
$$ -23 7 270 145 109 270 108 28 16 -118 84 15 218 45 81 64 -66 102 76 154 -54 -86 -30 57 -73
8087g3J49k34K62P5l02J05J33j82J2J51j86p7K72j69J31j52N2J24p2Q3k17J06
$$ -73 76 -158 104 179 -123 -18 115 -67 -55 96 -90 -167 105 -64 67 -85 -33 91 19 102 -115 -9
8109iM1j4l3J25l92L18P4j93K56l20J96l38K3N26n7l73l0M61l19J38j80n6K76
$$ -9 32 18 -15 110 -282 36 110 -83 173 -147 49 -289 -266 260 203 -170 -200 261 -58 80 -100 -156 120
8132A20k46L2R6j48K35J02q2l8j37k6K22k53K39k66L06q2K6k32L3K44j27j13J4
$$ 120 -126 -94 2 -146 89 191 109 71 -66 -92 130 -123 116 -150 156 74 100 -132 -99 145 18 -95 -81
8155h1j1L9j32J56N7q3R6p1J28J5j49J15k39j63M13j95Lk2L97j66j11L69n01M9
$$ -81 -92 -53 -185 -29 28 -55 41 -30 98 113 -36 79 -160 -323 90 -105 -102 -124 273 107 -4 365 -136 -87
8179h7J93Mk82K98J1k87J54Q8r6M7r4L2
$$ -87 106 110 -172 126 137 -150 4 92 -4 43 -51 -19
8191a9
$$ Imaginary data points
##PAGE= N=2
##DATA TABLE= (X++(I..I)), XYDATA
0@%%%%%%%%%%qJ6j6J6k4L2l2M0n6O4p2Q8j05J29j52J76k08K40k74L15l62M12m68
$$ 0 0 0 0 0 0 0 0 0 0 0 -8 8 -8 8 -16 16 -16 24 -32 32 -40 48 -57 72 -80 96 -112 128 -146 169 -193 219 -249
33b49N31n98O72p56Q48r48J058j177J309j453J608j779J966k169K390k635K903
$$ -249 282 -316 356 -400 448 -500 558 -619 690 -763 845 -934 1032 -1137 1253 -1382 1521
50A521l196L519l876M274m719N218n784O431p179Q057r101J0367j1943J3963j6655
$$ 1521 -1675 1844 -2032 2242 -2477 2741 -3043 3388 -3791 4266 -4835 5532 -6411 7552 -9103
65i103K0443k6199L6079n7581J83575k9039j41343K00307k60969J13897J35922
$$ -9103 11340 -14859 21220 -36361 147214 118175 -23168 177139 -83830 30067 165989
76A65989j60935R4731K6432k54411K23590p9561o5734K17045k19544K7645Q0908
$$ 165989 5054 99785 126217 -128194 95396 15835 -49899 167146 -52398 -24753 56155
87E6155j56116J16896M4345j68711J41966n9109r8377K27107j80852M5351P1112
$$ 56155 -99961 16935 61280 -107431 34535 -24574 -122951 104156 -76696 -31345 39767
98C9767j75163J32011M3181j10230J39813o8194j33206K09045j41348O9024J40617
$$ 39767 -135396 -3385 39796 -70434 69379 1185 -132021 77024 -64324 4700 145317
109A45317k15297J00522p777j13715J73457J714j14781J61153j62715k7020J78602
$$ 145317 -69980 30542 22765 -90950 82507 84221 -30560 130593 -32122 -59142 119460
120A19460j69504J30940J9077j60944J03518j7560q3821J63716q2127p2647J43087
$$ 119460 -50044 80896 99973 -60971 42547 24987 -58834 104882 22755 -49892 93195
131I3195j78556R3836O2192j34763J05373m3469p9521J21790l7738n1863J27781
$$ 93195 -85361 8475 70667 -64096 41277 -2192 -81713 40077 2339 -49524 78257
142G8257j60476M2899P7209j17709J41601m0073q5661Q0465m9745k2103J44970
$$ 78257 -82219 -39320 37889 -79820 61781 21708 -63953 16512 -33233 -55336 89634
153H9634j02084P197O5686j63411J31852N160n7884J07402p6695o1332R8982o5047
$$ 89634 -12450 -5253 60433 -102978 28874 34034 -23850 83552 6857 -54475 44507 -20540
165b0540J4518J14141j59360P2754j380r1738J34076m3685m1397O5113p4845k0675
$$ -20540 -6022 108119 -51241 21513 20133 -71605 62471 18786 -22611 42502 -32343 -53018
177e3018J14374j02186N7047K1548j27309J07567l8238j0876Q0163o3423l4498
$$ -53018 61356 -40830 16217 37765 -89544 18023 -20215 -31091 49072 -14351 -48849
188d8849O2625p3915N0148O7816j10724Q4431n8640l5968R5688l8535Q690M1020
$$ -48849 13776 -60139 -9991 57825 -52899 31532 -27108 -63076 32612 -5923 2767 43787
200D3787q0756L509O6712p8248R9661k2284p3935P3598o5562K2489O4484m7086
$$ 43787 -36969 -33460 33252 -44996 54665 32381 -41554 32044 -33518 -11029 53455 6369
212F369q190L4747q9683O6790K8048o4372Q6150p8134j5926N0990l1814K1948
$$ 6369 -1821 32926 -56757 10033 38081 -26291 59859 -18275 -34201 16789 -15025 6923
224F923L9569p2996J0277K5406o3974J00279l6638k4842L5175o2245K3448M0256
$$ 6923 46492 -26504 -16227 9179 -54795 45484 8846 -15996 19179 -43066 -19618 20638
236B0638k2206R187J6164q0027O1269q160j1893O6792o8564N911O863k0109K8866
$$ 20638 -1568 7619 23783 -56244 5025 -3135 -15028 51764 -16800 -10889 -4026 -24135 4731
249D731L4358n2123K2894j4346m1071Q1524m0285J8230P239m9550J3368K2556
$$ 4731 39089 -13034 9860 -4486 -45557 35967 -4318 13912 21151 -28399 -15031 7525
261G525j3965K5865O542o4705M9664l4062J5653M3999m2424R186j1583j6738J9160
$$ 7525 -6440 19425 25967 -38738 10926 -23136 -7483 36516 -5908 3278 -8305 -25043 -5883
274e883L3646l5624K9990l2902k2780M8533k7358L5666p156k5484o103J1652p885
$$ -5883 27763 -7861 22129 -10773 -33553 14980 -12378 23288 16132 -9352 -15455 -3803 -11688
287a1688L2715K264l8216K6963m4223L1063J7622q543O802j9075j5343P529K5722
$$ -11688 21027 23291 -14925 12038 -32185 -1122 16500 7957 14759 -4316 -19659 -12130 13592
300A3592j6454L3788m0643n972J2027j3874L7282p232n721j8790M922j3427L5238
$$ 13592 -2862 30926 -9717 -15689 -3662 -17536 19746 12514 6793 -11997 -7075 -20502 14736
313A4736J425j2581R548m0432K3923J508J7994j10o735j9682m304J7856l615L2182
$$ 14736 16161 3580 13128 -27304 -3381 -1873 16121 16011 9276 -10406 -14710 3146 -469 31713
327C1713k8735k40j7126K140J8393N252R827k7069K173k1108K5091M103Q992n678
$$ 31713 2978 2738 -14388 -12248 6145 11397 21224 -5845 -3672 -24780 311 4414 13406 7728
341G728k2991L118j1565L2073p751J2567k0942j2823N715R67K4302p066M346k9469
$$ 7728 -15263 -12145 -23710 8363 612 13179 -7763 -20586 -14871 -13904 10398 3332 7678 -21791
355b1791J1680p007K0244J4956j9391Q349k7152J3615P102J7555o570K208j9900
$$ -21791 -10111 -17118 3126 18082 -1309 7040 -20112 -6497 605 18160 11590 13798 -6102
368f102p111K7464j4919L5281k3059j1674J51n182J3582J5699n205k1546J2480
$$ -6102 -13213 14251 -668 34613 11554 -120 31 -5151 8431 24130 18925 -2621 9859
381I859l4362L4627M549j1640J6420l4115J36R092O772r41J9880m0657O259O891
$$ 9859 -24503 10124 14673 3033 19453 -14662 -14526 -5434 1338 397 20277 -20380 -14121 -7230
395g230j8637M7702k4317l420p16j4963O530K9183j3823K931O712m4407M4407
$$ -7230 -25867 21835 -2482 -5902 -6618 -21581 -15051 14132 309 3240 9952 -34455 9952
408I952j1237P564K2879l2795j509R401o359J5170K5581m6506K5624k0000j1762
$$ 9952 -1285 6279 29158 -3637 -5146 4255 -2104 13066 38647 -7859 17765 -2235 -13997
421a3997M9018k7569R614j533k8857N673K7412k5728L0386j1598m3139M2389l3381
$$ -13997 35021 7452 17066 15533 -13324 -7651 19761 -5967 24419 12821 -30318 12071 -21310
434b1310K1228K3663l3374R19M092k6595L1892J6808l8677M1312m5101r41L9518
$$ -21310 -82 23581 -9793 -8874 -4782 -31377 515 17323 -21354 19958 -25143 -26084 13434
447A3434k6036K6079K829l5029J1281J6506k5504N5270k3999k2551L4269m6408
$$ 13434 -12602 13477 16306 -18723 -7442 9064 -16440 38830 14831 -7720 26549 -19859
459a9859L4135K1216k3772J2609k590l9023M2339p14j8816M8340n9819R390J6755
$$ -19859 14276 35492 11720 24329 21739 -17284 25055 24341 5525 53865 -5954 3436 20191
472B0191k8007L4849K829l8059J7816q866k7420O2237m1341K292J8527n5496L5441
$$ 20191 -7816 27033 29862 -8197 9619 753 -26667 35570 -5771 -3479 15048 -40448 -5007
485e007Q201k0232K6885j2139m2122M8172k5840O375M6838o2113K5412k320k5594
$$ -5007 3194 -17038 9847 -2292 -44414 3758 -22082 -15707 31131 -30982 -5570 -7890 -33484
498c3484M5494M386k8762L2498l1752j4408O1548m4605L4774O005n0137L5133
$$ -33484 12010 16396 -12366 20132 -11620 -26028 35520 -9085 25689 31694 -18443 16690
510A6690m243j2292M2998j8187l0362M4051n0514K6415L1419n1090L7334j9706
$$ 16690 12447 155 43153 24966 -5396 38655 -11859 14556 45975 -5115 32219 12513
522A2513k6400L9649q928k0554M0808n1809J323M0344n1866N0320j2410m1539
$$ 12513 -13887 25762 16834 -3720 37088 -14721 -13398 26946 -24920 25400 12990 -28549
534b8549L2970j8510q579N0321l2953j2977L2690o4565M7880J4754l3499M5343
$$ -28549 4421 -14089 -22668 27653 -5300 -18277 14413 -50152 -2272 12482 -21017 24326
546B4326l4400k2877L8939j7818L687M8180o1200K0944J1327m5339O4379j8239
$$ 24326 -10074 -32951 5988 -11830 -8143 40037 -21163 -219 11108 -34231 30148 11909
558A1909j7822L2335l3485n050M6977m0870J7684K0094o2590N4875j3292j8075
$$ 11909 -5913 26422 -7063 -12113 34864 -6006 11678 31772 -30818 24057 10765 -7310
570g310M3664l9435j2074L4088l1999J7298L5174o5288L6944j6163l0385O3761
$$ -7310 36354 -3081 -15155 18933 -13066 4232 39406 -25882 11062 -5101 -35486 28275
582B8275k7758l299K2892m7027K940M1165m1664M5502j379n5768N0321l6204N109
$$ 28275 517 -2782 20110 -26917 -23977 17188 -24476 21026 19647 -36121 14200 -22004 -16895
595a6895M7378l5864K797K0880n0483L3681K0727m5796N7181l7613j6094M5952
$$ -16895 30483 -5381 -2584 18296 -32187 1494 22221 -23575 33606 -4007 -20101 25851
607B5851l7338J5043K3792m5614J8497J9436m5094N7154k2840l0111M4811m6656
$$ 25851 -11487 3556 27348 -18266 231 19667 -25427 31727 8887 -21224 23587 -23069
619b3069J8907L2874l5945J3035P223n1792M6228O05k4841N5713n4858j865K5443
$$ -23069 -4162 28712 -7233 5802 13025 -38767 7461 8066 -16775 38938 -15920 -17785 7658
632G658l4393L1584K0395m2854K4843q157l7942O3694l2401K858L1135n3553K2705
$$ 7658 -26735 4849 25244 -17610 7233 -924 -38866 24828 -7573 -4715 26420 -27133 -4428
645d428J4587k8670L2330M66m2701M7976k8448m568M7130n2680K0850Q142l2881
$$ -4428 10159 -18511 13819 14285 -28416 19560 -8888 -13456 33674 -19006 1844 9986 -22895
658b2895L4650N937l3785L5680k7055j8512N4780m1830K4140J0760m7122K6339
$$ -22895 11755 17692 -16093 19587 -7468 -25980 28800 -13030 11110 21870 -25252 1087
670A087J302j8549M0775j2998l0147L8266m4779J8646L2164l8741K9720j2249
$$ 1087 2389 -16160 24615 11617 -18530 19736 -25043 -6397 25767 -12974 16746 4497
682D497k8864L1481k505j6100M0623l9600l018L0710m1368L8949j349k9171K4338
$$ 4497 -24367 7114 4609 -11491 29132 -10468 -13486 17224 -24144 14805 13456 -15715 8623
695H623j2612j4296L9332k1373q801K8987m9484L1119J0122k4260L2292k1224
$$ 8623 -3989 -18285 21047 -326 -9127 19860 -29624 1495 11617 -12643 19649 -1575
707a575j9223K6661j1701j014L6347m4240J2260P215l1703M3620r342j2018J7296
$$ -1575 -20798 5863 -5838 -6852 29495 -14745 -2485 4730 -26973 16647 7305 -4713 12583
720A2583k2120q671L4382k2190J2472J3590m4300L0731r049n703K9154j8882j0413
$$ 12583 -9537 -18208 16174 -6016 6456 20046 -24254 6477 -2572 -8275 20879 1997 -8416
733h416J5825k0219Q115K7769l5009K3309j2448k0011L2501j2230K109J2134k2265
$$ -8416 7409 -12810 -4695 23074 -11935 11374 -1074 -21085 11416 -814 1295 13429 -8836
746h836m454K2565k2840K5088J714k9912K4845k0550N678K1163j2261l267Q793
$$ -8836 -13290 9275 -13565 11523 13237 -16675 8170 -12380 -6702 14461 2200 -1067 7726
759G726k4664J3892J6928k2181K8300k2682q601J7023j0930J0242J0946j8589
$$ 7726 -16938 -3046 13882 -8299 20001 -2681 -11282 5741 -5189 5053 15999 -2590
771b590k091J0112k1378L0038o181j1743J4482k3348P653J1356n104J798N444
$$ -2590 -4681 5431 -15947 14091 7910 -3833 10649 -12699 -5046 6310 1206 3004 8448
784H448k4912J3889L238r626K5111k2066k58K723p572R614J0239j2619J429P22
$$ 8448 -16464 -2575 663 -8963 16148 -5918 -6176 -3453 -11025 -1411 8828 -3791 -2362 -1640
798a640j7604K7122r256L446N535j8617N154N148R21N282N919k1646J2476o758
$$ -1640 -19244 7878 -1378 2068 7603 -11014 -5860 -712 209 5491 11410 -10236 2240 -4518
812d518J694J9138j5602M814o642m416N212J1303p979N628o923j2784J7829r694
$$ -4518 -2824 16314 712 5526 -1116 -5532 -320 10983 3004 8632 1709 -11075 6754 -2940
826b940J2341j375j0398j210J16P87O990N367j5578Q542j3897O863R037m326M911
$$ -2940 9401 8026 -2372 -3582 -3466 -2679 4311 9678 -5900 2642 -11255 -4392 4645 319 5230
841E230r130k971j532J1068m091R930r625p052O384o095J4937k771n0p807k86
$$ 5230 -3900 -6871 -8403 2665 -1426 8504 -1121 -8173 -1789 -7884 7053 4282 4232 -3575 -3861
856c861j470P820O508o778M599j5230O897N90O281K784n231l637p043Q372j944
$$ -3861 -5331 2489 8997 2219 6818 -8412 -1515 -925 5356 8140 2909 -728 -7771 601 -1343
871a343J1055p676k305m554k787Q941j044P340j0939J020o924N304N365Q42J562
$$ -1343 9712 2036 -269 -4823 -7610 1331 287 7627 -3312 -2292 -9216 -3912 1453 2295 3857
886C857r755K133n840J2547k024L856l426q996N814k108J0280j266J232r851K775
$$ 3857 -5898 -3765 -9605 2942 918 4774 1348 -7648 -1834 -3942 6338 5072 6304 -3547 -772
901g72j266M118J0532j0566N707j1230K491M664M178J60j510n673o673J2092p590
$$ -772 -2038 2080 12612 2046 7753 -3477 -986 3678 7856 8016 6506 833 -5840 6252 -1338
916a338J2666n955q140K565n483N969M060N25r571N621j3170R090O483p427R521
$$ -1338 11328 5373 -2767 -202 -5685 284 4344 4869 -4702 919 -12251 -3161 3322 -4105 5416
931E416j3765j051L519L487J61P483j2371j656P182j0579K0186p374l059K170
$$ 5416 -8349 -9400 -5881 -2394 -2233 5250 -7121 -8777 -1595 -12174 8012 638 -2421 -251
945b51p849L277J0466k451j656N929j9903J5864q25j579J3364j5001n28K947k340
$$ -251 -8100 -4823 5643 3192 1536 7465 -12438 3426 2601 1022 14386 -615 -1143 1804 -536
960e36L950J1974j7383O940l286j0991K2151j0569L113J387j2759Q13J0912p699
$$ -536 3414 15388 -1995 4945 1659 -9332 12819 2250 5363 6750 -6009 -5196 5716 -1983
974a983Q809J021k1588J8127j2093M779J3851j4052O25J203j0047Q783J1679j7210
$$ -1983 6826 7847 -13741 4386 -7707 -2928 10923 -3129 -2504 -1301 -11348 -2565 9114 -8096
988h096J6236j4158p629J9953j2837J0398L156j4875K360P531j1861J9959m617
$$ -8096 8140 -6018 -13647 6306 -6531 3867 7023 -7852 -5492 2039 -9822 10137 5520
1001E520j4932J7929k0414J0431J1958j2065O102m75j6515J4637M125j1750K2719
$$ 5520 -9412 8517 -11897 -1466 10492 -1573 4529 4054 -12461 2176 6301 -5449 17270
1014A7270k3410o6J1683j4980J6727K764j5112O397j369j3820K6912j2278k973
$$ 17270 -6140 -6206 5477 -9503 7224 9988 -5124 1273 -96 -13916 12996 718 -2255
1027b255J3631k6973J4775M776r058J3314l599j8081J7986q088l333K4304k6864
$$ -2255 11376 -15597 -822 3954 -5104 8210 4611 -13470 4516 -3572 -6905 17399 -9465
1040i465R726K104j5169J8743N05j2210J2755j0018j0399K6878j9427J0278O868
$$ -9465 261 2365 -12804 5939 6444 -5766 6989 -3029 -13428 13450 -5977 4301 11169
1053A1169k5633J6806j922n821J7239o873j4836J8224j8702P158J9648k4591J6825
$$ 11169 -14464 2342 420 -5401 11838 4965 -9871 8353 -10349 -3191 16457 -8134 8691
1066H691q163j3765J8619k876o031J7519j8894m447J9377k3345K1501j78j8521
$$ 8691 528 -13237 5382 2506 -3525 13994 -4900 -9347 10030 -13315 8186 8008 -10513
1079a0513J6622j0256m456J9174j0931n897J6952k5980J5714Q569j9191K1220
$$ -10513 6109 -4147 -8603 10571 -360 -6257 10695 -15285 429 8998 -10193 11027
1091A1027j4471q233J6161p143o60J8067k4065M388R595k1021K8057o769j0268
$$ 11027 -3444 -11677 4484 -2659 -3319 14748 -9317 -4929 4666 -16355 11702 4933 -5335
1104e335J2882j5785j750J9712j2155M615J1170k9152J9138k969q291K3459j5567
$$ -5335 7547 -8238 -9988 9724 -2431 2184 13354 -15798 3340 371 -7920 15539 -28
1117b8m369J0659j3560M800J7174k3022J4586k191j7785K5798j3089n98J1712
$$ -28 -4397 6262 -7298 -2498 14676 -8346 6240 4049 -13736 12062 -1027 -1625 10087
1130A0087j6969J288J5123j6721J3593L185k4987K2177j2481j15K0121j6149n15
$$ 10087 -6882 -5594 9529 -7192 6401 9586 -15401 6776 -5705 -5820 14301 -1848 -2363
1143b363O507j7449J0545J3454j9335K0651j3623j2585K0385j3773Q628J0781
$$ -2363 4144 -13305 -2760 10694 -8641 12010 -1613 -14198 6187 -7586 1042 11823
1155A1823j7169J809P717j8382K1684j606j4346J9877k0738M156J3435j2950O656
$$ 11823 -5346 -3537 4180 -14202 7482 5876 -8470 11407 -9331 -5175 8260 -4690 1966
1168A966N388j9040J3923K807j4239K3321j8669k526J3742j5310J1862O855j6284
$$ 1966 7354 -11686 2237 5044 -9195 14126 -4543 -7069 6673 -8637 3225 10080 -6204
1181f204O782Q74j5827K5563r111m980J4358k3645Q442Q045q986J1589J416j9492
$$ -6204 578 1452 -14375 11188 2077 -2903 11455 -12190 -3748 4297 -4689 6900 8316 -11176
1195a1176J4849o806n206K4158j9714N274L307j5422J2544M937j1247J1941o059
$$ -11176 3673 -3133 -8339 15819 -3895 1379 4686 -10736 1808 6745 -4502 7439 1380
1208A380j2894K1696j5244O485R061j9409R826R88p484J2964j540j4620J5316
$$ 1380 -11514 10182 -5062 1423 10484 -8925 901 1889 -5595 7369 5829 -8791 6525
1221F525j3899K704J7015j7946J0296l442j2292J2030K045p153J4294j2806p376
$$ 6525 -7374 -4670 12345 -5601 4695 1253 -11039 991 3036 -4117 10177 -2629 -10005
1234a0005J6035j6446J5000L361j4342Q671n187o125J5100l115o790J3065j9341
$$ -10005 6030 -10416 4584 7945 -6397 2274 -2913 -9038 6062 2947 -3843 9222 -10119
1247a0119P365Q817j2243J4470o465q859Q772k385l579J5813j4236J5P952j5784
$$ -10119 -2754 6063 -6180 8290 1825 -7034 1738 -647 -4226 11587 -2649 -2634 5318 -10466
1261a0466J6407j207o815P148p509m934J3284n694L02R263j9622J0438k62n173
$$ -10466 5941 4734 -2081 5067 -2442 -7376 5908 214 516 9779 -9843 595 333 -4840
1275d840J3897o905n827N593o381M39J4309j3495O483q07j2512J4515m473Q88
$$ -4840 9057 2152 -3675 1918 -4463 -4024 10285 -3210 3273 2466 -10046 4469 -4 884
1289H84N780q131m256R167p949P339N627j5273J0591p699n21J0472m842j774L299
$$ 884 6664 -1467 -5723 3444 -4505 2834 8461 -6812 3779 -3920 -4441 6031 1189 -585 2714
1304B714q807K268R460j0300J0662o607o772Q653n143L874M649o149l020N471
$$ 2714 -6093 -3825 5635 -4665 5997 -610 -7382 1271 -3872 2 4651 -1498 -4518 953
1318I53q755J0203J333p942Q036j0108K495N921j566M94K595r468L203M731n811
$$ 953 -7802 2401 3734 -4208 3828 -6280 -3785 2136 570 1064 3659 -5809 -2606 2125 -3686
1333c686J2139q566j863K556m178M714M343l928j085J320q514J0853k125o33M267
$$ -3686 8453 -113 -1976 580 -3598 1116 5459 1531 446 1766 -6748 4105 1980 1347 5614
1348E614r351K173J319P58J795K704q869L255j412j790R803o897J736k701k638
$$ 5614 -3737 -1564 -245 513 2308 5012 -3857 -602 -2014 -3804 5999 -898 838 -1863 -4501
1363d501K260M305j588L44r89p443P962l421M689J163n313l0j270J939J985M000
$$ -4501 -2241 2064 476 820 -169 -7612 350 -3071 1618 2781 -2532 -2562 -3832 -1893 92 4092
1379D092o425K592m885J125O117k687L261m467j202j173M447m12K946j972n136
$$ 4092 -2333 259 -4626 -3501 2616 -71 3190 -1277 -2479 -3652 795 383 3329 1357 -3779
1394c779L405l807O440o49j2k394k428O34J149M435l052J917n732J424Q88J890
$$ -3779 -374 -4181 2259 1610 1598 -796 -3224 -2590 -1441 2994 -58 1859 -3873 -2449 -1561 329
1410C29K572l276r0m363L919l96M062j249k390q01k098M638q69M336m895q7j640
$$ 329 2901 -375 -465 -4828 -909 -1305 2757 1508 -882 -1683 -3781 857 -12 4324 -571 -658 -2298
1427b298L5M494m61J416m602M90k622M740L86N12j55n826L094j516L838M20j69
$$ -2298 -2263 2231 1770 3186 -1416 -926 -3548 1192 1578 2090 1935 -3891 -797 -2313 1525 1945 1776
1444A776l888l16L83j80O170n235K346m205p99L334Q17J053j176j595m108N924
$$ 1776 -2112 -2428 -2045 -2225 3945 -1290 1056 -3149 -3948 -614 203 1256 80 -1515 -5623 301
1460C01k869M577Q3n478K819l360L072K632O16l807J792m420K454N254m705N393
$$ 301 -2568 2009 2092 -3386 -567 -3927 -855 1777 2393 -1414 378 -4042 -1588 3666 -1039 4354
1476D354n915j083K228P30J228K472l949k936M300n326Q273j848l164K050m570
$$ 4354 -1561 -2644 -416 314 1542 4014 65 -2871 1429 -3897 4376 2528 -636 1414 -3156
1491c156J368L755J10k051L119q627M803J744k765P187o352j279J029j142J910
$$ -3156 -1788 1967 2077 26 3145 -5482 -679 1065 -1700 5487 -865 -2144 -1115 -2257 -347
1506c47N581o248N20O85o540J0240l267J23K220o246N10M401k073K438K924j0471
$$ -347 5234 -1014 -494 191 -6349 3891 624 747 2967 -3279 -2769 1632 -441 1997 4921 -5550
1522e550O965l214m60Q410o783N03N00m628K910O390p474N893m100o208J0045
$$ -5550 1415 -1799 -2259 6151 -632 -129 371 -4257 -1347 5043 -2431 3462 -638 -6846 3199
1537C199n444L492K767p227N42L157m857P356Q44q789Q404q654K139P334n598
$$ 3199 -2245 1247 4014 -3213 -2671 486 -4371 2985 3829 -4960 3444 -5210 -3071 4263 -1335
1552a335K805J82o920M500L756o337R981p562l289P410p443O331K866o839K195
$$ -1335 1470 1652 -5268 -768 2988 -3349 6632 -930 -4219 3191 -4252 2079 4945 -1894 301
1567C01O70o634J0517k217m671P978j1737M739M493n204N587o61q646O437r28
$$ 301 971 -5663 4854 2637 -2034 5944 -5793 -1054 3439 -1765 3822 3161 -5485 952 24
1582B4l930J2308j0605J229L159q660P842K083n701M789k821o966J1800o860J754
$$ 24 -3906 8402 -2203 -974 2185 -6475 1367 3450 -2251 2538 -283 -7249 4551 -2309 -555
1597e55O595j2364O415L50m218P519j546p390Q018o342J65J0670j1384O091j384
$$ -555 6040 -6324 91 441 -3777 3742 2196 -5194 2824 -3518 -3353 7317 -4067 2024 640
1612F40p797R196m50l742P388o812m698J0483r688Q035L044j0633P008m184k832
$$ 640 -7157 2039 1589 -2153 5235 -1577 -6275 4208 -5480 2555 5599 -5034 1974 -2210 -5042
1627e042R445k425m387P655j1051L832P014r508J0222m443o047P444l450j161
$$ -5042 4403 1978 -2409 5246 -5805 -1973 5041 -4467 5755 1312 -4735 2709 -741 -1902
1641a902Q709q540k47O344j0991J0842r37o559P195o440j358Q874m955l53O082
$$ -1902 6807 -1733 -1980 4364 -6627 4215 3278 -3281 3914 -2526 -3884 4990 35 -318 5764
1656E764j3103P595J907o169J1222p194l581M976n554K094Q806r332L942O74j0790
$$ 5764 -7339 256 2163 -4006 7216 22 -3559 1417 -4137 -2043 6763 -2569 1373 2047 -8743
1671h743J2541m210p42O603q245j179O491o509M884M821j1331Q894m396l120J0083
$$ -8743 3798 -412 -1154 5449 -2796 -3975 2516 -3993 891 5712 -5619 3275 -1121 -4241 5842
1686E842p005N74L670p081L355O111r145P888l630o701J0763o370K470M783q368
$$ 5842 -1163 -589 3081 -4000 -645 5466 -3679 4209 579 -6122 4641 -1729 741 5524 -2844
1701b844P99M032o991Q678J111q979Q640q774Q76P831n329K896J585q498M077
$$ -2844 -2045 1987 -5004 3674 4785 -4194 4446 -4328 -3452 4379 -950 1946 3531 -4967 -890
1716h90L021o628J1112o352l385O490p633N052L621n883K562J275p613R402k409
$$ -890 2131 -4497 6615 263 -3122 3368 -4265 787 4408 -1475 1087 2362 -5251 4151 1742
1731A742l789Q050j0047L367L956m665M082N67p642N724p03l665J0141q538P22
$$ 1742 -2047 6003 -4044 -677 3279 -1386 2696 3263 -4379 1345 642 -3023 7118 -1420 -698
1746f98K506p172O131K508m540L358j924o816R399m679J262N863r645L550N25
$$ -698 1808 -5364 767 3275 -1265 2093 169 -6647 2752 -1927 -665 5198 -4447 -897 -372
1761c72l659N906K86n799N897n049q90Q552p766M578k43o009N364M13k236N027
$$ -372 -4031 1875 2161 -3638 2259 -2790 -3680 4872 -2894 1684 1441 -4568 796 1209 -1027 4000
1777D000l633m376P682o798N085K945p148M030k304k417N840k30m059N635p772
$$ 4000 367 -4009 3673 -3125 1960 4905 -2243 1787 -517 -2934 2906 2676 -1383 4252 -3520
1792c520J672N267o088O487k468m731L295p42j619O699m563j982M189p660O929
$$ -3520 -1848 3419 -2669 3818 1350 -3381 -86 -828 -2447 4252 -311 -2293 1896 -5764 1165
1807A165M28l157L292l519k096M640r38p46N096q330L105J364l487O621k817j926
$$ 1165 1593 -1564 1728 -1791 -3887 753 -185 -931 4165 -4165 -1060 304 -3183 3438 621 -1305
1823a305J750j902q61O769n376J475J237o800O929j558J0K355l152k167L584k402
$$ -1305 445 -1457 -2318 4451 -925 550 1787 -5013 1916 358 368 2723 -429 -2596 988 -1414
1839a414J737L880p441L911k482j206N194j982p71Q64l006n25N370m321L954j653
$$ -1414 323 4203 -3238 673 -1809 -3015 2179 197 -574 290 -2716 -3241 2129 -2192 1762 109
1855A09m645M964k811K137K398k402j995K382l079L437K290m227L508m220N71
$$ 109 -4536 428 -2383 -246 2152 -250 -2245 137 -2942 495 2785 -1442 2066 -2154 -1583
1870a583L006n69L20J004l645L29L062l295N287k678k004J573k279K107J515r08
$$ -1583 1423 854 1174 2178 -1467 -1138 1924 -1371 3916 1238 -766 807 -1472 635 2150 1242
1886A242j635J453m050L864J84j564L095m828P59N26N18O13J467l674M85N15j943
$$ 1242 -393 1060 -2990 874 1058 -506 2589 -2239 -1480 -954 -436 177 1644 -2030 -1545 -1030 -2973
1903b973N359l132M08p54j692J545J305L01l30M67m038L807j233J711J363k949
$$ -2973 2386 -746 -338 -1092 -2784 -1239 66 367 37 504 -3534 273 -960 751 2114 -835
1919h35O42j413J442M60K323k368N65j575p59L719j622J929k226n99m84J508N69
$$ -835 -193 -1606 -164 296 2619 251 816 -759 -1518 2201 579 2508 282 -317 -801 707 1276
1936A276N63L30l566J695j764K575Mk39o24j716J280n67K949k059O48k033l58
$$ 1276 1839 2169 -1397 298 -1466 1109 1113 874 250 -1466 -186 -753 2196 137 785 -1248 -1606
1953a606J102L02K122k039M26k422J712J47J151O36k031O4j582K472m74K249j907
$$ -1606 -504 -202 1920 -119 307 -2115 -403 -256 895 1531 -500 -436 -2018 454 -20 2229 322
1970C22q44J8j030L055r51J167j940k70j201J890P21l70J310l615J593q64J310
$$ 322 -522 -504 -1534 1521 570 1737 -203 -473 -1674 216 937 567 1877 -1738 -145 -1009 301
1987C01R89o36j205m00R1l76L624k993J572j632j578K683k50Q49k24r86k327L032
$$ 301 1290 654 -551 -951 -860 -1236 2388 -605 967 -665 -2243 440 190 1039 815 -171 -2498 534
2005E34j026J634P78l582K146k019J274J631J36j943J052j860L42L412l104L183
$$ 534 -492 1142 1920 -1662 484 -1535 -261 1370 1506 -437 615 -1245 -903 2509 -595 2588
2021B588l052j140J834l83J036J135j790k020K676l409M241lk361J896l581J163
$$ 2588 -464 -1604 230 -153 883 2018 228 -1792 884 -2525 1716 1713 -648 1248 -2333 -1170
2037a170J890M9q24J664m111J805J459k400M542l433q97P68r79J270K204k401
$$ -1170 720 769 -55 1609 -2502 -697 762 -1638 2904 -529 -1426 -658 -1637 -367 1837 -564
2053e64rQ59m309N448j382j66J755l900Q21J598m03P41J672m940L022j152q65
$$ -564 -573 286 -4023 1425 43 -123 1632 -2268 -1447 151 -252 489 2161 -2779 243 -909 -1774
2070a774M994l624N06L1j858Q94L144k907J918p19m014N486l153K158J486l808
$$ -1774 3220 -404 102 133 -1725 -831 2313 -594 1324 605 -3409 2077 -1076 1082 2568 -1240
2086a240N57J285j822K670J144m837L981l718L08M539l528J790N4l583J421K641
$$ -1240 -683 602 -1220 1450 2594 -2243 1738 -1980 -1672 2867 -661 1129 1183 -2400 -979 1662
2102A662l413N074l400k593M255m219L383J232l028P87N30l297M603j84l110M840
$$ 1662 -1751 3323 -77 -2670 1585 -2634 749 1981 -1047 -260 270 -3027 1576 1392 -1718 3122
2118C122n751J417L020l221L011l07l923K645N85k699O143n007k37K658m644M181
$$ 3122 -2629 -1212 1808 -1413 1598 1291 -2632 13 598 -2101 4042 -965 -1202 1456 -3188 993
2134I93R45k383J605j059l700N698k119j17L976o988L243J81k087M131m59l718
$$ 993 1938 -445 1160 101 -3599 2099 -20 -137 3839 -3149 94 275 -1812 2319 1860 -1858
2150a858L292k563j203O171n317K790lm728M745k62j678K845k308k884N781m580
$$ -1858 1434 -1129 -2332 3839 -1478 1312 1309 -3419 1326 1064 -614 2231 -77 -2961 2820 -1760
2166a760K628K746o442M061j589j404M454j416k576L561m805J019M902n257M902
$$ -1760 868 3614 -2828 1233 -356 -1760 2694 1278 -1298 2263 -2542 -1523 3379 -1878 3024
2181C024j904m115M038j547k26M284l612j775L990o085N323R88m453M494l473
$$ 3024 1120 -2995 1043 -504 -730 3554 -58 -1833 2157 -3928 1395 2383 -2070 2424 -1049
2196a049j654M224j809l85L854o168K677J560m289O006l096j808L207k396P6M405
$$ -1049 -2703 1521 -288 -673 3181 -2987 -310 1250 -3039 2967 -129 -1937 1270 -1126 -1050 3355
2212C355m783J072J736n854O801j654j366L357m474k55L375k241J669K874o729
$$ 3355 -1428 -356 1380 -4474 2327 673 -693 2664 -1810 -2065 1310 -931 738 3612 -3117
2227c117M233j565k264O221l631R6J913l920Q48L808m319L696o67m884N460l314
$$ -3117 1116 -449 -2713 3508 -123 -27 1886 -2034 -1186 2622 -1697 1999 1332 -3552 1908 -1406
2243a406R30L352m190N69K292l999L306J217m917N054l616l70M641l596J039J060
$$ -1406 -476 2876 -1314 -745 1547 -2452 854 2071 -2846 2208 -1408 -1778 2863 -733 306 1366
2259A366l848J910K399l976N324k711l232M598m286K632K473l168Q08L82l810
$$ 1366 -2482 -572 1827 -2149 3175 464 -2768 1830 -2456 176 2649 -519 289 671 -3139
2274c139M267Q4k759N000n602R58K395k960K857Q21m023K174o0k916N942m024
$$ -3139 1128 1212 -1547 3453 -2149 -1191 1204 -1756 1101 1922 -2101 73 13 -2903 3039 -985
2290i85j4K261m454L508Q45k183J586l50l710M978k126l35L765n546K251L34j617
$$ -985 -999 1262 -3192 316 1161 -1022 564 214 -3496 1482 -644 -979 2786 -2760 -509 -175 -1792
2307a792L256K81l136K317j949j295N508l876K269r5l737K736N31j087K429j209
$$ -1792 1464 1745 -1391 926 -1023 -2318 3190 -686 1583 1488 -2249 487 1018 -69 2360 1151
2323A151l129L900l580K047K827m259K435j350j481K881M1k427L254l744k24L703
$$ 1151 -1978 1922 -1658 389 3216 -1043 1392 42 -1439 1442 1483 -944 2310 -1434 -1658 2045
2339B045l743L394j122k431J712m01q35L169j719j926K712m112L582P64k332J989
$$ 2045 -1698 1696 574 -1857 -145 -546 -1381 1788 69 -1857 855 -3257 325 1089 -1243 746
2355G46j431j376K156L49r34K699l775P56J313k037L545j304j383R75p04n34L177
$$ 746 -685 -2061 95 444 -490 2209 -1566 -810 503 -1534 2011 707 -676 299 -405 -939 2238
2372B238j842j74J570m302L628l86j47J530j919j252K033q64K46K543m124J819
$$ 2238 396 222 1792 -2510 1118 732 585 2115 196 -1056 977 113 359 2902 -1222 597
2388E97r57j042L411j541q5M9j369n60K922j949J273O9k853K668j502J124R70
$$ 597 -360 -1402 2009 468 383 432 -937 -1497 1425 -524 749 818 -2035 633 -869 255 1225
2405A225j007j199R75j110J352J616k936K113k031K0K032p96L54K73j631j80J885
$$ 1225 218 -981 -6 -1116 236 1852 -1084 1029 -1002 -982 1050 254 608 881 -750 -930 955
2422I55j653K558j250j351J055j358J489O76k00j294N06j676J564Q42j334K084
$$ 955 -698 1860 610 -741 314 -1044 445 1121 921 -373 133 -1543 21 863 -471 1613
2438A613k742N70M38p9Q46K59j575j79R33j494K945j134j9m03j289J091M39N10
$$ 1613 -1129 -559 -121 -200 646 905 -670 -849 84 -1410 1535 401 382 -21 -1310 -219 220 730
2456G30p32Q84k259J419o8M36J040j837M80n23L71J84J523j392l44k39n97K091
$$ 730 -2 882 -1377 42 -26 410 1450 -387 93 -430 -59 125 1648 256 -88 -327 -924 1167
2474A167r71R72j077o90q7N05P87k31N05j760Q54o96Q55M32m91Jj266R65n73J634
$$ 1167 196 1168 91 -599 -686 -181 606 375 880 -880 -26 -722 133 565 74 75 -1191 -226 -799 835
2494H35q41J42p16o04Q53j36J519j402M46j203Q27K27K32N80j267L73o13R81r5
$$ 835 -6 136 -580 -1184 -331 -467 1052 -350 96 -1107 -280 -53 179 759 -508 -135 -748 233 138
2513A38R86q62r05O85r67J676k01K94j022p6m60O87P42p92J242k359P16l8M49
$$ 138 1124 262 -643 42 -925 751 550 844 -178 -254 -714 -27 715 -77 1165 -1194 -478 -516 -67
2532f7P72m60k93m02J35k78K162j415P2k16j499J870j57N39n01k85j098J293j78
$$ -67 705 245 -48 -450 -315 -593 1569 154 226 10 -1489 381 224 763 262 -23 -1121 172 -6
2551fP50N94k203J315j523P15J114j41p08J35p90k52K156j565J516j063j357J465
$$ -6 744 1338 -865 450 -1073 -358 756 615 -93 42 -748 -1000 1156 -409 1107 44 -1313 152
2569A52p33J066J99q49r90J626j830J930L94j703J349j900L47J419j57l94P57
$$ 152 -581 485 684 -165 -1155 471 -1359 571 965 -738 611 -1289 -942 477 320 -74 683
2586F83j815K27J496j681L031k060m61Q86r52O88J057j008k24P80k573L232p40
$$ 683 -1132 -905 591 -1090 1941 -119 -580 306 -646 42 1099 91 -133 647 -1926 1306 566
2603E66n95J448k158L48Q62m60M25J398l085J363k27j050L389k451L49K62j587
$$ 566 -29 1419 -739 -391 471 11 436 1834 -1251 112 -115 -1165 2224 -227 122 384 -1203
2620a203P83J836k021J142mk574L183j950O95J849k519L10M75q51J434Q91k678
$$ -1203 -420 1416 -605 537 533 -2041 1142 -808 -113 1736 -783 -473 2 -849 585 1476 -1202
2637a202K321j925n72L464k616Q25L43j897J235Q31j311K186j646j369K669k556
$$ -1202 1119 -806 -1378 2086 -530 295 638 -1259 -24 807 -504 1682 36 -1333 1336 -1220
2653a220J725R84j888N38L9j593J963N97k038K708l174N32J769j956J977k41k059
$$ -1220 505 1489 -399 139 178 -1415 548 1145 -893 1815 -1359 -827 942 -1014 963 722 -1337
2670a337J172K23j609L470k314l69J896l172K560L48j549J292m57j978K825p12
$$ -1337 -165 58 -1551 1919 -395 -764 1132 -2040 520 868 -681 611 154 -1824 1001 289
2686B89p70K858m295J852N62j735K965r23j691J531j256n58L684k903J029M19
$$ 289 -481 2377 -1918 -66 496 -1239 1726 803 -888 643 -613 -1171 2513 -390 639 1058
2702A058l222L171m32o92J755j404j729K812k365J150K183l725K454j181j096
$$ 1058 -2164 1007 575 -117 1638 234 -1495 1317 -1048 102 2285 -1440 1014 -167 -1263
2717a263K321q32j036K087k619K84K656l087K490o50k233K429r78l13J962j961
$$ -1263 1058 226 -810 1277 -1342 -1058 1598 -1489 1001 351 -1882 547 -431 -744 1218 -743
2733g43o16K283l170K630Q36k727K362j934m78K431r84JJ788l294R37J740k530
$$ -743 -1359 924 -2246 384 1220 -1507 855 -1079 -1557 874 -110 -109 1679 -1615 -678 1062 -1468
2750a468L645j873j107J624j687J7K442j828O67J249l641L212l52j367K350k444
$$ -1468 2177 304 -803 821 -866 -849 1593 -235 432 1681 -1960 1252 900 -467 1883 -561
2766e61J08J563j321N48J597l377J989q0j919L352k077k13Q73j612N58J970k261
$$ -561 -453 1110 -211 337 1934 -1443 546 466 -1453 1899 -178 -391 482 -1130 -572 1398 -863
2783h63J691j38l038L199j629M92J834k601L44P64j780J681J271k587K537k162
$$ -863 828 690 -2348 851 -778 -286 1548 -1053 -709 55 -1725 -44 1227 -1360 1177 -985
2799i85o32K984k248R02O64j951Q14J388k041K530j081j809K918k500J443J311
$$ -985 -1617 1367 -881 21 685 -1266 -452 936 -1105 1425 344 -1465 1453 -1047 396 1707
2815A707k256O83O36k234K476L4j721K748l300M90J906j746J509J20j931P11M68
$$ 1707 -549 134 770 -1464 1012 1046 -675 2073 -1227 -737 1169 -577 932 1052 -879 -168 300
2832C00j648L518k280j63J261k741J818O20j033J150m08k228K543r91m40K483
$$ 300 -1348 2170 -110 -273 988 -1753 65 685 -348 802 394 -1834 709 -282 -722 1761
2848A761l087J278L01j492K015j48j485J583q76j077L058k431J042K53k399J902
$$ 1761 -1326 -48 253 -1239 776 628 -857 726 -150 -1227 1831 -600 442 695 -1704 198
2864A98J09m11J035o82j408K091j940J113J460k611J782j045q03J841j64r75J257
$$ 198 307 -104 931 249 -1159 932 -1008 105 1565 -1046 736 -309 -1112 729 565 -410 847
2881H47j612o54K382k209K327p84j355J042l41n5J132n19j005J608k199J852P09
$$ 847 -765 -1419 963 -1246 1081 297 -1058 -16 -357 -412 720 201 -804 804 -1395 457 1166
2898A166j611J267j345k89J348n7o33J422k101L80R51j308K097j075m21M86m92
$$ 1166 -445 822 -523 -812 536 479 -154 1268 -833 -453 498 -810 1287 212 -209 277 -215
2915b15j20J401q12j87P83k326J787k40j18R89j171n91P77k60K12J581k339O63
$$ -215 -335 1066 254 67 850 -1476 311 71 -47 942 -229 -820 -43 -303 -91 1490 -849 -186
2933a86k74o50J876r39K38m1o09n45J566p66O08K79j754J527q03M93Q48r36k14
$$ -186 -460 -1110 766 -173 65 24 -585 -1130 436 -330 278 557 -1197 330 -473 20 868 -68 -282
2952b82Q8m34N75J192j744J189j145m9R29k89M19o0o17l29J064p62J120p28p85
$$ -282 -194 -628 -53 1139 -605 584 -561 -610 319 30 449 389 -228 -557 507 -255 865 137 -648
2971f48P55j068J131L41k20m27J55p45N26O74p09J290j497K65j69J97M62k1j80
$$ -648 107 -961 170 511 291 -136 19 -726 -200 474 -235 1055 -442 -177 -346 -149 313 292 112
2990A12p77P76p57J595p60j48L73j258R13PL29l08L01q76K84J70J97N67j043M89
$$ 112 -665 111 -646 949 189 41 414 -844 69 76 405 97 398 -478 -194 -24 173 740 -303 186
3010A86q04N49J94K05j31m86K02q87J515o69N69l74n52jo6R55m60M13r19N72n63
$$ 186 -618 -69 125 330 199 -287 -85 -972 543 -126 443 69 -483 -484 -550 405 -55 358 -561 11 -552
3031e52M21M41l81J39q40O05j23O91j9m83Q4p75O89K2Q33p67L56o52j40P68j57
$$ -552 -131 310 -71 68 -772 -167 -290 401 382 -101 -17 -792 -103 -81 752 -15 341 -311 -451 317 160
3052A60N08p85J13m65N47J13L09j68n07K07p62J169j47N7o2o99R2J94N14m36N76
$$ 160 668 -117 -4 -469 78 191 500 332 -175 32 -730 439 292 349 287 -412 -320 -126 388 -48 528
3073E28j318O01j1n4J218q25k57l48K37k85R94m67L8N1j017R39o6N64k45l26n71
$$ 528 -790 -189 -200 -254 964 139 -118 -466 -229 -514 480 13 51 102 -915 24 -42 522 277 -49 -620
3094f20N64j16J12J149j739R60n71l5Q18l10Oj34k30n02J383j360J077l90r80
$$ -620 -56 -172 -60 1089 -650 310 -261 -296 522 212 218 84 -146 -648 735 -625 452 62 -918
3113i18J091n59P85q9l48o51P29q42N40J172j519J033j124J84Q02j81N5K41j004
$$ -918 173 -386 399 310 -38 -689 40 -802 -262 910 -609 424 -700 -516 286 105 160 401 -603
3132f03J96J161j358J663r48m87P18p47P40K19m02o8L79j166J255Q8p59J503j817
$$ -603 -407 754 -604 1059 111 -376 342 -405 335 554 152 84 463 -703 552 640 -119 1384 -433
3151d33J78N33k88K54M97j158M10J92r09K119j352o0M43j136M32Q25p92J87M91
$$ -433 -255 278 -10 244 741 -417 -7 185 -724 1395 43 -17 426 -710 -278 547 -245 -58 433
3170D33j837J768q52L32J061j775Q07j43n07O04Q01j576R77l66r04K063j426Q20
$$ 433 -1404 364 -488 -156 905 -870 -63 -206 -713 -109 692 -884 93 -273 -1177 886 -540 280
3188B80J05j255N54P84r00J294m16j445J952j574O84J074j287M47qq47J030P1
$$ 280 385 -870 -316 468 -432 862 446 -999 953 -621 63 1137 -150 297 289 -558 472 543
3206E43r54J543j588p1J823j516J114m44j007N05J69q46J902q54q80J224j733
$$ 543 -411 1132 -456 -527 1296 -220 894 450 -557 -52 117 -729 1173 319 -561 663 -1070
3223a070J188N08j100J149r89q46J423k93p55J948k195P29L12q73J328m39p76
$$ -1070 118 626 -474 675 -314 -1160 263 -30 -785 1163 -1032 -303 9 -864 464 25 -751
3240g51P37m11n00J832j404L99P94k132J588K13n26P97q08p99J479p84J23J465
$$ -751 -14 -425 -925 907 -497 -98 696 -1436 152 365 -161 636 -172 -971 508 -276 -153 1312
3258A312k130J093j98j081J344J64o63P61j040m74J944j622J249J68j894J460
$$ 1312 -818 275 77 -1004 340 504 -159 602 -438 -912 1032 -590 659 827 -1067 393
3274C93p40m4J032l83j088J629j507N18J074j760J702j304l86J566p11j89J037
$$ 393 -347 -391 641 258 -830 799 -708 -190 884 -876 826 -478 -864 702 -9 -198 839
3291H39j438p9J288j726J996p22q55R36r25J52J445r31m61J080k047J621J35j059
$$ 839 -599 -678 610 -1116 880 158 -697 239 -686 -534 911 -20 -481 599 -1448 173 308 -751
3309g51J816j375m00Q65m06K0J474j763M72N13j735K255r38m57Q49j250M44Q57
$$ -751 1065 -310 -710 155 -251 -231 1243 -520 -48 465 -1270 985 47 -410 439 -811 -367 490
3327D90r44L76N96j816J782p24m17J768j663K25M15o07P05P49j747R83k78r04
$$ 490 -454 -78 518 -1298 484 -240 -657 1111 -552 -327 88 -519 186 935 -812 171 -107 -1011
3345a011J752j207M58M48j006QN94n65J163M2j603J309j233O55J041j010K30N15
$$ -1011 741 -466 -8 440 -566 -558 36 -529 634 676 -927 382 -851 -196 845 -165 65 580
3363E80j151P01K44q60J388j220m69J334j155P41L18q38K53J85p63J445p03p02
$$ 580 -571 130 374 -486 902 -318 -787 547 -608 133 451 -387 -134 51 -712 733 30 -672
3381f72J246j567R02P96j053L83J92r92Q75p3m75J720j850J58M89o43O32P8m57
$$ -672 574 -993 -91 705 -348 35 227 -765 110 37 -438 1282 -568 -410 79 -564 68 146 -311
3400c11M41p0j004J635p15l2P10j523J044o7l06O28j17j108J224q21J73J207j480
$$ -311 130 60 -944 691 -24 -56 654 -869 175 108 -198 430 313 -795 429 -392 -219 988 -492
3419d92N54qp57O57J49l80O87l14q38J237r51O73R6r49N59j47N8O31k15o58P24
$$ -492 62 54 -703 -46 103 -277 410 96 -742 495 -456 217 313 -636 -77 -224 -166 465 250 -408 316
3440C16q31N68N90p71Q48r06l30N28J27j95O98o72l27O92j112J352k05n26K45
$$ 316 -515 53 643 -128 720 -186 -516 12 139 -56 642 -30 -357 335 -777 575 370 -156 89
3459H9j36n66R10j27l88P62j407R55Q8m12Q68o76k84L06k04p4R04r45L32Q7q82
$$ 89 -47 -613 297 170 -218 544 -863 92 180 -232 636 -40 -324 -18 -222 -296 608 -337 -5 82 -800
3480h00J196k93j60k6l12K18K83p9k1N84j432J012m88J52P57o07j40N1j66j8Q59
$$ -800 396 103 -57 -83 -395 -177 106 27 6 590 -842 170 -318 -166 591 -16 -156 -105 -271 -289 570
3501E70p30O88o80l27R24n62N56k87r7k27L43m05K81L73q63N22m49J93K68L2j46
$$ 570 -160 528 -152 -479 445 -117 439 152 55 -172 171 -234 47 420 -443 79 -370 -177 91 123 -23
3522b3O5k87l0N62l34P42q10m4J38j79M57j22J41m29J62l27L72K40l59J29m77
$$ -23 42 -245 -275 287 -47 695 -115 -159 -21 -200 257 135 276 -153 9 -318 54 294 -65 64 -413
3543d13L25j8Q3K98j45l11m7K66l49P25n95K22l07L06j67M54q2m65L74o31M88
$$ -413 -88 -106 -23 275 130 -181 -228 38 -311 414 -181 41 -266 40 -127 327 245 -220 154 -477 11
3564A1k79K85L1l41K25m54P97l97M22m35j50L18k18M81k58R6l75J11N3K37J35
$$ 11 -268 17 48 -293 -68 -522 275 -122 300 -135 -285 33 -185 296 38 134 -241 -130 -77 160 295
3585B95N5l75j84L44j50N43m51nL40n45O18m04L17j72k52rJ33M6j9J44m78L78
$$ 295 350 -25 -209 135 -15 528 77 72 412 -133 485 81 398 226 -26 -35 98 144 125 269 -209 169
3607A69n71M86Q3q5K26n26j18M6M29l45N39o39o0K55k79P51k92j11l51K14p0M53
$$ 169 -402 84 167 82 308 -218 -336 -290 139 -206 333 -306 -366 -111 -390 361 69 -42 -393 -179 -249 204
3629B04J77n78L02n29M51j55K30P5j94m41L88J40PN97j013O11k64k77N76Pj85
$$ 204 381 -197 105 -424 27 -128 102 177 -17 -458 -70 70 77 674 -339 272 8 -269 307 314 129
3650A29K47n11q6O84n07L41P0q52Q11m43J95J59k18m49O14l14p2Q16r49N61m02
$$ 129 376 -135 -221 463 -44 297 367 -485 326 -117 78 237 19 -430 184 -130 -202 614 -335 226 -176
3671a76j97M61j25j77R2j13l30P21o62Q22k40n35O79p40J58M04j65j08M71p62
$$ -176 -373 88 -37 -214 -122 -235 -565 156 -506 316 76 -459 220 -520 -362 42 -123 -231 240 -522
3691e22K69P46p24P31j076L2M67j26j7N10m04N7N6q91J253j17m12L29m55j3N32
$$ -522 -253 493 -231 500 -576 -544 -77 -203 -220 290 -114 -57 -1 -892 361 244 -168 161 -294 -307 225
3712B25k83p8K88r36Q31j30k2N49q67J58J98m12M55N13q49L64J53q42J290n69
$$ 225 -58 -136 152 -784 47 -83 -105 444 -423 -265 -67 -479 -24 489 -360 4 157 -685 605 36
3732C6k11M43m97K29m9j06L11J76q52P55m26q0O71n76L23q3m04M52K02l94M76
$$ 36 -175 268 -229 0 -49 -155 156 332 -520 235 -191 -271 400 -176 147 64 -340 112 314 -80 396
3753C96n09l22O55o13M78K72r63M36L26m16N75j79o66Q42r96N96M00p63N89l39
$$ 396 -113 -435 220 -393 85 357 -606 -170 156 -260 315 136 -530 312 -684 -88 312 -451 138 -201
3773b01m81P64o4k85Q06j006O6N25o60R10j35m26K82m7p78Q98j21m9L82q78N01
$$ -201 -682 82 18 -267 539 -467 -401 124 -536 374 239 -187 95 48 -730 168 47 -2 380 -498 3
3794CR2n53P84j41m33J46N0q1N60p46L18r4l84P60%l83N96n56n08J087p72M31
$$ 3 95 -458 326 185 -248 -102 -52 -133 427 -319 -1 -95 -479 281 281 -102 494 -62 -570 517 -255 176
3816A76K50j021P62m53J42N27j04n48K44o88M92O92p56P00l10m57M99j02j80M08
$$ 176 426 -595 167 -286 -144 383 279 -269 -25 -713 -221 471 -285 415 105 -352 147 45 -135 273
3836B73o94O0M89n63N55R0p23R88p40J53N26o48P9O08j021N49M95p02P24o91J51
$$ 273 -421 -361 128 -435 120 210 -513 475 -265 -112 414 -234 -155 453 -568 -19 476 -226 498 -193 -42
3857d2J23m16K68N54o79Q4J43n81R42k07l77M88n23K4M02p1k10M90r68O72Ll61
$$ -42 81 -335 -67 487 -192 -108 35 -546 396 189 -188 300 -223 -199 203 132 -78 412 -556 116 119 -242
3879b42Q54o30j81M29n97K59N20p28M14o0k61O26l12J68K51o99K1K41k64K85L89
$$ -242 612 -18 -199 230 -367 -108 412 -316 98 38 -223 403 91 259 510 -189 -168 73 -191 94 483
3900D83j111J107n50k6O96p78K97oo00M49N44p14O83m92l58N60m30K25J87k04
$$ 483 -628 479 -71 -97 599 -179 118 112 -488 -39 505 -209 474 -18 -376 184 -246 -21 166 -38
3920c8j78R0l38O30l7n17P55q35M57j73J61K38l25j13L25J32o08O69m03j37L48
$$ -38 -216 -126 -464 166 129 -388 367 -468 -11 -184 -23 215 -110 -223 102 234 -374 295 -108 -245 103
3941A03n06N93n6k08L8j21j81N38k26j63O07q71M50r3N4L88j68n60O76l85o7P79
$$ 103 -403 190 134 -74 -36 -157 -338 200 -26 -189 418 -453 -3 -96 -42 346 178 -382 294 -91 -158 621
3963F21p32L9J75l72M53j51l08N78l32j82N54n58J59M47o79M26j35k41L51K50
$$ 621 -111 -72 103 -269 184 33 -275 303 -29 -211 343 -215 -56 391 -288 138 3 -238 113 363
3983C63m79J97k22J02M03p76O99n56J84J6O9k3K75j80m51M51l56M14M3o50N41
$$ 363 -116 81 -141 -39 364 -412 287 -269 -85 -69 0 -23 252 72 -379 72 -284 130 173 -477 64
4004F4k76L3J43J85k94M78o80k4N74k99K75m51M10k06j5J37K94k12m5j7l56M76
$$ 64 -212 -179 -36 149 -145 333 -347 -371 203 -96 179 -272 138 -68 -83 54 348 136 91 74 -282 194
4026A94k2r0P7k94r6L56K2j59L72q03N41J67m38O60m21J01q3j35J60L23n29K20
$$ 194 172 82 159 -135 -231 125 147 -12 360 -443 98 265 -173 487 66 167 84 -51 109 432 -97 123
4048A23p7l48N69l53J55m8J84R4m46P3J58J04l19Q5j42J63K20K5o1j56k69o8K80
$$ 123 46 -302 267 -86 69 21 205 299 -147 -74 84 188 -131 -46 -188 -25 195 220 159 3 -266 -334 -54
4071e4M4Jok51K52k92M86j23J42j83o9O6k8K32j85J41l59L65j38J02R4k68M8j42
$$ -54 -10 -9 -15 -266 -14 -306 180 57 199 16 -53 13 -15 217 32 173 -186 179 41 143 237 -31 17 -125
4095a25K86r0L19m04L02m26J50J2k23M04j91J44l24L46l30J77J71k57N1j06K62
$$ -125 161 71 390 -14 288 -138 12 24 -199 205 14 158 -166 180 -150 27 198 -59 -8 -114 148
4116A48j11j82J68j93L12j75K4J19J44l69O9o7J27J11l59L82l95L04N6j34J91
$$ 148 37 -145 23 -170 142 -33 -9 110 254 -115 -46 -113 14 125 -234 148 -247 57 113 -21 170
4137A70j10%l72L53j60M70k69k87K5j43J99J63J30m37L20l29J50L93l43K87j91
$$ 170 60 60 -312 41 -119 351 82 -205 -180 -323 -124 39 169 -268 52 -277 -127 266 -77 210 19
4158A9k2r7K32n4o6j36m6M50l95J56j31Q3k4J4k20L85j12m23L78l57L77K5j9r6
$$ 19 -3 -100 132 78 12 -124 -170 280 -115 41 -90 -7 -31 -17 -237 148 36 -387 -9 -366 11 36 17 -79
4182g9M5l4j7J62k08J42k12J68R6j42J40Kj47Q0M7l87M42j41nJ38n08N97k88J20
$$ -79 -34 -68 -85 77 -131 11 -201 -33 63 -79 61 63 -84 -4 43 -344 98 -43 -48 90 -418 179 -109 11
4206A1K56m34K48j78M2r9J37j60K59J22n11L54J20m7j88P2k76N50m82M53j85m33
$$ 11 267 -167 81 -97 -55 -154 -17 -177 82 204 -307 47 167 120 -68 4 -272 278 -204 249 64 -369
4228c69N11j71oj74J95k03K76k35Q8L11l63L06o6k47P0k29M36M2j17j72K01l66
$$ -369 142 -29 -35 -209 -14 -217 59 -176 -88 223 -140 166 100 -147 -77 -306 130 172 55 -117 84 -282
4250b82L98J6m22M94l94j0M04m5k55L39n02K07j2j54M07l40PJ76j44J89L82n07
$$ -282 116 132 -290 204 -190 -200 204 159 -96 243 -259 -52 -64 -218 189 -151 -144 32 -112 77 459 -48
4272d8q0J24m01O63k33N1k7k41j01J17J11ro7j18K73k18K85K84l61M0q0l8J86
$$ -48 -128 -4 -405 258 25 76 49 -192 -293 -176 -65 -74 -141 -259 14 -204 81 365 4 44 -36 -74 112
4295A12j03O0R4r8k26L94m63L29p5k50J59j30j17L93M5l18M4Q5K44k34j07M1K97
$$ 112 9 69 163 65 -161 233 -230 99 24 -226 -67 -197 -314 79 124 -194 -150 -65 179 -55 -162 -121 176
4318A76l83L8L77k65L69l99p0M59n10K54k7k6P4j7k98N38k32j82N06o14M16m19
$$ 176 -207 -169 208 -57 312 -87 -157 302 -208 46 19 -7 67 50 -248 290 58 -124 382 -232 184 -235
4340b35K25J90k85j34L26n9j32K84k60J02r9n4L82q9k55K33j29j92L52J10k12
$$ -235 -10 180 -105 -239 87 28 -104 180 -80 22 -77 -131 251 162 -93 140 11 -181 171 281 69
4361F9M34q75M47l59J65L94k81j19Q6k5j74N66m92J15J69k77K71k55K26n4j2j08
$$ 69 503 -372 75 -284 -119 275 -6 -125 -39 -64 -238 328 -164 -49 120 -157 114 -141 85 31 19 -89
4383h9J42l13K81P8k49L81l01J68K34n48J56J56j04J26K2j17J69j53k9j71L9N0
$$ -89 53 -260 21 99 -150 231 -70 98 332 -216 -60 96 -8 118 140 23 192 39 10 -161 -122 -72
4405g2J98J7j76J24l30L41m8k25L35m10J02M36k67L7J85l48L52j10l15O33l65
$$ -72 126 143 -33 91 -239 102 54 -171 164 -246 -144 292 25 62 247 -101 251 141 -174 459 94
4426I4M1j67k20L77O6l62J78OK0M6k76Q2K11k14k9M96m73K81l5k63L38r8l39N70
$$ 94 135 -32 -252 125 191 -171 7 13 33 79 -197 -115 96 -118 -147 349 -124 157 122 -141 197 99 -240 330
4450C30m40J65P4l45O02j63j41R3j2m16L90k06P0J53m29L51j9l16L04M7l04K79
$$ 330 -110 55 129 -216 386 223 82 175 163 -253 137 -69 1 154 -275 76 57 -259 45 92 -212 67
4472F7j33j84K32j3J46K4j95K3J41k71K68o1k05M04l61K35R2k48R6J8j01J35o5
$$ 67 -66 -250 -18 -31 115 139 -56 -33 108 -163 105 44 -161 243 -118 117 209 -39 57 75 -26 109 44
4495D4j61M91l78J04O6k60J31O2j25j49L6J40L29l70o1J81k37j5L54r0j23J14
$$ 44 -117 374 -4 100 166 -94 37 99 -26 -175 -139 1 330 -40 -101 80 -157 -172 182 92 -31 83
4517H3n2J1J3j16K66J2k89N4J9K64j50k13L8j3J22p0Q5J6Q3L8k90k9r4J76K8j47
$$ 83 31 42 55 -61 205 217 -72 -18 1 265 115 -98 -60 -73 49 -21 64 80 163 201 -89 -118 -212 -36 -8 -155
4543a55L12k82J55O4j16m0J06j05K07l14M6J32m6k51K50P9L57m69n5K06J35j01
$$ -155 157 -125 30 94 -22 -62 44 -61 146 -168 -122 10 -36 -287 -37 42 399 -70 -125 81 216 115
4565A15j57J74k58J56j18r0J83JK0l8Mn0m0K03J45j71k78J72o1J70r4J13l33J07
$$ 115 -42 132 -126 30 -88 -178 5 6 26 -12 -8 -58 -98 105 250 79 -199 -27 -88 82 -12 101 -232 -125
4589a25Q7J33k01K1K77l40J87j61Q7o4l5L7J71K34k19O6j93Q3l4K82m03J8J7p1
$$ -125 -38 95 -106 -85 192 -148 39 -122 -35 -99 -134 -97 74 308 89 155 -38 45 11 293 -110 -92 -75 -146
4613a46O4j09K65q0K60k70J08k09Q8J56k38M2k6J58Or0J28j40o4K12J76k05k19
$$ -146 -82 -191 74 -6 254 -16 92 -117 -29 127 -111 -69 -95 63 69 -21 107 -33 -97 115 291 86 -133
4636a33P1J24P4j55r7J40n4k5j16J72k56K98N0j73J41o6K7O0J43m53L25k89K64
$$ -133 -62 62 136 -19 -116 24 -30 -55 -171 1 -255 43 93 -80 61 -5 22 82 225 -228 97 -192 72
4659G2r6M4j9K05l95K91n5j77J26J49j95L5l14L50J7j18J72j18p0J83j62K39M8
$$ 72 -24 20 1 206 -189 102 47 -130 -4 145 -50 -15 -329 21 38 -80 92 -26 -96 87 -75 164 212
4682B12rk5n83L17j34K71K6j69J19j32k6L73j52O2j04Ql28L66o4R9J6k17J85o2
$$ 212 203 178 -405 -88 -222 49 75 -94 25 -107 -133 240 88 150 46 54 -274 92 28 127 143 -74 111 49
4706D9j00K44k27K56l86K87p9J15k00J51k16J58K8K4k39L8p0K17p2P5o4N3J93
$$ 49 -51 193 -34 222 -164 123 44 159 -41 110 -106 52 80 104 -135 -97 -167 50 -22 53 -11 42 235
4729B35k90J2J97M5j62k76K43N2J64j15j05L2n3J66j16k06K18n0k59L3L49J21
$$ 235 -55 -43 154 199 37 -239 4 56 220 105 0 32 -21 145 29 -177 41 -9 -268 -235 114 235
4751B35k38k01R4J92nj85J56J62j30K8j40j92R6P3JJ95j89M20m12K09j80J07k64
$$ 235 -3 -204 -110 82 77 -108 48 210 80 108 -32 -224 -128 -55 -54 141 -48 372 -40 169 -11 96 -168
4774a68L02q9p9L0l23L73n4J69j87L8k2K0m1r9R9K96l57P1o3k09J97K04j07j27
$$ -168 134 45 -34 -4 -327 46 -8 161 -26 12 -10 10 -31 -130 -31 265 -92 -21 -84 -293 -96 108 1 -126
4798a26K82k52N1q5q9J90R2q5O1P7j36q5K2J5K09j30l43J87L5J52j45J67j13j50
$$ -126 156 -96 -45 -130 -219 -29 63 -22 39 116 -20 -105 -83 -68 141 11 -332 -145 -110 42 -103 64 -49 -199
4822a99K52Q2Q4k87K21l25L84k04j7J71l14L39r9n7J43j56j34J46N3mJ99j30k90
$$ -199 53 135 219 -68 153 -172 212 8 -9 162 -152 187 88 31 174 18 -116 30 83 79 278 148 -142
4845a42J21j05K28o7m2J51j53p5k7J58J50k58K50k15l7o3M43k42j18j1J36q9J73
$$ -142 -21 -126 102 35 -7 144 -9 -84 -111 47 197 -61 189 -26 -63 -126 317 75 -43 -54 82 -7 166
4868A66j68p8L0jO3J16k44O9M5k19N0K42j57K19l18J63J62k37J33j60l6J63k4
$$ 166 -2 -80 -50 -51 12 128 -116 -47 -2 -221 -171 71 -86 133 -185 -22 140 -97 36 -124 -160 3 -21
4891b1L1K33l01j8j5NK59j00l4o5J17O6l73J34j34P6K32j65k8J14k38R7J08k11
$$ -21 10 243 -58 -76 -91 -86 173 73 39 -26 91 157 -216 -82 -216 -140 92 -73 -101 13 -225 -128 -20 -231
4915b31R7j23L57k2J9j06N6k26J52M2nP6K1p8j40j00K81J44Mk07N1o6l0K16k86
$$ -231 -134 -257 100 78 97 -9 47 -179 -27 15 10 86 107 29 -111 -211 70 214 218 11 62 -4 -34 182 -104
4940a04L27k69L49l11K6P7J03k94K60k65l8K49n5j84J06m1o4J66l11L50l1j59
$$ -104 223 -46 303 -8 18 95 198 -96 164 -101 -139 110 55 -129 -23 -64 -128 38 -273 77 46 -113
$$ [...]
8191a21
##END NTUPLES=NMR FID
##END=
