##TITLE=1H_N1-28.09.20
 CCCl3, 8 sc, 
 28.9.2020
##JCAMPDX= 6.0         $$ Bruker NMR JCAMP-DX V2.0
##DATA TYPE= NMR FID
##DATA CLASS= NTUPLES
##ORIGIN= UXNMR, Bruker Analytische Messtechnik GmbH
##OWNER= root
$$ XWIN-NMR		Version 3.5
$$ Mon Sep 28 11:14:58 2020 Russian Standard Time (UT+4h)  she@DPX200
##.OBSERVE FREQUENCY= 200.1315066352
##.OBSERVE NUCLEUS= ^1H
##.DELAY= (6, 6)
##.ACQUISITION MODE= SIMULTANEOUS
##.ACQUISITION SCHEME= undefined
##.AVERAGES= 8
##.DIGITISER RES= 18
##SPECTROMETER/DATA SYSTEM= spect
##.PULSE SEQUENCE= zg30
##.SOLVENT NAME= CDCl3
##.SHIFT REFERENCE= (INTERNAL, CDCl3, 0, 15.7039)
##AUDIT TRAIL= $$ (NUMBER, WHEN, WHO, WHERE, WHAT)
$$ ##TITLE= Audit trail, XWIN-NMR		Version 3.5
$$ ##JCAMPDX= 5.01
$$ ##ORIGIN= Bruker BioSpin GmbH
$$ ##OWNER= she
$$ F:/spectra/data/she/nmr/H-F/1/audita.txt
$$ ##AUDIT TRAIL=  $$ (NUMBER, WHEN, WHO, WHERE, WHAT)
(   1,<2020-09-28 11:13:54.20 +0400>,<she>,<DPX200>,
      <created by zg, POWCHK disabled, PULCHK disabled
       configuration hash MD5:
       00 E9 B6 7A A2 85 ED C7 34 08 36 98 17 FE 4E 26
       data hash MD5: 16K
       D7 43 BB D7 87 BF 4A C1 BC C1 78 FA 83 83 F3 E2>)
$$ ##END=
$$ 
$$ hash MD5
$$ F4 A4 13 B7 90 A3 CB 54 C7 07 A7 83 5F 5C 52 BD
##$RELAX= 
##$RELAX= 
##$RELAX= 
##$RELAX= 
##$RELAX= 
##$RELAX= 
$$ Bruker specific parameters
$$ --------------------------
##$DU= <F:/spectra>
##$EXPNO= 1
##$NAME= <H-F>
##$PROCNO= 1
##$TYPE= <nmr>
##$USER= <she>
##$AMP= (0..31)
100 100 100 100 100 100 100 100 100 100 100 100 100 100 100 100 100 100 
100 100 100 100 100 100 100 100 100 100 100 100 100 100 
##$AQSEQ= 0
##$AQ_mod= 1
##$AUNM= <au_zg>
##$AUTOPOS= <>
##$BF1= 200.13
##$BF2= 200.13
##$BF3= 200.13
##$BF4= 200.13
##$BF5= 200.13
##$BF6= 200.13
##$BF7= 200.13
##$BF8= 200.13
##$BYTORDA= 1
##$CFDGTYP= 0
##$CFRGTYP= 5
##$CHEMSTR= <none>
##$CNST= (0..31)
1 1 145 1 1 1 1 1 1 1 1 1 1 1 1 1 1 1 1 1 1 1 1 1 1 1 1 1 1 1 1 1 
##$CPDPRG= <>
##$CPDPRG1= <>
##$CPDPRG2= <>
##$CPDPRG3= <>
##$CPDPRG4= <mlev>
##$CPDPRG5= <mlev>
##$CPDPRG6= <mlev>
##$CPDPRG7= <mlev>
##$CPDPRG8= <mlev>
##$CPDPRGB= <>
##$CPDPRGT= <>
##$D= (0..31)
0 1.2 0 0 0 0 0 0 0 0.06 0 0.03 0 0 0 0 0.0002 0 0 0 0 0 0 0 0 0 0 0 0 
0 0 0 
##$DATE= 1601277233
##$DBL= (0..7)
120 120 120 120 120 120 120 120 
##$DBP= (0..7)
150 150 150 150 150 150 150 150 
##$DBP07= 0
##$DBPNAM0= <>
##$DBPNAM1= <>
##$DBPNAM2= <>
##$DBPNAM3= <>
##$DBPNAM4= <>
##$DBPNAM5= <>
##$DBPNAM6= <>
##$DBPNAM7= <>
##$DBPOAL= (0..7)
0.5 0.5 0.5 0.5 0.5 0.5 0.5 0.5 
##$DBPOFFS= (0..7)
0 0 0 0 0 0 0 0 
##$DE= 6
##$DECBNUC= <off>
##$DECIM= 32
##$DECNUC= <off>
##$DECSTAT= 4
##$DIGMOD= 1
##$DIGTYP= 9
##$DL= (0..7)
0 120 120 120 120 120 120 120 
##$DP= (0..7)
150 150 150 150 150 150 150 150 
##$DP07= 0
##$DPNAME0= <>
##$DPNAME1= <>
##$DPNAME2= <>
##$DPNAME3= <>
##$DPNAME4= <>
##$DPNAME5= <>
##$DPNAME6= <>
##$DPNAME7= <>
##$DPOAL= (0..7)
0.5 0.5 0.5 0.5 0.5 0.5 0.5 0.5 
##$DPOFFS= (0..7)
0 0 0 0 0 0 0 0 
##$DQDMODE= 0
##$DR= 18
##$DS= 0
##$DSLIST= <SSSSSSSSSSSSSSS>
$$ [...]
##$SUBNAM2= <"">
##$SUBNAM3= <"">
##$SUBNAM4= <"">
##$SUBNAM5= <"">
##$SUBNAM6= <"">
##$SUBNAM7= <"">
##$SUBNAM8= <"">
##$SUBNAM9= <"">
##$SW= 16.880792210976
##$SWIBOX= (0..15)
0 0 2 0 0 0 0 0 0 0 0 0 0 0 0 0 
##$SW_h= 3378.37837837838
##$TD= 16384
##$TD0= 1
##$TE= 0
##$TE2= 300
##$TE3= 300
##$TEG= 300
##$TL= (0..7)
0 120 120 120 120 120 120 120 
##$TP= (0..7)
150 150 150 150 150 150 150 150 
##$TP07= 0
##$TPNAME0= <>
##$TPNAME1= <>
##$TPNAME2= <>
##$TPNAME3= <>
##$TPNAME4= <>
##$TPNAME5= <>
##$TPNAME6= <>
##$TPNAME7= <>
##$TPOAL= (0..7)
0.5 0.5 0.5 0.5 0.5 0.5 0.5 0.5 
##$TPOFFS= (0..7)
0 0 0 0 0 0 0 0 
##$TUNHIN= 0
##$TUNHOUT= 0
##$TUNXOUT= 0
##$USERA1= <user>
##$USERA2= <user>
##$USERA3= <user>
##$USERA4= <user>
##$USERA5= <user>
##$V9= 5
##$VALIST= <valist>
##$VCLIST= <CCCCCCCCCCCCCCC>
##$VD= 0
##$VDLIST= <DDDDDDDDDDDDDDD>
##$VPLIST= <PPPPPPPPPPPPPPP>
##$VTLIST= <TTTTTTTTTTTTTTT>
##$WBST= 1024
##$WBSW= 4
##$XGAIN= (0..3)
0 0 0 0 
##$XL= 0
##$YL= 0
##$YMAX_a= 845992
##$YMIN_a= -626291
##$ZGOPTNS= <>
##$ZL1= 120
##$ZL2= 120
##$ZL3= 120
##$ZL4= 120
##$ABSF1= 10
##$ABSF2= 0
##$ABSG= 5
##$ABSL= 3
##$ALPHA= 0
##$AQORDER= 0
##$ASSFAC= 0
##$ASSFACI= 0
##$ASSFACX= 0
##$ASSWID= 0
##$AUNMP= <proc_1d>
##$AZFE= 0.1
##$AZFW= 0.1
##$BCFW= 1
##$BC_mod= 2
##$BYTORDP= 1
##$COROFFS= 0
##$CY= 11.3945322036743
##$DATMOD= 1
##$DC= 2
##$DFILT= <>
##$DTYPP= 0
##$F1P= 16.9975609425685
##$F2P= -3.02152046262296
##$FCOR= 0.5
##$FTSIZE= 0
##$FT_mod= 4
##$GAMMA= 1
##$GB= 0.15
##$INTBC= 1
##$INTSCL= 1
##$ISEN= 128
##$LB= 0.24
##$LEV0= 0
##$LPBIN= 0
##$MAXI= 10000
##$MC2= 0
##$MEAN= 0
##$ME_mod= 0
##$MI= 1.114404
##$NCOEF= 0
##$NC_proc= 0
##$NLEV= 6
##$NOISF1= 3.799351
##$NOISF2= 2.8
##$NSP= 1
##$NTH_PI= 0
##$NZP= 0
##$OFFSET= 15.70392
##$PC= 1
##$PHC0= -9968.504
##$PHC1= 10.6009
##$PH_mod= 1
##$PKNL= yes
##$PPARMOD= 0
##$PSCAL= 0
##$PSIGN= 0
##$REVERSE= no
##$SF= 200.130013532006
##$SI= 16384
##$SIGF1= 3
##$SIGF2= 2
##$SINO= 400
##$SIOLD= 16384
##$SREGLST= <1H.CDCl3>
##$SSB= 0
##$STSI= 0
##$STSR= 0
##$SW_p= 3612.71676300578
##$SYMM= 0
##$S_DEV= 0
##$TDeff= 0
##$TDoff= 0
##$TI= <>
##$TILT= no
##$TM1= 0
##$TM2= 0
##$TOPLEV= 0
##$USERP1= <user>
##$USERP2= <user>
##$USERP3= <user>
##$USERP4= <user>
##$USERP5= <user>
##$WDW= 1
##$XDIM= 8192
##$YMAX_p= 0
##$YMIN_p= 0
$$ End of Bruker specific parameters
$$ ---------------------------------
##NTUPLES= NMR FID
##VAR_NAME=  TIME,          FID/REAL,        FID/IMAG
##SYMBOL=    X,             R,               I
##VAR_TYPE=  INDEPENDENT,   DEPENDENT,       DEPENDENT
##VAR_FORM=  AFFN,          ASDF,            ASDF
##VAR_DIM=   8192,          8192,            8192
##UNITS=     SECONDS,       ARBITRARY UNITS, ARBITRARY UNITS
##FACTOR=    0.000296,      1,               1
##FIRST=     0,             0,               0
##LAST=      2.424536,      0,               0
##MIN=       0,             -626291,         0
##MAX=       2.424536,      845992,          0
$$ Real data points
##PAGE= N=1
##DATA TABLE= (X++(R..R)), XYDATA
$$ [...]
2033g43K014j776J169l91N53j202R88j003J277j245l1J917l072L332k947J506
2049C46m94n28J414k191K069j162J22j42Q56j221J069m89j4J117k266L050l147
2066a611K192k83q70J789k249K293k327J121m8J36n70P30n44j66M92j334K166
2083I17k435K590j208p06K342k650K269j497J550p33m65R35k38n42M98M19j563
2100e17J955k191K082j700M79J068k654K861k071J132n19Q8K12q65P82k33o5l46
2118e02J540k307K171j673P73P41j838K759k948J821o27m54N63o06J020q23M82
2135I2l92J082j975K047j544O60N34j706K274k963K925j857K48J161j243R63p94
2152d88J066r82N25p75J313j727J375L66j815K340k462K495j981R17N34j500J997
$$ plain form
2033 -743 1271 -505 664 273 826 -376 612 -391 886 -359 -390 1527 -1545 1787 -1160 346
2049 346 -148 -676 738 -1453 616 -546 -424 -566 290 -931 138 -351 -365 752 -1514 1536 -1611
2066 -1611 581 298 -572 1217 -1032 1261 -1066 55 7 143 -427 303 -241 -407 85 -1249 917
2083 917 -1518 1072 -136 -842 1500 -1150 1119 -378 1172 439 -26 909 671 129 627 1046 -517
2100 -517 1438 -753 1329 -371 108 1176 -1478 1383 -688 444 -75 13 225 -640 142 -91 -156 -502
2118 -502 1038 -1269 902 -771 2 743 -1095 1664 -1284 537 -90 -544 19 -587 433 -390 92
2135 92 -300 782 -1193 854 -690 -30 504 -1202 1072 -1891 1034 -823 -575 586 -657 306 -488
2152 -488 578 -404 121 -654 659 -1068 307 673 -1142 1198 -1264 1231 -750 167 701 -799 1198
2169A198j368M80m65P01q91Q21r26J146p11q59J982k604K712k241J301M2r89J855
2187A184k314J368l48K68l98P66o12M09j89m29J480k354K991k547J379J76j238
2204d08J497k243K051j396K75J16K16p85L51j00k66R44j766K258k194J560m51
2221c41p25J949k280K135j496J131l42n43N85J02J42r4O32j839J348j839J492
2238A7j043J12K387l230J537k37R63p55l32P53m68J15j02R44j413K177k186J716
2256I55o88m16J332k092K555k136R54j48J73M4o89Q39o27K11o40J418j854J793
2274I84j283K08Q23j393J930k312J667n08m19O57o97O74j066Q12m35L70r80J360
2292C92j196K25R63j865K199j945J832j410L29J277j472P31m10P49p22Q34r15
$$ plain form
2169 1198 -170 310 -155 546 -345 476 -450 696 -15 -874 1108 -1496 1216 -1025 276 318 -671 1184
2187 1184 -1130 238 -110 158 -240 526 -86 323 134 -295 1185 -1169 1822 -725 654 830 -408
2204 -408 1089 -1154 897 -499 -224 -108 108 -677 -326 -426 -692 252 -1514 744 -1450 110 -341
2221 -341 -1066 883 -1397 738 -758 373 31 -512 73 175 317 223 855 -984 364 -1475 17
2238 17 -1026 -914 1473 -1757 -220 -457 506 -249 -581 172 -296 -181 -283 661 -752 1425 -761 955
2256 955 267 -149 1183 -909 1646 -490 464 316 489 533 -156 683 56 267 -373 1045 -809 984
2274 984 -299 -91 732 -661 1269 -1043 624 116 -303 354 -343 331 -735 77 -358 12 -968 392
2292 392 -804 -579 384 -1481 718 -1227 605 -805 -476 801 -671 60 -350 399 -323 511 -404
2309d04J051j102N59L54j195J896j980J503r59L22O10j572J804j208P39m67P21
2326F72p27P16o21L72J09r81K120k365K267j590L12J05j090J747j608R52n15J47
2344B2m50P83q19K36M36m18P12k140K633j868O98L56r08J337j997J718j204M29
2362d44p5M57o37L26J76p10J420j710J804j598J426l55j165K026j921J725j244
2379d99P86l0m42N65j50l03J3R71j674J974j555J000l84l04J302k086J879j216
2397a53P11k05K0J41n67N12j86L89q70J338j427R68m12k75R51j769K238k061J118
2416D61l22l77M07p21N93n94M55n64O89j529J460r11j11R73j417K203k281J773
2434A87r13q3P96o83P72n86O35n35P04j005Q74o65N01M45j577K352j935J062p35
$$ plain form
2309 -404 647 -455 104 458 -737 1159 -821 682 -277 45 655 -917 887 -321 418 -49 672
2326 672 -55 661 40 412 521 -460 1660 -705 1562 -28 284 389 -701 1046 -562 390 -125 22
2344 22 -428 355 -464 -228 208 -210 502 -1638 995 -873 -175 181 -727 610 -1387 331 -873 -444
2362 -444 -519 -62 -699 -373 -197 -907 513 -1197 607 -991 435 80 -1085 941 -980 745 -499
2379 -499 287 257 -185 380 230 -73 -60 911 -763 1211 -344 656 272 -32 1270 -816 1063 -153
2397 -153 558 353 373 514 -53 459 273 662 -208 1130 -297 671 259 -16 935 -834 1404 -657 461
2416 461 139 -238 169 -552 41 -553 -98 -662 27 -1502 -42 -953 -1064 -91 -1508 695 -1586 187
2434 187 -726 -809 -13 -696 76 -510 125 -410 294 -711 163 -502 -1 444 -1133 1219 -716 346 -389
2453c89L47L23j229J398q55N64l04N93o16M86l25J08M12r03J784j810J433p31
2471B86K54K60q37J376j490Q17l02K97m92N54n04K01J05j044J519j790J843j304
2489b51K84O28j295J368j389J255q87J93N0K18k97n4K99n05P99j061J362j344
2507f27N88N59j275J509j497J125j081N13j71k12L36p5J68r99J450j394J285j053
2525h51P77k39l29J552k136J570p88O39l37r7N37m97M55l19P44j165J202r70O42
2544C90j50l77J095j743J864j209K85K58m09M09n26O25n57L86k49N44j222J079
2562D93l26m32Q81j267J434j363Q07j15n66Q54n96K61m32P37p30N33p92J123n75
2581g1j54P04j523J830j653R06n51l93J206j297R55p41P21m86N00n22L86j01J07
$$ plain form
2453 -389 -42 281 -948 450 -405 159 -145 448 -168 318 -7 101 513 -390 1394 -416 1017 286
2471 286 540 800 -37 1339 -151 666 364 661 169 723 219 420 525 -519 1000 -790 1053 -251
2489 -251 33 661 -634 734 -655 600 -287 -94 -44 174 -123 -177 122 -383 416 -645 717 -627
2507 -627 -39 520 -755 754 -743 382 -699 -186 -357 -569 -233 -308 -140 -1139 311 -1083 202 -851
2525 -851 -74 -313 -642 910 -1226 344 -444 195 -142 -239 298 -199 256 -63 681 -484 718 -252 390
2544 390 240 -137 958 -785 1079 -130 155 413 4 413 -113 512 -45 341 92 636 -586 493
2562 493 167 -265 616 -651 783 -580 227 112 -454 400 -196 65 -367 370 -360 173 -619 504 -71
2581 -71 -225 479 -1044 786 -867 39 -512 -905 301 -996 -41 -782 -61 -547 -47 -569 -183 -284 -177
2600a77R26j759J888j542J040n68K33O06j298J518j010M72m86R28m88J44j55o8
2618B04J89p11J331j776J560q10L36L73r93J290j345Q08q3j81j40N30j41n04P70
2637G07o00R59j448J209j016K75P17j509J312j169Q62p67K20J61q6J4k21L89r79
2656i70J205j346J487j259O30K37r28J548j388J219p82N88j11m21M44j36J65l01
2674a19P87j424J128n37J04M35r45J529j531J374r36M81p5l18N37n43N33m09P01
2693G72p99J022j184R50k24o70J082j669J559j103K77L01n69N03o76P36m41K98
2711A65m96P40n29Q25p91k11J013j351J226j340J026n53l74O45n81P75p59N61
2729iq30M70l64N19m01Q5Q47j112J307j050P89k42k02Q23r74Q92n31L51o27N22
$$ plain form
2600 -177 749 -1010 878 -664 376 -192 41 647 -651 867 -143 329 -157 771 283 427 272 204
2618 204 393 -318 1013 -763 797 -13 323 696 -297 993 -352 456 373 192 52 582 441 -63 707
2637 707 107 1066 -382 827 -189 86 803 -706 606 -563 299 -468 -248 -87 -173 -159 -380 9 -970
2656 -970 235 -1111 376 -883 -253 -16 -944 604 -784 435 -347 241 130 -291 153 17 182 -119
2674 -119 668 -756 372 -165 -61 374 -571 958 -573 801 -135 346 271 -47 490 -53 480 71 772
2693 772 -27 995 -189 761 537 -133 949 -720 839 -264 13 314 -255 248 -428 308 -133 165
2711 165 -331 409 -120 705 -86 -297 716 -635 591 -749 277 -276 -650 -5 -586 189 -570 -9
2729 -9 -839 -369 -733 -214 -615 -530 317 -795 512 -538 251 9 -193 630 -344 548 17 368 -259 263
2749B63m00K61j80J18K91j110J597j571J092m14M2L76r39J235q48P07k86J68k39
2768A63M8J37k70O18j076J099j544J330m12m73P61j214J214j241J122o94K95K59
2786A22j61j70J41M28p93J336j261Q78r48L20N09j247J465j244P46m48q2J85l35
2805e59L39l99L92p50J313j105R14o75N27J83r71J545j379J005p07P17j79l74
2823a63O09n03K37m74P73r84J072o23L9J07o60J472j645J416p07L40j08k35P00
2842F63q70N62n01N82q46J064j135P25J44r83J429j441J365j054P64j29o76P41
2860D04l61K00n58P85o84K45k78M14n1o26J318j734J469j105Q29J13q28R18r71
2879e01O14l09O45p37N07m77Q7K81m42P37j050J330j063L07j17j42J053j419J338
$$ plain form
2749 263 -137 124 -56 62 353 -757 840 -731 361 -53 -11 365 -574 661 -187 520 234 402 163
2768 163 211 348 78 696 -380 719 -825 505 93 -380 381 -833 381 -860 262 -432 -137 122
2786 122 -39 -209 -68 360 -433 903 -358 520 -428 -108 401 -846 619 -625 121 -327 -409 -224 -559
2805 -559 -220 -619 -227 -977 336 -769 145 -530 -3 180 -791 754 -625 380 -327 390 211 -163
2823 -163 446 -57 180 -294 479 -505 567 -56 -17 90 -570 902 -743 673 -34 306 198 -37 663
2842 663 -207 355 -146 436 -410 654 -481 244 388 -595 834 -607 758 -296 468 339 -337 404
2860 404 43 243 -315 470 -214 31 -247 167 116 -510 808 -926 543 -562 267 380 -448 470 -501
2879 -501 113 -196 449 -288 219 -258 -171 110 -332 405 -645 685 -378 -71 -188 -330 723 -696 642
2898F42j019P16l22M10n64L15j5n31P52r62J317j293Q98k30l17L46o36J076p46
2917a63N03n16L34l47O33rm12O48j139J082j096J132o37m73J090j133R29j034
2935f08Q51n29L1K36n05M88m84N94q54J175j183J162m81k62N58r24J364j238O32
2954B3l35J39L02n35Q27o15J57k04P74j091P81m46kM25j050J548j126O41m61N96
2974C48m23o2L86m29O42n59M25n95J028r11K11O35j089J336j288J221j020M49
2992C05J9n97P56m71N88q07M47o55N51l05L88K94r19R73j083R82q45M05k3l71
3012c68O24o71M51o17R33q64N13m9l9J17n65R83j042J178j245O98o8m82O90p35
3032e58R11q46P22n60K69m8j47K91l89Q88j104J218j105M37K01l95L86n47J292
$$ plain form
2898 642 -377 339 17 427 -137 178 163 -368 384 -578 739 -554 344 114 -203 143 -493 583 -163
2917 -163 340 -176 158 -189 444 435 23 671 -468 614 -482 650 13 -460 630 -503 426 -608
2935 -608 243 -286 -255 -19 -524 -36 -520 74 -780 395 -788 374 -107 -369 189 -735 629 -609 23
2954 23 -312 -173 129 -406 421 -194 -37 -241 533 -558 223 -223 -225 200 -850 698 -428 213 -248 348
2974 348 -75 -137 249 -180 462 -97 328 -267 761 -150 61 696 -393 943 -345 876 -144 305
2992 305 324 -273 483 12 600 -207 240 -415 136 -169 219 513 -406 567 -516 466 -379 26 3 -368
3012 -368 256 -415 36 -581 352 -512 1 -48 -87 30 -535 448 -594 584 -661 37 -31 -513 177 -558
3032 -558 353 -493 229 -331 -62 -110 -257 34 -355 533 -571 647 -458 -21 180 -215 171 -376 916
3051I16j373Q89m62j52J07M69m78j94M76p62J648j086K58L98j46q57n36N24K24
3070a37J38l75R15p33N22k22k80P15o90O57n60N66m67k75Q90j097J090j012P27
3089C72o10P8K71j30K30o01L44m36Q45j195J035m32j33M39o31J131j197M95Q2
3108d3j04J66l92M68k89L58m19O10p53O42j63m11N10o66J133j100Q95n38j29L37
3128A12k45O74p18M95m52N67p69R55p11J03M65q40R48q79O68o49K42J57j92N25
3148D56o76L92o30N63j32K51l24J54J46p86J098j050R95q45N01Rm46P47q28P23
3168C18p19M61l44L30j10j37J58l85P45j144J158p73L46L01p75Q09q39P80o59
3187d79M67k32L13l68K39K78n81P63q86J192j078M19J62m60P45q36O76k63K98
$$ plain form
3051 916 -457 432 -30 -182 -75 394 -84 -278 198 -564 1084 -2 256 654 508 -349 -885 -361 -137
3070 -137 1 -374 541 -192 330 108 -172 543 -147 510 -50 516 49 -226 664 -433 657 -355 372
3089 372 -238 -160 111 -19 211 -390 -46 -482 363 -832 203 -229 -362 77 -554 577 -620 -125 -43
3108 -43 -147 19 -373 95 -194 164 -255 355 -398 244 81 -330 180 -486 647 -453 442 -96 -225 112
3128 112 -133 541 -177 318 -134 433 -336 619 -92 11 476 -364 584 -295 373 -276 -34 123 -69 456
3148 456 -220 172 -458 105 -27 224 -100 54 200 -586 512 -538 457 -388 113 122 -324 423 -405 318
3168 318 -401 60 -284 46 -64 -201 -43 -428 317 -827 331 -442 -96 205 -570 239 -600 180 -479
3187 -479 -12 -244 69 -299 -60 218 -363 400 -486 706 -372 47 209 -251 494 -342 334 71 369
3206C69j72NJ20J61N0p84O76o34Q67r37P03m82l15Q35r01Q93o60M78k34J65k64
3227f1k37M34l17O87p69P89o59N87l71l64O98j208J336r52L00q4J46L1k52L47
3247H1k42K11k85K26l24L48j38l70O91o76J043j157P10j47j49J37m30P35o55O46
3267B55o67P72q23N85j47l68P56p54P92o93O57m28P7O38p12L26k25N38n18K62
3287C23k67K6Q8j93M18q44R45j033R23l40J66K89n62N27q83O53m55N81m06Q9p5
3308c0k62O35q04O86o27O22l36j0K53o44Q34o65M57o95N74k26k34L81l86K81m18
3329f14R20p13O49p28L86L91o08Q16q74J071p73M68l92M7qj28N4l63Q58r40O61
3350A80o06L46K40m09O46r76J022o33L17r5K88ok66N35k97L23m25N34o59K81p6
$$ plain form
3206 369 197 202 322 483 533 -251 425 -209 658 -279 424 -58 -373 462 -439 454 -206 272 38 203 -61
3227 -61 -298 136 -181 506 -263 526 -133 454 83 -281 417 -791 545 -407 -107 -191 -45 -14 -266 81
3247 81 -161 50 -235 -9 -333 15 -123 -493 198 -478 565 -592 118 -29 -178 -41 -471 264 -391 255
3267 255 -412 360 -463 122 -25 -393 363 -391 401 -292 365 -63 14 652 -60 266 41 579 61 323
3287 323 56 82 170 -23 395 -449 496 -537 386 46 212 501 -61 466 -417 236 -219 362 -44 45 -30
3308 -30 -292 343 -461 225 -402 220 -116 -126 127 -517 317 -348 109 -586 -12 -238 -472 -91 -477 -196 -614
3329 -614 306 -407 242 -486 -100 291 -317 499 -375 696 -77 391 -1 46 38 -90 -36 -399 459 -481 180
3350 180 -426 -80 160 -249 397 -579 443 -190 127 32 320 314 48 583 286 609 184 718 59 340 264
3371B64l10O65j240J129p62J88J45k03K37j63J39j97M02n25L97n07O29m99r9P48
3391D38j056P63n13K03R7j85K98l84M49k63M18o19M46l54J62J01j72L90p25P85
3411B79p40M53R3J9J8l52M81m28M33n83M30k40Q3J71l13M72o27O97p34O92l75
3432g1J65J18l12L54m22L79l25R02q11N32k18P9J0p45Q59p19N97o23L49P1n30
3453c61O42o89M37m08N60k17o8jr2L38n70P64n06L21k73J89K38l21L67n78K10
3474a8k84K47k21K76j16J7J75o39P82p63N70l16J97K11l46M77m60O27n76L49j90
3495aq3n8J99K22m96M39n73O20n91N40J6l92P22r52P27n12L74j94J15J16r3j02
3517D3k50O77o81M75m27J49K25l56P13r31P10n43L62r9r5R9j38R0k41N50p61P34
$$ plain form
3371 264 -46 619 -621 508 -254 -66 79 -124 113 -50 89 -108 294 -231 166 -341 288 -211 -310 438
3391 438 -618 145 -368 -165 -68 -253 45 -339 110 -153 265 -354 92 -262 -100 1 -171 219 -506 279
3411 279 -461 -8 85 104 122 -230 251 -177 256 -327 103 -137 -54 117 -196 276 -351 346 -388 304 -71
3432 -71 94 212 -100 254 -168 211 -114 788 -23 509 291 370 380 -365 494 -225 372 -251 98 169 -361
3453 -361 281 -408 29 -379 181 -36 -104 -105 -197 141 -429 335 -171 150 -123 66 304 -17 350 -228 -18
3474 -18 -302 -55 -276 0 -116 -99 76 -563 219 -544 26 -290 -93 118 -228 249 -211 416 -160 189 -1
3495 -1 -84 -142 57 279 -217 222 -351 269 -322 218 234 -158 564 -388 339 -173 201 7 122 238 145 43
3517 43 -207 470 -211 264 -163 -14 211 -145 568 -363 347 -196 166 67 -28 71 -67 23 -218 332 -429 305
3539C05q03O75k3n32L64l88M84n18M33J21j98K34l56K53m32M40k54O00m43p1J73
3560F4p01J116r28O20n87N85k40k81O87l30J93n36O48n41L72P7n5j70j10L76m09
3581a50L33m36Q12n56r2M68m49M23n29O63o65N50m09J45rqK23p73R03m72J46J9
3603A37j18N4l33O10o02K34k83N38m31J26L56k59R8o44O41n19N18j99p5L57n97
3624c91N46n89Q83m42Ko5j45L87l45M38p93Q11p03M84q5RJ54l51O67o98O89l78
3646H5J7J43k12L57n72J15j32N62n94P18l15j98J78l41N90n76M91l86K69J41n08
3667a68L88o28M26j00N54n03n2J4J8j50j78Q32q52N71j92K1j31P1J73l97N44n72
3689c11O26m50M20o03K76J71l49L13o17R64r59L07L37l08M86n91K82k75M23k15
$$ plain form
3539 305 -498 177 154 -378 -14 -402 82 -436 -3 118 -80 154 -202 51 -381 59 -195 405 -38 -109 64
3560 64 -637 479 -449 171 -416 169 -71 -352 335 5 198 -338 310 -231 141 218 163 -7 -117 259 -150
3581 -150 183 -253 559 3 -89 379 -70 353 -176 487 -178 372 -37 108 99 91 314 -459 444 -28 118 137
3603 137 19 73 -260 350 -252 -18 -301 237 -194 -68 288 29 127 -517 124 -395 123 -76 -151 206 -391
3624 -391 155 -434 449 7 9 -56 -201 186 -159 279 -514 297 -406 78 -7 2 156 -195 472 -226 463 85
3646 85 102 245 33 390 -182 -67 -199 363 -231 487 172 -26 152 -189 401 -175 316 -70 199 340 -168
3667 -168 220 -408 18 -82 472 -31 -83 -69 -51 -201 -379 453 -399 172 -20 1 -130 -59 114 -283 261 -311
3689 -311 315 -135 285 -318 -42 129 -220 93 -524 440 -519 -212 125 -183 303 -288 -6 -281 142 -73
3709g3L49n15K39Q7k72M17m35K98j88J79o3R7k19k9L82l28M60o13K74K8j0K01
3731B66j99K46p50O81l58K77o1l25M77n73P16n12J11k24R4M09j88q5p8N0j51L27
3753A50n76M47j61k7K29l67N71n42M60n15L86k85J39M9k2K52l74J43j78J05P8
3774c8k61O48o63N17m11M75l58j6K14j67O8j16M46n50M43n45P70n69J88K09m34
3795a50J015j010N07l89Q2L32l65J65j49J50l96O35p61Q10n43L84j18l12P64p71
3815a20M57l62N5Pl4J25l57M02m89N23n00L65k95j04L81m50M51m14Q27n39k22
3836b93K55k37M61m60J60j26J27J65k33o0K16Jl69N45m77L69k47J46K87k48K05
3857A87m53L53n76N25r1J04P0k48O42q26N99o98M47k07O8M10k81L32m77M70l43
$$ plain form
3709 -73 276 -239 0 87 -185 232 -203 95 -93 86 23 120 -99 -128 254 -74 386 -227 47 75 65 266
3731 266 67 313 -437 244 -114 163 102 -223 254 -319 397 -115 -4 -228 -134 275 87 2 -76 -26 -177 150
3753 150 -426 21 -140 -167 62 -305 266 -276 184 -331 55 -230 -91 -42 -64 188 -186 -43 -221 -116 -38
3774 -38 -299 349 -314 203 -208 267 -91 -107 107 -60 8 -108 338 -212 231 -314 456 -113 75 284 -150
3795 -150 865 -145 362 -27 55 387 22 187 38 188 -208 427 -334 476 -67 317 199 -113 651 -120
3815 -120 337 -25 30 37 3 128 -229 173 -316 207 -293 72 -223 -327 54 -396 55 -359 468 -71 -293
3836 -293 -38 -275 186 -274 -114 -240 -113 52 -181 -241 -25 -24 -393 152 -325 44 -203 -57 230 -18 187
3857 187 -266 87 -489 36 -55 49 119 -129 513 -313 286 -412 35 -172 -104 306 25 357 -120 350 7
3878GM09l23o7J80j15J63j96L11n77O23m07K32k53m5J69m38R35n91r1P1P6r7j30
3901a54L06j49J58k41M10o46J86J13m06P70n99K51k39M60l51O5j9k90K67k72L60
3922b0k19M04m67M62j57m37Q24q36Q13p89M56O0j67Rj31L24l65K33k15O44m84
3943e8m5J94m8K27o24R32q99M86k59L14j8k98M99m99O04n47M6j19L20p1l85N00
3965B52m11K20m62N42j54r9K04m58N25m12O42p02M15n84M53N7l0P1j57M23m79
3986a44M5k51J22P1j04N47n28K85k9K9J05nn28K59M82n87M46n13M58l51K15n6
4008c2m6L60n90M36j82L44k47r7O4K5K37m11K79l19N43n30L12j0m54O52n14L20
4030A40k74K97J1j65K20k02K39m80L79m87P03l15K98l19kJ33m69O53n58K55J26
$$ plain form
3878 7 416 93 26 206 91 254 58 369 -208 415 8 240 -13 -58 111 -327 608 17 -74 -3 73 -24 -154
3901 -154 152 3 161 -80 330 -316 -130 -17 -423 347 -252 -1 -240 220 -131 -66 -85 -375 -108 -380 -20
3922 -20 -239 165 -302 160 3 -434 390 -446 367 -422 34 94 -73 -64 -195 129 -236 -3 -218 426 -58
3943 -58 -103 91 43 270 -354 578 -321 165 -94 220 202 -96 403 -96 508 -39 7 -112 208 137 -248 252
3965 252 -159 61 -401 141 -13 -112 92 -366 159 -253 389 -313 102 -482 -29 28 -2 69 -88 335 -144
3986 -144 -99 -350 -228 -157 -261 286 -242 43 14 43 148 143 -385 -126 356 -231 215 -298 160 -191 24 -32
4008 -32 -78 282 -308 128 -54 290 43 -54 10 35 272 -139 140 -179 364 -166 146 136 -318 334 -180 140
4030 140 -134 163 174 9 229 27 266 -214 165 -322 381 66 364 45 43 176 -293 360 -198 57 183
4051A83k00J82l67L12k62J09l54N31n16N91m70j03P44m35K60n71N29n00O4N64
4071B91l04m7j69L38j91K67j80p9J42k23L00l00N13p29M43k19q9L46k30K62o33
4092d91P09j39J35l34L84j84o4R6l11N39n06L37j98J2M9Q3K18k97K56l21K81k09
4114D5k4K01k85J07j78N57n21L01k10p2K24k43K57l47J51LJ32j23k9ln5J4k46
4137c44N39n48M34j96K9J04k82L69n2J45j97M7j81J59j0j82L35l82M48o26Q07
4158D16o96M52p2k1J84j06J15j52j02J53l41k28J84L60q8K1m77M86j70K92J86
4179C96n20N82l95K42o02N12k85K1J79m92M02m3Q1J11K8m92K66K40n11L81q8J14
4201A27k87q2K05J32Q6k63L29m45J92j67j1rJ63j74J73K89o86L88m00M56j5j79
$$ plain form
4051 183 -17 165 -202 110 -152 -43 -397 134 -382 209 -261 -364 380 -55 205 -366 163 -337 -273 291
4071 291 -13 -60 -229 109 -82 185 5 -74 68 -155 145 -155 358 -371 72 -147 -236 110 -120 142 -491
4092 -491 218 79 214 -120 264 80 16 112 -199 340 -166 171 -27 -15 34 117 335 38 294 -27 254 45
4114 45 21 222 -63 44 -134 423 -98 203 -7 -79 145 -98 159 -188 -37 -34 98 -25 -54 -57 -112 -98 -344
4137 -344 195 -353 81 -115 -86 18 -264 105 53 198 1 48 -133 26 16 -166 169 -213 235 -391 416
4158 416 -280 172 100 79 263 157 272 120 18 171 -170 -398 -214 146 58 79 -398 88 -82 210 396
4179 396 -124 458 63 305 -297 215 -70 -49 130 -362 40 -3 78 189 217 -275 -9 231 -280 101 13 127
4201 127 -160 -242 -37 95 181 -82 247 -198 -6 -173 -184 -193 -30 -204 -31 258 -428 -40 -440 16 1 -178
4223a78P6n6M45n35M0n2K98k01L36k29j99M84m37M88m23K49m1n8K48l10L90o23
4245b88K93l5J95q9L7j00j35K92m48P42p49L73j37J36J94m00K96m01J97m3J26
4266E6j3l01K38j73K71m84P63o69LL90j24L60m35J84j23p3J28m5R7L9j09k19J28
4289a11l15M91l33M40k01k20L42m46L00o9P2r4L1J48m53K77K09j84J19L04n11
4310b04K20p6N2J86k24J45k62L25k0q9k66N98k61j82J56j32L23l07J93j48k5J58
4332A60k63M07l67J89j38J45J38k59N2p0o5p0M30l53K52k24J12m1k29L41k79L82
4354B50n17L27p3j64J94r1j3k02J77k69L80j32rK63l15K94l42M87l06Q9Lk41K43
4377C3p4L04m40L45o11O54k97J2J15k5R1l20K95M0Q7j36jJ83m03L31k34K02r2
$$ plain form
4223 -178 -102 -158 287 -248 -208 -260 38 -163 173 -56 -255 229 -208 280 -143 106 65 7 255 -55 335 -288
4245 -288 5 -30 165 76 113 13 -122 170 -278 464 -285 88 -49 87 281 -119 177 -224 -27 -70 56
4266 56 43 -258 -20 -193 78 -406 357 -312 -309 81 -43 317 -118 66 -57 -130 -2 -47 50 89 -20 -239 -111
4289 -111 -426 65 -268 172 -29 -249 93 -353 -53 -122 -50 -144 -113 35 -418 -141 68 -116 3 307 -204
4310 -204 16 -60 -8 178 -46 99 -163 162 142 53 -213 385 124 -58 98 -34 289 -18 175 27 2 160
4332 160 -103 304 -63 126 -12 133 271 12 64 -6 -71 -141 289 -64 188 -36 76 35 -194 147 -132 250
4354 250 -267 60 -13 -177 17 -74 -87 -289 -112 -381 -1 -133 -142 121 -194 100 -242 245 -61 28 31 -210 33
4377 33 -41 263 -177 168 -443 211 -86 -74 41 16 107 -213 82 122 209 73 72 255 -148 183 -51 151 59
4400E9j37J38l27N48k09L04m07j3k27L89L2n9j66N4M7l96O18l71J44J1j63J67
4422C6k05M88m52J66j56O8o2j57N15n90N92m38J66k58L97k36k84M40m8K45l57
4443a30M27n88L76o9r0K39n62M53r7J51M4j36M1j18p1j46M71k39o9N5Q8J66k84
4466h8L04k98M42o16L95j14N8j8L02q0j95J01k37K52k27J8j34J71N0k49L97l82
4488a48K70r3l0K47k33K09j94J27k26n8k22J25J74j2J53l33K49k97J89J15Q4k34
4510a38M9K83k57J44k54M27l33L09j92l45K40j45N38m33K27l04O2J97q1K21l34
4531a19K61l41L92k88J77K8L4j87R4N6m2n5j31K8L22k36J09j76L20k94J27p1Q1
4554H9k15J29K01m80M31j89K79l43J20J19l57L64k24K84j84K28j97J62j42o3O0
$$ plain form
4400 59 -78 60 -267 281 72 376 -31 -44 -271 118 150 91 -75 -21 26 -370 248 -123 21 32 -131 36
4422 36 -169 319 -133 33 -123 -55 -117 -274 241 -349 243 -195 -29 -287 110 -126 -410 30 -18 227 -130
4443 -130 297 -291 85 16 -74 165 -397 56 -41 110 154 18 59 -59 -130 -276 195 -44 -113 -58 30 196 -88
4466 -88 216 -82 360 -256 139 25 83 65 367 287 92 193 -44 208 -19 -1 -135 36 86 -163 234 -148
4488 -148 122 29 -1 246 13 222 28 155 -71 -129 -351 -226 -52 -64 89 -244 5 -292 -103 12 96 -138
4510 -138 -89 194 -63 81 -173 254 -79 230 38 -307 -67 -212 326 -107 120 -184 -122 75 -6 215 -119
4531 -119 142 -199 193 -95 82 110 144 -43 51 107 65 10 -121 -93 229 -7 102 -74 246 -48 79 8 89
4554 89 -126 3 204 -276 155 -34 245 -98 22 141 -216 148 -76 208 24 252 55 217 75 12 72
4575G2j02J40m06L33j28p2Q6l29M72j15p9j01K04q3K38l19Q8M1j18N63n57L79
4597B07l53K5K70r0J23o19M51m5J83n2p2M5n8J92j30k40K72K98n12Q0K04l87M08
4620B00j29K05l47R3j23J43n6LJ16l45L79r6NJp8m0QL32j74L28n18L17k44P2M7
4645I9k56K20l74O11l92K92k23J05k81j7M5j66L10k71L64J95l29K46k09J65j76
4666d2J59l91J54N8N0k03J49K44l06N11m02K8k6J65j29q0o7M7L08k39m0qK89Q5
4690C14j99J15l03J19k47O34k34l24L60l76K49k42M94l20P2R5p4K12m78P9l09
4711c63O49l72J60j83J26J0j71K29m25O06o78K94o1M1K23j51Q8k67L48j03jP0
4733F9O0O1n91L50j59K35j89J45n2n8J4LK26k52K84j14j69m8K20pj36L32k16k8
$$ plain form
4575 72 -30 110 -296 37 -91 -163 -77 -406 66 -49 -128 -229 -25 -108 130 -189 -101 -60 -178 385 -172 207
4597 207 -146 -121 149 59 182 -437 14 -31 152 100 28 73 15 207 77 -163 109 407 -105 -25 179 -208 200
4620 200 71 276 -71 22 -101 42 -14 -11 105 -240 139 43 48 49 -29 -69 -61 271 97 425 -93 224 -20 52 99
4645 99 -157 63 -311 300 -92 200 -23 82 -199 -216 -171 -337 -27 -298 66 261 -68 178 -31 134 -42
4666 -42 117 -274 -120 -62 -12 -215 -66 178 -128 383 -19 9 -17 148 19 -61 -128 -81 227 -12 -52 -60 229 314
4690 314 115 230 -73 46 -201 433 199 -125 235 -141 108 -134 360 40 112 207 133 345 -133 -54 -363
4711 -363 286 -86 74 -109 17 27 -144 85 -340 266 -412 -118 -179 -138 85 -66 22 -245 103 0 -1 69
4733 69 129 190 -401 -51 -210 25 -164 -19 -71 -129 -115 -112 114 -138 146 32 -137 -185 35 28 -108 224 8 -20
4757b0j30R1J69K29n31L18K50n43Q2J42J64m09J89P2j40L68l63J39j53NrMK31
4780A55N4k22J96J16n5j99r7MK89j65J43m91K76k55M50k14k04L59m12L82l15L17
4802A12l73L36J15q5M5o13P78k57N1q9K4L2m5K55n30K22j93L25l12J05r0K39j12
4825f0k0L03o24O32k06N9k56P3lk26N16m9j17j12J04P6j79J71l1k8Q7k4l00N6
4849a58J17o5K05j99L59j62Q8m49M22n8r8J10j8L1k49K85j31K32j71j25J89k75
4871a20K14r3l4j30J3K50k67K69o9j11l71M60j29K02k20O9Q8O2k4l57L83j87L03
4894B01j79j77K75r8J5k01L27l55M54m07J38o6j5L46o13M37j20N9O5k69K03q1
4916f1J67m13J23L09o3n2lJ22k32K89j89J03j8K6m9kn6N4k40J16R6O0J20n16L94
$$ plain form
4757 -20 -150 -59 110 339 -192 126 376 -167 -85 57 221 -188 1 73 -67 301 -62 77 -76 -71 -80 -76 155
4780 155 209 -13 183 299 244 45 -52 -48 241 76 219 -272 4 -251 199 -15 -219 140 -272 110 -205 112
4802 112 -261 75 190 105 150 -463 315 58 109 20 44 76 31 286 -244 -22 -215 110 -202 -97 -187 52 -60
4825 -60 -80 223 -401 231 25 84 -172 -99 -102 -328 188 139 22 -90 14 90 -89 82 51 23 110 86 -214 -158
4849 -158 -41 -106 99 -100 259 97 185 -264 158 100 2 112 94 125 -124 161 30 262 91 -34 155 -120
4871 -120 94 1 -33 -163 -150 100 -167 102 33 -78 -449 11 -118 84 -136 -67 21 83 59 -298 85 -102 201
4894 201 22 -155 120 22 37 -164 163 -192 262 -145 -7 -73 -88 258 -355 82 -38 21 86 -183 20 -61
4916 -61 106 -307 -184 125 62 10 7 129 -103 186 -3 100 82 108 59 57 1 55 -185 -69 27 87 207 -309 85
4941H5L4k17J29j4K03k75j00J98k98K54j39j6m1K86k56L32k51qJ72j85J55k61
4963b13M13m44K50k7J32j49j7J57k79K13j22Rj9J14K71m55J59j66L49m22K64J6
4985C4j40L16l44K75k12J72j12K67k12j85k9L07j4l04K53J36k36J08j7q3p2Q2
5007a0K8J61j06J48j35m1J12k37J63q8j0R1J2j55P3J3q7p7N9J70q5J21j49o9K35
5032A37l61K46l3P5k61J48j90J55Jj77N09l49M30l95R0j03j4j31J12PJ24O3j81
5055i8J28k9J5j7r3M10l49j23p4L05k20K80j63R6k2o0P6j54K58j60m1J41q8m0
5079b2o1P4J0Q6r9NJ7k99N49m38K11k58K99K47m45K9K05n7l04L05j08q5rJ59R8
5104A09k13J14k51K26o8K01j02p9J09j37O0K2Q6j3rp8J52l9J4j12j00P4k45K34
$$ plain form
4941 85 119 -98 31 17 220 -55 -155 43 -255 -1 -140 -156 -197 89 -167 165 -86 -94 78 -107 48 -213
4963 -213 200 -244 6 -21 111 -38 -55 102 -177 36 -86 -77 -96 18 289 -166 -7 -173 176 -246 18 34
4985 34 -106 210 -134 141 -71 101 -11 256 44 -141 -170 137 123 -181 72 208 -28 80 63 -20 -92 -10
5007 -10 18 179 73 221 86 45 157 -80 83 -5 -15 76 88 -67 6 19 -68 -145 -86 84 -1 120 -29 -98 137
5032 137 -224 22 -11 64 -197 -49 -239 -84 -83 -260 249 -100 330 -65 25 -78 -92 -223 -111 -104 20 83 -98
5055 -98 30 1 16 -1 -94 316 -33 -156 -230 75 -145 135 -28 68 46 -14 62 -92 166 6 -35 106 18 -22
5079 -22 -83 -9 1 87 -12 -7 10 -289 260 -178 33 -225 74 321 -124 -95 110 53 -251 54 -54 -139 -148 11 109
5104 109 -104 10 -241 -15 -83 118 16 -63 46 -91 -31 -9 77 64 55 -23 129 90 104 -8 -108 -34 -279 -45
5128d5Q9J77l54J02OKM11n81K67lK34j08l29M11n10J86K08j6l78K76p3q3K26j80
5152f5L59m27j03J05J6K80k46K53j35p0r0L0J74k41M06k14Jk87M10j45k2r8PJ68
5176F6l27L73m81O50l54L8L3j03J98k16N1J49k05P0J40k07L7M28l50M6j46J20
5198A0J19k11J58K58j44j83K55l54k7J4m5K22j11n4J34J13k34J01L3p8J26o8J57
5221A91j38k8o4N6l30J65l7K06j43L1K15Kk36N6L9L2O9j39k23L21m26M06l5j61
5245a71M9J34J79l43K40j58P1o7K35j80j69L63l55K30j33R8m4J02M4j6J04j83
5267C0P7k43K55j74L27j65m0N6l06L0j11K33n4L8K0m3J65k95J97r6J17M6p3K71
5291B62k71J23k03L08n62P0P40n25M6p1L2j3J33m09M52j54k2K4l4n3J23K25k63
$$ plain form
5128 -45 44 221 -133 -31 -25 -23 388 -193 74 71 305 197 -132 279 -231 -45 163 147 -231 45 -28 -111 115 -65
5152 -65 294 -133 -236 -131 -115 165 -81 172 37 -33 -123 -93 81 -160 246 32 33 -254 156 11 -11 -109 -102 66
5176 66 -261 112 -369 281 -73 -35 -2 -105 93 -123 -72 77 -128 -58 82 -125 -88 340 -10 36 -110 10
5198 10 129 -82 76 334 190 7 262 -92 -119 -105 -150 72 -39 -93 41 154 -80 21 54 -24 102 34 191
5221 191 53 25 -39 17 -313 -148 -185 21 -122 -91 124 126 -110 -54 -15 17 86 -53 -276 45 -381 25 -10 -171
5245 -171 -122 12 191 -152 88 -70 1 -66 169 -11 -180 183 -172 58 -75 23 -21 81 125 109 213 30
5267 30 107 -136 119 -55 272 107 67 123 -183 -153 -264 -31 -85 -47 -27 -70 95 -200 -3 -99 18 64 -9 262
5291 262 -9 114 -89 219 -343 -273 467 -58 -12 -83 -51 -64 69 -340 112 -42 -64 -40 -74 -127 -4 221 -42
5314d2rJ38p6R7l63L42j46J73j14J52k47r7K6J02J05N4R5k18K07k82Q2Ml7%m0
5339i4K45l02J12J28RP4k57J56j73L22k65K70j62L4j8k51K25j45N6l24N16p2j45
5362f1Q6n3K17l21L89j66L32l42L56m32Q6R9l64K73j61O6J26j89J17r2R5r3K31
5385A99N2n2j95J85l41n9L28j67Q1k97L59j29J07J30l30J87k01Q3j33M02j46J53
5407B16k09m39K49p6K49l7J03j01MK36k85L85n58J35K80k04r3J76Q7p7K5k86M71
5430B51l81K28j78J01l4Q1N9q3J43k01rN7M5l0k29R9j49N14k29r0K74n05L50O2
5454A46n0k50NL02j67J28k15J13Q5j07k86K08N5Q0R5l35K64j41Q1k62M01l36L47
5477A61j82k85M85m14L67k10k2pr9N6P6N6r8J57K8J66m42M25m27L63j71O0K76
$$ plain form
5314 -42 -51 87 11 108 -255 87 -59 114 0 152 -95 -192 -166 -64 41 95 190 -28 179 -103 -21 -17 -54 -54 -94
5339 -94 151 -151 -39 89 98 172 -85 71 -102 220 -45 225 63 97 79 -172 53 -92 -36 -360 156 84 -61
5362 -61 25 -28 189 -132 257 91 423 81 437 5 91 190 -174 99 -62 4 130 -59 58 -34 61 -32 199
5385 199 251 199 4 189 -152 -211 117 -50 31 -266 93 -36 71 201 -129 58 -143 -60 -193 209 63 216
5407 216 7 -432 -183 -259 -10 -47 56 -45 -41 195 -90 295 -263 -128 152 -52 -145 31 118 41 66 -220 251
5430 251 -130 98 -80 21 -13 68 127 44 187 -14 -23 34 79 49 -180 -81 -230 284 55 -35 239 -266 84 146
5454 146 96 -154 -149 153 -14 114 -101 12 97 -10 -296 -88 -33 47 142 -193 71 -70 11 -251 150 -186 161
5477 161 -21 -306 179 -235 132 -78 -100 -107 -206 -150 -74 -18 -116 41 69 235 -207 218 -209 154 -17 43 319
5500C19m75nL25l48M5J81Qj81K13j51j5K34O6j73o3J60m4j67O0J0P8J24m26N16
5524B91l07l5J36j23K34k81K39j48R2J15k22J0o2J69j32J78l47K14r2l8K42o6
5546F7R6k16rJ89j52J5Nn0J58j76n7K82K5j49J54k07O2N7r9j75J74j60m6L10j64
5571f6J30j18L83k39l02K46k47J27O0O8j30J9o5K35l2j20K76j02P7k15P4q1J26
5594A04j48J08P9j18j28J46M8q7k61L09J9L6k45L02k90L02r4l5k27N9J75j17K42
5617A79k37K7j17J64Q1j73Q7j99L83j30r7j91N9Q4j53J58J06J28j71J08j73m0
5639a17K45k50K50k36N2qQ7k60J45J51j45J85k51J26J08k22J64J04j35j91L45
5660A47l20K13Q6r5j06K29k38R2j54K63k62K79R2m03K95O8k42Q6L7P5m30K00J97
$$ plain form
5500 319 -156 -161 164 -184 -139 42 50 -131 82 -69 -84 150 216 43 -20 140 96 -71 -11 -1 77 201 -225 291
5524 291 -16 -51 85 -38 196 -85 154 6 98 213 -9 1 -61 108 -24 154 -193 21 -71 -109 133 67
5546 67 163 -53 -62 127 -25 -10 -5 -55 103 -73 -130 152 177 28 182 -25 37 94 -5 -180 -6 -166 -212 98 -66
5571 -66 64 -54 329 90 -212 34 -213 -86 -26 42 -88 -69 -134 101 69 -51 225 123 200 -15 59 -22 104
5594 104 -44 64 143 25 -103 43 91 4 -257 52 71 107 -138 164 -126 176 82 47 -180 -121 54 -63 179
5617 179 -58 -31 -148 16 97 -76 11 -188 195 65 -32 -223 -164 -80 -233 -75 31 159 -12 96 -77 -117
5639 -117 128 -122 128 -108 -56 -64 23 -237 -92 59 -86 99 -152 -26 82 -140 24 128 -7 -198 147
5660 147 -173 40 126 31 -75 154 -84 8 -146 117 -145 134 226 -177 118 186 -56 30 67 142 -288 -88 109
5683A09j3l4j68K87m67o6K12L52j99j27p2L86l22K09j15k0k9j07L78j40j41K97
5705B10j47m4q8l6oK72r8O7m09L65P8j83j14K93N9j03j82O9k11J67Q8j18R7J83
5729B09k17k75L13o7Q3r2N8o3p4J26j33rR4J99j04K14p6k34Q8j5Q7o7j44K5M1
5754c3M6J08j50k25J30J44r3K8J09N9N2j3k86J35j65M07k75Q9m62N08ml3K00n97
5778c21M18k37J66N5m5l38J55M59j86j23k67K34P6l45K87j42K22l7p1J34J50l99
5800a55L16k36M8J26j79L20j66J9N5J06o7j73qm7J29k20K84J9j47J54k28l0LK02
5824A25l44M78m72J05J39j70j87K74O9o3L10j76p2j50j1K3P8R0j67O8J84j15J17
5847A33j95j08P0K16l17M10j22m8l6k78L80k37Q1J58l73L56k24O8j3J81l8P4l39
$$ plain form
5683 109 96 62 -106 181 -286 -352 -140 212 13 -114 -186 200 -122 87 -28 -48 -77 -184 194 54 -87 210
5705 210 63 19 -69 -105 -111 161 63 130 -279 86 164 -19 -133 160 219 116 -66 3 -208 -41 47 -71 26 209
5729 209 -8 -283 30 -37 46 -46 12 -51 -125 1 -132 -141 -47 152 48 262 186 -48 40 25 112 45 -99 -74 -33
5754 -33 13 121 -29 -254 -124 20 -73 -45 64 123 175 162 -124 11 -154 253 -22 67 -395 113 109 76 276 -321
5778 -321 97 -140 26 81 36 -302 -147 312 126 3 -264 -30 46 -299 -12 -154 68 31 -40 94 244 -155
5800 -155 161 -75 -27 99 -80 240 74 93 148 254 187 14 6 -41 88 -132 152 171 24 178 -50 -80 -77 125
5824 125 -219 259 -213 -108 31 -139 -326 -52 17 -46 264 88 16 -134 -145 -122 -44 46 -121 -53 131 16 133
5847 133 -62 -170 -100 116 -201 209 87 39 3 -275 105 -132 -51 107 -266 90 -134 -66 -79 102 64 138 -201
5870b01J21J59k58K93l20J00L8J89k2K3k62J41m0m7M8m44M09k5J01R6N1j25j18
5893i3R0N0k07J03J30l35K10J32j31K6J87P8l49J7K17k32M36k59nL7K1j17r8M8
5917d4L1J41l17J32r9J46j98K26j43J1R1j81K88Kk99rK49k70K60j7k56M15k36
5940g7K06K6J34Kl86J94j56J52j68o0K28j93L05M8l03K26ok12J50K4j75R8r5J
5964c7j9K32l72N23m70J06JmJ5p5K44j57j7n9l8L7O9J12k69J06J18l3kQ7j91O2
5990c1Nj64N00n81M83j76N5L7j2K3m48K76k11N41k85O3q7p3J43r3P5j02M0q3L1
6015g4Q9j82K81j43J93k65K72K2k52P8Q3J48j72k29J18J61r1q1l8Q3J00k09J15
6038GJ10j11j71L28j40J7P0k93O3R5q9K29Nk05J72R5j5J18l97K59k99o5J24j9
$$ plain form
5870 -201 -80 79 -179 114 -206 -106 -68 121 99 122 -140 1 -39 -86 -38 -482 -73 -98 3 99 150 25 -93
5893 -93 -3 47 -160 -57 73 -262 -52 80 -51 -25 162 240 -109 -92 125 -107 329 70 65 102 123 6 -92 -44
5917 -44 -13 128 -189 -57 -156 -10 -208 18 -125 -114 -23 -204 84 86 -213 -222 27 -243 17 0 -256 159 -77
5940 -77 129 155 289 291 -95 99 -57 95 -73 -133 95 -98 207 255 -48 178 172 -40 110 134 -41 57 -38 -37
5964 -37 -56 176 -196 327 -143 -37 -36 -40 -25 -100 144 -13 -30 -89 -127 -90 -21 91 -178 -72 46 13 11 98 -93 -31
5990 -31 -26 -190 310 -271 212 36 91 128 116 139 -309 -33 -244 297 12 75 -12 -85 58 -35 40 -62 -22 -105 -74
6015 -74 15 -167 114 -29 164 -101 171 193 -59 19 102 250 78 -151 -33 128 37 -44 -82 1 101 -108 7
6038 7 117 6 -165 163 23 40 110 -183 -120 -25 -114 115 120 -85 87 182 167 285 -112 147 -152 -217 -93 -112
6062a12K14Q8j86j53J29J1K61k12p5R4J6J2O2l9j07l4K06l83K53M3j47N0N0j3
6086B8o1j1J75J23m34L4r2R8J85j53J88K9O3m91M30k89K61j64j99M28k11J57N1
6109A45J46m41K01l6j09Q2j03j51K95J84k66L3j2K1K9M7k30L89l34j8N1q0J19
6132c8q8O3P9j71J78M8j03mQ6J48k37k32K06r6J28J54k51K98l72K07O1j25Q5P1
6156I5j12p0rJ64j55J43j36P0mJ85j31K2J04l93K54K0k43J83L1%m3j59J94K69
6180B79k99J68j56P0Q1l55N83m67K70k54K87k34J05K3q5J66l00L07J8o2j74pJ56
6203A20p6p2j73M31k42q2K44j38N9r3J57j44j28j13L90k37J77M7j21J72l78J33
6225f7j9J9p0R1r9M1M2o7K04q7l7k7P0j68K32k8q3j06K16J9oj00k0j0Kl3JJ4j77
$$ plain form
6062 -112 102 190 4 -149 -20 -9 252 40 -35 59 75 87 149 110 3 -31 175 -208 45 88 -59 -9 41 28
6086 28 -33 -44 131 254 -180 -146 -238 -140 45 -108 80 109 172 -319 111 -178 83 -81 -280 148 -63 94 145
6109 145 291 -150 51 15 -94 -12 -115 -266 29 213 -53 -20 -32 -11 18 65 -165 224 -110 -128 -77 -157 -38
6132 -38 -126 -63 16 -155 23 71 -32 -36 50 198 -39 -271 -65 -161 -33 121 -130 168 -204 3 64 -61 24 95
6156 95 -17 -87 -96 68 -87 56 -80 -10 -14 171 40 62 166 -227 27 47 -196 -13 18 18 -25 -184 10 279
6180 279 -20 148 -8 62 143 -212 371 -96 174 -80 207 -27 78 101 16 182 -118 189 207 145 -29 -36 120
6203 120 44 -28 -201 230 -12 -94 150 12 71 -22 135 -9 -137 -250 140 -97 80 127 6 178 -200 -67
6225 -67 -86 -67 -137 -46 -145 -104 -62 -129 75 -12 -49 -76 -6 -174 58 30 -53 -159 57 76 70 -30 -50 -60 -58 -91 -90 -76 -253
6254b53P6J35l0J62J7k75L86k79R3q4M47k88k52K12qJl3J61l20l0J12J32j95P
6278a06J11j6P4N6l00K46j46J29l6n3K1J18k66K89j98K74k18O3K6l3K6l33L06
6301C4J9j67KJ57n0o6mR2O2p0j12K20pM3j1j40j1r1J31M4j35P5j30qK98k70R0
6328er6l9J90m56N03j08j73K10j51J52j49J98j19P0j49J38ko5K54m51K77o6M6
6351Ip5J72M7k47K92q3Rn4m1j37N8k6J89nPk45k3P0KM1J13j8n8J76p1N2j7l73
6379b36K92j85K8J30mj9j38K76r4oj0j31Q5P0j70j33L95j80R2k10M8R6n1L25l12
6404d2J27j0Q7j21n6K75l15P8oj75L9J12j04k12J3K53K03j33K97l26J34o4p5J29
6428A08k17K59j99Q7Rj45K07n9j13j3K10k12J10l2R5p0J0j02l7K39k53O8p5O1
$$ plain form
6254 -253 -177 -42 -72 90 107 -168 218 -61 32 -52 395 107 -145 67 59 60 27 188 -132 -162 -50 82 -113 -106
6278 -106 5 -11 63 119 -181 65 -81 48 12 -41 -20 98 -168 121 -77 197 -21 42 68 35 61 -272 34
6301 34 53 -114 -112 45 -5 -71 -75 17 79 9 -103 117 110 153 142 2 -9 -100 31 75 -60 15 -115 -123 175 -95 -5
6328 -5 -101 -140 50 -406 97 -11 -184 26 -125 27 -122 76 -43 27 -122 16 14 -51 203 -248 29 -37 9
6351 9 -66 106 153 -94 198 115 124 70 29 -108 -50 -76 113 108 115 -130 -153 -83 -81 -40 73 55 -3 173 102 154 137 -236
6379 -236 56 -129 -101 29 25 6 -132 144 50 44 34 -97 -12 58 -112 -245 150 -30 62 -148 -100 -4 -55 270 -42
6404 -42 85 75 162 41 -15 260 -55 23 17 -158 -119 -7 -111 -323 -310 -57 146 13 310 -16 118 54 -21 108
6428 108 -109 150 -49 38 47 -98 109 50 -63 -76 134 -78 32 0 95 25 35 -67 -104 135 -118 -50 -125 -64
6452f4J19k86M24l22R2J01q8J25Oj91o7J65k21K38J16j24l8j61L55l03O9J10Q7
6475A42q7n4k86K28O5k74M39l08K38j41J09k99J52J34j85J73n8J64k11O1P2o1
6497A3j75L21j19L4j47poJ40j06j29m4K03K5j2N4j19L22k47j1P3K8l07K51M2j66
6522h9J51n9M9J6r8J37j07J87j37NJ23R2k58J37j57NM6l0k0j69J5J21m9O2J07
6547H0j02m4K25l4R5j11j29L33k88n2N3j57J79p2j91R2l0K16q9o3L09m31M63k70
6571a8r2K19K4j20R3j41j04K55l55K41l01K95k2J93j16O9j59J81n6q0J47j03Q9
6594A39j38K0j97ol0L18k78K07k36J60M9N5q0P8j91K44J01k41J94q7J33j75k7
6617A2j30J88p8J1J82l89K7J19M5J10n0n1l4j45L09o3j29Q4j8J12k56L00j74o6
$$ plain form
6452 -64 55 -231 193 -129 -37 64 -24 101 107 -84 -151 14 -207 31 147 23 -15 -176 179 -124 -55 55 142
6475 142 55 1 -285 -57 8 -266 173 -135 103 -38 71 -228 -76 58 -127 46 -12 152 -59 2 74 13
6497 13 -162 159 40 74 -73 -80 -86 54 -52 -181 -225 -22 3 -9 45 -74 248 1 -10 63 91 -216 35 77 -89
6522 -89 62 3 52 68 -30 107 0 187 50 55 178 270 12 149 -8 -3 43 13 -7 -176 -161 -40 -89 -27 80
6547 80 -22 -66 159 125 220 109 -20 313 25 -27 26 -131 48 -24 -215 -123 -153 63 -26 -89 220 -211 252 -18
6571 -18 -110 109 133 13 106 -35 -139 116 -239 2 -299 -4 -26 167 51 120 -39 142 86 6 153 50 139
6594 139 1 21 -176 -182 -212 106 -172 35 -201 -41 8 63 -17 61 -130 114 215 -26 168 81 214 39 12
6617 12 -118 70 -8 3 185 -204 -177 -58 -13 97 47 -4 -38 -183 126 63 -66 18 0 112 -144 156 -18 -84
6641h4J36j75J82q2K1Q2ol68O13l35J34p5j05j42J06M0p6J95k2k23J69N6q5J83
6665A39j06k52j01K52m7L07k26J03l3k49J38j14J11k4K28j68J25Mq4r7J13K8r4
6688d7M2J54n5l45J40j8R3Q0k18L75k77L1P7J5l2k2k11M02j91K54l00l3KN1n4
6713h7q8K26j33K32o2K07k71m1L8N5l82M21j75j95J16j3L49j63R4q3q1J14O1q
6737A31n1R3l04L7M0j1K32j38j52Q0L1J82l30R0J23J18j07Q2k12n1L42m73K67
6760A9J62k04J04Rr0k9p9L33j46Q0j37k7m7o5R9N1J28m14L03L3o6j02L6Q4j3j06
6786h4j63L19j79K23p5K5r8m6Q1r3q0K30j75K79r1k2m7k4l5L8J2j58L82j13j44
6811c8o9K51o7j32r0J57j52M25Oj06j14n8r7r9K36K07l40O7L3J11j85K41l25l5
$$ plain form
6641 -84 52 -123 59 -23 -2 80 74 -294 319 -16 118 43 -62 -204 -98 -58 -134 61 39 -184 -15 41 -44 139
6665 139 33 -219 -320 -68 -115 192 -34 69 36 -213 -75 -189 -78 -102 126 -42 83 87 3 -94 19 47 -47
6688 -47 -5 149 94 -251 -111 -129 -36 44 -174 201 -76 -45 32 47 15 -7 -218 184 -7 247 -53 -86 -84 -33 -87
6713 -87 -175 51 -82 150 88 295 24 -17 21 76 -306 115 -60 -255 -139 -152 197 34 128 45 -36 78 139 131
6737 131 80 173 -131 -94 -54 -65 167 29 -123 -43 -12 170 -160 -70 53 171 64 146 -66 -117 225 -248 19
6760 19 181 -23 81 90 0 -29 -108 225 79 159 22 -5 -52 -117 -18 33 161 -253 50 83 17 -85 -49 35 22 -84
6786 -84 -247 72 -107 116 41 66 -32 -78 3 -90 -170 60 -115 164 73 51 4 -20 -55 -17 -5 -163 219 106 -38
6811 -38 -107 144 77 -55 -145 12 -140 285 291 185 71 13 -84 -183 53 260 -80 -13 20 131 -54 187 -138 -173
6835a73J38k6J3k0p2K07l2l6Q9j88J27Q7j37J6j10J34j6L4q3j12J69m2J29l07
6859b11K64O3j74n4J34J75P5m47J38M8P5J73k00k81J35J46L07j62j85p8J03N2
6881I6j2N8j77J27j83J33lm9J62j07J31j19q5l5j22L07k47q7M83j90k66M11l29
6904a03J71q6j18K33K46l64L8J7K0k73K34m4J60j06k5L1k2J03P6l88J39qP3j9
6928a5j4J79l51M25l19n4J50M4K1K42l70K20jq2j02K95k88L18n73K72J12k71K24
6951F2K9Q1j71J42j86K86M03p02P6Q1r6J44K1k96P9m9K62j43PJ43l49M23j60j38
6975e1L60m43L08J9n2o9P0M1K1k87M2j14L52j72j16R8j44L22j73N6p1PK8k29K03
7000FM3j1L4r4K48j71Q4o9j12k48K00j52L36M2j50QM2Q7l2J49k78L83k80j06J4
$$ plain form
6835 -173 -35 -61 -48 -68 -140 67 35 -1 88 -100 27 114 -23 -7 -117 17 1 35 -48 -160 9 -33 96 -211
6859 -211 53 116 -58 -112 22 197 272 -175 -37 11 86 259 59 -222 -87 59 366 204 19 -59 44 96
6881 96 84 142 -35 92 -91 42 39 -10 152 45 176 57 -28 -63 -185 122 -125 -212 271 81 -185 226 -103
6904 -103 68 -18 -136 97 343 -21 17 34 54 -219 15 -29 131 25 0 31 9 112 188 -200 -61 -69 4 -15
6928 -15 -29 150 -201 224 -95 -149 1 45 66 308 -62 158 157 75 -27 268 -20 298 -275 -3 109 -162 62
6951 62 91 172 1 143 -43 243 646 -56 20 101 5 149 170 -126 -47 -96 166 23 30 173 -176 247 87 -51
6975 -51 309 -134 174 193 141 72 142 183 204 -83 -41 -155 197 25 -91 7 -137 185 12 68 -3 4 32 -197 6
7000 6 49 38 72 -22 226 55 139 70 -42 -290 -90 -242 94 136 -14 -6 36 123 91 240 -38 345 65 -41 -27
7025b7j10J48J41k98l5L31q1j78J23J03j97R9j09m4j7Q6P7Q5q6o2j82L27p7M2
7049E9O3j49J98j70j77L50l24K36j60n6J80nRo8J3lL4P8O8r3l6j72n5J47LK26
7075A96kJ07n95K37J19o2q3o0M17k44q6J85k16RQ2O1l3k08K23K41k89j06j51M32
7099A74j25l6K43l82L20k30p3J20J34k8Q8l64K84k04N5K6k30L22j88J08j21K0
7121h7L06j73j73rr2N5L7J46j87J63J58j8k88J55J18k36M7J49l89J74J86j17R0
7144A5r6K56k28L7J7k08L45k54M9P3J34j56K20p5k35Q7j61L02k26L80n41M40j04
7167G1p6l3J35J2l94K76M7j5j25j20K85m7j42J45p7k73M37J4k00J56N8j45J44
7190A33k40J10J96O8k38l7J49k80L56k24j84J76j11N1j45M35j83j3J15k26L14
$$ plain form
7025 -27 -137 11 152 -146 -181 150 69 -109 14 117 -80 19 -90 -134 -151 -65 12 97 11 -51 -233 94 17 59
7049 59 122 -27 171 1 -176 174 -150 86 -74 -130 50 45 54 -14 -1 -4 30 108 176 83 47 -125 -180 -33 -30 196
7075 196 194 301 -294 -57 62 0 -83 -143 274 30 -56 129 -87 -78 4 65 32 -176 47 288 -1 -107 -258 174
7099 174 49 13 256 -126 194 -36 -109 11 145 117 205 -159 125 -79 -24 2 -228 94 -94 14 -107 -87
7121 -87 219 46 -127 -136 -228 -173 -136 10 -177 -14 144 126 -162 -7 111 -125 -78 71 -318 -144 42 -75 15
7144 15 -81 175 -53 -16 1 -207 138 -116 -67 6 140 -16 204 129 -106 -19 -180 122 -104 276 -265 175 71
7167 71 -5 -38 97 109 -285 -9 38 23 -102 -222 63 16 -126 19 -58 -331 106 120 -80 76 134 -11 133
7190 133 -107 3 199 267 29 -8 141 -139 217 -7 -191 -15 -126 -75 -220 215 32 19 134 -92 222
7211B22m28L09j05k75K42J7R1m39J34J77J85J02N8l07k79K71o5l3j38J36J55o9
7233c9J10k0o3J13O3J21m40K59k78J10K1L30k10l41K9J89O0j50K81lk07r4N14
7256C55j30k12kj27l0M7M50m07p4J94L6k22J90m9L8R2j4k20R1k8p5L5J08p1O0
7281C5J28O8j94k22K92k09L54j70l36L43no6K91j76j64K59j35o0j18m5L09k52
7303g3K29l34P4J37k27L12j68K39l80J35j75M12j02k07J09P9lK62k45N5k03K52
7325A78q38k17R80j33K12p2Jl7Lk06n8J11K63j02k09j08M37j79J31m11J81o5J41
7348Cm1O6J26N5m98L13Lj48J67j44m1K58l18K58j21J54o8q7J71P4k18J16ojl5
7373C8j63P7P6nr0j69K80j25J51k3k8K6j02J81j34n9J50N3j58J64j8m2J8m67K73
$$ plain form
7211 222 -206 103 -2 -277 -35 -18 73 -366 -232 -55 130 232 290 -17 -296 -25 -90 -123 -261 -125 30 -39
7233 -39 71 51 -12 101 164 285 -155 104 -174 -64 -43 287 77 -264 -235 -46 14 -136 145 142 -65 -159 355
7256 355 225 13 11 -116 -146 -99 351 -56 -130 64 100 -122 68 19 57 149 135 -85 6 -22 -97 -62 46 -25 35
7281 35 163 231 37 -185 107 -102 252 82 -254 89 84 18 309 133 -31 228 93 33 -85 -130 179 -73
7303 -73 156 -178 -104 33 -194 118 -50 189 -191 -56 -231 181 79 -128 -19 60 57 319 74 129 -74 178
7325 178 -660 -877 103 -30 182 110 111 74 77 -129 -187 -76 187 85 -124 -232 205 26 157 -254 -73 -138 3
7348 3 -38 28 154 209 -289 24 27 -121 46 -98 -139 119 -199 59 -62 92 24 -63 108 182 -36 80 74 73 38
7373 38 -125 -48 28 23 -67 -236 44 -81 70 47 19 45 -57 124 -10 -69 81 134 -24 140 122 80 98 -369 -96
7398i6Q0q6l2P0J74j61o2K31M9o8p2q4j1l2J58k4j49J68pl9J32l09M05l48N4M9
7424a0M9L1m5k66J25L13o2j32Mr1Q1q3P7j02J53K40j54k46J78k29l7L44j03m2
7448gj57K73j94J88M0O6k06N6j44J31N2K0p3J82k73K1J94k4m58J52N6K09k96K21
7472B9r6O7n2J0J16k30K85M9m2j83J40q9K3o3R6N0j90R4J85o2j47j5Qj76L36k68
7498a25J76P6l0k08K66l26j20L93k40p5N55l40J44k75R5J74J16ok29J6j22K9j06
7521a62J00j6J47m7l3Pj43P3J7K24k76L93j84m0M3j85P6Q2l34K98Q3j29k85M27
7545A36j34r8O4K91j77j39O7k7M2j43N1J93l44K06J41k29L39m10k9J54J30k09
7567a25J75Q2N1O1k0k08L8q2m0J48p3r4j87M71l48K53l17l2J85J37j92m8M02j63
$$ plain form
7398 -96 -16 -102 -134 -64 110 -51 -113 118 167 99 27 -57 -68 -100 58 34 -115 53 46 7 139 -170 235 -113 -59 -10
7424 -10 39 70 25 -241 -116 197 135 3 7 -84 -3 -86 -9 -111 42 282 128 -118 60 -169 -206 138 35 -7
7448 -7 -164 109 -85 103 143 209 3 59 -85 46 98 118 45 227 -46 -25 169 145 -313 -161 -105 104 -192 29
7472 29 -67 0 -52 -42 74 -156 129 178 136 -47 93 4 27 -36 60 110 -80 14 199 137 -10 -25 -17 -193 143 -125
7498 -125 51 127 97 -111 155 -171 -291 102 -138 -213 342 2 146 -129 -34 140 256 250 21 37 -85 -56 -162
7521 -162 -62 -78 69 22 -11 -4 -147 -74 -57 167 -109 284 100 60 103 -82 -6 76 -258 40 123 -6 -291 136
7545 136 2 -96 -32 259 82 -57 10 -17 25 -118 -67 126 -218 -12 129 -100 239 -171 -200 -46 84 -125
7567 -125 50 132 183 244 224 16 54 -28 -68 80 7 -87 -274 197 -151 102 -215 -247 -62 75 -117 -165 237 74
7591G4J62m32K20k07R0N6l8K12L2L7k90j58K94k2j10J4j58L5J53m3M39n09M8J58
7615E7J15j94N0K21k03O4o2P7O9k62M5K35k37J58j97N0J8K19k84J29k26Q2K10
7638A34k47l9L49k08j51J69M8k28K53Rj24Q1M0k54K43k1o1N4l2l6N5m3q8O7n7
7663h7J53o8J81m5k12j9q4j63K39J18r5L04o6k47K09l04K26j01K51k47j01K08
7685E0l0j16J26kp4O3jj22K18Kmm2M24j57J87n04k91N40l33L68m20K52l08K99
7709A25k72K85m4j7J9k20L33k66J11l1N1j82O3L6l3j01J52P1j27j15J71Q1j45
7732e5r0K80j36N4j01J4j20n2K00o3K14l74M30j94r0J48m4oo8l4J76j18j19L56
7756B08l23L09k02J3j14J08P4j02n3J75J7o0j17K19l01K75o7j60j0Q2j55LL01
$$ plain form
7591 74 236 -196 24 -183 -93 -37 -75 137 169 206 -84 -242 52 30 -80 -66 -224 -189 -36 -79 360 -149 -101 57
7615 57 172 -22 28 249 46 110 48 125 194 -68 -23 212 -25 133 -64 -14 4 223 -61 68 -158 -76 134
7638 134 -113 -152 197 -11 -162 7 55 -173 80 89 -35 46 86 -168 75 54 -7 47 15 -21 34 -9 -97 -30 -87
7663 -87 66 -2 179 134 -78 -97 -181 -344 -105 13 -82 222 156 -91 118 -186 40 -61 190 -57 -158 50
7685 50 20 -96 30 28 -46 17 16 -106 112 114 110 68 492 335 522 18 -273 267 -66 302 -118 134 -174 125
7709 125 -147 138 94 77 96 -124 209 -57 54 23 74 -108 -45 -9 -42 -143 9 80 -47 -162 9 90 -55
7732 -55 -145 135 -1 53 -48 -34 -154 -206 -6 -69 145 -229 201 7 -83 65 21 15 -53 -87 89 -29 -148 208
7756 208 -115 194 -8 5 -109 -1 73 -29 -82 93 110 50 -67 152 -149 126 59 -101 -111 -29 -184 -181 120
7779A20l0k05l7K39m0L2Kj85L06l12N1O0j22J50k6n8J02J7j02p1J03J52l12K36
7803G0p54L73L36J95k16J81j56M6o9rj19K58m9j48J15j80P5j41M31j89j5J22m27
7826b70O17l98P3r8k50O52J1l9o87K41K66j59p13J246k29m76K19r1l46M70k58
7847b19K04k57N18j4k54J084o70m63k72M33Q7Pj40l53J19L30k66K04j07m1Q6j10
7869i4K29n0m6p5r9r4M13k38r4Q5R2O6j63l1J30M9n9o0k3M7k0mr0L05m9r0N8l73
7897b78L21n1k2j2j6%Q3L9j07J61l77J98J71l6j41o6K47j13M2k16K80j27P5k6
7921B9j34K45J16M6m75K48J3p7R4k79J22J91j95J14m5r7k46M87j92Q9q6Q4O8j69
7945d9J11nj16k4M8R9K06l47k5O6Q2j02M4K35k96m7J15j62J94J2j43P6J49l22
$$ plain form
7779 120 90 -115 -152 87 47 79 81 -104 202 -110 -59 1 -121 29 3 -55 47 64 -38 -109 -6 146 -166 70
7803 70 -684 -311 25 220 4 185 29 75 6 -3 -122 136 87 -61 54 -126 -51 -192 239 50 35 157 -270
7826 -270 347 -51 22 -76 -326 326 337 298 -389 -148 118 -41 -754 492 263 -213 6 -85 -431 39 -219
7847 -219 -15 -272 246 232 -22 1062 392 -71 -343 90 177 184 44 -309 -190 140 -126 78 -29 -70 16 -94
7869 -94 135 85 39 -36 -135 -229 184 -54 -148 -63 29 95 -68 -99 31 80 21 -39 -62 -15 -35 -39 -129 176 127 37 95 -278
7897 -278 43 -8 -30 -42 -58 -58 25 64 -43 118 -259 -61 110 74 -67 -133 114 1 43 -173 107 -20 55 29
7921 29 -105 140 256 302 -173 75 88 11 105 -174 -52 139 -56 58 13 -84 -330 157 -35 54 -32 52 120 -49
7945 -49 62 57 -59 -83 -35 64 270 -77 -102 -36 46 -56 -12 223 -73 -120 -5 -167 27 39 -104 -28 121 -201
7969b01K34l3n1k83L03L14k94K68k58J39l29L29j24L17o6l30QJ5P9k30M10j01
7991A16j67J7Q3l0j05O2k81K98K8M2r9p9K56k82N9M7p9J25o8k2j04J00J04J01
8015A22o1R5l56Q7J95j43Q8k13K2M63j79j59q6K08M7O0j22j71j4P9K73k15J24
8038A44j29Q7j97j48K13L7p7k5J24j6L2o7k92K85l6O3Lj08O7K42k62J51j65O5
8062ij01r8K61j08K73k01k7R0k74M65k28m2q0Q9J1k87K74j82L38o5K4j17J39j3
8086A32P9l61P6Q7n7m5J8L33l66J95K9j16k8L7m5j65K3R7K85m46Q3J41J38p7j2
8111C5j21q6RK28L7o0r1n0J67j11J22k65rJ31O5p0J98R9j45j97K9l7J90k1j17
8136g0J26r2J82l52P5L33k6r9R3j68J63k36M36m55o9L20r4N0J9j91J90l42K58
$$ plain form
7969 -201 33 0 -51 -334 -31 283 -11 257 -1 138 -191 138 14 331 265 -65 -57 -42 37 -193 217 116
7991 116 -51 -34 49 19 -86 -24 -305 -7 21 63 -36 -115 141 -141 -82 -35 -114 11 -57 -79 -183 -83 21 122
8015 122 61 156 -200 -113 82 -61 27 -186 -164 299 120 -39 -125 83 130 190 68 -103 -117 -38 235 20 144
8038 144 15 102 -95 -243 -30 7 -70 -95 29 13 45 -22 -314 -29 -65 -2 1 -107 -40 202 -60 91 -74 -9
8062 -9 -110 -208 53 -55 218 17 -10 80 -194 271 43 1 -79 10 21 -266 8 -174 164 99 123 6 145 132
8086 132 211 -150 -74 13 -44 -89 -71 262 -104 91 120 4 -24 13 -32 -197 -174 -77 208 -238 -155 -14 124 47 35
8111 35 -86 -172 -163 65 102 42 -49 -99 68 -43 79 -186 -195 -64 1 -69 129 228 83 -114 -85 -122 68 47 -70
8136 -70 56 -36 146 -206 -131 202 176 77 170 2 165 -71 365 -90 -159 161 67 117 136 -55 135 -207 51
8159E1qj78P2J86k6j64n1j96M23k33J01J9L55k73k14P7K9ol7K24m4m7J05k45K69
8184A89k56K53j0k74rJ85j33
$$ plain form
8159 51 43 -135 -63 123 97 -67 -118 -314 109 -124 -23 -4 351 78 -136 -59 -30 -36 -73 151 107 60 165 -80 189
8184 189 -67 186 176 -98 -107 78 -55
8191e5
$$ Imaginary data points
##PAGE= N=2
##DATA TABLE= (X++(I..I)), XYDATA
0@%%%%%%qJ6j6K4l2M0n6P2q8J12j44J76k08K48k96L52m24N04n92O90p98R24j066
29e70J223j400J598j816K056k320K610k932L288l676M100m563N067n617O220o879
45c611P600q389R247j0185J1215j2349J3602j4991J6537j8262K0203k2407K4932
58A3142k7858L1295l5397M0391m6623N4637o5364Q0511j03575J43110k28040O86822
70E43051l90771p09802J403514j233036N10292M16046j086625R19610j03928o97600
80d29249Q33012n67560J06940L60905o23477M84706j1116m11951M26794k08551
90c9547n7792L07789l78382J62351K69575n05523L93022p9263l14156N91535m27226
101g7617p1484N02071o02953L31129P7834n87231P88069m59986j97577P06056
$$ plain form
0 0 0 0 0 0 0 0 -8 8 -8 16 -16 24 -32 40 -48 64 -80 96 -112 136 -160 192 -232 272 -320 370 -428 496 -570
29 -570 653 -747 851 -965 1091 -1229 1381 -1551 1737 -1939 2161 -2402 2665 -2952 3268 -3611
45 -3611 3989 -4400 4847 -5338 5877 -6472 7130 -7861 8676 -9586 10617 -11790 13142
58 13142 -14716 16579 -18818 21573 -25050 29587 -35777 44734 -58841 84269 -143771 543051
70 543051 152280 -557522 845992 -387044 123248 539294 -547331 372279 268351 -429249
80 -429249 403763 -163797 -56857 304048 -319429 165277 154161 -257790 169004 -39547
90 -39547 -97339 210450 -167932 -5581 263994 -241529 151493 72230 -241926 349609 -77617
101 -77617 -149101 352970 -249983 81146 158980 -428251 359818 -100168 -297745 408311
111D08311q00931M55800J36151p11837Q41129l27701l46666O94287n73245K00481
121b4221K33745o11009O09026j52595l19532M68013k95661N4174J54218l19723
131b03565K59407P5798l19133K84788o6858j26370K63347l20764J10190K70059
141B26899l97462K09724J08931l33234L89779k42962j25006M58798n07234K59943
151D8176J28331m71022N16810k71594j84823N00486m65185J68138K18046m76356
161b88993M70834j73524k40315M62743l57445J23290J56790l40793K86572k3805
171G5354k25654K49629j21237j3595J67997k62854J58935O4487k47349J94640
181D0353j4924j36502K02794j52305l5570K39492l06033J48481R8568k45877L07807
$$ plain form
111 408311 -392620 63180 199331 -512506 328623 922 -345744 348543 -224702 -24221
121 -24221 209524 -401485 207541 54946 -264586 203427 -92234 -38060 116158 -203565
131 -203565 55842 131640 -187493 97295 30437 -95933 167414 -153350 -43160 226899
141 226899 -170563 39161 148092 -185142 204637 -38325 -163331 295467 -211767 48176
151 48176 176507 -294515 222295 -49299 -234122 266364 -198821 -30683 187363 -288993
161 -288993 181841 8317 -231998 230745 -126700 -3410 153380 -187413 99159 75354
171 75354 -150300 99329 -21908 -35503 132494 -130360 28575 93062 -154287 40353
181 40353 25429 -111073 91721 -60584 -96154 143338 -162695 -14214 84354 -161523 146284
192A46284j91715n9380K96883l25352J24345J42714k94461L05182j30715j36119
202a22334L30504l45928J41513J30139k99910K93778r8517j48039K62842k03945
212e9897O171J68147k36066J77459Q387j80918K14815j20046m3564J56240j45343
223e4615L4345J21531j76143J01951K2878j47098J90179j34695L278J58508k12320
234i2201J15014N0210j87624J93871p7716r0721K32521k27972Q7665R0791k32185
245a38347K29696r4961q7751K13431j79655L0569J21913k01789J43874p648j28239
256i8907K05479j53666J4032J22620j78306R6522L8754j27913J25482j9413r1032
267f6348J40987j15810J2696Q8807j35528J13940j0149r1621J24808p0810m7696
$$ plain form
192 146284 -45431 -104811 192072 -133280 -8935 133779 -160682 144500 13785 -122334
202 -122334 208170 -137758 3755 133894 -166016 127762 29245 -118794 144048 -59897
212 -59897 -53726 114421 -121645 55814 64201 -116717 98098 -21948 -65512 90728 -54615
223 -54615 -20270 101261 -74882 27069 49947 -97151 93028 -41667 -38389 120119 -92201
234 -92201 22813 73023 -114601 79270 1554 -89167 143354 -84618 3047 93838 -138347
245 -138347 91349 -3612 -91363 122068 -57587 -27018 94895 -106894 36980 29332 -98907
256 -98907 106572 -47094 -33062 89558 -88748 7774 46528 -81385 44097 24684 -66348
267 -66348 74639 -41171 -28475 60332 -75196 38744 28595 -63026 61782 -9028 -56724
278e6724J27658j27698O0383O0996j50957J61783q3886n4262J46299j46283N5926
289f765Q3110j50811J11088n96j15553J50947j12234K2946R4625j52513J22146
300D6390j9431r4570J22742o6986k9752J15962j12057L9531N5297j21821J11832
311D7137n0012l7981J07533q9952J2886O7213r9838M6377L1814r6212J13434n9519
323g120k3193R5756j24125O4276K7345j04258J06643j5018q4921J23540q6395
334b7470q760R0573j25617R8409r345o7275J05902p5887j0610P9438q9095L8891
346h46M7816r6584R6777m1530m0898Q6188q7123L7946M2933p8885N0839K1507
358C8140q7172P9574k4654m4697R0094q0759L8335K6940p8659O5406j2155m8757
$$ plain form
278 -56724 70934 -56764 3619 64615 -86342 75441 -8445 -62707 83592 -62691 -6765
289 -6765 76345 -74466 36622 36026 -79527 71420 -40814 -17868 76757 -75756 46390
300 46390 26959 -67611 55131 -11855 -41607 74355 -37702 1829 57126 -64695 47137
311 47137 -2875 -40856 66677 -23275 -10389 56824 -43014 3363 35177 -61035 52399 -7120
323 -7120 -30313 65443 -58682 5594 32939 -71319 35324 20306 -64615 58925 -27470
334 -27470 -36230 54343 -71274 27135 17790 -49485 56417 -19470 -30080 49358 -39737 -846
346 -846 46970 -49614 47163 5633 -35265 50923 -36200 1746 44679 -34206 16633 38140
358 38140 -49032 30542 5888 -38809 51285 -29474 8861 35801 -42858 22548 10393 -38364
370c8364Q4098n3439j2805Q1346j02600N9454l565n6539R4403p2236J1751N2665
382D4169q0082M0670J8352p5275Q2106l0523l2982P1974p5415L8636M37n0535
394d8468O4829j7850l7322N3667k2923k1940M7031o2720M4857J3941n2022N7348
406A8428k9596p564L5778n2646K2876N1324q3839N5834P695n0394O5339p2802
418c9567L9009L3483o8716N5082r067l4518N4583m6620l900N9135o5473M5267
430A8698p877k8461N1209n3220J3835K9840l0816P401K3096m0196K6758N302m6109
443c0540M6401j3366j159J3207l2102K2396K1873o0791L5299K1449m5132N5055
455C2590n5754K3647L1127p2525N4232j1647j0615L7458n7544K3513M5468q3786
$$ plain form
370 -38364 45734 -7705 -20510 60836 -41764 17690 14125 -42414 51989 -20247 -8496 44169
382 44169 -35913 4757 23109 -52166 29940 -583 -33565 38409 -37006 1630 2067 -48468
394 -48468 16361 -1489 -38811 14856 -8067 -30007 17024 -45696 -839 13102 -38920 18428
406 18428 -11168 -18732 17046 -35600 -12724 38600 -45239 10595 18290 -32104 33235 -39567
418 -39567 -558 32925 -35791 19291 10224 -24294 30289 -16331 -20231 38904 -26569 18698
430 18698 10821 -17640 33569 -19651 -5816 24024 -6792 609 23705 -16491 10267 15569 -30540
443 -30540 15861 2495 1336 14543 -17559 4837 26710 -34081 1218 22667 -22465 32590
455 32590 -23164 483 31610 -40915 13317 1670 -8945 28513 -29031 -5518 39950 -43836
467d3836M2438R033k5198M8492o7190L9385J9734n1919L0189L805j1337K2182
479A5778r444j8847L9867k7243n570K0252j0303J2658l377j8908K1482L855m2322
492b2122M9915l2194L386M3355p0555M5583p175k3267L9344m6064K4464L7914
504D2584p0565L9651R352m2158N3856n7569L5030K4971o0997M1986k0149K348
516a660J5415l7564J7036L3730l9979n46J6519r465P941j9991J4199J3714p133
529B216k1613K7877q476j8286L3965m4171M1711j317m1525M2782k7592L095J9145
542G811m2814M0206L852m8268O1266m7592O606M0816o1710N5916j8925q102L4077
555B3139m5115K4333J7903l7010K3035Q933j8189J8490k7563J2970O686j4902
$$ plain form
467 -43836 -1398 7635 -17563 30929 -36261 3124 22858 -29061 1128 4933 -6404 15778
479 15778 6334 -12513 27354 111 -5459 14793 4490 17148 13771 -5137 16345 20200 -22122
492 -22122 27793 -4401 -1015 42340 -28215 17368 10193 -13074 26270 -19794 4670 42584
504 42584 -27981 11670 21022 -21136 32720 -24849 10181 35152 -25845 16141 -4008 -1660
516 -1660 13755 -23809 -6773 26957 -13022 -13568 2951 -6514 1427 -18564 -4365 9349 2216
529 2216 -19397 8480 4 -18282 15683 -28488 13223 11906 -29619 13163 -14429 -11334 7811
542 7811 -35003 5203 9055 -39213 22053 -25539 -18933 21883 -39827 16089 -2836 -10938 23139
555 23139 -21976 2357 20260 -16750 6285 15218 -2971 15519 -12044 926 7612 -7290
567g290L047q87J2500j7115J0102k1795K2065N560l6576M2917j1645q208J4683
580G358k1720K2702M553l7144N1539k2169j3673M2605o1900M6129p177l1085M5036
593B5054l5837J6695O060l3203L0107p587k1599L7968k6141P199J1963k4673K5188
606A1194k0313J1872L597o948N685J231J410j9028K2951j1475m252J6452j6050
619c674N469P906k2114J7023m025j4579L7731m3619K7221O412l9476M5185l0553
632a1093Q045J5807k6780K6198r407k0005L3028k7276R86K7628l5632K8273j4523
645d751k948J3955k2202J8987o485K704K285K45n981M183L817r070O723M823k564
660C721k631M551j0939J7119k0167Q936J5302l1418L5681k6200j283K3026k9283
$$ plain form
567 -7290 -4243 -5130 7370 -9745 357 -21438 627 6187 -30389 12528 883 -7325 7358
580 7358 -14362 8340 12893 -24251 27288 5119 -8554 34051 -27849 18280 11103 -19982 25054
593 25054 -10783 5912 11972 -21231 8876 1289 -20310 17658 -8483 -1284 10679 -13994 11194
606 11194 -9119 2753 6350 -598 5087 6318 7728 -11300 11651 176 -4076 12376 -3674
619 -3674 1795 9701 -12413 4610 585 -13994 23737 -19882 7339 13751 -25725 19460 -11093
632 -11093 -3048 12759 -14021 12177 2770 -17235 15793 -11483 -10497 17131 -18501 9772 -4751
645 -4751 -7699 6256 -15946 3041 -3444 -740 1545 1790 -4191 -8 3809 -5261 1462 6285 3721
660 3721 1090 5641 -5298 11821 -8346 590 15892 -15526 20155 -6045 -7328 15698 -13585
673a3585J7426N28r852K0579k1765j506K8849l8839K4688o53j4578K8384l1327
686a1651J5941l74r661J1315r308L633R927j2079m992J4005j1055L705n171Q804
700C039Ln779J612m391J1054j7983J7925j0030m14J7863k7260J4154J741r754
714h220R690n580m01J7231k6916J4296N648k3402L2872k6457R871J3102j9857
727h123J3108r591M060Q364j3130K614J8085j8821N100n59k520J0081j4257J1151
741E562m161N767p258k436L902j366O392j6585J7570j244j1588M912P47j615L980
756B579p374O150R793k3400K2915j5492L37J7986k4204J7801k829l931L713p802
770c758L226Q778j5351R360M577j4982J6886j7495O827J785l588M853p993R082
$$ plain form
673 -13585 3841 4369 -5483 15096 -6669 -8175 20674 -18165 6523 5870 -8708 19676 -11651
686 -11651 4290 3916 -5745 5570 -3738 -105 9822 -2257 -7249 6756 -4299 -594 -5765 3039
700 3039 3042 -2737 -1125 -5516 5538 -12445 5480 -4550 -4964 12899 -14361 -207 1534 -8220
714 -8220 1470 -4110 -4511 12720 -14196 100 5748 -17654 15218 -11239 -1368 11734 -8123
727 -8123 4985 -4606 -546 7818 -5312 -2698 15387 -3434 1666 1107 -1413 8668 -5589 5562
741 5562 1401 7168 -90 -2526 1376 10 6402 -10183 7387 6143 -5445 -533 214 -1401 2579
756 2579 -4795 1355 11148 -12252 10663 -4829 -4492 13494 -10710 7091 4262 331 4044 -3758
770 -3758 -532 8246 -7105 2255 6832 -8150 8736 -8759 -1932 -147 -3735 1118 -6875 2207
784B207m133j742o186J2016m096n367R464l142K92k272J637l072J0766j2411R419
799C380n78o541J4598k3542J6527J493j0551Q367k693J43J750p958L513O100j5966
814a1958J9769j2379n93R651j4898J1128o895O020j123p95L050J110m947Q46P869
829E855q404Q038k326K218m017N050l856l379Q813j0295J1609j2090O512j79j2436
844h887J2328n837j250L480o35l115M724j0411J2300n788m089J7320j8539J4105
858E706m180m091O661m541M084j700J807M46k69q444J0170o989Q7K498k269M860
874C836j0576R944r815M800J39j617N656q201J0124q158r5O111k034l838Q667
889D943m558J436K659j0990J5809j4797J0437L67r901J4823j0116J03M42K930
$$ plain form
784 2207 -1926 -3668 -9854 2162 -1934 -7301 2163 -979 -687 -2959 -1322 -4394 6372 -6039 3380
799 3380 2802 -3739 10859 -12683 3844 5337 -5214 3153 460 603 2353 -5605 -2092 4008 -11958
814 -11958 7811 -4568 -5161 4490 -10408 720 -6175 -155 -1278 -2073 977 2087 -2860 -2014 5855
829 5855 -2549 5489 3163 5381 1364 6414 2558 -821 7992 -2303 9306 -2784 3728 3549 -8887
844 -8887 3441 -2396 -3646 -166 -801 -3916 808 -9603 2697 -3091 -7180 10140 -8399 5706
858 5706 1526 -2565 4096 -445 3639 1939 3746 4192 3923 -4521 5649 -1340 -1253 1245 -1024 3836
874 3836 -6740 3204 -6611 -1811 -1672 -3289 2367 -5834 4290 -3868 -3963 2148 114 -3724 4943
889 4943 385 1821 4480 -6510 9299 -5498 4939 5306 -4595 10228 112 215 657 3587
903C587j111p95j959Q092o911m213Q034p506P941j0102Q063k265k301M086j1972
918i332J2110m985R95j916K754L099o297j270P149k756l733J1374j1853J0956
932F295p476q22P398j2178J4174j0094J446M360m777j008r44J65K388k802j876
947e751P916j1641J0860p879m15R150p368Q279r695J1154l026n685O078k49K384
962D112l581J606K649j510o909R924r445O980q58r414J5698j5034P876n509k10
977c625J0505j2717M659N309n240n18K222m479J0383j0287O423J178q640J3145
991H318j3628P761k457J396J578n977P478o318P33N76J19r13K904m730N255m836
1007b741Q38M152j2914J8433j0683N28L931o843J1042j2086M407N234n143K199
$$ plain form
903 3587 2476 1681 -278 7814 903 -3310 4724 -2782 5159 -4943 3120 855 -1446 2640 -9332
918 -9332 2778 -2207 -1212 -3128 -374 2725 -3572 -4842 2307 -449 -4182 7192 -4661 6295
932 6295 -1181 -2003 5395 -6783 7391 -2703 -1257 3103 -1674 -2682 -3626 -3461 -1073 -3875 -5751
947 -5751 2165 -9476 1384 -6495 -6910 2240 -5128 3151 -6544 4610 1584 -4101 1977 1728 4112
962 4112 531 2137 4786 3276 -3633 6291 -3154 3826 2968 -6446 9252 -5782 2094 -3415 -3625
977 -3625 6880 -5837 -1178 4131 -1109 -1627 595 -3884 6499 -3788 2635 3813 -4827 8318
991 8318 -5310 2451 -6 1390 2968 -3009 4469 -1849 -1116 -540 -421 -1334 1570 -3160 2095 -2741
1007 -2741 -1903 2249 -10665 7768 -2915 -2387 1544 -5299 5743 -6343 -1936 3298 -1845 354
1021C54K683p880Q583m706j559P222r991J4153j2685N143M007j0302R350n587
1035a215N518l731K23K953l013k364M701l268O33L357n495Q186j1893J0647n543
1050c04l975J2362j3472J0356m696q55L083n732M920J104o847P852j220p526J0833
1065E883j2073R483m544k357J0540j4211J1402n642k007L652k191J438q52K16
1079a263J712k614k216P315r480Q238m209J373L542r611J2585j2159P088J529
1093A830o549P156l391J023n64k548L996J112p476J2047r372K700L978j0179J2700
1108F463j1211Q134j217n633R230o541m03K198L85q30J387l529P286q257L299
1123G61J549o263J0907j0426O629l629R08L133r542R464k530k048J537N49r41
$$ plain form
1021 354 3037 -4843 3740 -966 -2525 4697 -5294 8859 -3826 1317 5324 -4978 4372 -1215
1035 -1215 4303 572 795 3748 735 -1629 3072 -196 437 3794 -1701 6485 -5408 5239 -304
1050 -304 -4279 8083 -5389 4967 271 -584 2499 -3233 1687 2791 -4056 3796 2576 -4950 5883
1065 5883 -6190 3293 -1251 -3608 6932 -7279 4123 -1519 -3526 126 -2065 -627 -1479 -1263
1079 -1263 449 -2165 -4381 2934 -6546 1692 -2517 -1144 2398 -7213 5372 -6787 301 1830
1093 1830 -4719 2437 -954 69 -495 -3043 953 2065 -5411 6636 -2736 -36 3942 -6237 6463
1108 6463 -4748 3386 2169 -3464 5766 -775 -1178 1020 1405 575 1962 -1567 5719 -2538 761
1123 761 2310 -3953 6954 -3472 3157 -472 436 3569 -5973 3491 961 -1087 450 999 58
1138E8J145n537P086k831k876Q725j2914J2439o942j605N885p299R416p704P98
1153b156M860m191k052N389m933L746j032k300O386r716J0125p410J103N199n655
1168b637N180n849N963l080k044L494J27j530K485k300J90L191p064Q371q544
1183d047Q018l90r146J1617q042L499k669P46M107l669j085M062l232j110L816
1198B475o514Q645o452L757j367k472P211j0738P659j923L34J62j757K464k086
1213f02r75K119p4l815P415p515M472k055j347M692q570J0333n990O47K353l506
1229b418K433j805R60P88j87j068L832p544P715l296k795O571o517P655p746L808
1245C86J497m714L825o76O11r94J547k139K480l750M425l331P00M228p223P198
$$ plain form
1138 58 1203 -4334 2752 -79 -2955 5770 -7144 5295 -1647 -3252 2633 -4666 4750 -2954 -2156
1153 -2156 2704 -1487 -3539 1850 -3083 663 -369 -2669 3717 -5999 4126 -3284 -2181 3018 -2637
1168 -2637 2543 -3306 2657 -423 -2467 1027 1154 -376 2109 -191 -1 3190 -3874 4497 -4047
1183 -4047 3971 3581 -5565 6052 -1990 1509 -1160 -414 3693 24 -1061 3001 -231 -1341 2475
1198 2475 -4039 4606 -1846 1911 544 -1928 5283 -5455 2204 281 615 777 -980 1484 -602
1213 -602 -1577 542 468 -3347 4068 -3447 1025 -1030 -2377 2315 -6255 4078 -1912 -1265 1088 -2418
1229 -2418 15 -1790 -830 -42 -229 -1297 2535 -5009 2706 -590 -3385 3186 -3331 4324 -3422 386
1245 386 1883 -2831 994 318 929 -65 1482 -657 1823 -1927 2498 -833 -133 4095 -3128 4070
1261D070o454M558k530p94N486o299L387Q8r89j370K702k667L696l829K654J465
1277C174o897Q624p784M421l36j703L045m490M628l406l34Q96J867l531L081j711
1293d56J02Q41l465N996p184O605k862j877M064m274L741m868M091J2j959K25
1309a268K490l027N41N24k094N808o961O361m529J057L481o768N920k484J905
1324I56j732L2J350m49k638K719O48l220N263n895N163l987J588P69l689P148
1340D026n692K141p64J368n35j621J940J022j006j103K965m849N760n711K102
1355D3J671l028M826q113P003j881k860J728k3J582j781n82J065J554m696N345
1371A853m632L639O05m992N768m884N103n091J630K888k854R65p49J180j498O30
$$ plain form
1261 4070 -2384 2174 -356 -1150 4336 -1963 1424 1512 523 -847 1855 -812 2884 -945 1709 3174
1277 3174 -3723 4901 -2883 1538 1202 -501 2544 -1946 2682 -724 -1058 -162 1705 -1826 1255 -456
1293 -456 -354 487 -2978 3018 -4166 2439 -423 -2300 1764 -2510 1231 -3637 454 466 -1493 -1268
1309 -1268 1222 -1805 -1264 -740 -2834 2974 -3987 2374 -2155 -1098 2383 -4385 1535 -949 956
1324 956 -776 -744 606 157 -2481 238 886 -2334 2929 -2966 2197 -1790 -202 567 -3122 4026
1340 4026 -1666 475 -289 1079 544 -1077 863 1885 879 -224 2741 -2108 3652 -2059 43
1355 43 1714 -1314 3512 -4601 2402 521 -2339 -611 -634 948 -833 -1415 -350 1204 -3492 1853
1371 1853 -2779 860 1465 -3527 2241 -2643 2460 -2631 -1001 1887 -967 -2 -751 429 -1069 -439
1387d39j623L452l297L715k204k071N319n639M880m145L864M54m524M871k371
1402B42N28k45N19j34K425m052L013k170N68L165p576Q565l890K98n79p38L923
1419C862m973K151J46O50j262J053k449K721j881m51K290l584O104p817M301l66
1435D95k141K590l859N290l554j60J297j200q63K548k742J183J580l091M151o691
1451e167O588k574k431N051m387L917l385J332M44q43N03P52j493J794L73l648
1467c174M943m184M334l684J642L482o417N682l821K461p57r11K360j475J06J172
1483A759k032KL669n782N310l196J501O48m603O986o502L330J3j565J849j583
1499a96P52k22o90N38J460m166N654m419P61J369k606M358o111N405k445j119
$$ plain form
1387 -439 -2062 1390 -1907 1808 -396 -2467 2852 -2787 2093 -2052 1812 2266 -2258 2613 242
1402 242 770 525 1044 910 3335 -717 2296 126 694 3859 -3717 4848 958 1256 677 -61 3862
1419 3862 -1111 1040 1186 1836 574 1627 -822 1899 18 -433 1857 -1727 4377 -3440 861 495
1435 495 -1646 944 -2915 2375 -1179 -1339 -42 -1242 -2105 443 -2299 -1116 464 -2627 1524 -5167
1451 -5167 1421 -1153 -3584 1467 -2920 997 -2388 -1056 -612 -1455 -952 -200 -1693 101 474 -3174
1467 -3174 1769 -2415 1919 -1765 -123 3359 -3058 2624 -1197 1264 507 -404 1956 481 587 1759
1483 1759 -273 -271 3398 -2384 2926 -270 1231 1879 -2724 4262 -2240 1090 1103 -462 1387 -196
1499 -196 556 334 -356 182 1642 -2524 3130 -1289 -528 841 -1765 2593 -3518 1887 -558 -1677
1515a677K634k399J076q70R11J6k24r69L089m988L821m64k790N043n345N247m228
1532b117J307K514m676M204j337j49K71rj094K289l134L688j903j206M819o331
1548b864N278l176J118O66k678M587m021J591L78r07k98J536j672J759j409M48
1564C36J939n115O326n201K237P82k091L433m911L867j017j349J512J54j609K301
1580A594k041j11J601l183M685n624M270k88l257L961l533L169k708R26J337j732
1596i34L75J017j527O07R70k365L662l909M035k879p94M403n823M666k346J152
1612C10k00j331J875j154n50J633l81j858M153m332L074k699J270K478n393O150
1628C045l880J559j5j474J882j456Q91K28m05J0J897m332M531k474M57J252k703
$$ plain form
1515 -1677 957 -1442 -366 -1236 -325 -309 -533 -1502 1587 -3401 420 -44 -2834 2209 -3136 2111 -2117
1532 -2117 -810 1704 -2972 1232 -105 -254 17 8 -1086 1203 -1931 1757 -146 -1352 3467 -2864
1548 -2864 2414 -762 356 1022 -1656 2931 -1090 501 879 -28 -326 1210 -462 1297 -112 336
1564 336 2275 -2840 3486 -1715 522 1304 -787 2646 -2265 1602 585 -764 748 902 -707 1594
1580 1594 -447 -558 1043 -2140 2545 -3079 1191 903 -2354 1607 -1926 1243 -1465 -539 798 -934
1596 -934 -559 458 -1069 -462 508 -1857 1805 -2104 1931 -948 -1742 2661 -3162 1504 -842 310
1612 310 110 -1221 654 -500 -1050 583 202 -1656 2497 -1835 1239 -1460 -190 2288 -3105 3045
1628 3045 -835 724 709 -765 1117 -339 552 780 375 385 2282 -2050 2481 7 464 1716 -987
1645i87M749n925L457k83j843K175j569J059q72K41k19J02j869L791l468J692
1661B31R01l464M187m451M120k670j53K856l092J664p41N60r93J022q28J616k827
1678b062K346k27k607M201m477L882k458P78J320l189L471k096M30N62M85r42
1694e83J155j422J584q93o99L344m972M993k674L96R34j906K971l406K395l81
1710H36l31m72J411j711R39k41l18J884l748M646m329J691J060l050L132k655
1726a256K804k054l62J231j96j271J096k63m98J663l039L466l760K620o04j988
1742b411M100l481K048j943J670m8j175O22P17j159J86J103k388L582l381K348
1758C90j014n20K845m442L932j674O82k92l22J379o08j39K65O04j642K980l164
$$ plain form
1645 -987 3762 -2163 1294 1011 -832 1343 -226 833 -39 202 -17 85 -1784 2007 -1461 231
1661 231 1132 -2332 1855 -2596 1524 -1146 -1299 1557 -1535 129 -612 -52 -1045 -23 -851 765 -2062
1678 -2062 284 57 -2550 1651 -2826 1056 -1402 -624 696 -2493 978 -1118 -688 -126 359 -583
1694 -583 572 -850 734 -159 -858 2486 -2486 2507 -167 229 1163 -743 2228 -1178 1217 836
1710 836 505 33 1444 -267 672 431 113 1997 -1751 2895 -1434 257 1317 -1733 1399 -1256
1726 -1256 1548 -506 -868 363 167 -1104 -8 -271 -769 894 -2145 1321 -2439 181 -423 -2411
1742 -2411 1689 -1792 256 -1687 -17 -65 -1240 -618 99 -1060 -874 229 -2159 1423 -1958 390
1758 390 -624 -1144 1701 -2741 1191 -483 199 -93 -415 964 356 217 482 1086 -556 2424 -740
1775g40K631q86p64J680l328M462l687J306N04p93N13r62R30p09P22j283J575
1792A171k060K611k054m90K104k595L249l811L282q95j742J751j440J377q90M37
1808En37J127j822J820k255J382J412l660L929l054K443k024N03J929k924J732
1824Fl07N50r92J013j408J428o35N01j30j701L882m128K623j206N97R45k274L146
1842A910k106Q34k52Ko12J551j083o5O44q40J898m163M154k078N6P34j613K671
1860A642l085J631n00R6N2M07q52R31L80j988K322k322L512l522J493J367k912
1877a348K434k606K218j239N74n6n78K5M38n96l58K104k541K340k281J927l85
1894G2j833L659l258K717j684P64k02n27O05n02J18q8Q79k396K868k399J244o33
$$ plain form
1775 -740 1891 1005 241 1921 -1407 3055 -632 674 1178 385 898 -64 866 157 879 -404 1171
1792 1171 -889 1722 -332 -822 1282 -1313 1936 -1875 1407 512 -1230 521 -919 458 -432 5
1808 5 -532 595 -1227 593 -1662 -280 1132 -2528 1401 -1653 790 -1234 -731 1198 -1726 6
1824 6 -301 249 -743 270 -1138 290 -345 156 26 -1675 2207 -1921 702 -504 93 1038 -1236 1910
1842 1910 -196 638 386 388 -224 1327 244 179 823 -17 1881 -2282 1872 -206 -150 584 -1029 1642
1860 1642 -1443 188 -312 -216 -164 243 -609 322 702 -1286 1036 -1286 2226 -1296 197 1564 -1348
1877 -1348 1086 -1520 698 -541 33 -23 -601 -576 -138 -734 -1092 1012 -1529 811 -1470 457 72
1894 72 -1761 1898 -1360 1357 -327 437 235 -292 313 -189 -71 -159 720 -1676 1192 -1207 37 -596
1912e96m79K502l429L367k151O71M08p58N53j81R82j240J012j161K038k699J659
1929D98k10r93K146l069L363l251J647j14j015J536q14O68o14N71o42J309j802
1946g86K361j152m11J768k864K974k998K250r58o35J961k011Q18l92M84j115J224
1963E18j121J372j267O56Q08k653L420l220K207q33l39J391k335K128j353L17
1979c04m77J165j346J201q88L80N17j893L125l301K612r95k38J007j767K443k270
1996a029J369l29l3l50P92q91L86M89r99J794k839L425k400L13J202k224K435
2013A111j942K000j469K60N73k64m64P30l2j181K351k493K041k383J372O62k216
2030a344K843k318J689j359L48K84m03M37j01l16l09J443k678K487j602Q65M3
$$ plain form
1912 -596 -1075 1427 -2002 1365 -786 -115 293 -465 88 -93 889 -351 661 -500 1538 -1161 498
1929 498 288 -705 1441 -1628 1735 -1516 131 17 -998 538 -276 392 -222 349 -293 1016 -786
1946 -786 1575 423 12 1780 -1084 1890 -1108 1142 184 -451 1510 -501 317 -75 409 -706 518
1963 518 -603 769 -498 158 966 -1687 1733 -1487 720 -113 -452 939 -1396 732 -621 -304
1979 -304 -781 384 -962 239 -649 -269 248 -1645 1480 -1821 791 -204 -442 565 -1202 1241 -1029
1996 -1029 340 11 -22 -372 420 -471 -85 404 -595 1199 -1640 1785 -615 -302 900 -1324 1111
2013 1111 -831 1169 -300 -40 533 269 -195 535 503 -678 1673 -820 1221 -1162 210 872 -1344
2030 -1344 1499 -819 870 -489 -141 143 -260 177 76 -240 -549 894 -1784 703 -899 -34 9
2047Ij450K987l677K650j235O43N08r67Q23o40N92r3M36j495K684k447J106L7
2065D71r29J825l066L414k341N93O67j228J156j001P48q27O96m46J301k154K247
2082A126q61r90K089k575L065k543J795l92j314J815j557P26o34R99j088O70j030
2099f99J479j447R9J516k868K979k452J761r03m27J642k069J557r28P06k72L91
2116F5q77J126n94J01Q20j951K879l035J887j93n99J188j824J966j578O56P6Q4
2134A97o93Q77m12k44N65j291K316k746K488j535l06J395j770K443k262J639m29
2151B32m00K78L55q53N47M02j167K013k417K619j958M57J159k499K298k018J653
2168G01q84J15N99q89L99%j41q37K021k416J950j561J098N5j420K844k771J881
$$ plain form
2047 9 -1441 1546 -2131 519 -716 -73 435 -532 291 -349 243 150 586 -909 1775 -672 434 471
2065 471 -458 1367 -1699 1715 -626 -33 634 -594 562 -439 309 -518 178 -268 1033 -1121 1126
2082 1126 265 -725 1364 -1211 1854 -689 1106 714 -600 1215 -342 384 -250 749 -339 331 -699
2099 -699 780 -667 -568 948 -1920 1059 -1393 368 -535 -962 680 -1389 168 -760 -54 -326 65
2116 65 -812 314 -280 -179 641 -1310 1569 -1466 421 228 -371 817 -1007 959 -619 37 113 197
2134 197 -496 381 -31 -275 290 -1001 1315 -1431 1057 -478 -784 611 -1159 1284 -978 661 232
2151 232 -168 110 465 -388 159 561 -606 1407 -1010 1609 -349 108 1267 -1232 1066 -952 701
2168 701 -183 -68 531 -358 41 41 -100 -937 1084 -1332 618 -943 155 210 -1210 1634 -1137 744
2186G44q53J94L48o37O20n94N02m79R32j790K033j788P42L38j316K265k910K350
2204G01j288J88K82p40R40q47O54j75M03j039J446j544J195K40j096J945j960
2221f95K401k385J125K60o91P28r33Q24q17L52j74M84j307J153N34j447J842k842
2239a588L040k596J870l77p36J751j893J105m43N89j116J568q18N50q96J8J013
2256A041k192K485k001J028l03o92J342j862J846j163M76l44N84r22P38k13k02
2273c54N47j380K380k618J576m17o22J161j486J628j525J078m20J32j07M98n56
2290d85l55J209j175J743k129J852m34p92J623j813J944j598R08o63M11R3j8k43
2308G8J94N56j511J709j593J420j375N87R50k015K311j825J146p67L49K49p57
$$ plain form
2186 744 -109 85 433 -204 416 -178 324 -155 777 -1013 1020 -768 -26 312 -1004 1261 -1649 701
2204 701 -587 -399 -117 -857 83 -764 -110 -285 118 -921 525 -1019 176 416 -680 1265 -695
2221 -695 1706 -679 446 706 15 743 -190 634 -183 169 -5 479 -828 325 859 -588 1254 -1588
2239 -1588 1452 -1144 726 349 -387 1364 -529 576 133 722 -394 1174 356 906 10 28 1041
2256 1041 -1151 1334 -667 361 58 -634 708 -1154 692 -471 5 -339 245 -677 61 -152 -354
2273 -354 193 -1187 1193 -1425 151 -266 -888 273 -1213 415 -1110 -32 -452 -320 -427 71 -485
2290 -485 -840 369 -806 937 -1192 660 226 -566 1057 -756 1188 -410 498 -165 246 339 321 78
2308 78 272 828 -683 1026 -567 853 -522 65 1015 -1000 1311 -514 632 -135 214 463 -294
2325b94M96jK34j118J461j613J326q85K66M13j570K069k096J572o40L0L06n33
2343e77M35n48M63m54J012j524J607j267L17O30j077J625j787J805j227R6R10
2360D39q39R04p57P32o51M70m04J285j374O66K63j343J711j476J546j393O81M41
2378I01j219J446j333P23m93O38q96P95p61N62j11o96J726k143J972j482O63k09
2396H3n67J237j460R83o74P68q59O29o13M85j71l25R95k109K504k034Q14l41l50
2415a005J198j492J413j089L60l7K85n26O78Kn79Q36j212J987j920J249J37q10
2433e25J644j605J263j032P40l92O0K64K37m09j37R47j554J306j259J381o13o22
2451c06J263j721J871j003P27p56K27M28l68O6P5J36o67J438j580R45m15p2Q14
$$ plain form
2325 -294 202 201 435 -683 778 -835 491 -394 -128 285 -1285 784 -1312 260 -380 -350 -44 -577
2343 -577 -142 -690 -227 -681 331 -1193 414 -853 -536 94 -983 642 -1145 660 -567 -471 439
2360 439 -400 504 -253 479 -172 298 -106 1179 -195 471 734 -609 1102 -374 1172 -221 460 901
2378 901 -318 1128 -205 518 25 663 -233 562 -199 363 252 -444 1282 -861 1111 -371 292 83
2396 83 -484 753 -707 276 -398 370 -489 140 -473 12 -159 -484 511 -1598 906 -1128 -314 -655 -1005
2415 -1005 193 -1299 114 -975 -615 -652 -367 -893 -215 -213 -792 44 -1168 819 -1101 148 285 -525
2433 -525 1119 -486 777 -255 485 93 153 417 654 245 108 1055 -499 807 -452 929 316 -306
2451 -306 957 -764 1107 104 831 75 302 730 362 428 503 639 -28 1410 -170 775 360 288 1102
2470A102j590J676j750J031m20nJ49o94P35k47j46m00J003j928J834q06N0L98
2488hj057J681j713J041j65l01M85m42Q61q05N09m74N38q44J120j160K81Q73j559
2507a139J980j963J723j230L03N10j043J019p44P35n51M44m95O07o80P40N47j360
2525e97J623j749J308l75N0M16j028J566j251O67n93N71o31N53m66K02K9n83J297
2544A009j704J793j440K98L65q96J227j446J406q47R5r1P57q77K72K17q18J261
2562E81j576J739j390O23n7o15J168j358J257r54Q71q5m94mM59l23l30R10j421
2581i99J615j672J478k59q10J411j576J491j015O53k51k83L91j25J80j90Q48j209
2599c22J400j208R34m06m31J207j402J504j295N55k26l24M24o21O34l44K08o16
$$ plain form
2470 1102 -488 1188 -562 469 49 44 193 -501 234 -13 -159 -559 444 -1484 350 -456 -406 -8
2488 -8 -1065 616 -1097 -56 -221 -522 -37 -479 382 -423 86 -388 150 -694 426 -734 -453 420 -1139
2507 -1139 841 -1122 601 -629 -326 184 -859 160 -584 151 -400 44 -451 156 -524 216 763 -597
2525 -597 1026 -723 585 210 260 676 -352 1214 -37 630 37 608 -23 530 64 266 295 -288 1009
2544 1009 -695 1098 -342 -44 321 -575 652 -794 612 -235 -140 -231 526 -351 -79 138 -680 581
2562 581 -995 744 -646 -23 -80 -695 473 -885 372 -582 289 204 -290 -294 165 -158 -488 422 -999
2581 -999 616 -1056 422 163 -647 764 -812 679 -336 317 66 -217 174 49 229 39 887 -322
2599 -322 1078 -130 804 398 -33 1174 -228 1276 -19 536 310 -14 410 -211 423 79 287 -329
2617c29J118j272O51j43k58P10j717J999j663J173k97l23P49j009P11o62Q27q51
2635e86O51o83J95j08O4R17j340J480j567J293l80k44M77o64O05p11P02p18P82
2654A65p25Q34n86K52P38j367J512j241J343r93J31P11j193J131o55J95l83N79
2672D48m71L35m21K79J68p84J313j353J364r72K04M15r42J107j042R25k47k76
2690E0J1P5q7j49K0m83J030j458J563j196L32K28o25J122j301J126q65M44N5J93
2710H5k30J72j04l90Q71j238J207j139N50K87p64J205j394R38p77O92k66l2J22
2729b05J30O6k85J093j128J064r21Q72j74p10J138j456J411p83J04n9l86P14q43
2748c58L66j42M85r26J076q08M63r7k57J004j503J764j187M68J50n48M79p03N37
$$ plain form
2617 -329 789 -483 168 25 -233 477 -1240 759 -904 269 -28 -351 398 -611 100 -562 265 -586
2635 -586 65 -618 -423 -531 -467 450 -890 590 -977 316 -64 -308 169 -495 110 -601 101 -617 165
2654 165 -560 274 -312 -60 678 -689 823 -418 925 -68 63 774 -419 712 57 252 -131 448
2672 448 -23 312 -109 170 338 -446 867 -486 878 -94 110 525 -417 690 -352 573 326 50
2690 50 61 136 49 -100 -80 -563 467 -991 572 -624 -292 -64 -689 433 -868 258 -607 -163 -108 85
2710 85 -145 27 -77 -467 404 -834 373 -766 -216 71 -693 512 -882 56 -721 -29 -295 -327 -205
2729 -205 -75 -9 -294 799 -329 735 -186 686 512 -198 940 -516 895 112 216 157 -229 485 -358
2748 -358 8 -134 351 -575 501 -307 156 59 -198 806 -697 1067 -120 348 498 -50 429 -274 263
2767B63m46M07o01P38j297P54J5n60J186j528J311j291R11P6m51M73j02L08n05
2786c39O95o04P01q32P52n48n8Q51j329J211j240Q63k72Q4M37j039J046o13L73
2805A39n04P88n82O69m12j13P98j443J867j412Q86l64L0L66j131J324r91K78l80
2824a87O35o91K82j3k16P13j047J173j231J259n74j04O27q11P23o59O41m68K24
2843B76k14n7lj32O55j060J042j190J205j060L79J56o34J024j049J124j173O35
2861g6n0j08K48k99M56p33J131j371J198p30M89m5o08J112j192Q99q96P33p7k72
2881a91L37k04M22l87M54q59J039o20N76l01n10J146j550J362j012N30k18j9N17
2900E12r23P44o20R13q25O35p78O64j9o65J226j525J320q73K42j3k10N33o36O71
$$ plain form
2767 263 -183 224 -377 361 -936 -182 -167 -727 459 -1069 242 -1049 -138 -62 -513 -40 -142 166 -339
2786 -339 356 -248 453 -379 373 -175 -233 618 -711 500 -740 123 -149 -65 372 -667 379 -234 139
2805 139 -365 423 -159 510 98 -15 783 -660 1207 -205 681 317 347 713 -418 906 -85 193 -187
2824 -187 448 -243 39 26 -190 523 -524 649 -582 677 103 -1 626 -185 538 -121 520 52 276
2843 276 62 5 2 -130 525 -535 507 -683 522 -538 -159 -3 -637 387 -662 462 -711 -76
2861 -76 -126 -234 14 -285 171 -562 569 -802 396 -334 155 110 -498 614 -578 321 -575 158 81 -191
2881 -191 146 -58 364 -23 431 -428 611 -9 567 266 -244 902 -648 714 -298 232 14 -5 512
2900 512 -411 333 -287 626 -199 436 -342 322 303 -362 864 -661 659 -214 28 15 -195 338 -298 373
2920C73p41P89q49O69o63K83J74o37J075j148J064j271J024l03l73P89r08P14
2938F1l22L42n35M66k36K14k0k72Q49r62R91r06Q73m86k79P97p46O65n81L53n41
2959b75O19j95r5p1q5O72j339J543j216P66k35k08P81j114J236r67P48m02K61
2978D24j81N4k30j96N19n56R17j470J037k15o23Q41p92R05q15Q31r51M62J03j97
2998a33Jo0M23p19P03r20R96p26K38M31q27J093o66K15m03L68j18m8J58m33N29
3019A02m35Q39j055Q86n98Q9N25r42J272j188Q14m32J49K07l73R7n59P75k00O35
3039F08j428R98l14M75k17l08M06p87J411q98lM8K6N03r56J240r39M22j62j21
3059DpO6o4n67L19n86K132j909J025o15j43J41l59K92r06P27j18L56j67K65L31
$$ plain form
2920 373 -368 421 -428 241 -422 -139 35 -602 473 -675 389 -882 142 -161 -534 255 -653 61
2938 61 -261 81 -454 12 -224 -10 -30 -302 547 -415 576 -330 543 57 -222 575 -171 494 -87 266 -275
2959 -275 344 149 54 -17 -102 570 -769 774 -442 324 89 -119 662 -452 784 -183 565 163 424
2978 424 243 297 67 -129 390 -166 751 -719 318 103 -520 321 -471 434 -381 450 -501 -39 64 -133
2998 -133 -132 -192 231 -488 215 -705 291 -435 -197 234 -593 500 -166 49 -354 14 -104 -152 6 -427 102
3019 102 -333 506 -549 337 -261 -172 353 -589 683 -505 309 -123 26 233 -140 -43 -602 173 -27 608
3039 608 -820 178 -136 339 122 -186 220 -567 844 -54 -57 -9 17 520 -436 804 -135 287 125 4
3059 4 -3 63 -1 -568 -249 -835 1297 -612 413 -202 -345 -204 -563 -271 -1177 -450 -568 -212 -379 -114 217
3080B17q41P80r76J199j033R65j39n58O33o75N49l93M46p11N35Q6N7k94o3Q06
3100E90j246J151r08P96j22m69P36j165Q25m30N66o16O40m57K6K73m75L64n53
3119d74J263j301Q79m48k11Q81q93Q77p36M32j12r7j27J71Q7l87O04p43P76q40
3139c99J029r76K02N65j254J097o32M94m60K48K34m64L49k90O49j006O88l81M10
3158A03m82K36M73q56R76j283P70j64K77k40qN86o24K21l54R55j100N67q4J55
3178A24L97p63J062j231P92m27J20Mm62P43n64M95k95N85q20O34l84R1L44p70
3198c25R36q61R09r38L24M19o81P35n46J37m04N75m17N50k74k79L64q78J041p40
3218c53N79o66N55L05q31Q45r67P25m97N06n99K72q9L44j51n68R09j068J004p57
$$ plain form
3080 217 -624 156 -820 379 -654 311 172 -386 247 -428 121 -272 174 -537 -2 84 141 -153 -216 590
3100 590 -656 495 -413 383 261 -208 528 -637 188 -242 324 -292 348 -109 -83 190 -285 79 -474
3119 -474 789 -512 367 -81 -292 589 -304 573 -163 269 157 60 -67 104 191 -196 408 -335 441 -399
3139 -399 630 -346 -144 421 -833 264 -368 126 -334 -86 148 -316 33 -257 392 -614 74 -307 103
3158 103 -379 -143 330 -526 450 -833 -63 -227 50 -190 -198 388 -236 -15 -369 586 -514 53 -31 124
3178 124 521 -242 820 -411 381 -46 74 78 -384 359 -205 290 -5 580 -240 394 10 101 445 -325
3198 -325 611 -250 659 -279 45 464 -217 518 -28 109 -295 280 -137 413 139 -140 224 -654 387 -353
3218 -353 226 -440 115 420 -411 434 -533 192 -305 201 -398 -126 -215 129 -22 -590 319 -749 255 -502
3238e02L86J28p37P72n77O79p46O25o4J61k81L15n1l43O76p45P94o26M87k53k42
3259a44K23n59J198q41L11m53K62p5o9J34l87P33p40J034p48M13j55l10R52j045
3279b66Q17o90J98p7p7J58l16J01J1M22o91Q18o99O95o07J6N58n80O18q69N61
3300A01k05j31L11m67N04m94M28l52N79n63K35m14K17N85r39J005j164P92m95
3319d67O1L48o4L66l49J65n27P97o99M08L7k41O55q15J003r05Q58m80j53L72l08
3340F2J87l20N61o68M32n72N75l72R4L43p04J008r61R07n10L3M11r47P52m46L63
3361B28l03L66k13K67l44L4K39q18R10n96M70p14M23O4q31J100q41O21n29O98
3381B31o58L73J9J2K24o04P31q47P78n70L76k2m08O58q95O96l57K70j21k1n2j80
$$ plain form
3238 -502 -116 12 -725 47 -530 149 -597 28 -36 125 -156 159 108 -235 441 -304 490 -136 351 98 -144
3259 -144 79 -480 718 -123 188 -265 -3 -78 -147 -13 -400 333 -407 627 -121 292 137 -173 779 -266
3279 -266 551 -139 59 -18 -95 63 -253 -152 -141 281 -410 408 -291 404 -203 -187 371 -209 409 -460 101
3300 101 -104 -235 76 -391 113 -381 47 -305 274 -289 -54 -468 -251 334 -605 400 -764 28 -467
3319 -467 -406 -58 -122 244 -105 60 -467 330 -369 39 76 -165 490 -325 678 -227 631 151 -2 370 62
3340 62 249 -71 490 -178 254 -318 257 -115 -21 322 -382 626 -335 572 62 95 506 -441 311 -135 228
3361 228 -75 291 78 345 1 35 274 -544 366 -230 240 -474 -51 13 -818 282 -559 62 -467 231
3381 231 -427 -54 -35 -23 201 -403 328 -519 259 -311 65 43 -365 293 -602 94 -263 7 -114 -135 -187 -367
3403c67N81l67M39q76J166q50L87M11p58N76p29Q80p11M32P1j62J5k28N02p82
3423c70P35o64Q44p49M21J2m07P84r03P03m94O60l94j5j25j39J59j10K00l70K23
3444Ak82L69k44k34Q57q70O78n39L34j02m01N79l06M08m92N00n74M75l78K47M6
3465G2k30L43o39Q15p74O23l78k3J05j12L61m87P11n68L17k40K73p6r9L80n17
3486a43O45q52P81l26O3k0j06K10k59M24p32L56l18P04m04j41N97q10O10p59O74
3507A94k36j06M37m90N82l53P4m45K54L0J81j10k65L58p23J037q35P14o58M1K75
3528d4m83P03n73K94l83M74l20L66j14j54M49m80N12p83O07k16j31K17j46O53
3548D48r47Q10l05jR6o7l3j48L41m66N08o30O63k67N8Lj22O04p17P30p27M25N4
$$ plain form
3403 -367 214 -153 286 -590 576 -274 113 524 -234 342 -387 493 -218 214 285 123 138 -90 412 -370
3423 -370 365 -299 545 -204 217 229 -178 606 -297 406 -88 572 178 163 38 -101 58 -52 148 -222 1
3444 1 -281 88 -156 -390 467 -403 275 -264 70 -32 -433 146 -160 248 -244 256 -318 157 -221 26 72
3465 72 -158 185 -454 361 -413 210 -168 -191 -86 -198 163 -324 387 -181 136 -104 169 93 -6 374 -143
3486 -143 502 -350 431 105 168 148 42 252 -7 417 -315 41 -277 427 23 -118 479 -331 279 -480 194
3507 194 -42 -148 289 -201 381 28 102 -343 -89 -59 122 12 -253 105 -618 419 -416 298 -360 -319 -44
3528 -44 -527 176 -397 -103 -486 -12 -332 34 -80 -234 215 -265 247 -536 71 -145 -276 -59 -205 448
3548 448 -499 311 6 5 101 34 1 -147 194 -272 236 -394 269 2 60 63 -59 545 -172 558 -169 256 310
3571C10j9j63J0J32n91R07j016P98m63M74k09j83M31p73O84m27K94l13R9J01m81
3592c98O90m45L40m17K21k85K78J21k68K14m88N79n43N38r3l06L73n35M39m03
3612c88N62k73JN4J20J1j05K03p17Q21o28N15r8l09L90k64L77n48M71l01J43j39
3634a02K53J3k86N79p69P35p41O86k50j00J50m38M63l54L49n14M72l85M78P4l95
3655h2L12o21M76m96N05l89J38Q5k97M46n85L75o4Q7Mj95Q4M0K99l71M98o12L26
3678c7O7k81K87k39N61r39P18k27R0k47P7J65O7P5o14O83m20M58m86K92K71l57
3700c6O78r07N40j80L6J55l33L36n5k0k66L86l52L93m56QM30m56L97m53M83l23
3722EJ23j48J16M1k95N37o26O51p58M58k99N7K93l33N12q10Q80p60N46k58M7r4
$$ plain form
3571 310 291 128 138 270 -321 586 -430 368 -95 379 170 -13 418 -355 329 -98 196 -117 -18 83 -398
3592 -398 292 -153 187 -230 -9 -294 -16 105 -163 51 -437 142 -401 137 44 -262 111 -424 15 -388
3612 -388 174 -99 -98 -44 76 87 -18 185 -532 289 -339 176 78 -231 159 -105 272 -276 195 -106 37 -102
3634 -102 151 164 -122 457 -312 423 -318 368 118 18 168 -270 193 -161 188 -326 146 -239 239 313 -82
3655 -82 230 -391 85 -411 94 -295 -157 -72 -369 77 -508 -133 -197 -110 -106 -301 -217 -177 122 -249 249 -363 -37
3678 -37 30 -251 36 -203 358 -581 137 -90 0 -247 -170 -5 62 137 -477 206 -214 244 -242 50 321 -36
3700 -36 642 -265 275 95 131 286 -47 289 234 214 -52 334 -18 375 -81 -73 357 -99 298 -155 328 5
3722 5 128 -20 96 137 -158 379 -247 404 -354 104 -195 -138 155 -178 334 -476 404 -356 190 -68 -21 -115
3744a15m3K81l66K48k29L72l56O7K07l40L39m41P45p66O29k06j90L93m71L82n05
3765c65O30o43M38k78M28j58j45K81l93N00m51M08k21r0K48l52N62q20L88j86
3785b19M06j08J60kk14L47n11M29o10N40r5j31K11m02O98p73L33j56K41k02p7
3806a35K79l20N04n90N76n68M88l49J1K18l71M90n65M64l53J21J89p6J43k98J63
3827B1m65Q04q76K74K98l49M16k01J84m56O82m62R8j15K77m1j13K12j07L4j40
3848b5K37m81M17K14n66N16n12N17j58J10J4k26K51m69J75rK36l49M37m35J78
3869G2J78m67O78m32L17l76J03J14m08L86k29L33o55N02m05L71j39L9M9l38M54
3890A47m20N58m94K31k63J25K48p23N92m87Q18m77J60j06m8J16l11N69o44N58
$$ plain form
3744 -115 -158 123 -243 5 -224 148 -208 -141 66 -274 65 -376 369 -397 232 26 -164 229 -242 140 -365
3765 -365 265 -378 60 -218 210 52 -93 188 -205 295 -156 252 31 -59 189 -163 399 -421 -33 -219
3785 -219 187 79 239 237 23 370 -141 288 -322 218 123 -8 203 -199 499 -274 59 -97 144 -58 -135
3806 -135 144 -176 328 -262 314 -254 234 -115 -104 114 -257 233 -332 132 -221 -100 89 13 156 -142 21
3827 21 -444 360 -516 -242 56 -293 123 -78 106 -350 332 -130 -32 -147 130 89 -24 188 81 115 -25
3848 -25 212 -269 148 362 -204 312 -200 317 159 269 283 57 308 -161 14 5 241 -108 329 -106 72
3869 72 250 -217 461 29 346 -30 73 187 -221 165 -64 269 -386 116 -289 82 -57 -18 31 -307 147
3890 147 -273 285 -209 22 -241 -116 132 -591 1 -486 332 -145 15 -91 -139 -23 -334 235 -409 149
3910A49p98P32k32J84L5k99M51n00K42R4Q2j89L21qj65K64o66O05m84N10k07j5
3932A06j3j01J99l02L03k56M21o56M47n9m0O41q01M32l54J47J5k12M36l22K13
3953B44m52K60n0J22J64k42J7l82M64l19M72n27K93J25k44L29o20O34l74L02k90
3974g4K0N4k6J61m28N35m22K83k96J25P4m9J44m83O52m80K03K4J71K80m70L4K6
3997E8L5j41O36o36K32j90J14K2l04M44m68M55j27j69J29j97M79m20L77n74N69
4018C24m64K21r4N7L35n33N90o03M44m20J14l7j98L12l63L41l64N43n22L18n1
4039e0K41j09m68P07n17K41m8j3p1k63M67m22L43k90M41n88L54j62L5K41k99L64
4061A34m94P39p08L99l13K15K12k86M21l66M9J48j52J88k05J76m39L42k59K45
$$ plain form
3910 149 -649 83 -149 35 70 -229 222 -278 -36 58 140 -49 272 264 99 363 -303 302 -182 328 121 106
3932 106 93 -8 191 -111 192 -64 357 -299 148 89 49 690 -111 321 -33 114 129 -83 353 31 244
3953 244 -208 52 2 124 288 46 63 -319 145 -174 298 -229 64 189 -55 274 -346 288 -86 216 -74
3974 -74 -54 0 -26 135 -293 242 -180 103 -193 -68 6 -43 101 -382 270 -210 -7 17 188 468 -2 32 58
3997 58 93 -48 588 -48 184 -6 108 130 -174 270 -198 257 130 -39 90 -107 372 -48 329 -245 324
4018 324 -140 81 -13 44 379 -154 436 -167 277 -143 -29 -66 -264 48 -315 26 -338 205 -317 1 -50
4039 -50 191 82 -386 321 -196 45 -3 -16 -87 -350 117 -305 38 -252 189 -399 -45 -207 -172 69 -230 134
4061 134 -360 379 -329 70 -243 -28 184 -102 319 -47 2 150 -2 186 -19 157 -282 60 -199 46
4081D6o9L8qk75M33m35M69k35j6O0J07j93K48kj76N91j149J013n99J67L8j60N41
4104D34o34M54m58J48j15OJ97j24J78j3P6j45M2j47K09pj85K72m56L12k05J92
4126C1j23K48j88k99L37j95N75o87N06p04M35O1j7K30k33M70o81L81p0J88l46
4147h1n0K34k8p8j67L10k18J28k46K28J84l90L60l75K39n2j91K41m18M93r6j71
4169a44J30L83o33N9K97LP1o61O09j085J166k96M5j60J78J09j88L95n40M10l48
4190b00N0R5n7O4n4M07n07K84m47m7K94j99N31l55K70j09K54k50J78j30o6r9k17
4213c10O27m64M08j94j13L7l5L18l25J21l29N51k54%J00k11K05j19L21o83O70
4234C21k98K27j36nk4m15O70l83J71q0k5l9K2J40m93L78k17L51k87JJ40k53K17
$$ plain form
4081 46 -23 15 7 -268 165 -270 199 -36 -52 8 115 -78 170 168 -8 583 -566 447 -152 15 53 -107 434
4104 434 -200 254 -204 -56 -171 -165 32 -92 86 73 149 4 46 -101 108 101 -84 188 -268 44 -161 31
4126 31 -92 156 -32 -331 6 -189 386 -301 205 -499 -64 -3 -20 210 -23 447 -234 147 77 265 -81
4147 -81 -131 103 75 -3 -170 140 -78 50 -196 32 216 -174 186 -189 50 -2 -193 48 -370 123 27 -144
4169 -144 -14 369 -264 -205 92 95 166 -495 114 -971 195 -101 -56 -216 -38 71 -117 278 -262 148 -200
4190 -200 -150 -55 -112 -48 -102 305 -202 82 -365 -412 -118 -317 214 -141 129 20 274 24 202 72 6 -93 -310
4213 -310 317 -147 261 67 -46 -9 -44 274 -51 70 -259 292 38 38 138 -73 132 13 334 -349 321
4234 321 23 250 114 109 85 -330 340 -43 128 48 23 -16 6 146 -347 31 -186 165 -122 -121 19 -234 -17
4257a7P6J72k92J16J6j68J65r1J33l01M28n20K28k25K44k5j9L99n75N00m67K02
4279b1p1L4J19k29M76l72J37l29M88l38K26j31M3K24k43K89n87K87J96k36l1O4
4301el8rL14l43K18k25L27km63M81l45L43j62K33m34M5Q8J6Q1k21J73l23K97j20
4325g4j23J29J7J02l55K43j85K63j00R6m8o4L29m88L77k24J31L4j73J76p9l7j74
4348b27J28j6J87k51J11K41n62M55l91M6R7K10k26L72nj17K01m30M48m84K91K78
4370C56k09j21M1K5k85L78l65K24k0j50K74l69J49PK99n58N14m41K57K49m69L10
4392I6o35O29j59J45j21R9Q8l17M60m33M30m30k5J19M8L3l39L93l28M91n33N77
4414B88j51p2j2k07O5J88k18k25N03m04K87j31j97J49k47O54k22r2Q7l6J56k21
$$ plain form
4257 -17 59 231 -61 55 71 -97 68 -23 110 -191 237 -283 -55 -280 -36 -61 -80 319 -256 244 -223 -21
4279 -21 -92 -58 61 -168 308 -64 73 -256 232 -106 120 -11 32 256 13 302 -285 2 198 -38 -69 -5
4301 -5 -43 -52 262 -81 137 -88 239 237 -226 255 -90 253 91 324 -110 -65 23 39 120 -101 72 -251 46 -74
4325 -74 -197 -68 -51 51 -304 -61 -246 17 -83 13 -35 -99 230 -258 119 -105 26 60 -113 63 -16 -53 -227
4348 -227 -99 -115 72 -179 -68 173 -389 66 -325 -279 -182 28 -198 174 169 52 253 -177 271 -213 78 356
4370 356 147 26 67 92 -193 185 -180 44 24 -126 148 -221 -72 -65 234 -324 190 -251 6 255 -214 96
4392 96 -539 90 -69 76 -45 54 142 -175 285 -148 282 -148 -173 -54 -6 27 -312 81 -247 244 -289 288
4414 288 137 65 53 -154 -89 99 -119 -344 159 -245 42 -89 -286 -137 -384 270 48 -44 43 7 163 -58
4436e8J86j42L58l37J21j21PJ55l06K82k43N74m46j4K6l6N4j69K5m5K99j24Q5
4459A31OQ1l9k16J71j03K1j1O2j96K8M85k92j75j10L69j81J04k44M4L69l96L84
4482B92o55O37l71Q9r7l8K69l86M03n10M37p0Rj07n1K3J27Q4l76K82p2L29j37
4505A11j88J28k46M50n94N74l63J74j00J47J91j65N7l14M16m24M65k72Q8j12k07
4526a84K79j96K68l95K02j85M44P8k98K34l80M44l65K63o8k70K30k02M16n04L77
4547A88l68J74l27K47m4K38Q6l21K45m63N10j06j43J1j03J52j50L52j39l6j20
4568a17J35r8o8L08l99K31j39L09l86J03L17k61Pm03M30J9K07Q0m97O16k56p2
4590F6k31K93O6j64pj99M39j74K42n31M64k59j20J08j8L87l62J21q8K9N7n2l36
$$ plain form
4436 -58 128 -14 344 7 128 7 14 169 -137 145 -98 476 30 16 42 6 60 -109 -84 -129 170 46 131
4459 131 137 218 179 -37 134 31 52 41 103 -93 -65 420 128 -47 -157 212 31 135 -109 -65 304 -92 292
4482 292 -363 274 -97 -8 -105 -143 126 -260 143 -367 70 0 9 -98 -149 -126 1 85 -291 -9 -81 248 111
4505 111 -77 51 -195 255 -339 235 -128 46 -54 93 284 119 176 -138 278 -146 319 47 135 23 -184
4526 -184 95 -101 167 -228 -26 -211 233 311 13 247 -133 311 -54 209 141 -129 101 -101 315 -189 188
4547 188 -180 -6 -333 -86 -130 108 194 -127 118 -345 165 59 -84 -73 -176 -24 -174 178 39 3 -117
4568 -117 18 -80 -148 160 -239 -8 -147 162 -224 -121 196 -65 -58 -461 -31 -12 195 275 -222 394 138 66
4590 66 -165 128 194 30 23 -176 263 89 331 -200 264 5 -115 -7 -25 362 0 121 33 62 119 67 -269
4613b69L97P1k23J18k31M63l33N5L6k89L14l56L59L8j36l1j25K77K6p8j61J57
4635G9l61L20j81j9M4K31K57n28M02k66M5k29K84M2j46l7j12K25l15M54n28K18
4657a21J23n5J13k96M24m06N15m54J62J35k22k3j5K93j25J35r7kn9k15L39k64
4679a15J64L2L13m63J95k6p0j2pL30l00R6q9J98k54J19J29l72L26j82m0o6R0l6
4703d0j21L51j46j55Q7J67k65L38k34j52M09l53L09m74L46j40j10Q8k32M12m4
4724D1l4j58Qr0L32J8k08L30n93M69k19J06q7J39L7j17J55k0j66k9Q4j88K43K8
4748H1j55K02k40K16k15M69m75J98R9k80L17m16L94k21J04l75M75j07J63q5j62
4769a3LM9J97j61j42NJ18L1l90M24j63L9p5K64j19o3n5R2P3k93M9j14K69k13J52
$$ plain form
4613 -269 128 199 -24 94 -137 326 -7 48 84 -205 109 -247 112 150 14 -17 -142 135 161 83 -78 79
4635 79 -282 38 -143 -162 -118 113 370 -158 244 -22 23 -206 78 120 -26 -63 -175 50 -265 189 -339 -121
4657 -121 2 -53 60 -236 188 -218 297 -157 5 140 -82 -105 -120 173 48 183 86 84 25 -190 149 -115
4679 -115 49 81 394 -69 126 100 30 18 11 341 41 137 48 246 -8 111 240 -132 194 12 -28 -94 -4 -40
4703 -40 -161 190 44 -111 -24 143 -122 216 -18 -170 239 -114 195 -279 67 -73 -183 -95 -327 85 41
4724 41 7 -151 -143 -233 99 117 -91 239 -354 115 -104 2 -85 54 91 -26 129 109 -57 -86 -2 -190 53 81
4748 81 -74 128 -112 104 -111 358 -117 81 180 -100 217 -199 195 -26 78 -297 178 71 234 149 -13
4769 -13 -10 39 236 75 -67 -62 56 87 -303 121 -42 -3 -78 186 67 4 -51 41 114 -179 -130 -244 25 -188 -36
4794c6J25k13J04k16L77j68J3K14m25K36p4K89m09M27k48N4Q5l24L72m00K44p5
4816d8J86q5j55M3K12j49R5J3j21L43l80O9R5k64L23j52K50l27L37jl51K29j1
4839A51J30l56J71l14K98j96M53m35jK02j55K55m06Q9J21j02N47n03K26k92J26
4860Il1J65l54MJ63J4Q9j60J12l12M01j28Q4r2J06Lm05J86O8L91k93j96O6M6K21
4885A57m67P09k16k90J89j6m1l49L77j89J93J13r6Q7R7j34j18K78k58jL0N0j34
4908b9N7K7j58J61L8K65m38J18L0j24pm0J04k58L25k05K06k74m9L20M1L1k15K07
4932A33l18J50J37L13k57l46J01p5K12o25P05k08l14L78p7L9l32N83l65J67p2
4953g1K24j00L0J3p7K11k22K30l30K67k21j13K96l78L50k30K61K4M6j00n2K82
$$ plain form
4794 -36 89 -124 -20 -236 141 -27 -14 200 -225 11 -63 226 -183 244 -4 50 135 -189 183 -217 27 -48
4816 -48 138 53 -102 -59 153 4 99 112 -9 334 -46 23 118 -146 177 25 275 -52 285 284 -67 162 151
4839 151 281 -75 96 -218 80 -116 337 -98 -99 103 -52 203 -203 -114 7 -95 452 -51 175 -117 9
4860 9 -22 143 -211 -207 -44 -30 59 -101 11 -301 100 -28 56 -36 70 73 -332 -146 -78 313 20 -176 -110 -64 157
4885 157 -310 399 183 -107 82 66 25 -324 53 -136 57 170 74 161 258 124 6 284 26 25 55 105 -29
4908 -29 28 55 -103 58 96 361 -77 41 71 -53 -60 -100 4 -254 71 -134 72 -202 -251 69 110 141 -74 133
4932 133 -185 -35 102 415 158 -188 -87 -162 50 -575 130 -78 -392 -14 -91 -52 -384 199 -166 1 -71
4953 -71 153 53 83 96 19 230 8 238 -92 175 -46 -159 137 -241 109 -121 140 164 210 110 58 340
4975C40m07M28j60r8k53O5L20l03K99k17J34k56L54k39j41J45L1L3j08J6k5J08
4997F6N5k42L52n13O63m44O8j86K57J76j78k7j58K67j85N5j07jj52QL70k68K83
5020A59n58K76L2n2P5J5L55k44J17l16L69n16L82O1N6k9l40J76lJ77l20L00l9
5043A33O1k07l5J71k19J17o6L50k33J29p9qJ65l06L46m07K73o4lk1l12N18l71
5066f8J23k08PKJ5j28J57J29k48N05k38k41R2m9n8J80rl37M36j66J04k6l78L26
5090g8K8J4m8L12k88K6j08L13j15j38L60k93J43k34j06J63%J28k10J64n2J12k78
5113a85J45j11J98Q6p7Mj95L12k30J81j25K8P4L0O7k60J43p4L39m92l2n8J60n
5137g7o7K31Q9j04M9k07N7j04K0J93Q0p1O5k19l7J46k08K16k11L33k85R0j72R4
$$ plain form
4975 340 -67 361 201 103 -150 -85 235 -68 231 14 148 -108 246 7 -134 11 42 75 -33 -17 -42 66
4997 66 121 -121 231 -282 381 -63 5 -181 76 252 74 47 -111 156 -29 26 -81 -82 -234 -226 144 -124 159
5020 159 -399 -123 -91 -143 -68 -53 302 58 175 -141 228 -288 94 155 211 182 -158 18 15 192 -128 172 133
5043 133 194 -13 -48 123 -96 21 -45 305 72 201 122 114 279 -27 319 -88 185 121 118 97 -215 303 -68
5066 -68 55 -153 -146 -144 -129 -257 -100 29 -219 286 48 -193 -101 -150 -208 -28 -37 -374 62 -104 0 -26 -404 -78
5090 -78 -50 -36 -84 228 -60 -34 -142 171 56 -82 278 -15 128 -106 -212 -49 -49 79 -131 33 -19 93 -185
5113 -185 -40 -151 47 133 56 60 -135 177 -53 128 3 31 105 135 202 -58 85 11 350 -142 -174 -232 -72 -77
5137 -77 -144 87 176 72 121 -86 -29 -133 -113 80 160 89 154 -65 -102 44 -164 52 -159 174 -111 -21 -193 -99
$$ [...]
8191C4
##END NTUPLES=NMR FID
##END=
