##TITLE=1H_N1-03.09.20
 CDCl3, 8 sc, 
 4.9.2020
##JCAMPDX= 6.0         $$ Bruker NMR JCAMP-DX V2.0
##DATA TYPE= NMR FID
##DATA CLASS= NTUPLES
##ORIGIN= UXNMR, Bruker Analytische Messtechnik GmbH
##OWNER= root
$$ XWIN-NMR		Version 3.5
$$ Fri Sep  4 10:05:47 2020 Russian Standard Time (UT+4h)  she@DPX200
##.OBSERVE FREQUENCY= 200.1315066352
##.OBSERVE NUCLEUS= ^1H
##.DELAY= (6, 6)
##.ACQUISITION MODE= SIMULTANEOUS
##.ACQUISITION SCHEME= undefined
##.AVERAGES= 8
##.DIGITISER RES= 18
##SPECTROMETER/DATA SYSTEM= spect
##.PULSE SEQUENCE= zg30
##.SOLVENT NAME= CDCl3
##.SHIFT REFERENCE= (INTERNAL, CDCl3, 0, 15.7039)
##AUDIT TRAIL= $$ (NUMBER, WHEN, WHO, WHERE, WHAT)
$$ ##TITLE= Audit trail, XWIN-NMR		Version 3.5
$$ ##JCAMPDX= 5.01
$$ ##ORIGIN= Bruker BioSpin GmbH
$$ ##OWNER= she
$$ F:/spectra/data/she/nmr/H-F/1/audita.txt
$$ ##AUDIT TRAIL=  $$ (NUMBER, WHEN, WHO, WHERE, WHAT)
(   1,<2020-09-04 10:04:36.75 +0400>,<she>,<DPX200>,
      <created by zg, POWCHK disabled, PULCHK disabled
       configuration hash MD5:
       00 E9 B6 7A A2 85 ED C7 34 08 36 98 17 FE 4E 26
       data hash MD5: 16K
       CE 29 B3 AC 99 85 FD F4 D3 29 40 4D CF B5 4C 9E>)
$$ ##END=
$$ 
$$ hash MD5
$$ CF 8A 86 FB AF 03 1E 63 66 F8 46 80 06 4B B4 8E
##$RELAX= 
##$RELAX= 
##$RELAX= 
##$RELAX= 
##$RELAX= 
##$RELAX= 
$$ Bruker specific parameters
$$ --------------------------
##$DU= <F:/spectra>
##$EXPNO= 1
##$NAME= <H-F>
##$PROCNO= 1
##$TYPE= <nmr>
##$USER= <she>
##$AMP= (0..31)
100 100 100 100 100 100 100 100 100 100 100 100 100 100 100 100 100 100 
100 100 100 100 100 100 100 100 100 100 100 100 100 100 
##$AQSEQ= 0
##$AQ_mod= 1
##$AUNM= <au_zg>
##$AUTOPOS= <>
##$BF1= 200.13
##$BF2= 200.13
##$BF3= 200.13
##$BF4= 200.13
##$BF5= 200.13
##$BF6= 200.13
##$BF7= 200.13
##$BF8= 200.13
##$BYTORDA= 1
##$CFDGTYP= 0
##$CFRGTYP= 5
##$CHEMSTR= <none>
##$CNST= (0..31)
1 1 145 1 1 1 1 1 1 1 1 1 1 1 1 1 1 1 1 1 1 1 1 1 1 1 1 1 1 1 1 1 
##$CPDPRG= <>
##$CPDPRG1= <>
##$CPDPRG2= <>
##$CPDPRG3= <>
##$CPDPRG4= <mlev>
##$CPDPRG5= <mlev>
##$CPDPRG6= <mlev>
##$CPDPRG7= <mlev>
##$CPDPRG8= <mlev>
##$CPDPRGB= <>
##$CPDPRGT= <>
##$D= (0..31)
0 1.2 0 0 0 0 0 0 0 0.06 0 0.03 0 0 0 0 0.0002 0 0 0 0 0 0 0 0 0 0 0 0 
0 0 0 
##$DATE= 1599199476
##$DBL= (0..7)
120 120 120 120 120 120 120 120 
##$DBP= (0..7)
150 150 150 150 150 150 150 150 
##$DBP07= 0
##$DBPNAM0= <>
##$DBPNAM1= <>
##$DBPNAM2= <>
##$DBPNAM3= <>
##$DBPNAM4= <>
##$DBPNAM5= <>
##$DBPNAM6= <>
##$DBPNAM7= <>
##$DBPOAL= (0..7)
0.5 0.5 0.5 0.5 0.5 0.5 0.5 0.5 
##$DBPOFFS= (0..7)
0 0 0 0 0 0 0 0 
##$DE= 6
##$DECBNUC= <off>
##$DECIM= 32
##$DECNUC= <off>
##$DECSTAT= 4
##$DIGMOD= 1
##$DIGTYP= 9
##$DL= (0..7)
0 120 120 120 120 120 120 120 
##$DP= (0..7)
150 150 150 150 150 150 150 150 
##$DP07= 0
##$DPNAME0= <>
##$DPNAME1= <>
##$DPNAME2= <>
##$DPNAME3= <>
##$DPNAME4= <>
##$DPNAME5= <>
##$DPNAME6= <>
##$DPNAME7= <>
##$DPOAL= (0..7)
0.5 0.5 0.5 0.5 0.5 0.5 0.5 0.5 
##$DPOFFS= (0..7)
0 0 0 0 0 0 0 0 
##$DQDMODE= 0
##$DR= 18
##$DS= 0
##$DSLIST= <SSSSSSSSSSSSSSS>
$$ [...]
##$SUBNAM2= <"">
##$SUBNAM3= <"">
##$SUBNAM4= <"">
##$SUBNAM5= <"">
##$SUBNAM6= <"">
##$SUBNAM7= <"">
##$SUBNAM8= <"">
##$SUBNAM9= <"">
##$SW= 16.880792210976
##$SWIBOX= (0..15)
0 0 2 0 0 0 0 0 0 0 0 0 0 0 0 0 
##$SW_h= 3378.37837837838
##$TD= 16384
##$TD0= 1
##$TE= 0
##$TE2= 300
##$TE3= 300
##$TEG= 300
##$TL= (0..7)
0 120 120 120 120 120 120 120 
##$TP= (0..7)
150 150 150 150 150 150 150 150 
##$TP07= 0
##$TPNAME0= <>
##$TPNAME1= <>
##$TPNAME2= <>
##$TPNAME3= <>
##$TPNAME4= <>
##$TPNAME5= <>
##$TPNAME6= <>
##$TPNAME7= <>
##$TPOAL= (0..7)
0.5 0.5 0.5 0.5 0.5 0.5 0.5 0.5 
##$TPOFFS= (0..7)
0 0 0 0 0 0 0 0 
##$TUNHIN= 0
##$TUNHOUT= 0
##$TUNXOUT= 0
##$USERA1= <user>
##$USERA2= <user>
##$USERA3= <user>
##$USERA4= <user>
##$USERA5= <user>
##$V9= 5
##$VALIST= <valist>
##$VCLIST= <CCCCCCCCCCCCCCC>
##$VD= 0
##$VDLIST= <DDDDDDDDDDDDDDD>
##$VPLIST= <PPPPPPPPPPPPPPP>
##$VTLIST= <TTTTTTTTTTTTTTT>
##$WBST= 1024
##$WBSW= 4
##$XGAIN= (0..3)
0 0 0 0 
##$XL= 0
##$YL= 0
##$YMAX_a= 166332
##$YMIN_a= -174670
##$ZGOPTNS= <>
##$ZL1= 120
##$ZL2= 120
##$ZL3= 120
##$ZL4= 120
##$ABSF1= 10
##$ABSF2= 0
##$ABSG= 5
##$ABSL= 3
##$ALPHA= 0
##$AQORDER= 0
##$ASSFAC= 0
##$ASSFACI= 0
##$ASSFACX= 0
##$ASSWID= 0
##$AUNMP= <proc_1d>
##$AZFE= 0.1
##$AZFW= 0.1
##$BCFW= 1
##$BC_mod= 2
##$BYTORDP= 1
##$COROFFS= 0
##$CY= 11.3945322036743
##$DATMOD= 1
##$DC= 2
##$DFILT= <>
##$DTYPP= 0
##$F1P= 16.9975609425685
##$F2P= -3.02152046262296
##$FCOR= 0.5
##$FTSIZE= 0
##$FT_mod= 4
##$GAMMA= 1
##$GB= 0.15
##$INTBC= 1
##$INTSCL= 1
##$ISEN= 128
##$LB= 0.24
##$LEV0= 0
##$LPBIN= 0
##$MAXI= 10000
##$MC2= 0
##$MEAN= 0
##$ME_mod= 0
##$MI= 1.114404
##$NCOEF= 0
##$NC_proc= 0
##$NLEV= 6
##$NOISF1= 3.799351
##$NOISF2= 2.8
##$NSP= 1
##$NTH_PI= 0
##$NZP= 0
##$OFFSET= 15.70392
##$PC= 1
##$PHC0= -9971.712
##$PHC1= 10.4009
##$PH_mod= 1
##$PKNL= yes
##$PPARMOD= 0
##$PSCAL= 0
##$PSIGN= 0
##$REVERSE= no
##$SF= 200.130013532006
##$SI= 16384
##$SIGF1= 3
##$SIGF2= 2
##$SINO= 400
##$SIOLD= 16384
##$SREGLST= <1H.CDCl3>
##$SSB= 0
##$STSI= 0
##$STSR= 0
##$SW_p= 3612.71676300578
##$SYMM= 0
##$S_DEV= 0
##$TDeff= 0
##$TDoff= 0
##$TI= <>
##$TILT= no
##$TM1= 0
##$TM2= 0
##$TOPLEV= 0
##$USERP1= <user>
##$USERP2= <user>
##$USERP3= <user>
##$USERP4= <user>
##$USERP5= <user>
##$WDW= 1
##$XDIM= 8192
##$YMAX_p= 0
##$YMIN_p= 0
$$ End of Bruker specific parameters
$$ ---------------------------------
##NTUPLES= NMR FID
##VAR_NAME=  TIME,          FID/REAL,        FID/IMAG
##SYMBOL=    X,             R,               I
##VAR_TYPE=  INDEPENDENT,   DEPENDENT,       DEPENDENT
##VAR_FORM=  AFFN,          ASDF,            ASDF
##VAR_DIM=   8192,          8192,            8192
##UNITS=     SECONDS,       ARBITRARY UNITS, ARBITRARY UNITS
##FACTOR=    0.000296,      1,               1
##FIRST=     0,             0,               0
##LAST=      2.424536,      0,               0
##MIN=       0,             -174670,         0
##MAX=       2.424536,      166332,          0
$$ Real data points
##PAGE= N=1
##DATA TABLE= (X++(R..R)), XYDATA
$$ [...]
2334C099l470J130L150q692O037j242j982O601n199q81K146l235J611N388o447
$$ 3099 -371 759 3909 -4783 1254 12 -1970 4631 -568 -1449 697 -2538 -927 4461 -1986
2349a986L451j654m991P819l522J202K511n196k07L694l404L766J699p042N659
$$ -1986 1465 -189 -5180 2639 -883 319 2830 -2366 -2573 1121 -2283 1483 3182 -3860 1799
2364A799m332M42N351l665O94M98m031K192L833m910N563l825k807N017l979L368
$$ 1799 -2533 -2091 3260 -405 289 787 -3244 -1052 2781 -2129 3434 -391 -3198 1819 -2160 1208
2380A208J673l967LJ843l639N349k74l814M191n732K130K783k045J689J78m563
$$ 1208 2881 -1086 -1083 760 -2879 2470 2196 -1618 2573 -3159 -1029 1754 -291 1398 1576 -2987
2396b987K172J710k539N900m876o39J676k829L435R69k080n3K71l665N570j652
$$ -2987 -815 895 -1644 4256 -620 -1259 417 -2412 1023 1992 -88 -141 130 -3535 2035 383
2412C83m34K865n855K517M21o4J597L41l751J765o27p80N136m109J303r94k064
$$ 383 -51 2814 -3041 -524 -103 -167 1430 1771 -1980 -215 -842 -1622 3514 -595 708 -286 -2350
2429b350K580Q27p07P17r17l273M192k062J900J230l793J246j170O00J650J119
$$ -2350 230 1057 350 1067 150 -3123 1069 -993 907 2137 -1656 -410 -1580 -980 670 1789
2445A789k882J193k204L71L090k122K308k503j146Q69J183k0J221j057k546K529
$$ 1789 -1093 100 -2104 -1733 1357 -765 1543 -960 -2106 -1237 -54 -74 1147 90 -2456 73
2461G3k290L299k83m94l16j383L84R07J663j614J235k923R74J171l7J847k169
$$ 73 -2217 1082 799 305 -11 -1394 -1010 -103 1560 -54 1181 -1742 -768 403 366 2213 44
2478D4J51j676J716j59J742o37j605J85j569K764n90J458j953n29q36L40K224
$$ 44 195 -1481 235 76 1818 1181 -424 -239 -1808 956 366 1824 -129 -658 -1494 -1154 1070
2495A070r98J351k639J08l20J320R11l68L33l082J720q41K234J22o04j243p47
$$ 1070 72 1423 -1216 -1108 -1428 -108 803 435 768 -2314 -594 -1435 799 921 317 -926 -1673
2512a673R29mK732k006N33k085L6K223l46J071j312l90j494K228o82J927p5k829
$$ -1673 -744 -748 1984 -22 511 -1574 -1538 685 339 1410 98 -292 -1786 442 -240 1687 1612 -1217
2530a217J290k039K158P42j4j196m5j400Q60K677k197K338l279l67J506n21J580
$$ -1217 73 -1966 192 934 920 -276 -321 -1721 -861 1816 -381 1957 -1322 -1689 -183 -704 876
2547H76L34j793r52J378j744L618r09j226Q20k925K002J307l7j81O45l667K510
$$ 876 1210 -583 -1535 -157 -1901 1717 808 -418 402 -2523 -521 786 749 568 1213 -2454 56
2564E6N67r69L641m063M92K10q64J857J561k529K88pk919N099k268O97O35l659
$$ 56 623 -346 3295 -768 -276 -66 -930 927 2488 -41 247 240 -2679 2420 152 849 1484 -2175
2582b175J400P79k79J427K00m152L328k280P24M025m025J046r69j594K257J831
$$ -2175 -775 4 -275 1152 1352 -2800 528 -1752 -1028 2997 -1028 18 -951 -2545 -288 1543
2598A543k561K304k043k253M807l450L038M08l841J605M52j207L210k38l560L705
$$ 1543 -1018 1286 -757 -3010 1797 -1653 1385 1793 -2048 -443 9 -1198 2012 1774 -1786 1919
2614A919m474K208K966k957K363j526k751K641Q30j865M100m279n95K870l994
$$ 1919 -2555 -347 2619 -338 2025 499 -2252 389 1219 -646 3454 -825 -1420 1450 -2544
2629b544M817m54l144J639j036j541M271j579j453L250o048L718J116k340L700
$$ -2544 2273 1819 -1325 314 -722 -2263 2008 429 -1024 2226 -3822 -104 1012 -1328 2372
2644B372k232k743K946r68o67N220n733J594P35l933N507r50j549J979k450j679
$$ 2372 140 -2603 343 -625 -1292 3928 -1805 -211 524 -3409 2098 1148 -401 1578 -872 -2551
2660b551N124l108J411K609o791M242j214j106M498k528k041L185l729J117M554
$$ -2551 2573 -535 876 3485 -3306 936 -278 -1384 3114 586 -1455 1730 -1999 -882 3672
2675C672n804M067j859l278M700j852j93K738l809j133M655m858M344L75n377
$$ 3672 -2132 1935 76 -3202 1498 -354 -547 2191 -1618 -2751 1904 -2954 1390 1765 -3612
2690c612M401l029L09M283k466q12K469n364L050L025m644N859l781k445M004
$$ -3612 789 -2240 -1931 2352 -114 -926 1543 -3821 -771 2254 -2390 3469 -312 -2757 1247
2705A247k357J164L738m316J22K014n089O608j640k476M428n013P09L575l097
$$ 1247 -1110 54 3792 -524 -402 1612 -3477 3131 1491 -985 3443 -1570 -861 2714 -383
2720c83J303K117n726M064p6l253O154n083l13K588l446K239K731m816K360o15
$$ -383 920 3037 -2689 1375 1299 -1954 4200 -883 -1196 1392 -2054 185 2916 -1900 460 -155
2736a55m124P021l153j70L125n528J181K449k735L298Q18n919N147l023o51N375
$$ -155 -4279 2742 -411 -581 2544 -2984 -1803 646 -2089 1209 2027 -3892 1255 -1768 -2419 2956
2752B956m273J314J060m045K310K328l998M843k481k988N848m481K134K076m592
$$ 2956 -1317 -3 1057 -2988 -678 1650 -2348 2495 14 -2974 2874 -1607 527 2603 -1989
2767a989K088J120l192M529l83m274M898m974J704L928m086K415k97m075L195
$$ -1989 99 1219 -1973 2556 2173 -2101 2797 -2177 -473 3455 -631 1784 1487 -2588 607
2782F07J010l024N803m857j447L622m741M282J201l603J858p16l517N202j573
$$ 607 1617 -1407 4396 -461 -1908 1714 -3027 1255 2456 -1147 711 -5 -3522 1680 107
2797A07j389M629o537K713J331l103L641m91l461L139j417j254N589n389J459
$$ 107 -1282 3347 -3190 -477 854 -2249 1392 901 -2560 579 -838 -2092 3497 -1892 -433
2812d33J107l863M348K3k334K585j907k480N207l016J384K487o030L514m32j959
$$ -433 674 -3189 1159 1182 -1152 1433 -474 -2954 2253 -763 621 3108 -2922 592 160 -1799
2828a799M394j318k584K810l093L43M448m638L440j261l520L777r35q10L159k602
$$ -1799 2595 1277 -1307 1503 -1590 -1247 3201 -1437 2003 742 -2778 999 64 -746 2413 -189
2844a89j652L612m356L674J054m513L358k245n46L679j458j224K627m407J594
$$ -189 -1841 1771 -2585 1089 2143 -2370 988 -1257 -1803 1876 418 -806 1821 -2586 -992
2859i92L065l883M342k372k061K603j355M88K977l348m19K274m294M822l72k165
$$ -992 2073 -1810 2532 160 -1901 702 -653 -165 2812 -536 -955 1319 -2975 1847 1475 -690
2875f90K716l206j11K602j357L30K122m681K356K38k062M396k865l58J033k151
$$ -690 2026 -1180 -1291 1311 -46 284 2406 -2275 81 319 -1743 2653 -212 -570 463 -1688
2891a688Q03K840l060J347J27l882M957j741l4J800k863J12J809j640J745J353
$$ -1688 -885 1955 -1105 242 369 -3513 1444 -297 -331 1469 -1394 -1282 527 -1113 632 1985
2907A985m161K992j899l77L487k200N25L12k123O16K619k363K414j113k739L302
$$ 1985 -2176 816 -1083 -1460 2027 -173 352 664 -1459 -843 1776 -587 1827 714 -2025 1277
2923A277k157J690J139k147l39P64j814K348Q72k754K534l088P41J881j228J261
$$ 1277 -880 810 1949 -198 -537 227 -1587 761 1633 -1121 1413 -1675 -934 947 -281 980
2939I80k54j833K10J430j708L141j971r94J358k024K177M96n20n22J28k043K475
$$ 980 726 -1107 -897 533 -1175 1966 -5 -999 359 -1665 512 1008 488 -34 94 -1949 526
2956E26J72o78J974l612J170M68m39J384J76j878L78p7p33L226k242N06k35j629
$$ 526 698 20 1994 -1618 -448 20 -419 965 1141 -737 -359 -436 -1169 2057 -185 321 86 -1543
2974a543J651M70L40n42n0k117J948o99P09J302k416J021j135O36P07P82j258
$$ -1543 108 578 918 376 326 -1791 157 -542 167 1469 -947 74 -1061 -425 282 1064 -194
2991a94K76q37n13K366j356J400j144r10O47J01Q80j19j20j753J564j125J487
$$ -194 82 -755 -1268 1098 -258 1142 -2 -912 -265 -164 716 597 477 -1276 288 -837 650
3008F50N70j002J81j283P27L7R62n18L99j325K49O70m33J522j362l44m90O43K94
$$ 650 1220 218 399 -884 -157 -120 842 324 723 -602 -353 317 -116 1406 44 -300 -790 -147 147
3027A47M28K04j140J24j066J334K11M64o71o62K13n04J395l17P99j418l32J18
$$ 147 575 779 -361 -237 -1303 31 242 706 35 -627 -414 -918 477 160 959 -459 -791 -673
3045f73O11P45m56L57j636Q46l48Q02Q01r77J65q68N37j75J679j340R0o33q28
$$ -673 -62 683 227 584 -1052 -206 -554 248 1049 72 237 -631 -94 -269 1410 70 160 -473 -1301
3064a301J858n49Q40q13k01o59Q77k58O86N73j949J265j496J004J134p86l95n8
$$ -1301 557 8 848 35 -166 -825 52 -206 480 1053 -896 369 -1127 -123 1011 225 -170 -228
3082b28m43j39J787j245J256j438o34J250m28J340l01m61j090Q83j010K139n9
$$ -228 -671 -810 977 -268 988 -450 -1084 166 -262 1078 777 316 -774 109 -901 1238 1179
3099A179j561J473k380J275N55J32o6P8j747Q32P78r63K353k303j62O32j074J331
$$ 1179 -382 1091 -1289 -14 541 673 607 685 -1062 -230 548 -415 1938 -365 -527 105 -969 362
3117C62L99o82k48P7j914K960j159j44J318k629J131N16k15M87N79k332J396p71
$$ 362 761 79 -169 -92 -2006 954 -205 -349 969 -1660 -529 -13 -228 259 838 -1494 -98 -869
3135h69L9K745k655P69k8j254J056R91j016J176j034j625K893j467Q48Q68k170
$$ -869 -830 1915 -740 29 1 -1253 -197 794 -222 954 -80 -1705 1188 -279 569 1437 -733
3152g33O75Ql42J522K88k490K272k104K38K408k220J901r84j627J155R58j244
$$ -733 -58 -50 -392 1130 1418 -1072 1200 -904 -666 1742 -478 1423 439 -1188 -33 925 -319
3169c19K036k070j090K540k551K634r1j641Q73j035q05K452o94j036K373l564
$$ -319 1717 -353 -1443 1097 -1454 1180 1089 -552 321 -714 -1519 933 239 -797 1576 -1988
3185a988J202J328j691K344j265j514J295l51m25K880k822L76J460l352L536m28
$$ -1988 -786 542 -1149 1195 -70 -1584 -289 -640 -1065 1815 -1007 -631 829 -2523 1013 585
3201E85j325J352j426r23K477j078K19K061l867K230k72j065K886j378j186J429
$$ 585 -740 612 -814 -1737 740 -338 -119 1942 -1925 305 33 -1032 1854 476 -710 719
3217G19j714L15K914l076J898l55k574L105j114j09J444j755q08K341k347J769
$$ 719 -995 -680 2234 -842 1056 701 -1873 1232 118 9 1453 -302 -1110 1231 -1116 653
3233F53J163l539K600j488p39K415j261k75J587k851Q21K282l062K680j392j599
$$ 653 1816 -1723 877 -611 -1350 1065 -196 -471 1116 -1735 -914 1368 -1694 986 -406 -2005
3249b005K486j454M49J917k262l24K022l334L365j04k086K688k563j01K089j113
$$ -2005 481 -973 -524 1393 -869 -1193 829 -2505 860 756 -1330 1358 -1205 -1306 783 -330
3265c30N29J364l193J438Q52k052L668k502m53J408j930P36J976k174Q80M30k822
$$ -330 199 1563 -1630 -192 660 -1392 2276 -226 -679 729 -1201 -465 1511 -663 217 647 -2175
3282b175L590j645l10J996k927P18J331j627J250J025l053K234q72j103L785l127
$$ -2175 1415 -230 -540 1456 -1471 -753 578 -1049 201 1226 -1827 407 -465 -1568 2217 -910
3298i10O17P63k060J281J489k353K504r36k690L532k070J155J602k845R03L01
$$ -910 -293 470 -1590 -309 1180 -1173 1331 395 -2295 1237 -833 322 1924 -921 -18 283
3314B83j737K269L87k467K768k557J68K595k486J556j08j849J328N16j637K619
$$ 283 -1454 815 1202 -1265 1503 -1054 -886 1709 -777 779 671 -1178 150 666 -971 1648
3330A648j897j219K509k708K200Q74k319J259l23j607K327k33j263K421l357J168
$$ 1648 -249 -1468 1041 -1667 533 1407 -912 347 24 -1583 744 511 -752 1669 -1688 -520
3346e20J008j648K317n11j727R87j50r66L293k551J70J472k944K370j10j070J507
$$ -520 488 -1160 1157 646 -1081 -94 -244 -1210 2083 -468 -298 1174 -1770 600 490 -580 927
3363I27q51j324K547j615J16K089l357J791J02j338K159p30j404J350j220m5K769
$$ 927 76 -1248 1299 -316 -200 1889 -1468 323 425 -913 1246 516 -888 462 -758 -803 1966
3380A966k579J144L7k307K343p05k69J843j555q85J891k043J288J448k770K116
$$ 1966 -613 531 568 -1739 604 -101 -370 1473 -82 -967 924 -1119 169 1617 -1153 963
3396I63j378o83J917m42m12J297k141M50J653k212K190p15j531J571j091K56J534
$$ 963 -415 -1098 819 377 -35 1262 -879 -429 1224 -988 1202 487 -1044 527 -564 -308 1226
3413A226j238p36J246k019K251J46j488J664j882k33J597o64o5J344k369R13Q19
$$ 1226 -12 -748 498 -1521 730 876 -612 1052 -830 -1063 534 -130 -195 1149 -1220 -307 512
3430E12j388K135j226m54O28r18K76J344r20J28M62k091K054m54k31J458j727
$$ 512 -876 1259 33 -421 207 -711 -435 909 -11 117 579 -1512 542 88 -143 1315 -412
3447d12J24M63n12N51J361k389J283n28q06K320j336J40J62j012L21R26q41Q14
$$ -412 -288 175 -337 214 1575 -814 469 -59 -865 1455 119 259 421 -591 -270 656 -185 629
3465F29k69j522J837j141O98Q14j394J24J99r51J080J017j865J254j362J79J306
$$ 629 360 -1162 675 -466 232 1046 -348 -224 -25 -976 104 1121 -744 510 -852 -673 633
3482F33q42R43m84o71k45R44j065J919q97r20J062j419J308M24l43l40J10q17
$$ 633 -209 734 250 -421 -666 278 -787 1132 235 -685 377 -1042 266 690 347 7 117 -700
3500g00R32L06p05R82j441K49o9K67Q42l31n75j71K86q42J734o49k38K81j090
$$ -700 232 538 -167 815 -626 -377 -446 -179 663 332 -243 -414 -128 -970 764 115 -123 158 -932
3519i32J058j39K10j49j59o99P21o5j31J198j292M71l57K29K31J97l31k10j46
$$ -932 126 -13 197 48 -111 -810 -89 -154 -285 913 -379 92 -265 -36 195 392 61 -149 -295
3538b95r9R94n99M63l38o16L54j6N46L7N1r00P55q16N00P35q01M30r47K26J17
$$ -295 -394 600 1 464 126 -490 -136 -152 394 431 482 -418 337 -479 21 756 -45 385 -562 -336 -219
3559b19O91k37l14k36l03O74m90P71n75o8k7k51M59j60P40q91J30k19J81L02K55
$$ -219 472 235 -79 -315 -618 56 -434 337 -238 -306 -333 -584 -125 -285 455 -436 -306 -525 -344 -42 213
3580B13j73l96J08m58J014j26L8k93m27L41J63N80n30N35j115M02j5K33M58l88
$$ 213 40 -356 -248 -706 308 182 220 -73 -500 -159 4 584 54 589 -526 -124 -139 94 552 164
3600A64k43j23K19o5O68m73K2R0n93O67k06L42K4p65k10L54K75R5N39j121J55
$$ 164 -79 -202 17 -48 620 147 169 259 -334 333 127 469 493 -272 -482 -128 147 242 781 -340 -185
3621a85k54M7Q49n66K0q7l88M9Q11n30M19k95o87Q43o66Q24k75l6p31Q97q49R98
$$ -185 -439 -392 457 -109 -89 -176 -564 -515 296 -234 185 -110 -797 46 -620 204 -71 -107 -838 59 -790 208
3643B08K46j005Q89j018K98N50k19M0J51o73k53J137q05J467j063m46P68r05J043
$$ 208 454 -551 338 -680 -382 168 -51 -11 140 -533 -786 351 -454 1013 -50 -496 272 -633 410
3662D10q7l27p2K96j165J357k33j49N64j349N58R5P2O8M50j112N64k43o34J762
$$ 410 323 -4 -76 220 -945 412 179 30 594 -755 -197 -102 -30 38 488 -624 -60 -303 -937 825
3682H25j016J81j00q03P89K06l89L81l32q31J242n38M58R91j974O66K5m08P95
$$ 825 -191 -10 -110 -913 -124 82 -307 74 -258 -1089 153 -385 73 1064 -910 -244 -219 -627 168
3701A68K79j130R32j046o4J480j050R01m90r94J050L09p70Q94m79q65J203j271
$$ 168 447 -683 249 -797 -861 619 -431 470 -20 -1014 36 345 -425 469 -10 -875 328 -943
3719i43R03Q77j559R03n10n52J397j13j031J286j724N31R12j097J525r04o97P07
$$ -943 -40 837 -722 181 -329 -881 516 403 -628 658 -1066 -535 377 -720 805 -99 -796 -89
3737h9k82k48J476j091l68R60j872J711Ql76L42k04q69J155l34j90J208k154J298
$$ -89 -371 -619 857 -234 -602 358 -1514 197 205 -171 171 -33 -902 253 -81 -271 937 -1217 81
3756H1N3r10J477m60o34P54q78o3J626j505M98O41j970J831l14n01R72r95m60
$$ 81 134 -776 701 241 -393 361 -517 -580 1046 -459 39 680 -1290 541 227 -274 698 -297 -757
3775g57J118j123R71P79k092J574p62l66J379q58N0N67j173N5J196j202J278o42
$$ -757 361 -762 209 988 -1104 470 -292 -658 721 -137 -87 480 -693 -638 558 -644 634 -8
3793hj245J861j085Q5J112r41k87Q40j308J400L93j548J419j181j24J353p47L11
$$ -8 -1253 608 -477 -392 720 -221 -508 332 -976 424 817 -731 688 -493 -617 736 -11 300
3811C00K71j322N48Q91j541J818o93p08J059j395N46Q80j130O09K87j789J636
$$ 300 571 -751 -203 688 -853 965 272 -436 623 -772 -226 654 -476 133 420 -1369 267
3828B67p7r45J865j709M64N26q57O37M13j247Q85J23j250J896j214K75K93j124
$$ 267 190 -755 1110 -599 -135 391 -466 171 584 -663 222 345 -905 991 -223 52 345 -779
3846g79Q18Q61j178O29L81j751J760r82k4J276j592P14k8q30J121K81j297J341
$$ -779 39 900 -278 351 732 -1019 741 -241 -265 1011 -581 133 105 -725 396 677 -620 721
3864G21j126k03J454j385Q19P0j263R52L70j144J382m12r87J305j477P90O65p19
$$ 721 -405 -608 846 -539 280 350 -913 39 409 -735 647 235 -752 553 -924 -134 531 -188
3882a88M03J16r26P67K66r79J325j222P9J030j388J257k1r67O91j46m57J295q19
$$ -188 215 331 -595 172 438 -541 784 -438 -359 671 -717 540 519 -448 243 97 -360 935 116
3901A16k78Q55j670J497M1j049J005l90p06P37j2m78J381j365J42J55p44J205
$$ 116 -162 693 -977 520 561 -488 517 127 -579 158 146 -332 1049 -316 -174 -19 -763 442
3919D42l9r63P81m61n66J793j446O26L12j346J334n81L1P28o22o14Q92p60L71
$$ 442 403 -560 221 -240 -806 987 -459 167 479 -867 467 -114 -83 645 23 -591 301 -459 -88
3938h8J197j802J098n82m54J255o74o2P54j001j89J273j187J003j95j240J348
$$ -88 1109 -693 405 -177 -631 624 -50 -112 642 -359 -548 725 -462 541 346 -894 454
3955D54n57k13J020q86k91Q83j015O52M04p99J111j221n0N89J10j86O98j414L18
$$ 454 -103 -316 704 -182 -473 410 -605 47 451 -348 763 -458 -508 81 191 5 703 -711 -393
3974c93P60r70J309k93m71K79m42j8O87k24k98O23j122P84J78n17J011j401J59
$$ -393 367 -603 706 413 -58 221 -221 -239 448 224 -74 549 -573 211 389 -128 883 -518 -359
3993c59L95l3J0P00j041N26j09o06J094n69J06J39p93L19M42m15M38J28j213R32
$$ -359 36 3 13 713 -328 198 89 -517 577 8 114 253 -540 -221 221 -194 244 372 -841 91
4013I1p48O05L57m32j80J58j71J33O84r61O60l94o06J025k86L23k80m57R1M38
$$ 91 -657 -52 305 -127 -307 -149 -320 -187 497 -464 196 -198 -804 221 -65 258 -22 -479 -388 50
4033E0m73P21R3o63P84j041N12L04k17j03j76j55L00N46p13P88n04l60L45j90
$$ 50 -423 298 391 -272 512 -529 -17 287 70 -33 -209 -364 -64 482 -231 557 53 -307 38 -152
4053a52O20j93l81k07K48m22P82Q9o30M86o77L74j1K75j25n8m24K4O56l46N19
$$ -152 468 275 -106 -313 -65 -487 295 384 -246 240 -437 -63 -74 201 76 18 -406 -382 274 -72 447
4074D47p75K73j13j56K98J25r5j32l5m29P01j63J82j89l12K18kL66j26R3p36K25
$$ 447 -328 -55 -168 -324 -26 99 4 -128 -163 -592 109 -54 128 -61 -373 -155 -157 209 83 176 -560 -335
4096c35K27J8K69m42O09p69L55k34K71K41k88J44p18O07j03O00m13k15J00m40
$$ -335 -108 -90 179 -263 346 -423 -68 -302 -31 210 -78 66 -652 -45 -148 452 39 -176 -76 -516
4116e16M23k08O97n02p9M1p7L22k5M2n01L04l20M04J13j77n4l14L12k92M90j25
$$ -516 -93 -301 396 -106 -185 -144 -221 101 76 118 -383 -79 -399 5 118 -59 -113 -427 -115 -407 83 -42
4138d2J56k40k88K97p4N35l47j20k49L77k77L13O3n11N32n96N65J05l36J17l47
$$ -42 114 -126 -414 -117 -191 344 -3 -123 -372 5 -272 41 104 -407 125 -471 94 199 -137 -20 -367
4159c67J80Q5J79N1R4p86M50k20p8Q59m17J80n96K36r0L45l91M38k05n95N82l31
$$ -367 -187 -102 77 128 222 -564 -114 -334 -412 447 30 210 -386 -150 -240 105 -286 152 -53 -648 -66 -397
4181c97L41K48k81j3L6l56L80L15o63Q16q01M4P38n37J45K1k22j63N00k49O79
$$ -397 -56 192 -89 -102 -66 -422 -42 273 -390 426 -375 -331 407 -130 15 36 -186 -349 151 -98 581
4202E81n09l10M59o46M01L11k68k66N03r19R40L2o04P58p03K32r7k16L54K98q80
$$ 581 72 -238 221 -425 -24 287 19 -247 256 -663 277 309 -295 463 -240 -8 -105 -321 33 331 -549
4223e49M14J6m52J062p88O1L93n93L35M09l69J5M5n32R97n53O1N55r18M64n18
$$ -549 -135 -119 -571 491 -297 -236 157 -436 -101 308 -61 -46 -1 -533 464 -89 -28 527 -391 73 -445
4244d45m7N54K14o05K76m03n5J321j061N28n7o32L98j41O9L21j16o62J037q60
$$ -445 -492 62 276 -329 -53 -456 -511 810 -251 277 220 -412 -14 -155 -86 235 119 -543 494 -366
4264c66L18N27q75O75k38n87O29l2j53O08n77k79O97p03P46l15l92N98j74l29
$$ -366 -48 479 -396 279 41 -546 83 51 -102 506 -71 -350 347 -356 390 75 -317 281 107 -222
4284b22P52k85n82Q88j342R56K08n52O80l96m04O73k54l67R53r10K50J85p76J169
$$ -222 530 245 -337 551 -791 165 373 -179 501 105 -299 374 120 -247 706 -204 46 231 -545 624
4304F24p19j56L24l53j67Q79o59J50P82j547Q54M7j03M98o38j46M12k88J85O26
$$ 624 -95 -251 73 -280 -447 432 -227 -77 705 -842 12 59 -44 454 -184 -330 82 -206 -21 605
4324F05j114L54j01m69R66l15j84L99m91k3J096j038N92r8j017J236o40N7P12
$$ 605 -509 -155 -256 -725 241 -74 -258 141 -350 -373 723 -315 277 179 -838 398 -242 -185 527
4343E27m87k02N18q34L63N71j180J103n00m45J013n52K96K95p14NO31r68J075
$$ 527 40 -162 356 -478 -115 456 -724 379 -121 -566 447 -105 191 486 -228 -223 408 -560 515
4362E15n28o76J009n67L31M29n27j99L22o71O48L53o96R73j179K45N32n40M50
$$ 515 -13 -689 320 -247 84 513 -14 -213 109 -562 86 439 -257 716 -463 -218 314 -226 224
4381B24L29q33J43J79p64J337n33k48P41j147M98J38j24K36K83j389J200k36n12
$$ 224 553 -280 -137 42 -722 615 82 -166 575 -572 -74 64 -60 176 459 -930 270 34 -478
4400d78J197j048L86om74M99L11q78R27k91o51J086q43K32K70n97N25n9l45O44
$$ -478 719 -329 57 51 -423 76 387 -491 436 145 -506 580 -263 -31 239 -358 167 108 -237 407
4420D07K4q23P27q38K87Q56q42M35j45l56M93K49o71Q19r45k26R11q98R15j7p01
$$ 407 431 -392 335 -503 -216 640 -202 233 88 -268 225 474 -197 622 -323 -549 362 -536 379 362 -339
4441c39K15K89l65M99m07l17R61j230P62J53n22Q61o51n16Q19Lo05J119j194L72
$$ -339 -124 165 -200 299 -108 -425 536 -694 68 221 -301 560 -91 -607 212 215 -390 729 -465 -93
4461i3L64r56Q78k07k1O5k1m19O50m65K64M41j157P67l10L7N66m28k33M19l43
$$ -93 271 -685 193 -14 -35 30 9 -410 240 -225 39 480 -677 90 -220 -183 383 -45 -278 141 -202
4482b02n8O12o29L82L6p72Q63j94j71L13k76k51R09q51N11mn12L18l32M59L99
$$ -202 -260 352 -277 105 141 -631 232 38 -133 180 -96 -347 562 -289 222 218 -294 24 -308 151 550
4503E50k69k73K22p52M37Q45p70L81o96K67K77m01J02K69j81k32O97r35N55J36
$$ 550 281 8 230 -522 -85 760 -10 371 -325 -58 219 -182 -80 189 8 -224 473 -462 93 229
4523B29m59N26o00K02M64l37n3O84j144M16L12n94R92q08j09N24m91M07K80o26
$$ 229 -230 296 -304 -102 362 25 -28 656 -488 -72 240 -354 638 -170 -279 245 -246 161 441 -185
4543a85o0L34l88O09m31K83l17j83K35K22j86J54M42j090O79k69p1Q45o33l9l47
$$ -185 -245 89 -299 310 -121 162 -155 -338 -103 119 -67 87 529 -561 118 -151 -222 623 -10 -49 -396
4564c96L11r4L83n19L34j19l64Q30m63K61J18n42K05J19k11L40J24m85K18k31
$$ -396 -85 -179 204 -315 19 -100 -464 366 -97 164 282 -260 -55 64 -147 193 317 -168 50 -181
4584a81o2N50l65K03j51n0j50N45m97M73n02m55P45l50L34j08m4M8J06k92L77
$$ -181 -243 307 -58 145 -6 -56 -206 339 -158 315 -187 -642 103 -247 87 -21 -65 -17 89 -203 174
4605A74N1k01L10q43N78j26Q8J62k64j51M1L16p3J27j41j67j76L04R9k8j47k6
$$ 174 225 24 334 -509 69 -57 31 193 -71 -222 -181 135 62 189 48 -119 -295 9 108 80 -67 -93
4627i3J57l25L11r2K38j48l03M21q2P4j82K00k27k70N04m47N77m02L07m75J86
$$ -93 64 -261 50 -42 196 48 -255 166 84 158 -24 176 -51 -321 183 -264 313 -89 218 -257 -71
4648g1K99j90K01j50P2l00L31k45L03n8k49N9m56N62j4J56j16j11j03j31L06N9
$$ -71 228 38 239 89 161 -139 192 -53 250 192 -57 2 -454 108 94 250 134 23 -80 -211 95 154
4670A54k2o0j9k92K19K9k07K47n38M38j66L84J56J6n68L1j16R0M28j42p4k41J29
$$ 154 132 72 53 -239 -20 9 -198 49 -489 -51 -217 167 323 339 -229 -198 -314 -224 204 62 -12 -253 -124
4693a24K90j51P9k02J32m24M82j7J68J46k59m32J20N5J82J43m79J61K28l83M32
$$ -124 166 15 94 -108 24 -400 82 65 233 379 120 -312 -192 -137 45 188 -291 -130 98 -285 147
4714A47l34M75l62k39M82k2L9Rl1n10O67l06R8Q4j60n6j82K58R1O7m17N06n33
$$ 147 -187 288 -74 -313 169 147 186 195 164 -346 321 15 113 197 37 -19 -201 57 148 215 -202 304 -229
4737b29M8N63m19J25R6j34k20L46k13K13k25j97K10j2Q5J28j55j29J62j90J44
$$ -229 -181 382 -37 88 184 50 -170 176 -37 176 -49 -246 -36 -48 37 165 10 -119 43 -147 -3
4758cL18o31P05o46j68M37r0K65k63k47J92K77m62N91j82l85N63p85M80j46J41
$$ -3 315 -316 389 -257 -425 12 -78 187 -76 -323 -131 146 -316 275 93 -292 271 -514 -34 -180 -39
4779c9K27P0p15O62l78m8N32p98M86L1q3K84r1m79M33l23k34O18m79M76K14q42
$$ -39 188 258 -457 205 -173 -221 311 -487 -1 30 -53 231 140 -339 94 -229 -463 155 -324 152 366 -476
4801d76O02l9k04M61r9o80P84m96R9M98p40M60k39j23K52K58m45K79k37k04Q39
$$ -476 126 87 -117 344 245 -435 349 -147 -48 450 -290 170 -69 -192 60 318 -127 152 -85 -289 550
4822E50r18M99J01o28N14l68K0P70l32m75K87l42L67Q5l61M28l44j79M16K0l04
$$ 550 -368 131 232 -396 118 -250 -230 540 208 -267 20 -322 45 130 -231 197 -147 -326 90 110 -194
4843a94O09r30L69K71n44O63j5m76M28k75r5P36l39j86K63j035Q27J2j88K20j03
$$ -194 415 -515 -146 125 -419 244 229 -247 181 -94 -189 547 208 22 285 -750 77 89 -99 121 18
4864A8j67N62o69J82M10n07K91l7m31O07k85N2M2k33k8L49l65N26l1q92R86m96
$$ 18 -149 413 -256 -74 336 -171 120 83 -348 259 -26 26 68 -165 -193 156 -209 317 286 -606 380 -116
4886a16K63L97n60r3K16m49L28N03o17K90j09m66Q11m59K27J36o26L55J46o06
$$ -116 147 544 -16 -109 107 -342 -14 489 -128 162 53 -413 398 -61 166 302 -324 31 177 -429
4906d29P45J7p08O92o63J58M83m89K11K6l49K09J67m48P42l80l53N54m20L71J13
$$ -429 316 333 -375 317 -346 -188 295 -194 17 43 -306 -97 70 -378 364 -16 -369 185 -235 136 249
4927B49k99j00L00n74P60m28l23N00m76M07Q1J11N3p1o83O75r2m02Q68n77k80
$$ 249 -50 -150 150 -424 336 -92 -415 85 -391 16 97 208 261 190 -493 182 90 -312 556 -21 -301
4948c01N19o01M17K05k86J47k29k89M92l81J90O60j096O43r9K0k7K76o93N49m86
$$ -301 218 -383 34 239 -47 100 -129 -418 74 -307 -117 543 -553 90 -9 11 -16 260 -433 116 -370
4969c70l3R20q40N62k14j80J03J53p3J38l36j5N83p44O18k62l14O14l19P0O3j03
$$ -370 -403 517 -323 239 25 -155 -52 101 28 166 -170 -185 398 -346 272 10 -304 310 -9 61 124 21
4991B1l73Q51p97P6M16l85N09k15k47J00Q1l17N79n66J0K96p38J090m84J39J87
$$ 21 -352 499 -298 -222 194 -191 318 103 -144 -44 37 -280 299 -267 -257 39 -699 391 -93 46 233
5012B33r8l21M31j92j68N12r11N51J14l26M32k7n83N10p1k19P47n46J88m7p27
$$ 233 135 -186 245 53 -115 397 -514 37 151 -175 257 230 -353 157 86 -133 614 68 256 209 -518
5033e18P36m0J86k0j59n37M07l37M98J06q03M66J0r2J10K6l57L87j25q2K68m44
$$ -518 218 178 364 344 185 -352 55 -282 216 322 -481 -15 -5 -97 13 39 -318 69 -56 -138 130 -314
5055c14M27k50j10M17j04O3J63k63k38J58j70K18j7l10N53m99j1K65k63O4L79
$$ -314 113 -137 -247 170 66 129 292 29 -209 -51 -221 -3 -20 -330 223 -276 -287 -22 -285 -221 158
5076A58k87J84K22k13L73p21K27K86j87j30M82m35o1R6k70M58p6j47J94k12j24
$$ 158 -129 55 277 64 437 -284 -57 229 42 -88 394 -41 -102 -6 -276 182 106 -41 153 -59 -183
5097a83J66J45l06M47o93M12J5kN02n47L46o5j15k24N22n88R4m6p3K66j14n9K89
$$ -183 -17 128 -178 269 -424 -12 3 1 503 -44 302 237 122 -102 420 -168 -74 -120 -193 73 -41 -100 189
5120A89k97L76k61j60J30J11k13J25j13J54K16l78L82l18Q5q4N5kJ00l60J17L31
$$ 189 -108 268 7 -153 -23 88 -125 0 -113 41 257 -121 261 -57 28 -56 -1 -3 97 -263 -146 185
5142A85j99J62k12J33n3N1q8l2L51n24M05m60K66J49l79L23k39Q3j06K31j58J70
$$ 185 -14 148 -64 69 16 67 -21 -53 298 -226 179 -281 -15 134 -245 78 -161 -78 -184 47 -111 59
5164E9m5q4n4N3J26j26n0R4J00j26J04j4N0l7j40R0K1K6j39K67r5j29R1q9M34
$$ 59 14 -70 -124 -71 55 -71 -121 -27 73 -53 51 37 87 50 -90 0 21 47 -92 175 80 -49 42 -47 387
5189C87k93n1p9Q1K15r5J39n73L85p9j0q2K82l0l60jL9K25k66K25q6j09R7J09
$$ 387 94 43 -36 45 260 165 304 -269 116 37 27 -55 227 197 -163 -164 -125 100 -166 59 -27 -136 -39 70
5213G0k0n7L24l74l1r6J23Q8j3q4o8N0J26m8j29K82P3n55M47o5l0Q7j36K01l13
$$ 70 50 -7 317 -57 -88 -184 -61 27 14 -70 -138 -88 38 -10 -139 143 216 -339 108 43 13 100 -36 165 -148
5238a48K53p8J86l88L16l60M01N0j79K21m51J71l10N24l46L02k53L5K66m26O15
$$ -148 105 27 213 -175 141 -219 182 232 53 274 -177 -6 -316 208 -138 164 -89 -54 212 -214 401
5259D01k87o7N8l88J02M78l46J18Nq8l2R8J60P9l80J08j64K77k25J83l74N49j99
$$ 401 114 47 105 -283 -181 297 -49 69 74 -14 -46 52 212 291 -89 19 -145 132 -93 90 -284 265 66
5282F6l85M85m04M92j25m17K44r0O5k3J99k69J30k04J76J38o8N0j82k3J45M0k51
$$ 66 -319 166 -238 254 129 -288 -44 -134 -69 -92 107 -162 -32 -236 -60 78 10 60 -122 -145 0 40 -211
5305b11M59n65L05J71k44K20k41m8j9J18n2L91r4o53O06m81K67J93k85K12R4l86
$$ -211 248 -317 -12 159 -85 135 -106 -154 -173 -55 -107 284 190 -463 143 -338 -71 122 -163 49 143 -243
5327b43K69m9n6N27n64Q0K5j14M56k41m84N98l6n17O21j46j31K51k63q7N2Q3K56
$$ -243 26 -23 -79 448 -116 -36 -11 -125 331 90 -394 204 168 -349 272 126 -5 246 -17 -104 -52 31 287
5350B87l7l80L10l91l7M46n21N65m11k80M45M1m00P14m57k19N85n61P22l79k50
$$ 287 250 -130 180 -211 -248 198 -323 242 -169 -449 -4 37 -363 351 -106 -325 260 -301 421 42 -208
5371b08K39j60O7R3j32j67M57l33m5L74l13O03m45l53K26O8j57L09k61m9L51m15
$$ -208 31 -129 -62 31 -101 -268 189 -144 -189 185 -128 475 30 -323 -97 -29 -186 123 -138 -187 164 -251
5393b51N16J7k94J37q8j39L45l68j41M95m53K68L1l26N41m19K0J65K11k55L28
$$ -251 265 282 -12 125 37 -102 243 -125 -266 229 -224 44 75 -251 290 -129 -109 56 267 12 340
5414C40k29j13r6l23O53l13Q0j40J41k47M20j91K15K75j056M64K8o8N09l90Q4
$$ 340 111 -2 -98 -421 232 -81 -1 -141 0 -247 173 -18 197 472 -584 -120 -92 -160 349 -41 43
5435D3j35j29J43J81m00N48m56j74N01k83L3L27m77K6K53k65j47M14n25Q91q08
$$ 43 -92 -221 -78 103 -297 251 -205 -379 122 -161 -128 199 -278 -252 1 -264 -411 3 -522 369 -439
5456d39K02N75l99pJ55j97M8K23k07M41m38j17K81k81L07P5k55K60k13K7J92L5
$$ -439 -237 338 -61 -68 87 -110 -62 161 -46 395 -43 -160 121 -160 147 222 -33 227 14 41 233 268
5478B68n0Nl32J90K80k74J39j90k85L63J64j85J69l94j2J71l68N38r3l43L40k39
$$ 268 218 223 -109 81 361 87 226 36 -249 114 278 93 262 -132 -144 27 -341 197 104 -239 101 -138
5500a38k66O50l22Q9K19o51L29P5k8K97j25n25M16j10k10N32m47L37K9m07L16
$$ -138 -404 246 -76 13 232 -419 -90 -15 -43 254 129 -396 20 -90 -300 232 -215 122 151 -256 60
5521F0j05j43N57j82l52L44j65rQ9j95K87k55j2L60p4k78L49p07O66R4o19N06
$$ 60 -45 -188 369 187 -165 179 14 5 94 -101 186 -69 -81 279 205 -73 276 -431 235 329 -290 216
5543B16k63j24L52j45k05M12l05M2Q1k85M33K1j93k69K07KK97j90k79M97k95m1
$$ 216 -47 -171 181 36 -169 243 -62 -20 61 -224 209 230 37 -232 -25 -23 274 84 -195 302 7 -34
5565c4K74l24K43k89j1M2J85k29N99o15J97J6l67L76j11M2Q7L3l39L04l67J58
$$ -34 240 -84 159 -130 -141 -99 86 -143 456 -159 38 54 -313 63 -48 -6 81 114 -225 79 -288 -130
5587a30K66k11L03o7m28L69n5j53K83o3j76K41o16L71M0k29M40l01K24N1k71j73
$$ -130 136 -75 228 161 -267 102 47 -106 177 114 -62 179 -437 -66 -26 -255 185 -116 108 159 -112 -285
5609b85K60o2L14j97m16N14j54J92l8j31Q9K7k30P4K28k62K51j57o4N07m89m9
$$ -285 -25 -87 227 30 -386 128 -26 166 128 -3 86 113 -117 -43 185 -77 174 17 -47 460 -29 -78
5631g8L41k27p7J01m01O69j85m36N55m25J60jjn8Q9o3R0L29l41J36m78L07R5l71
$$ -78 263 36 -41 60 -341 328 143 -293 262 -163 -3 -4 -5 -63 26 -37 53 382 41 177 -301 6 101 -270
5655b70M36Pj12kL0l38L42j56K44j91k45L65l04NK70J0q6j68j99K54L7k51L91
$$ -270 166 173 61 59 89 -249 93 -63 181 -10 -255 110 -194 -189 81 91 5 -163 -362 -108 -71 -322 69
5678F9j71M6j47J95l4p4jj54O91n68K24J16j18j86K50j26P3Rk32K1j81K12K36
$$ 69 -102 -56 -203 -8 -42 -116 -117 -271 420 -148 76 192 74 -112 138 12 85 94 -138 -117 -298 -86 150
5701A50l39J75J62k43P3O1k11K04Q7k14P5n7J98k58K83k6j98j54j4O13l79J12
$$ 150 -189 -14 148 -95 -22 39 -172 32 119 -95 -20 -77 121 -137 146 120 -78 -232 -246 367 -12 100
5723A00j07J59j22J43Q6m30J05j9N0l0K95j75M1K8m7J70j75J96j81n8l36K37q5
$$ 100 -7 152 30 173 259 -171 -66 -85 -35 -65 230 55 96 124 77 247 72 268 87 29 -307 -70 -155
5746a55K17J81l90n0K8N1L35j84Q0j07l8r2Q2k9J32j58J14j34L14j26l68M99l87
$$ -155 62 243 -147 -197 -169 -118 217 33 113 6 -32 -124 -42 -71 61 -97 17 -117 197 71 -297 202 -185
5769a85L20k54K56j01J1j03m5o6J5K00M6j01j79K06m2J21J3j99J77l86L20j06
$$ -185 135 -119 137 36 47 -56 -101 -167 -152 48 94 -7 -186 20 -22 99 112 -87 90 -296 24 -82
5791h2J20J52m17M74l00Q1j99J34J15j07J21k11L57l06R3jj62J57j77K44o2J73
$$ -82 38 190 -227 247 -53 28 -171 -37 78 -29 92 -119 238 -68 25 24 -138 19 -158 86 24 197
5813A97l98K48r9n0J34Q0m62K50O9l7J50k28J60j54M4J54N2j41J27j79o3K63j86
$$ 197 -201 47 -52 -102 32 112 -350 -100 -31 -68 82 -146 14 -140 -96 58 110 -31 96 -83 -146 117 -69
5836f9J83R2m32M59m30J7L25m14L91k17J72k03Q8q4J31M5m24L07q5k8N0J87j56
$$ -69 114 206 -226 233 -197 -180 145 -269 122 -95 77 -126 -38 -122 9 54 -370 -63 -148 -176 -126 61 -95
5859i5L30j49j75qj60M58n42J70K03k08L97j78j21M1O4k07L37l48OK48l07J64
$$ -95 235 86 -89 -97 -257 201 -341 -171 32 -176 221 43 -78 -37 27 -180 157 -191 -185 63 -244 -80
5881h0J11K6J47j23k93L58m39K01K24o03L80K7j74M56r7l29L3J02K11N7l04K35
$$ -80 31 57 204 81 -212 146 -293 -92 132 -471 -91 -64 -238 218 121 -208 -175 -73 138 195 -109 126
5903A26j27l23N81l86L0J87P4m49M75l26J83O2l50M29l39OK19k05J6K79l12L3
$$ 126 -1 -324 257 -129 -99 88 162 -287 188 -138 45 107 -243 186 -153 -147 72 -133 -117 162 -150 -117
5925a17J03l64M72j08J56k41J30j37K26m6j23K52n33O39j39m00K14j48J44P9j31
$$ -117 -14 -378 94 -14 142 -99 31 -106 120 74 -49 203 -330 309 170 -230 -16 -164 -20 59 -72
5946g2J23J55n67N34l7k75M53l40m5J14j33J98O1j58J29P3l22M13l85L8L23l21
$$ -72 51 206 -361 173 136 -139 314 -26 -71 43 -90 108 169 11 140 213 -109 304 -81 -43 280 -41
5968d1j25L40m84L35K75p00L38K02j94O65p47J1P1o7J82J05l88M14Rk86M00m69
$$ -41 -166 174 -310 25 300 -400 -62 140 -54 611 -136 -125 -54 -121 61 166 -222 192 201 -85 315 -154
5990a54J44P3j44J40k24pO15k80k93L33n45J2N61n08L25Q4m46L34K41k49K25p6
$$ -154 -10 63 -81 59 -165 -172 443 163 -130 203 -342 -330 231 -277 48 132 -314 20 261 12 237 161
6012A61k71K37m62M00N9m40L79J91m26J79J3k34O03o70J77J98j45j7Ml56L70J21
$$ 161 -110 127 -335 65 124 -316 63 254 -172 7 20 -214 389 -281 -104 94 -51 -68 -64 -420 -50 71
6034G1l20N49l13q8J60o6j0%k32M68l0k74J80k14Q5K05l35Q3J20j24J22p3k30
$$ 71 -249 300 -13 -101 59 -7 -17 -17 -249 219 189 -85 95 -119 -34 171 -164 -81 39 -85 37 -36 -266
6057b66K98m0j12N05m92J83k45NJ82K5j05J23l07QL84l01K74P9m68L13p0K02r2
$$ -266 32 -8 -120 385 -107 76 -169 -164 18 43 -62 61 -246 -238 146 -155 119 198 -270 43 -27 175 83
6080H3J0k58L53l32K07M14p81L45O0n5Pj49j17M66m40J69J10l30L06J39k14L01
$$ 83 93 -165 188 -144 63 477 -304 41 101 46 53 -96 -213 253 -187 -18 92 -238 68 207 -7 294
6102B94q1m16M74k01JK54o85M88J02n97N71m28J15K5j01R7M02o06L20o0j59L10
$$ 294 213 -203 271 70 71 325 -360 128 230 -367 204 -224 -109 -84 -185 -88 314 -292 28 -32 -191 119
6124A19q4n3K27k93j85L35L6k53M35m68L35k28M8K1k09L53j14l36J46N91m13K53
$$ 119 35 -18 209 -84 -269 66 102 -151 284 -184 151 -77 -29 -8 -217 136 22 -314 -168 423 10 263
6146B63j22l82L28l59M20O1k47j18L00m3n8k5j00K62n55M27j59J59K34j69k25
$$ 263 141 -241 87 -272 148 209 -38 -156 144 101 43 18 -82 180 -375 52 -107 52 286 117 -108
6167a08k6O0q2K59r4O1j07J54q7k2M9l27J40J02J92j48j73K57k83J36N8J0n0O2
$$ -108 -134 -74 -156 103 9 70 -37 117 30 8 57 -270 -130 -28 164 16 -157 100 -183 -47 11 21 -29 33
6191C3l41K40L25n92N23j75j03n1M5K06Q3l74J08J01j81m5mP5K09j83k6L25k86
$$ 33 -308 -68 257 -335 188 13 -90 -141 -96 110 193 -181 -73 28 -153 -198 -202 -127 82 -101 -127 198 -88
6214h8K69J3l64J55k22J32M20k68K1J2l02M56j38j48K51j46j95J64k01J93J18
$$ -88 181 194 -170 -15 -237 -105 315 47 68 80 -222 234 96 -52 199 53 -142 22 -179 14 132
6235A32j46O7J26k52j22K86j97J28p7j09J47k9J05l6j91L2L01j87q4N6r7k2k8
$$ 132 -14 53 179 -73 -195 91 -106 22 -55 -164 -17 -46 59 23 -168 -136 165 -22 -106 -50 -147 -169 -197
6258a97J13R1k6O3K3k41O2K20j25P0o4k70J31N8K38j23q1j10J20K6j39J72j20
$$ -197 -84 7 -19 44 67 -174 -112 108 -17 53 -11 -281 -150 -92 146 23 -58 -168 -48 -22 -161 11 -109
6281a09J1J02q0J67qp6po3O5j19J96K08k43j75j2J58L31l90J21j57J83j03ROr4
$$ -109 -98 4 -76 91 83 7 0 -63 2 -117 79 287 44 -131 -143 15 346 -44 77 -80 103 0 9 15 -79
6306g9r5K74J7l02K14l5m7k86K86J40j13k90L02J56m43O34n19L46j4l23M00m54
$$ -79 -174 100 117 -185 29 -6 -53 -339 -53 87 -26 -316 -14 142 -301 333 -186 160 146 -177 223 -231
6328b31L55j64k07o9L78r6k2K19j60J61k23k6J05nk9k8j13J29l2L7J89q2j70K22
$$ -231 124 -40 -247 -316 62 -34 -56 163 3 164 -59 -85 20 15 -14 -42 -155 -26 -58 -21 168 86 -84 138
6352A38k11R8J01n3P6J89m98J31J40j49J52j64O7j10Pk4J31j8K09k33k6L42j36
$$ 138 -73 25 126 73 149 338 -160 -29 111 -38 114 -50 17 -93 -86 -110 21 3 212 -21 -47 295 159
6375A59k74K26r8J48j35m6L6K28m23M6O9M9K5J12p6j36M7j2Mq7K61j14l31N49
$$ 159 -115 111 13 161 26 -20 16 244 -179 -133 -64 -15 10 122 46 -90 -43 -55 -51 -138 123 9 -322 227
6399B27l16P7R6n4n9K9j08L3O3j56N73n19J61j3j65K31J93k88Pr7J94J55m49q0
$$ 227 -89 -12 84 30 -29 0 -108 -75 -12 -168 405 -114 47 34 -131 100 293 5 12 -85 109 264 -185 -265
6423b65M11m3j16qK7L1j0l04M81k02J1R6l49L40j6l3j04j0o2K27l10o7N65n11
$$ -265 146 103 -13 -21 6 37 27 -277 204 2 13 109 -240 100 84 51 -53 -63 -125 102 -208 -275 290 -221
6447b21J89R4m15L57k1L5j8N4k75M50l81K27L07q65N19K2k8K8kj14L39m46m1L03
$$ -221 -32 62 -353 4 -17 18 0 54 -221 229 -152 75 382 -483 36 58 30 58 56 -58 281 -165 -206 97
6471I7k65L92l62j37L14k79K43o1j13r9N43l65K59l2m52J70M5J71M8o7k20J77
$$ 97 -168 224 -138 -275 39 -240 3 -58 -171 -270 273 -92 167 135 -317 -147 -102 69 117 50 -170 7
6493Gj10K38j8k36N61n21l40N64j3l71J45O6J53j51k52L41%OJ0p0l3K46j90p5
$$ 7 -103 135 117 -119 442 -79 -419 145 132 -239 -94 -28 125 -26 -278 63 63 69 79 9 -24 222 32 -43
6517d3J74l17K41o7P6K53m13q1M42k45L61o0n52N01l97m21O47j73L78j61n5j43
$$ -43 131 -186 55 -12 64 317 -96 -177 265 20 381 321 -231 270 -127 -548 99 -74 304 143 88 -55
6539e5J11k33N9L36n58N27l61J28J04k87K84j6k91o4N04k30K16k58R2K62l27M8
$$ -55 56 -177 -118 218 -340 187 -174 -46 58 -229 55 39 -252 -316 188 -42 174 -84 8 270 -57 -9
6561iO9r8J29J56m32M62l44O4K50m55K32m7j83M94m88O4K4J06R9J25k67OJ55m09
$$ -9 60 -38 91 247 -185 277 -67 -3 247 -208 24 -23 -206 288 -200 -136 -112 -6 93 218 -49 -43 112 -297
6585b97M55J72k86j4P5p6N1n0k60O17o60M54j86l4p4RL26k52J12n01P47l25K2
$$ -297 158 330 44 30 105 29 80 30 -230 387 -273 181 -5 -39 -113 -104 222 -30 82 -419 328 3 25
6608B5J0j72L66K1k54J48j61n9L35k78j33K87l48L48k20Q5J45r3K7Q6m08R4L23
$$ 25 35 -137 229 250 -4 144 -17 -76 259 -19 -152 135 -213 135 -85 0 145 52 79 165 -243 -149 174
6631A74l58L57q2l80L83j42R7J09k41l09O01k78O2K06k78K88m63L01M4N6k69L20
$$ 174 -184 173 91 -289 94 -48 49 158 -83 -392 209 -69 -7 199 -79 209 -254 47 91 147 -122 198
6653A98n22K75J95m38L51j2p1P7o1M8p1r1J39m7j65L10O8j67J84j28j00qN5K28
$$ 198 -324 -49 146 -292 59 47 -24 53 -8 40 -31 -122 17 -30 -195 115 183 16 200 72 -28 -36 19 247
6677B47k21l05L28m6o9L82m55J35p7J12r5j55L8K82j0r6K2j89J71K4j69lJ24m3
$$ 247 26 -279 49 3 -66 316 -139 -4 -81 31 -64 -219 -181 101 91 -5 17 -172 -1 23 -146 -149 -25 -68
6701f8r2K24j37J8k1j64K84n4ok19J41J24j43N0J18Lk90M54m21K82m8rO0J73l56
$$ -68 -160 64 -73 -55 -76 -240 44 -10 -16 -235 -94 30 -113 -63 55 58 -232 222 -199 83 35 26 86 259 -97
6726i7M10l4l93K76k01N2J75k77L0J79j58k70M17j32L50m73Q1K39j88K75j34J7
$$ -97 313 279 -114 162 -39 13 188 -89 -59 120 -38 -308 109 -23 327 -146 -65 174 -14 261 127 144
6748A44j06J03m85L74r0QK24n10L77j44K42l33K27K28k58q4j79J84J66j77K43
$$ 144 38 141 -344 30 -60 -52 172 -338 39 -105 137 -196 31 259 1 -83 -262 -78 88 -89 154
6769A54m9k42J86K31n71K12l1J85j73J01J99j90L7j35J10j32K40n8j03qj08K74
$$ 154 105 -137 49 280 -291 -79 -110 75 -98 3 202 12 49 -86 24 -108 132 74 -29 -37 -145 129
6791A29k98N43l96n2J47N2L4o9P6k98K48j36N4Rj03o9n1O2K28J54l07j10NL01
$$ 129 -169 374 -22 -74 73 125 159 90 166 -132 116 -20 34 43 -60 -129 -180 -118 110 264 -43 -153 -148 153
6815A53r2l5j8J41q8pp6J24J49p6k98J11j0M5p5lK05O7k00k2J06Lj20K49j59N6
$$ 153 61 26 8 149 61 54 -22 102 251 175 -123 -12 -22 23 -52 -55 150 217 17 -5 101 104 -16 233 74 130
6841A30j30j78K60m4j83L48k09j6K04l64J94j28j25K28O1j55J03j13K15k16K8
$$ 130 0 -178 82 38 -145 203 -6 -22 182 -182 12 -116 -241 -13 48 -107 -4 -117 98 -118 -90
6862i0j99J11L49k28L04n4Q1p6l76J75k48K10J90J61q3j13j05K3L19o09K17J72
$$ -90 -289 -178 171 -57 247 193 274 198 -178 -3 -251 -41 149 310 227 114 9 32 351 -258 -41 131
6884A31j10O4j40K85k05lJ06K10m35K56k12r2Q5K7k0o8J55m1J62l86J47J65k21
$$ 131 21 85 -55 230 25 22 128 338 -97 159 -53 -145 -60 -33 -53 -121 34 -7 155 -231 -84 81 -140
6907a40L87k53j33J78j13m6J06j37K72j5l37J82j7R6M9q2k62K74k27N14k12j26
$$ -140 247 -6 -139 39 -74 -120 -14 -151 121 106 -231 -49 -66 30 79 -3 -265 9 -218 296 84 -42
6929d2J12j67p1K07l52L08O7j01K55k47o8Q4J37k66L67n05K02J16k75K65n3J9
$$ -42 70 -97 -168 39 -313 -5 62 -39 216 -31 -99 -15 122 -144 223 -282 -80 36 -239 26 -27 -8
6951hk52M28Jl27k0J03P1n6J82m68N23k41J35k33M44n73M78M6l35K54k11k84M58
$$ -8 -260 168 169 -158 -178 -75 -4 -60 122 -346 177 -64 71 -162 282 -291 187 233 -102 152 -59 -343 115
6974A15M3k25K33J99k35K1l65L58k73p1J13J87k54P0K30k38K67k44M28k75j56
$$ 115 158 -67 166 365 130 151 -214 144 -129 -200 -87 100 -154 -84 146 -92 175 -69 359 84 -72
6995g2J48j62R4M9K09l28L68l33rO7j08J25p7j78L73l67q7L32j59J21K77l63K76
$$ -72 76 -86 8 57 266 -62 306 -27 -36 31 -77 48 -29 -207 166 -201 -288 44 -115 6 283 -80 196
7018A96o5k21K46l38R2j06M8k3L92l76L54k42j31K76k40K8J82K21k82K05l38J41
$$ 196 131 -90 156 -182 -90 -196 -148 -171 221 -155 199 -43 -174 102 -138 -110 72 293 11 216 -122 19
7040A9lj45K32n84M42J62k32J12J2J27n1p5l47N90k26PJ9k23J67J6k0j7L04n02
$$ 19 16 -129 103 -481 -39 123 -109 3 15 142 91 16 -331 259 33 40 59 -164 3 19 -1 -18 286 -216
7064b16M01m2m05M53m58lL65j24q1M12j29j42Mn8J99j55r1J39r4k34K39L0m6j73
$$ -216 185 143 -262 191 -267 -270 95 -29 -110 302 173 31 35 -23 176 21 -70 69 -25 -259 -20 10 -36 -209
7088b09J6L06j56OJ69k24K8J76p4j26J04j47K55k4k55K34n8J9J37o8N8o9l53K35
$$ -209 -193 113 -43 -37 132 -92 -64 112 38 -88 16 -131 124 100 -155 79 21 40 177 109 167 98 -255 -20
7112b0J68l01K10p0p0M79o45M32l65K34j35L9kL17l47r8J07O5J74j84oJ09L0k22
$$ -20 148 -153 57 -13 -83 396 -249 183 -182 52 -83 -44 -46 271 -76 -174 -67 -2 172 -12 -18 91 121 -101
7136a01K59j75k68N99n36N9L31m19M21j64j8R9r5J05J16k39K48jk04oJ01k05j12
$$ -101 158 -17 -285 314 -222 -163 168 -251 170 6 -12 87 -8 97 213 -26 222 221 17 11 112 -93 -205
7159b05L90j95l3r2K60J98l66J59k94K07J21q9k92M00k31j93M84k24m9J95m74
$$ -205 185 -10 -43 -135 125 323 -43 116 -178 29 150 61 -231 169 -62 -255 229 5 -44 151 -323
7180c23J99J51l51O11j95k81K97o7j19J02N1O2p5l03K80J02q2K62n42K93J85k81
$$ -323 -124 27 -324 287 92 -189 108 41 -78 24 75 137 62 -241 39 141 59 321 -221 72 257 -24
7202b4K93j89j86J13j34r9L66j10J07j02j46K16O8j90M7k03K73j67P0lP7k00J26
$$ -24 269 80 -106 7 -127 -226 140 30 137 35 -111 105 173 -17 30 -173 100 -67 3 0 77 -123 3
7225CJ32m05N06l27J83J1k3q5Q7j57j27K07j13L14m53K67J38k81K47j94j75J82
$$ 3 135 -270 236 -91 92 103 80 -5 82 -75 -202 5 -108 206 -247 20 158 -123 124 -70 -245 -63
7247f3J87j60K14l38K71K2p0R0k57J4m6M16k83k5J13o35N18k65J47J92K1j01J1
$$ -63 124 -36 178 -160 111 133 63 153 -104 -90 -136 280 -3 -28 85 -550 -32 -297 -150 42 63 -38 -27
7270b7M8K4P5j73K24j2j90J63O8k97p9J52n0J36n5k7Np3n0NK69l2k1J1r2q3r2
$$ -27 21 45 120 -53 171 159 -31 132 200 -97 -176 -24 -74 62 7 -20 -15 -88 -138 -133 136 104 83 94 2 -81 -173
7297a73J38J01j7n1L37m12OP2M0J61l28K09l44L26j03j22K23k20K97j70m7O4j9
$$ -173 -35 66 49 -2 335 -77 -71 1 41 202 -126 83 -261 65 -38 -160 63 -157 140 -30 -77 -13 -32
7320c2nJ39p4j7n3N7l4J50k13P7n8K66l11KK1K28j23l1j05k3M1%L72k53j2J70
$$ -32 -37 102 28 11 -42 15 -19 131 -82 -5 -63 203 -108 -106 -85 143 20 -11 -116 -139 -98 -98 274 21 9 179
7346A79m4k76J86k9P8k12r7L39k44R9J97j39P8%l82J29J92J2M2j09j07n8J63j02
$$ 179 135 -141 45 16 94 -118 -215 124 -120 -21 176 37 115 115 -267 -138 54 66 108 -1 -108 -166 -3 -105
7370a05K9J2J18O6j25J88q5k2n2k83L62n7J24k19J01r0n9P4J18j50j36J06N6k35
$$ -105 -76 -64 54 120 -5 183 98 76 24 -259 103 46 170 -49 52 -38 -97 -23 95 -55 -191 -85 -29 -264
7394b64L45K2l79K52N0K22j1l07K10k79L23l25K30j0o6q6j0O5q5j5O2j68M73l05
$$ -264 81 103 -276 -24 26 248 237 -70 140 -139 184 -141 89 79 13 -73 -83 -18 -103 -118 -56 -224 249 -56
7418e6l38N42k26L17j79r1j52L13o2K7j6l59L28N0o2o1J68k47K39k86R3Q9j50
$$ -56 -394 148 -78 239 60 -31 -183 130 68 95 79 -280 48 98 36 -25 143 -104 135 -151 -58 31 -119
7441a19K50l47J26J68j00l0K91l14J14L9p0J66j72j9P9k06M53j26j03r6J95m52
$$ -119 131 -216 -90 78 -22 -52 239 -75 39 78 8 174 2 -17 62 -144 309 183 80 -16 179 -273
7463b73M33j18R4j62k08K35j02j0K72J47n52J90L9k24L55K8k29L42m65J53J73
$$ -273 160 42 136 -26 -234 1 -101 -111 161 308 -244 -54 -15 -239 116 144 -85 257 -208 -55 118
7484A18M8O6j53k81K76l13P8O0J23J15l17K06j58R8O5J27j79L8o3j33K28M0l9
$$ 118 166 232 79 -202 74 -239 -161 -101 22 137 -180 26 -132 -34 31 158 -21 17 -46 -179 49 89 50
7507E0Q2k52J58J78j06j90L79l64L30k14N7N6j52L5J39j91k08L38k48L4K34q8
$$ 50 132 -120 38 216 110 -80 299 -65 265 51 108 164 12 47 186 -5 -213 125 -123 -89 145 57
7529E7k10K10k14P2rQ1j04N0oJ57j32Qk2m4kP7J35j43l5j37K81l9R6k18rJ95k1
$$ 57 -153 57 -157 -85 -94 -13 -117 -67 -73 84 -48 -40 -62 -106 -108 -31 104 -39 -74 -211 70 31 127 -91 -100 95 74
7556G4j1O4j68J42j7j22L3j81K53J29k38j0L32l32j85O11o04R8L52m18N03l69
$$ 74 63 127 -41 101 84 -38 -5 -186 67 196 -42 -52 280 -52 -237 374 -230 -132 220 -198 305 -64
7578f4p4K44k11R2n5O2J28O7j54J0r7j57K11k88M89j44Q8k91L63k89O1J43j9J7
$$ -64 -138 106 -105 -13 -68 -6 122 189 35 45 -52 -209 2 -286 203 59 147 -144 219 -70 -9 134 115 132
7602A32k02j56J80m4J31J58k60M4N0j49K29j02p8K66m43L51n1q0j32J96k50L85
$$ 132 -70 -226 -46 -90 41 199 -61 -17 33 -116 113 11 -67 199 -244 107 56 -24 -156 40 -210 175
7624A75l22J0R8k16Q7Q2M2RpJ24j35L39l86J94l76J10K17j86P3L27j54pj47l11
$$ 175 -147 -137 -39 -255 -168 -86 -44 -35 -42 82 -53 286 -100 94 -282 -172 45 -141 -68 259 105 98 -49 -360
7648c60N18r0J82k26j29K51j07J11j99K39l98L07l44O2M27m17J07O0M3P8q8k2
$$ -360 158 68 250 24 -105 146 39 150 -49 190 -208 99 -245 -183 244 -173 -66 -6 37 115 27 5
7670EJ15j02k01L05k60L10l50RJ67J16m33K53R0l66K78q9K00P4k19pKk37M54J52
$$ 5 120 18 -183 122 -138 172 -178 -169 -2 114 -319 -66 24 -342 -64 -153 47 121 -98 -105 -103 -340 114 266
7694B66n67L26J9j1O2j37N9J68j22j87K75k35M7m9K2J72j45Q0J38l22KL65k49
$$ 266 -301 25 44 33 95 -42 17 185 63 -124 151 -84 -37 -86 -64 108 -37 43 181 -141 -139 226 -23
7717b3J8l53L27J41k81J23P5p6J29j84J34j0jk69N9J02R7J03l58L46k25j2K64
$$ -23 -5 -358 -31 110 -171 -48 27 -49 80 -104 30 20 19 -250 -191 -89 8 111 -247 99 -126 -138 126
7740A26p8O7k26L09l44M5k10L16k77j5N56m22J08J22l5Nm9l05M39M0l24J90n1
$$ 126 48 115 -111 198 -146 -101 -311 5 -272 -287 269 -153 -45 77 42 47 -2 -307 132 172 -152 38 -13
7763a3l0J62j03k7J24n8l49K37J10O0l99L27O7k57Q9m3Q8K28r2j00j5l29K86j9
$$ -13 -43 119 16 -11 113 55 -294 -57 53 113 -286 41 108 -149 -60 -103 -15 213 121 21 6 -323 -37 -56
7787e6P2M0j31J0MJ99l31N39l56j63L06m3n0J11l16M0K70j41j46K18M9J41k60
$$ -56 16 56 -75 -65 -61 138 -193 346 -10 -173 133 90 40 151 -165 -125 145 4 -142 76 125 266 6
7810Flj93J29P9Mp6jK54j32O4q2j84M1J22j49J24L2p2j78L95k26kJ38L7l65K36
$$ 6 3 -190 -61 18 22 -54 -55 199 67 131 49 -135 -94 28 -121 3 35 -37 -215 180 -46 -48 90 127 -238 -2
7836bj30o9J51J8j46L2L31p3q8q4L32k75J12j46r5K99j63k7O6J09m6j2J28p6J5
$$ -2 -132 -201 -50 -32 -178 -146 185 112 24 -60 272 -3 109 -37 -132 167 4 -23 43 152 106 94 222 146 161
7861A61j76J54m3l6O6l70J66J06J56k68L7J46n8Q0k38L01j9j18J25k05l08RL63
$$ 161 -15 139 96 60 126 -244 -78 28 184 -84 -47 99 41 121 -117 184 165 47 172 -33 -341 -332 31
7884C1r0K16j69K04j60J59j58L4o3J77q7k26o0j3L30m5k4JP8j53QJ13r9j16J58
$$ 31 -59 157 -12 192 32 191 33 67 4 181 94 -132 -192 -205 125 80 56 57 135 -18 -10 103 4 -112 46
7909D6o0o7J66l08J71J94j30L0J83m6k68R2M4P8j33K42l65K47r7j2j20L8P9J38
$$ 46 -14 -81 85 -223 -52 142 12 42 225 179 -89 3 47 125 -8 234 -131 116 19 7 -113 -75 4 142
7933A42r4J03k9J50m70O7K38q2K0k53K85L7jl03n7M11k63K86o7l32N53K5j79p8
$$ 142 48 151 122 272 -198 -131 107 25 45 -208 77 114 113 -190 -247 164 -99 187 120 -212 341 366 187 109
7957A09j24J53k6j98j6O1Q3j59K29m29M17j18k25J70m0J10Rj43J35p6J19k28N01
$$ 109 -15 138 112 -86 -102 -41 42 -117 112 -317 100 -18 -243 -73 -113 -3 6 -137 -2 -78 41 -187 314
7980C14l10P6j58M4J30k77RQ9p8j99L29j5J35o7p6N0k15L59j29k17K50j29qK79
$$ 314 4 80 -78 -34 96 -181 -172 -83 -161 -360 -31 -46 89 22 -54 -4 -219 140 11 -206 44 -85 -93 186
8004A86l0m2J16n55O35l24j56K12m5n0k0j08j55K09K00j69K25l66K39j5j50L67
$$ 186 156 114 230 -325 310 -14 -170 42 -3 -53 -73 -181 -336 -127 73 -96 129 -237 2 -13 -163 204
8026B04l76J55J04L1q9%nk1Mr8J52n2q0J7J82j84O1p8pj63K78O1p5l6K98k28j11
$$ 204 -172 -17 87 118 29 29 24 3 7 -91 61 9 -71 -54 128 -56 5 -73 -80 -243 35 96 21 -15 283 55 -56
8053e6K53P1j27mj17K3J04n2j08J04m9l88L28N5j61J64j92K33n5L3k74j4K23J6
$$ -56 197 268 141 137 20 43 147 95 -13 91 42 -346 -18 37 -124 40 -152 81 26 59 -215 -229 -6 10
8077A0r0K69l60J10m5o6L25l48N47l16P2j80L5n5J25m6k28L65l02O1J16m2J35
$$ 10 -80 189 -171 -61 -106 -172 153 -195 352 36 108 -72 -37 -92 33 -13 -241 124 -178 -117 -1 -43 92
8100I2p5P4j47j58j7N61j18l18J24j46J10r1J63o0j00M2K9j34qJ84k97J40l8K22
$$ 92 17 91 -56 -214 -231 330 212 -106 18 -128 -18 -109 54 -6 -106 -64 -35 -169 -177 7 -290 -150 -188 34
8124C4j61R1J94q1j77j99M01j59n5P1O5R4j38j75K02k6P9Pj46p6J52Q6j35J30
$$ 34 -127 -36 158 77 -100 -299 102 -57 -112 -41 24 118 -20 -195 7 -19 60 67 -79 -155 -3 83 -52 78
8148G8o0J38k22o6J99p0Q5j98J77O9o9R8j61J13j47rJ0J35R3m19J41J60j81K82
$$ 78 18 156 -66 -132 67 -3 82 -116 61 130 61 159 -2 111 -36 -45 -35 100 193 -226 -85 75 -106 176
8172A76j39J64k89j74Q9L52k65L5L61m68J65J81l36J85j56K55j96J70j16
$$ 176 37 201 -88 -262 -173 179 -86 -51 310 -158 7 188 -148 37 -119 136 -60 110 -6
8191f
$$ Imaginary data points
##PAGE= N=2
##DATA TABLE= (X++(I..I)), XYDATA
0@%%%%%%%%%%kJ0j6J6j8K6l2M0m8N6p2Q8j04J21j40J64j93K25k59K99l41L85m39
$$ 0 0 0 0 0 0 0 0 0 0 0 -2 8 -8 8 -10 16 -16 24 -24 32 -40 48 -56 65 -75 89 -104 121 -138 161 -180 205 -234
33b34N00n65O34p10P97q92R96j109J232j368J514j674J850k042K249k476K728
$$ -234 266 -299 335 -375 422 -470 526 -583 649 -719 795 -879 971 -1071 1178 -1298 1430
50A430l005L311l649M023m440M908n440O049o753P580q563R753j1234J3134j5668
$$ 1430 -1575 1736 -1913 2110 -2330 2578 -2862 3187 -3566 4014 -4549 5204 -6030 7104 -8564
65h564J9229k4643L3944n4212J73662k2868j30544J80328k43985J08978J28667
$$ -8564 10665 -13978 19966 -34246 139416 116548 -13996 166332 -77653 31325 159992
76A59992j46441Q7305K0001k42627K12396p1856o2200K07146k11238J9511Q2953
$$ 159992 13551 100856 120857 -121770 90626 18770 -43430 163716 -47522 -28011 54942
87E4942j50971J09634N1084j71044J32575m9770j02165K22738j64855K8538P1996
$$ 54942 -96029 13605 64689 -106355 26220 -23550 -125715 97023 -67832 -39294 32702
98C2702j65796J15679N6909j03566J23706n7378j34930J94114j18643O3673J33972
$$ 32702 -133094 -17415 39494 -64072 59634 2256 -132674 61440 -57203 6470 140442
109A40442j98341Q3001p793j01290J65115R372j07198J45832j59820k4238J74038
$$ 140442 -57899 25102 17309 -83981 81134 90506 -16692 129140 -30680 -54918 119120
120A19120j58204J28778J5488j63777J02099j6629q3338J70820q7366p7535J46119
$$ 119120 -39084 89694 105182 -58595 43504 26875 -56463 114357 26991 -50544 95575
131I5575j84250R2851P6123j45200J03907l6441r8374J34351k9030o5731J39044
$$ 95575 -88675 4176 80299 -64901 39006 2565 -95809 38542 9512 -56219 82825
142H2825j64861K5565R6989j19881J32971j9862j03667P5873l4330l6437J54601
$$ 82825 -82036 -56471 40518 -79363 53608 33746 -69921 5952 -28378 -64815 89786
153H9786r0680r788O9831j60804J19857K2026n7080R9048o9765o8939R7534n8389
$$ 89786 -894 -10682 59149 -101655 18202 40228 -16852 82196 12431 -56508 41026 -17363
165a7363J5668J13436j58011O8800l751r0756J38555m3646m3457O9132q5727j7078
$$ -17363 -1695 111741 -46270 22530 18779 -71977 66578 22932 -20525 48607 -37120 -54198
177e4198J21525j10683O4560K1388j41262J18427l6239k1921R7455p3647m4417
$$ -54198 67327 -43356 21204 42592 -98670 19757 -16482 -38403 59052 -14595 -59012
188e9012Q0010q7885N3270Q3670j29457Q7991m9534n5236J12086l3384q278N7049
$$ -59012 20998 -66887 -13617 70053 -59404 28587 -20947 -76183 35903 2519 -5759 51290
200E1290q9402n346Q4195q5474R8021j1609q8110P5475n7530J3357P4159m8402
$$ 51290 -38112 -43458 40737 -44737 53284 41675 -46435 29040 -28490 -15133 59026 10624
212A0624j5308L9282r3521O8366L2186o6429Q6055q1028j8388N6752l5115K5825
$$ 10624 -4684 34598 -58923 9443 41629 -24800 61255 -19773 -38161 18591 -16524 9301
224I301M1158q4067J8056K2998o6834J11566m3953k9095M3247p3835K8924N1821
$$ 9301 50459 -33608 -15552 7446 -59388 52178 8225 -20870 22377 -51458 -22534 29287
236B9287l6488J7708J4645r3318P5873q717j7752P9248p9421l9K0170k9980L4703
$$ 29287 -7201 10507 25152 -68166 7707 -1010 -18762 60486 -18935 -18974 1196 -28784 5919
249E919M2866o6576K7335j3400m8495R2886l9346J0964J3546n7504J1857L1125
$$ 5919 48785 -17791 9544 -3856 -52351 40535 1189 12153 25699 -31805 -19948 11177
261A1177j7134K9203O261p1478N0920l3153J6417M9230m5600O778j1812k0229
$$ 11177 -5957 23246 29507 -41971 8949 -24204 -7787 41443 -4157 2621 -9191 -29420
273b9420K4865L4175l5695L1643l9771k3050N2309k8642M0437o855l3201k409
$$ -29420 -4555 29620 -6075 25568 -14203 -37253 15056 -13586 26851 19996 -13205 -15614
285a5614R328q138M1143k687m0105K9092n0379L4620K3039j3432J0416k1084k2036
$$ -15614 -6286 -14424 26719 24032 -16073 13019 -37360 -2740 20299 6867 17283 -3801 -25837
298b5837J3548K5459j6081L8121m6197q962J5370j5333M0381m065j1093j7868
$$ -25837 -12289 13170 -2911 35210 -10987 -19949 -4579 -19912 20469 16404 5311 -12557
310a2557L469j4767L9967J915j3930R680m2641K3156M920J8637P11p674k2511
$$ -12557 -9088 -23855 16112 18027 4097 13777 -28864 -5708 -788 17849 18560 10886 -11625
323a1625m151J8921j537L2423k9021k362j8083L441J9897N904R462k8926K51j9577
$$ -11625 -15776 3145 1608 34031 5010 2648 -15435 -11994 7903 13807 23269 -5657 -5406 -24983
337b4983K5019O630Q597q207k3827K084j0395L4476p542J0237k1960j4248O379
$$ -24983 36 6666 15263 7056 -16771 -14687 -25082 9394 1852 12089 -9871 -24119 -17740
350a7740M275K4665p087J976l0798J2068n368K2535J5689k1114O515k8154J4387
$$ -17740 -13465 11200 4113 6089 -24709 -12641 -18009 4526 20215 -899 5616 -22538 -8151
363h151J0556J8125o331l40k2457n308K8622j2640L5901k5676j4034J076n796
$$ -8151 2405 20530 14199 13859 -8598 -13906 14716 2076 37977 12301 -1733 -657 -6453
376f453J6689J7696q951k1566J0767l6444L9741N453j3172J7069l9085r40J4040
$$ -6453 10236 27932 18981 -2585 8182 -28262 11479 16932 3760 20829 -18256 -19196 -5156
389e156N842J536J9955m7478Q453Q234j9563N3648k6523p517J426j9156R298L5353
$$ -5156 686 2222 22177 -25301 -16848 -8614 -28177 25471 -1052 -8569 -7143 -26299 -17001 18352
403A8352j8063M719M916m9519M9974r674O939K6715l8261l737J2898q619K0106
$$ 18352 289 5008 9924 -39595 10379 705 7644 34359 -3902 -7639 5259 -3360 16746
416A6746K6805n1103K6658k2201j2893N5073k9364R517o15l5506Q352K9872k7899
$$ 16746 43551 -7552 19106 -3095 -15988 39085 9721 19238 18623 -16883 -8531 21341 -6558
429f558L5113j5687m7638M7462l6972K3201K8660m0810K964M468l2283L9601J6383
$$ -6558 28555 12868 -34770 12692 -24280 -1079 27581 -13229 -10265 -5797 -38080 1521 17904
442A7904m3226M7243n1520k094M7527l1704K9886N416m4807J8031J7580k9909
$$ 17904 -25322 21921 -29599 -31693 15834 -15870 14016 19432 -25375 -7344 10236 -19673
454a9673O5385k9489k6669M1034n2995L8114K7637l1537J6789l526m5954N1653
$$ -19673 45712 16223 -10446 30588 -22407 15707 43344 11807 28596 25070 -20884 30769
466C0769k658k0986N4621o9100J0335K1882l4233M1401K820m6862K4386j2894
$$ 30769 28111 7125 61746 -7354 2981 24863 -9370 32031 34851 -12011 12375 -519
478e19k9277P1171m8770K540K1840o4661M2427J0861k7091L4132j8320m6729N8431
$$ -519 -29796 41375 -7395 -4855 16985 -47676 -5249 5612 -21479 12653 -5667 -52396 6035
491F035l2152R409N3076p4046L0234J85l2547N7407J154l5534M1712m1243j2513
$$ 6035 -26117 -16708 36368 -37678 -7444 -7259 -39806 17601 18755 -16779 24933 -16310 -28823
504b8823P2389n3434M0284P669o2213M5081m553j7155N4995k7758l2862N2065
$$ -28823 43566 -9868 30416 38085 -24128 20953 16400 -755 54240 26482 -6380 45685
516D5685o0279L3084L7134o2536M4573k3086l3665N1914j4644k2157M7647o3858
$$ 45685 -14594 18490 55624 -6912 37661 14575 -19090 32824 18180 -3977 43670 -20188
528b0188M850M5860o0206N8824j5126n0051M1921k4547q777O1219m3281j0482
$$ -20188 -15338 30522 -29684 29140 14014 -36037 5884 -18663 -27440 33779 -9502 -19984
540a9984L5365p5095N8744J5614l9715N5876m3786k6409M9805k6139R506N4161
$$ -19984 15381 -59714 -970 14644 -25071 30805 -12981 -39390 10415 -15724 -6218 47943
552D7943p3650K8342J0769n3100P7546k3359k1141M1463m5166j951N4894n1185
$$ 47943 -25707 2635 13404 -39696 37850 14491 -6650 34813 -10353 -12304 42590 -8595
564h595K5540K0282p2807O5465j8010k1267N4026m9961j0769M0209m2023K5939
$$ -8595 16945 37227 -35580 29885 11875 -9392 44634 -5327 -16096 24113 -17910 8029
576H029L6259p4626M5066k1562l3790P4684l4769k102K7331n8772Q686M3918m7414
$$ 8029 44288 -30338 14728 -6834 -40624 34060 -709 -2811 24520 -34252 -25566 18352 -29062
589b9062N5491o178o1785N7846m3005P732N5424m4505O817K1182n8545M2611J9328
$$ -29062 26429 20251 -41534 16312 -26693 -18961 36463 -8042 -1225 19957 -38588 4023 23351
602B3351m9447O5899m5932j6562N3276m5206K0835K5805n4584K5242J8296m8621
$$ 23351 -26096 39803 -6129 -22691 30585 -14621 6214 32019 -22565 2677 20973 -27648
614b7648O6569k9926l2646N0526n3806K4370L7491m4126J7672M351n8115N5945
$$ -27648 38921 8995 -23651 26875 -26931 -2561 34930 -9196 8476 12827 -45288 10657
626A0657j703k5316O1328o4749j364K9691l9431L9863K0697n0229K8922j2544
$$ 10657 8954 -16362 44966 -19783 -21147 8544 -30887 8976 29673 -20556 8366 -4178
638d178l9286P3366l6856L045L3584o1882K6693J7471l2424L8470k806m8137N4671
$$ -4178 -43464 29902 -6954 -3909 29675 -32207 -5514 11957 -20467 18003 15197 -32940 21731
651B1731l2235k942N2359o0255K2377R849l7521M2133O217l9850M0019l2133j9313
$$ 21731 -10504 -13446 38913 -21342 1035 10884 -26637 15496 21713 -18137 21882 -10251 -29564
664b9564O2637m6002K6384J1881n6073L0662L000k0651M8232j7601l5117M3188
$$ -29564 33073 -12929 13455 25336 -30737 -75 2925 -17726 30506 12905 -22212 20976
676B0976n0235K2245L8365m5209L2075j3309l5252L8532k258j8376M6147m6107
$$ 20976 -29259 -7014 31351 -13858 18217 4908 -30344 8188 5930 -12446 33701 -12406
688a2406m155L5909m6636M3873K72l5928K8206j4059j6611M7216k5864j0541L2955
$$ -12406 -16561 19348 -27288 16585 16857 -19071 9135 -4924 -21535 25681 -183 -10724 22231
701B2231n6137L5534J3243k9314L6188k2854k4513L3566j3735j473M1893n2044
$$ 22231 -33906 1628 14871 -14443 21745 -1109 -25622 7944 -5791 -7264 34629 -17415
713a7415J3189J0004l5873N0201r362j7650K1293k6126r746M2788k7670J3548
$$ -17415 -4226 5778 -30095 20106 10744 -6906 14387 -11739 -21485 21303 -6367 7181
725G181J6377n2777L5632p434r547L5659k2317j5045K1546k4930J0679L2982m2956
$$ 7181 23558 -29219 6413 -1021 -10568 25091 2774 -12271 9275 -15655 -4976 28006 -14950
738a4950K6754j2729k4592L9907j3771j408J7385k8523m763K9194k8272K9682
$$ -14950 11804 -925 -25517 14390 619 -789 16596 -11927 -16690 12504 -15768 13914
750A3914J492l7190L0012k1319M236K8575j7455n749J3042l0823J9222J9973k7474
$$ 13914 15406 -21784 8228 -13091 -8855 19720 2265 -3484 9558 -21265 -2043 17930 -9544
763i544L2533k6728j2048K4375j3134J0571J4641k6159l64J2754k5634L7378q188
$$ -9544 22989 -3739 -15787 8588 -4546 6025 20666 -5493 -5857 6897 -18737 18641 10453
776A0453j6664J8169k7621Q386J7706r413K402O333l1448J9609L519j1420L0377
$$ 10453 -6211 11958 -15663 -7277 10429 1016 3418 9751 -21697 -2088 1431 -9989 20388
789B0388k7972k309O460j0639J3181J3638j9362M166q33k0337L4724j2056K446
$$ 20388 -7584 -9893 -3433 -14072 -891 12747 -6615 -2449 -3282 -23619 11105 -951 1495
802A495P509k3824O938R394k444R395M412k6963J7084q575K494K3643j9756M471
$$ 1495 9004 -14820 -7882 1512 -932 8463 12875 -14088 2996 -5579 -3085 20558 802 5273
816E273n919p554R273J3153j1591Q634j0824j4348K2519j1895J4431r95j4494
$$ 5273 -646 -8200 1073 14226 2635 11269 445 -13903 8616 -3279 11152 10157 -4337
829d337j168J520l32J1078L851j8634J0377j7049R269J2189o494N421j0397n436
$$ -4337 -5505 -3985 -4317 6761 10612 -8022 2355 -14694 -5425 6764 270 5691 -4706 -10142
843a0142J397J2435m668J1594j3244p505Q271o998J7757k814k143p988o43j322
$$ -10142 -8745 3690 -978 10616 -2628 -10133 -1862 -8860 8897 6083 3940 -4048 -4691 -6013
857f013J0946N677p891M182j7239R263J099P169K106o588n118o126R656j777J2314
$$ -6013 4933 10610 2719 6901 -10338 -1075 24 7193 9299 2711 -2407 -8533 1123 -654 11660
872A1660j0211k935n989j090J0532o39O668j3625J198p178P284O999L70L9j1138
$$ 11660 1449 -1486 -7475 -8565 1967 1328 7996 -5629 -4431 -11609 -4325 2674 3044 3083 -8055
887h055J546m365J5536k490L650n915j0007P678q11J1824j040j015j1508M176
$$ -8055 -6509 -10874 4662 2172 5822 -93 -10100 -2422 -3233 8591 7551 6536 -4972 -796
901g96r21P044J0696j3348N639j3117L620P269M363j136j511q998n793J4700q593
$$ -796 -1717 5327 16023 2675 8314 -4803 -1183 6086 10449 9313 7802 -1196 -6989 7711 -882
916h82J5131q779j0359L547o151Q372O130k307j0690N079j5698J4398O419r160
$$ -882 14249 5470 -4889 -1342 -7493 879 7009 4702 -5988 -909 -16607 -2209 4210 -4950
930d950J1072j8657M55O380K574K275P214j6946O03P378j0782K5206j0940l550
$$ -4950 6122 -12535 -12080 -5700 -3126 -851 6363 -10583 -9980 -2602 -13384 11822 882 -2668
944b668K745j0711O613J3007m795m72M252k3000K0640j775m36J5046j9665k68
$$ -2668 77 -10634 -4021 8986 4191 3719 7971 -15029 5611 3836 3400 18446 -1219 -1487
958a487M102l871P894J2048k1870R270o319j0743K7527j4582M127J057j7100M193
$$ -1487 2615 -1256 6638 18686 -3184 6086 -233 -10976 16551 1969 6096 7153 -9947 -5754
972e754J2455r770J2174k095k4662K2264j5198Q146J5818j9277K232Q41j2070
$$ -5754 6701 -3069 9105 7010 -17652 4612 -10586 -2440 13378 -5899 -3667 -2826 -14896
985a4896J4462J0499k0061J9580j9493n318K3661j5843J3522J672j8948N857P594
$$ -14896 -434 10065 -9996 9584 -9909 -15227 8434 -7409 6113 7785 -11163 -5306 2288
998B288j2716K5357r297j6185K0549k4699J5168J3143j5851Q436k876j8660K0371
$$ 2288 -10428 14929 5632 -10553 9996 -14703 465 13608 -2243 6193 3317 -15343 5028
1011E028K185j2408K5814l0088J870J4202j7601K1633J086j9778R345l297j3821
$$ 5028 7213 -5195 20619 -9469 -7599 6603 -10998 10635 11721 -8057 1288 -2009 -15830
1024a5830L3240j7773k278J4413l2203K0087N826j1317J6154o785k0940K3345
$$ -15830 17410 -363 -2641 11772 -20431 -344 5482 -5835 10319 3534 -17406 5939
1036E939j0966j078K7248l3708J2524J805j7538K5156j621j4959J5709j4771r098
$$ 5939 -5027 -6105 21143 -12565 -41 1764 -15774 9382 7761 -7198 8511 -6260 -15358
1049a5358L2862k4218J3167N211l0514K1662k061o487K2163j1834j7178K2252
$$ -15358 17504 -6714 6453 11664 -18850 2812 751 -5736 16427 4593 -12585 9667
1061I667k4068J2926K2269l0381K0334j1729j6069K5160m818o984K1339k6015
$$ 9667 -14401 -1475 20794 -9587 10747 -982 -17051 8109 3291 -3693 17646 -8369
1073h369k677K3042k8146K8483k567k3614K1599j3618m498K5320j6623n577J9698
$$ -8369 -11046 11996 -16150 12333 9766 -13848 7751 -5867 -10365 14955 -1668 -7245 12453
1086A2453l3038K2934Q707k3114K6177j9634j0181K2755j0434P78K1724l2625
$$ 12453 -20585 2349 11056 -12058 14119 -5515 -15696 7059 -3375 -2597 19127 -13498
1098a3498P845J0514k4736L6682j0293j3780J6544k1467J2K6241j7561P973J1040
$$ -13498 -5653 4861 -19875 16807 6514 -7266 9278 -12189 -12177 14064 -3497 4476 15516
1111A5516l7447K7197m675j0026L0264k2073m893J4699j8849Q574K0554l0608
$$ 15516 -21931 5266 591 -9435 20829 -1244 -6137 8562 -10287 -1713 18841 -11767
1123a1767K0323m840k1262L4404j8363j148J5837k4383M958J9485k2834J9279
$$ -11767 8556 3716 -17546 16858 -1505 -2653 13184 -11199 -6241 13244 -9590 9689
1135I689K77l0877L0091j6672J467K5770k4206M69Q348k2900J8773J4472k5515
$$ 9689 9966 -20911 9180 -7492 -6025 19745 -4461 -3992 4356 -18544 229 14701 -10814
1148a0814K6814k1291j3219K7931j8706J2411J2684k5915O114Q334k2169L0884
$$ -10814 16000 -5291 -18510 9421 -9285 3126 15810 -10105 -3991 4343 -17826 13058
1160A3058o554j7379K5430k7799P950J7521j9281J0757M566k4928K2006Q54j7522
$$ 13058 6504 -10875 14555 -13244 -5294 12227 -7054 3703 8269 -16659 5347 6201 -11321
1173a1321L0123k7385n70J8514k0557J7476O644k3628J1900j505j7258L4540j5961
$$ -11321 18802 -8583 -9153 9361 -11196 6280 12924 -10704 1196 -309 -17567 16973 1012
1186A012m381J6745l1677J4704J0621j3395J7546k485k5030K2218j1103k899K9491
$$ 1012 -3369 13376 -18301 -3597 7024 -6371 11175 8690 -16340 5878 -5225 -8124 21367
1199B1367k8124Q421L752k0536J9943M052j5184J7597j1843j3670K8990k1827
$$ 21367 -6757 1664 5416 -15120 4823 8875 -6309 11288 -555 -14225 14765 -7062
1211g062J0072J0494k6798J5694K91j0639J9592o404j7520K1524k0452P127K0513
$$ -7062 3010 13504 -13294 2400 2691 -7948 11644 5240 -12280 9244 -11208 -4081 16432
1224A6432k5090J4773n790j5941J9189nq657J9077k0223o392K0449k1513K1584
$$ 16432 -8658 6115 325 -15616 3573 3568 -5089 13988 -6235 -12627 7822 -13691 7893
1237G893K000j9727J3524q633o330K1938q129o974J6410k6942J3538R838j5671
$$ 7893 9893 -9834 3690 -4943 -11273 10665 2536 -4438 11972 -14970 -1432 8406 -7265
1250g265J9451j0812j1319J4253n559k275J9796k1687L147Q353j9673K3876m359
$$ -7265 12186 1374 -9945 4308 -1251 -3526 16270 -5417 -2270 6083 -13590 10286 5927
1263E927r567J0568j1621m431J8419j0201K258J0397k6419J6313j176o206J8695
$$ 5927 -3640 6928 -4693 -9124 9295 -906 1352 11749 -14670 1643 467 -5739 12956
1276A2956j1838p030Q714r671L569J7445j9598J0251l432j4688K0793o492K05
$$ 12956 1118 -5912 2802 -6869 -3300 14145 -5453 4798 1366 -13322 7471 979 1184
1289A184P954j2909l269J3034j1573J1797M250k0019J4762j0342P09J4636q596
$$ 1184 9138 -3771 -7040 5994 -5579 6218 10468 -9551 5211 -5131 -4422 10214 1618
1302A618k454M507j2685O008J1689j4324J4464j0676q461J3126p588O096N881
$$ 1618 -836 3671 -9014 -3006 8683 -5641 8823 -1853 -10314 2812 -4776 1320 7201
1315G201j0906k501P100j1500J6197q70j0461J0193j3832M458Q918l434J416K530
$$ 7201 -3705 -6206 894 -10606 5591 4721 -5740 4453 -9379 -4921 3997 563 1979 4509
1329D509j3564P023M925o974J5753j2636k159M390n904P514N895p532j78Q23j0210
$$ 4509 -9055 -2032 2893 -4081 11672 -964 -3123 1267 -4637 2877 8772 1240 1062 1885 -8325
1344h325J5540l935p96N185j3425L797L428m61L391J741j2103N695k535j105J2915
$$ -8325 7215 3280 2484 7669 -5756 -1959 1469 1008 4399 6140 -5963 -268 -2803 -3908 9007
1359I007j0466K023l286m268M765N511l543J486k848q724J1397m717O195P08q004
$$ 9007 -1459 564 -2722 -6990 -2225 3286 -257 1229 -1619 -10343 1054 -3663 2532 3240 -4764
1374d764Q00o51K039M189L625q852L848o389K669P738l582L461n800k481P84N510
$$ -4764 -3964 -4615 -2576 1613 5238 -3614 234 -6155 -3486 4252 670 4131 -1669 -4150 -3366 2144
1390B144o36L548m131n735M583l994Q460r18j442l416k195Q01K840M927m925J987
$$ 2144 1508 5056 925 -4810 -227 -4221 4239 3321 1879 -1537 -3732 -2931 -91 4836 -89 1898
1406A898q000K663K119K575K404m834p10m899N452j4N100k256l578j376j654O142
$$ 1898 -6102 -3439 -1320 1255 3659 -1175 -1885 -6784 -1332 -1346 3754 1498 -2080 -3456 -5110 1032
1422A032k98M187o457m35k110J600O303j526J207n708J90k005O891l92N74n44
$$ 1032 734 4921 -1536 -1971 -4081 -2481 3822 2296 3503 -2205 -2015 -4020 2871 2479 3053 2509
1438B509q053M433j171N221O87k020m905K34O28J291P133p959K763n912m57N934
$$ 2509 -5544 -1111 -2282 2939 3626 1606 -3299 -3065 -2437 -1146 5987 -1972 791 -5121 -5578 356
1454C56L30J097j439l939l986Q322l764O766j529p823M317m129M989L960j247
$$ 356 686 1783 344 -3595 -7581 741 -3023 3743 2214 -5609 -1292 -5421 -432 3528 2281
1469B281m600K526o682N570O055o267O922q592j498M495J28K330L344p805j599
$$ 2281 -2319 207 -6475 -905 5150 -1117 5805 -2787 -4285 210 338 2668 6012 -1793 -3392
1484c392N179p276J2602l970m425L442p712L358O332k210r23K590j2206R007O37
$$ -3392 1787 -5489 7113 3143 -1282 2160 -5552 -2194 4138 1928 1005 3595 -8611 396 1033
1499A033k921J0386j1128o19K395l058M883O171j0150L040q24p977J5623o648
$$ 1033 -1888 8498 -2630 -3249 -854 -3912 971 7142 -3008 32 -792 -8769 6854 206
1513B06P30L054j0084K865O190m109N294J064j3891J1209n769J361J1279j1513
$$ 206 936 3990 -6094 -3229 2961 -1148 4146 5210 -8681 2528 -3241 -1880 9399 -2114
1527b114K230K07o597O841O166j0225Q944p772o457J4480r124O704K281j1670
$$ -2114 116 323 -6274 567 6733 -3492 5452 -2320 -8777 5703 -3421 3283 5564 -6106
1541f106L504L086o213J1832k180j0831J1801j3328O312R232j0106N901j523r839
$$ -6106 -2602 484 -5729 6103 3923 -6908 4893 -8435 -2123 7109 -2997 2904 1381 -8458
1555h458R387K708p793J4138j3772j431J0009j1263J1490J612j0701N173j260
$$ -8458 929 3637 -4156 9982 -3790 -5221 4788 -6475 5015 6627 -4074 1099 -161
1568a61p263J6550p115m036R947j7728R579N116p413R187l851j1086J0850l727
$$ -161 -7424 9126 2011 -2025 7922 -9806 -227 4889 -2524 6663 2812 -8274 2576 -1151
1582a151k502J6138j7186L803L122j2052J4344m13p585Q270p095o888J6936j1391
$$ -1151 -3653 12485 -4701 -898 2224 -9828 4516 4103 -3482 4788 -2307 -9195 7741 -3650
1596c650M621O760j8137J1629j120n041J1980n501q791J1621j0414L146J3748
$$ -3650 971 7731 -10406 1223 103 -4938 7042 1541 -7250 4371 -6043 -2897 10851
1609A0851j7359R982l576j0273J4729k521m208J0026j2519l242J4118j3665J3400
$$ 10851 -6508 3474 -102 -10375 4354 1833 -2375 7651 -4868 -8110 6008 -7657 5743
1622E743J550j5824J1964p462k598J4908o934m247R904j7086Q450Q421j3509J5729
$$ 5743 7293 -8531 3433 -4029 -6627 8281 1347 -2900 7004 -10082 -1632 6789 -6720 9009
1636I009q653p750J1926o510l8J2485j5119K729Q348j5789J7594m056r374J1551
$$ 9009 356 -7394 4532 -1978 -2016 10469 -4650 -1921 6427 -9362 8232 4176 -5198 6353
1650F353j0760m5J3330r862J602O867j9188J3572J025p917J6639j2826m892Q821
$$ 6353 -4407 -4452 8878 -984 618 7485 -11703 1869 2894 -5023 11616 -1210 -6102 2719
1664B719r437N513J2135j6268P986j571j4215J9662p222q49R920j4323Q19R509
$$ 2719 -6718 -1205 10930 -5338 2648 1077 -13138 6524 -698 -1547 8373 -5950 -5131 4378
1678D378j0647R454M106j7083J5555q156l338J5714j2924J681N912j1687P913
$$ 4378 -6269 3185 7291 -9792 5763 -2393 -5731 9983 -2941 -1260 4652 -7035 878
1691H78P500j4382J3074p442q678J7356j0589M445O641j4645L217N977j0386J4687
$$ 878 8378 -6004 7070 -372 -9050 8306 -2283 2162 8803 -5842 -2625 3352 -7034 7653
1705G653j587j2579J3653j4776L445J2616j0775O021J082j3842R523K580q949
$$ 7653 6066 -6513 7140 -7636 -4191 8425 -2350 3671 4753 -9089 434 3014 -5935
1718e935J7164j2864l469J0922j3551R766N030j1140O689m18j0492J6423o582
$$ -5935 11229 -1635 -5104 5818 -7733 2033 7063 -4077 2612 2194 -8298 8125 1543
1731A543m436J2009j6432P212O129q797Q470j045j2581J1578l420m258J6344j5173
$$ 1543 -2893 9116 -7316 -104 6025 -2772 5698 4653 -7928 3650 230 -4028 12316 -2857
1745b857K168L597j1306J1396K602q077P493n869q986J6324r851M072P576j6543
$$ -2857 -689 2908 -8398 2998 5600 -2477 5016 -853 -9839 6485 -3366 706 8282 -8261
1759h261P952k92n412J1286k161r059J0235r731O41J3082j3472Q458j409r413
$$ -8261 -309 -601 -6013 5273 3112 -5947 4288 -5443 -4802 8280 -5192 3266 1857 -7556
1773g556J0261n61m667R847q502m537J2407j2011R916K919j2377Q297m289l010
$$ -7556 2705 2144 -2523 7324 -1178 -5715 6692 -5319 4597 7516 -4861 3436 -853 -3863
1787c863J0973l510n234Q584j3745N280P733r914J0719n729o731P217k955j278
$$ -3863 7110 3600 -1634 6950 -6795 -1515 6218 -3696 7023 1294 -5437 1780 -1175 -2453
1801b453J0376j0228n53N614j1765J2731j180n601O263o880k192R124m323L21
$$ -2453 7923 -2305 -2858 2756 -9009 3722 2542 -3059 3204 -3676 -5868 3256 -1067 -746
1815g46O749j3883P493P91m581J1005o809l007L840m196J399R495r646L825q4
$$ -746 6003 -7880 -387 404 -4177 6828 19 -2988 852 -3344 -1945 7550 -2096 1729 1645
1830A645r281J1895l736K4M585p352j790O561m919M633L723j1880P843n191l78
$$ 1645 -7636 4259 523 547 5132 -2220 -4010 2551 -2368 2265 5988 -5892 1951 -3240 -3618
1845c618Q855n256q41J476n815J888P187p274O870m044o221P955m427L487L353
$$ -3618 5237 -19 -860 616 -5199 -3311 3876 -3398 3472 -572 -6793 1162 -3265 222 3575
1860C575n498j367L558m985P080J468o863O256p602K302N161k028J343L82o349
$$ 3575 -1923 -3290 268 -4717 2363 3831 -3032 3224 -4378 -2076 3085 1057 2400 2782 -3567
1875c567K370M083m295Q470o562j836K844m040M524K199k888j262O02n739P655
$$ -3567 -1197 2886 -1409 7061 499 -1337 1507 -2533 1991 4190 1302 40 642 -5097 2558
1890B558o68j885L494p920K343J162K64K267M92n818J356N98j907P849n568R62
$$ 2558 1890 5 3499 -4421 -2078 -916 -652 1615 2107 -3711 -2355 -1757 -3664 4185 -1383 -421
1906d21j723k412L377K213n89m92j07n389O127j646K477J966n310J184j078K000
$$ -421 -2144 -4556 -1179 1034 445 -47 -154 -5543 584 -1062 1415 3381 -1929 -745 -1823 177
1922A77J536K195m154J041k376R5N516k741K488l620j284L27K628O07O13r25m499
$$ 177 1713 3908 -246 795 -1581 -1486 4030 1289 3777 157 -1127 -800 1828 2435 3048 2123 -2376
1939b376K775k095M647l07j638j303k203J734M14L770l045P41l879M68K266Q04
$$ -2376 399 -1696 2951 2644 1006 -297 -2500 -766 -352 3418 373 1114 -2765 -2297 -31 773
1955G73K118l689O46l334L073M14J956m0k859j33j679M237q24K939l687r87Mo72
$$ 773 2891 -798 -152 -3486 -413 1 1957 1917 -942 -1075 -2754 1483 659 3598 -89 -1076 -1072 -1744
1973a744M932j855J087l195k16j152L749L72n98J045o002L646j017K478J150j564
$$ -1744 3188 1333 2420 -775 -991 -2143 1606 1978 1380 2425 -3577 69 -948 1530 2680 1116
1989A116k538k54Q48J08M999m942J600k455j709M476p25J618j592j493k629M860
$$ 1116 -1422 -1676 -828 -720 4279 -663 937 -1518 -3227 1249 524 2142 550 -943 -3572 1288
2005A288k045L275N15o058L676l176K814K768r18k312P26l138J948M750m607M781
$$ 1288 -757 2518 3033 -3025 651 -2525 289 3057 2139 -173 553 -2585 -637 4113 -494 4287
2021D287n389j499L460o56J703J574l872k023L837m663P340j729l668L160n662
$$ 4287 -1102 -2601 859 203 1906 3480 -392 -2415 1422 -3241 4099 2370 -1298 1862 -3800
2036c800K664L327r10q77J693o965M380J541k945P058o819r46K159k163L022L394
$$ -3800 -1136 2191 1281 404 2097 -4868 -488 1053 -1892 5166 -1653 -2599 -440 -2603 419 3813
2052C813n320O76O91n717R702l749j12K759o839K511K880k005K296J665q493O437
$$ 3813 -1507 -831 -140 -5857 3845 96 -16 2743 -4096 -1585 1295 -710 1586 3251 -5242 1195
2068A195k742o4P402p556J892j72l520L796L540n462M554l393n043R694n772L764
$$ 1195 -1547 -1611 5791 -1765 127 -45 -3565 231 3771 -1691 2863 -530 -5573 4121 -1651 2113
2084B113J815p615K673J862l246O122j87p503P180p141K505O724o638L656j313
$$ 2113 3928 -3687 -1014 848 -2398 3724 3537 -3966 3214 -3927 -1422 5302 -1336 2320 1007
2099A007n664M996K110m270P668p125k405O765p398O984J054o176K969j015l996
$$ 1007 -4657 339 2449 -1821 5847 -1278 -3683 3082 -4316 2668 3722 -2454 515 -500 -4496
2114d496Q455k304m031O831j0237N038L735n477N718k298n910N774j084k456R924
$$ -4496 3959 1655 -2376 4455 -5782 -744 2991 -2486 3232 934 -4976 798 -286 -2742 7182
2129G182r838J334L140p583Q788j19m574M072l765l863R686n358J508N443j2261
$$ 7182 -2656 -1322 1818 -5765 3023 2904 -1670 2402 -1363 -5226 4460 -898 610 6053 -6208
2144f208P117n56k785P273k837n086N922n261m5R444j0110N817j149p100Q881
$$ -6208 909 353 -2432 4841 2004 -3082 2840 -2421 -2466 6978 -3132 2685 1536 -5564 3317
2159C317k365j946N427n851k485Q415q084O188K259j0232P676l626j399P860l942
$$ 3317 952 -994 4433 -1418 -3903 4512 -3572 2616 4875 -5357 2319 -1307 -2706 5154 1212
2174A212l123N567q794L939O799q928Q922n361n295P103l071O10O710p407r26
$$ 1212 -1911 3656 -5138 -1199 5600 -3328 5594 233 -5062 2041 -1030 -420 6290 -1117 -2043
2189b043N278r571J0222m20o253P635p316n42O623m411P62N612j1042O345J396
$$ -2043 3235 -6336 3886 3466 -2787 4848 -2468 -3010 3613 -798 -36 5576 -5466 879 2275
2204B275o475J0355p278k043N546m977K599N809q922L144J407q505J1774l736
$$ 2275 -4200 6155 -1123 -3166 2380 -2597 2 5811 -3111 33 1440 -7065 4709 973
2218I73k035N566q527Q55N815m355L840L152j0795P608l557k476J0647p268N97
$$ 973 -1062 4504 -4023 -3168 2647 -1708 2132 5284 -5511 2097 -1460 -3936 6711 -557 40
2233D0K638p203L478N389p273P201k761p170J0079o365K226M559p641K173L227
$$ 40 2678 -4525 -1047 4342 -2931 4270 1509 -5661 4418 -1947 279 4838 -2803 -630 2597
2248B597o152O876J82q166Q701o963O69P701p216L233N57o934M823L032n824R182
$$ 2597 -3555 3321 3503 -4663 4038 -2925 -2256 5445 -1771 1462 2019 -4915 -92 2940 -2884 6298
2264F298p154l676P476p243O057L034o385K181j73o033R034j636l814P872j0222
$$ 6298 -856 -4532 2944 -4299 1758 4792 -1593 588 415 -5618 3416 1780 -2034 5838 -4384
2279d384K669M027n100N376L9o716N089j338l377R554q062P54L680p535O727Q29
$$ -4384 -1715 2312 -2788 2588 2627 -4089 1000 -338 -3715 5839 -2223 -1469 2211 -5324 1403 2232
2295B232m380L929k072n259Q936m545P50M942r826M847O22k646N828q00n578M858
$$ 2232 -2148 1781 -291 -5550 3386 -1159 -409 4533 -5293 -446 176 -2470 3358 2558 -3020 1838
2311A838m249n10Q731p394M079k71o573N999j38j797M747l542m174O893o261M376
$$ 1838 -2411 -2921 5810 -1584 2495 2224 -4349 1650 1512 -285 4462 920 -3254 3639 -2622 1754
2327A754L113p423M532k619j566N264r92l352M581o585J312N576o456O036k948
$$ 1754 4867 -2556 1976 -643 -2209 3055 2063 -1289 3292 -3293 -1981 3595 -2861 3175 227
2342B27m063L968j346l14M969m436j964M504o874O601N11l903M088m485j097N161
$$ 227 -3836 132 -1214 -1528 3441 -995 -2959 1545 -5329 1272 1783 -2120 1968 -2517 -3614 1547
2358A547j461n26M338p726L094J816l731P164l844j772K082k317N12N299m299
$$ 1547 86 -440 3898 -3828 -734 1082 -2649 4515 671 -1101 981 -1336 -824 4475 176
2373A76N59J425o270O887j650n32K977m247r61L101j548J252K969o674L694j659
$$ 176 735 2160 -4110 2777 1127 595 3572 -675 -1636 1465 -83 1169 4138 -2536 1158 -501
2389e01j616N790l462J13K71k815N67M139l781L277j416m659N453k999K085J817
$$ -501 -2117 3673 211 324 595 -2220 -1653 2486 -1295 1982 566 -4093 1360 -1639 446 2263
2405B263k590q78J162k066L122J906m246L463m109N06L399j547J188k25k477m5
$$ 2263 -327 -1205 -43 -2109 1013 2919 -1327 2136 -1973 -1467 1932 385 1573 1348 -1129 -1174
2421a174K782k477M351k586k428K342k971K956J398j145j222J29k601L270J037
$$ -1174 1608 -869 3482 896 -1532 810 -2161 795 2193 1048 -174 -45 -2646 624 1661
2436A661k026K726m605J267Q14J00J250K31k781k2J076j615M821k577l17k49j842
$$ 1661 -365 2361 -2244 -977 -163 -63 1187 1418 -1363 -1385 -309 -1924 2897 320 3 -246 -2088
2453b088K189R07M27n61j27k943K658j43O11J708l546J011j135J277P36J265j717
$$ -2088 101 1008 1435 874 747 -2196 462 319 930 2638 -908 103 -1032 245 981 2246 529
2470E29l23o20j028L526j501J163j849q28L01P21J208m80N51l157J151o66J976
$$ 529 206 -414 -1442 2084 583 1746 -103 -931 -630 91 1299 819 1370 -1787 -636 -1302 674
2487F74N69q93n51j996J858n78K454j114k60j231o55J546L27J725k239M63j916
$$ 674 1243 350 -201 -2197 -339 -917 1537 423 163 -1068 -1723 -177 150 1875 -364 99 -1817
2504a817J292J262R3J032k636K14j030K097j51J567j561j244N79j378L384j006
$$ -1817 -525 737 830 1862 -774 -560 -1590 507 356 1923 362 -882 -303 -1681 1703 697
2520F97L90j324q07m39J723R71p95J039l609J655o9O09J562j600m39p56M84O0
$$ 697 1087 -237 -1044 -1483 240 1211 416 1455 -2154 -499 -568 41 1603 3 -436 -1192 -708 -648
2538f48L048k509K78m40k070L229n40R05l59j388j120K219o69J367J115m363K589
$$ -648 2400 -109 169 -271 -2341 888 348 1253 894 -494 -1614 605 -64 1303 2418 -1945 644
2555F44j740Q73K285j121j071J92j443M53L214k977K673k613j759K616q85J417
$$ 644 -1096 -223 2062 941 -130 62 -1381 -928 2286 -691 1982 -631 -2390 226 -659 758
2571G58O89k118j139J816k122L353M44l354K777l754J366K489q20j25P07l264
$$ 758 1447 -671 -1810 6 -2116 1237 1681 -1673 1104 -2650 -1284 1205 385 260 967 -2297
2587b297J484K120k676M682l896o30K010k069K027J443k253p8J206m169N137q72
$$ -2297 -813 1307 -1369 3313 -583 -1213 797 -1272 755 2198 -55 -133 1073 -3096 2041 1169
2603A169j339K742m506J197J804j060J163J351m940K726n74j455N528m110J11
$$ 1169 -170 2572 -1934 -737 1067 7 1170 2521 -2419 307 -267 -1722 3806 -304 -193
2618a93O01l108K403K321k700J887j050l922N840l105J202K552n004J927N11j526
$$ -193 408 -2700 -297 2024 -676 1211 161 -3761 2079 -1026 176 2728 -2276 -349 162 -1364
2634a364K882P41m653M349l620m9N296m400K087k08l542K588J314k351L909k865
$$ -1364 1518 2259 -2394 1955 -1665 -1714 3582 -818 1269 1061 -2481 107 1421 -930 2979 114
2650A14k673M830m625L949J210m038J576n82k200M439m64k970M326o234J993L039
$$ 114 -2559 2271 -2354 1595 2805 -1233 343 -239 -2439 2000 1536 -1434 2892 -3342 -1349 1690
2666A690l717L925j367l326K636k32j832N653m777m5K895n336N031L96l074K490
$$ 1690 -2027 1898 531 -2795 -159 -391 -2223 3430 -1347 -1392 1503 -3833 1198 1594 -1480 1010
2682A010j028l149N488k525j98L805o832L384J048k616M978k002l067K803j801
$$ 1010 -18 -3167 2321 -204 -402 3403 -3429 -45 1003 -1613 3365 1363 -1704 1099 -702
2697g02q14O251n417J907O14n330N417j082j203L379k993k332M606m223K621K742
$$ -702 -1516 4735 -682 1225 1839 -3491 1926 844 -359 3020 27 -2305 2301 -1922 699 3441
2713C441o199M140j793k019M590k071j151L082m380P24M552n754M528j324m218
$$ 3441 -2758 1382 -411 -2430 2160 89 -1062 2020 -2360 -1636 2916 -2838 1690 366 -3852
2728c852N005j977j32L644m085j196L595m868N176R04m942M704m176m03M491k008
$$ -3852 1153 -824 -956 2688 -1397 -2593 1002 -3866 1310 2214 -2728 1976 -2200 -2603 1888 -120
2744a20K75K873o244K380K279m124O456l059k045L065l656J562L504l862J217
$$ -120 155 3028 -3216 -836 1443 -2681 3775 716 -1329 1736 -1920 -358 3146 -716 501
2759E01J854n916N967j135k517M822m793M58L139l144J697K442o627M235n30k871
$$ 501 2355 -3561 2406 1271 -1246 3576 -1217 -759 2380 -764 933 3375 -3252 983 453 -2418
2775b418O364m357l42K191m328K048L404l892K766j012m939O351l355Q57L877
$$ -2418 3946 -411 -753 1438 -2890 -842 2562 -1330 1436 424 -4515 1836 -1519 -662 3215
2790C215n315P98J285k864L681J538n055M892l880r17N232m175K035J018l852
$$ 3215 -2100 -1302 -17 -2881 800 2338 -2717 2175 -1705 -2622 2610 -1565 470 1488 -2364
2805b364K084J865l635M845k301k977M950m551K760K301l984J370L99l250M126
$$ -2364 -280 1585 -2050 2795 494 -2483 2467 -2084 676 2977 -1007 363 762 -2488 1638
2820A638J09l204M947n836J155L333l353L106j49l852J935K35k186N556l563r83
$$ 1638 1747 -1457 3490 -2346 -1191 2142 -1211 1895 1746 -2106 -171 64 -2122 3434 -129 -1112
2836a112K701n300L919J242k136J719p76l104L993j752m12M359n961K585N33k439
$$ -1112 1589 -3711 208 1450 -686 1033 257 -2847 1146 -606 -1018 3341 -2620 -35 498 -1941
2852a941L691n19k797K315j512j282N398m529J999M27m263L954l12q95J984j304
$$ -1941 1750 1231 -1566 749 -763 -2045 3353 -1176 823 1250 -3013 941 629 -266 1718 414
2868D14l033M115k843J438K699m552K445j396j424L432m49j569K045l099k38L730
$$ 414 -2619 1496 -1347 91 2790 -1762 683 -713 -2137 1295 846 -723 1322 -1777 -2015 1715
2884A715l752L603q43l014K418p79j12K577j746j454K594l736L034J031k734K898
$$ 1715 -2037 1566 723 -2291 127 -652 -764 1813 67 -1387 1207 -2529 505 1536 -1198 1700
2900A700k531p98K453l13n45K334l745N53K037k873M396j992j252R71j165J75
$$ 1700 -831 -1629 824 511 -34 2300 -1445 -892 1145 -1728 2668 676 -576 395 -770 -595
2916e95K735j945l56J295m047L992q19p44K336k534m95J258m58K50K326l798J509
$$ -595 2140 195 -161 1134 -2913 1079 260 -484 1852 -682 -1177 81 -377 -127 2199 -1599 -90
2933i0k87j592L741j697j25L12j542M24J910j520J050K89l228L013j224O97J614
$$ -90 -377 -1969 1772 75 -50 262 -1280 -856 1054 -466 584 873 -2355 658 -566 131 1745
2950A745j951l23O97j023J033J645k536J725j992k84K180j080J116l86j364k87
$$ 1745 -206 -529 168 -855 178 1823 -713 1012 -980 -1264 916 -164 952 566 -798 -1085
2966a085J588j233K349r02j901J309k021K304N03p32n46J62j327J316J236j420
$$ -1085 503 -730 1619 717 -1184 125 -1896 408 911 179 -367 -205 -1532 -216 1020 -400
2982d00J713k386K66O49j54J210k66r00p93J470j497K599j034l06L16j923J948
$$ -400 1313 -1073 -807 -158 -312 898 632 -268 -1061 409 -1088 1511 477 171 487 -1436 512
2999E12k07P16p39K67j377P06L82p7J626k511P86q86P08M89L97l22j193L64j237
$$ 512 305 1021 282 549 -828 -122 260 183 1809 -702 84 -802 -94 395 792 470 -723 -359 -1596
3018a596K336n11N59r74p42K80j90J715j027Q35j702L08K4Q11N07r52O58j473
$$ -1596 740 229 788 -186 -928 -648 -838 877 -150 685 -1017 -709 -685 126 633 -319 339 -1134
3036a134R44k70J290j26p72k2r36J375l93J196j205K29j106K82J263k53J094j902
$$ -1134 -190 -460 830 704 -68 -90 -1026 349 -44 1152 -53 176 -930 -648 615 362 1456 -446
3054d46K13n04Q33L55M03j51j320P30j394J970l90Jr5r63M36K23P74p53R18k304
$$ -446 -233 -737 96 451 854 703 -617 113 -1281 689 299 300 205 -758 -322 -99 675 -78 840 -1464
3074a464J044K79j59J449j239k72k93O16n64J907r19k07Pj648K087o64Q10N3r94
$$ -1464 -420 -141 -300 1149 -90 -362 -655 -39 -603 1304 385 178 185 -1463 624 -40 770 823 -171
3093a71q35J075N7K80J054k549J238p51J23J671o75m42k76o89O5K092k086J662
$$ -171 -1006 69 126 406 1460 -1089 149 -602 -479 1192 517 75 -201 -890 -825 1267 -819 843
3111H43j001j555J968r84J136L88j054j203J418j283J451J065k484K013k041L50
$$ 843 -158 -1713 255 -729 407 795 -259 -1462 -44 -1327 124 1189 -1295 718 -1323 -973
3127i73J584p25N35l0j348O2J912j661K446j658j010J614j818J438J275j185m24
$$ -973 611 -114 421 391 -957 -895 1017 -644 1802 144 -866 748 -1070 368 1643 458 34
3144C4P26k265K702k82q91J786k646L65J305p12O77N72k357J109J99j446L430
$$ 34 760 -1505 1197 915 24 1810 -836 -471 834 122 799 1371 -986 123 322 -1124 2306
3161B306k364j76Q05j869J124J232j299N17J09l013L253j130J88J915l232N86
$$ 2306 -58 -234 571 -1298 -174 1058 -241 276 385 -2628 625 -505 -317 1598 -1634 -1048
3177a048P88j067J755O37k775K037j316o31L204k466J284l2j671J022O29q96J793
$$ -1048 -260 -1327 428 1065 -1710 327 -989 -1620 1584 -882 402 370 -1301 -279 350 -546 1247
3194A247r81j806K890k472J767J292k556J187n04j216K521J43k038K372k808M59
$$ 1247 266 -1540 1350 -1122 645 1937 -619 568 64 -1152 1369 1512 -526 1846 -962 -503
3210e03K134k575K684j017k140J493K10j074K616k007p16J966l444K619O30j768
$$ -503 1631 -944 1740 723 -1417 76 286 -788 1828 -179 -895 1071 -2373 246 876 -892
3226h92J521j098j397K330p12o48K520l528J410Q95k148K967q84j506J331q95
$$ -892 629 -469 -1866 464 -248 -896 1624 -1904 -494 401 -1747 1220 336 -1170 161 -734
3242g34o28L346k645L12J134l146L181n00p72K031j677j391K501j730Q40K387
$$ -734 -1362 1984 -661 -349 785 -2361 820 320 -452 1579 -98 -1489 1012 -718 122 2509
3258B509l895J887q86j172L011j032p64J335j943k49K587k626K176j80k621K577
$$ 2509 -1386 501 -385 -1557 1454 422 -342 993 -950 -1199 1388 -1238 938 758 -1863 714
3274G14j223l20J923j427r18K202k634J704J176k855K704j798q33K791j458j8
$$ 714 -509 -829 1094 -333 -1251 951 -1683 21 1197 -1658 1046 -752 -1585 1206 -252 -270
3290b70J307k520N90J892k651L569j904j580K354j861J075J718j700j84J043l257
$$ -270 1037 -1483 -893 999 -1652 1917 13 -1567 787 -1074 1 1719 19 -165 878 -2379
3306b379L142j0j777L023k838m18J906j531P24J658k795J414J26k121L516k057
$$ -2379 763 753 -1024 1999 -839 -1257 649 -882 -158 1500 -1295 119 245 -1876 1640 -417
3322d17k64J423k349Q11J685j757R67L28k869L340j082n63K486l004M41Q80j174
$$ -417 -681 742 -1607 -796 889 -868 99 427 -2442 898 -184 -747 1739 -1265 -824 56 -1118
3339a118J305J267k818J853j244q60L170k118R58O38k448J035J122j560K082n51
$$ -1118 187 1454 -1364 489 -755 -1615 1555 -563 395 1033 -1415 -380 742 -818 1264 713
3355G13k449K851k465J211J583k209Q97n1j398J654M37j928K747k460j91K189
$$ 713 -1736 1115 -1350 -139 1444 -765 132 81 -1317 337 774 -1154 1593 -867 -1058 1131
3371A131k399K021l32j829J044N83j663L014j641q58J911k642J725R87j591R54
$$ 1131 -1268 753 421 -1408 -364 219 -1444 1570 -71 -929 982 -1660 65 1052 -539 415
3387D15l74j677J987j81o28K233k746O60O69j729K326k18j433J036l94j288K804
$$ 415 41 -1636 351 170 -458 1775 -971 -311 358 -1371 955 737 -696 340 -54 -1342 1462
3404A462j986O47P84k672K054l15l00J125o73j385J857j119J88J918k664J086
$$ 1462 -524 123 907 -1765 289 -26 -326 799 126 -1259 598 -521 -333 1585 -1079 7
3420Gk07q74J876n65p49J034j158m72K210j941J561L3k090J901r04m0J307p08
$$ 7 -200 -1074 802 237 -512 522 -636 -1108 1102 -839 722 755 -1335 566 -338 -378 929 221
3438B21j110J519j667R61J172j718J751j499n40J140j13k5J054j744k05J510j720
$$ 221 -889 630 -1037 -76 1096 -622 1129 -370 -910 230 117 92 1146 -598 -803 707 -1013
3455a013K144p33j161R45r26M83J083o86j78O21j921J444K75q70J597j528j06
$$ -1013 1131 398 -763 182 -744 -261 822 136 -42 579 -1342 102 377 -493 1104 -424 -530
3472e30L48k18M01P97j379K67K77j022K004j140L22K01j070J51Q64m39L83K36
$$ -530 -182 -400 1 798 -581 -314 -37 -1059 945 -195 127 328 -742 -591 273 -166 217 453
3490D53j539J226j87j73J204q77k71P6j81J04J327j444P67n69n73J340r09O35
$$ 453 -1086 140 -47 -220 984 107 -164 -88 -269 -165 1162 -282 485 -84 -657 683 -226 409
3508D09O8q56LN25k45P45j19j109O71o99O87N07k06r8l44k19L6P41o95R22j002
$$ 409 477 -379 -376 149 -96 649 530 -579 92 -607 80 587 381 283 -61 -280 -244 497 -198 724 -278
3529b78k83N87l01Q99l31k98m06M03m12R89j42o87K51o99P85J54K00j65k71m53
$$ -278 -561 26 -275 624 293 -5 -411 -8 -420 569 427 -260 -9 -708 77 231 431 266 -5 -458
3549d58rN11N1M83q57M0j68J57L11M16J83j252J53l02J077l33P5n8p13K03k28
$$ -458 -467 44 95 578 -279 -239 -407 -250 61 477 660 -592 -439 -741 336 3 78 20 -693 -490 -718
3570g18J233n34N99j075L22J10J23M42m85M88j234P29J2L70L21m60r0n07N80j12
$$ -718 515 -19 580 -495 -173 -63 60 502 17 505 -729 0 12 382 703 243 153 -354 226 114
3590A14M48m34J8j49k69Q63l94P36q54q6j02K34L74k3j91p24P01p98Q02L7k28
$$ 114 562 128 146 -3 -272 591 197 933 79 -7 -109 125 499 476 285 -439 262 -536 266 303 75
3611G5J28o18KL19M89p21N52o18l5L36l73J174p18k97l3q2j60J075l83l21L48
$$ 75 203 -415 -413 -94 395 -326 226 -392 -427 -91 -464 710 -8 -305 -338 -420 -580 495 112 -209 139
3632A39j368J659l32K73K8o43j09K03K79J38R02j669P80l77k68J377q78K62k41
$$ 139 -1229 430 98 371 399 -244 -353 -150 129 267 1169 -500 280 -97 -365 1012 134 396 155
3651A55j97j64J042q54L67L05j704J151j51K62M23q90l13O55n62N30P72j211P71
$$ 155 -42 -206 836 -18 349 654 -1050 101 -50 212 635 -255 -568 87 -475 55 827 -384 387
3670C87j019N8J043m69J35J55j058M82O08p87J135n01j043J104p81N58M62m46
$$ 387 -632 -574 469 0 135 290 -768 -286 322 -465 670 169 -874 230 -551 7 469 23
3688B3k51M98j024Q92O85j601J900j733J10Q59m82N66J27j111M69L58j227J977
$$ 23 -228 270 -754 138 823 -778 1122 -611 -501 358 -124 442 569 -542 -73 285 -942 1035
3706A035j033k50N56j098O92N53n90mO13j567J329k46n19J167j386K67K70m82
$$ 1035 2 -248 308 -790 -98 455 -135 -139 474 -1093 236 -10 -529 638 -748 -481 -211 -693
3724f93R35L44j154N23j27o48J816j342N38J2j210Q99N60p79P87J4j480J739j447
$$ -693 242 586 -568 -45 -172 -820 996 -346 192 204 -1006 -107 453 -326 461 475 -1005 734 -713
3743g13N30J097j581Q52j93r44J227J10q11J202j197m06J595j384J229l21j059
$$ -713 -183 914 -667 185 -8 -952 275 385 -426 776 -421 -827 768 -616 613 292 -767
3760g67N27J34n75J543p79j199J752j840J162N76j114J017n37o93R10k2o57J547
$$ -767 -240 -106 -681 862 83 -1116 636 -1204 -42 534 -580 437 -100 -793 117 95 -562 985
3778I85j949M79R07j473J787k99p88O66p70m41J527q62kQ27j828J445l7p51J106
$$ 985 -964 -485 422 -1051 736 437 -351 315 -455 -896 631 -231 -233 594 -1234 211 174 -577 529
3797E29o91n66Q93l58j71J261j886R31N6p10J643o70l85P03j043l36J778j556
$$ 529 -162 -728 165 -193 -364 897 -989 -58 -2 -712 931 261 -124 579 -464 -800 978 -578
3815e78Q94K61j743J699j018L3J384q29n87J013j227N82J081j735J460j117n69
$$ -578 316 577 -1166 533 -485 -452 932 103 -484 529 -698 -116 965 -770 690 -427 -996
3832i96J434m73j48Q82j214N6J077j369J444m09j175J271q28MJ117r91R6Q10j834
$$ -996 438 -35 -183 699 -515 -459 618 -751 693 284 -891 380 -448 -444 673 -318 -222 588 -1246
3851a246J334N89j590J784j258k24P98n50N66N15j119Q0M91j192J830o35o65J216
$$ -1246 88 677 -913 871 -387 -611 187 -363 203 718 -401 -321 170 -1022 808 173 -492 724
3869G24j764O85P63p51N77J02j530J522k80m60J705j768L57J90o72O58P00j402
$$ 724 -1040 -355 408 -343 234 336 -1194 328 48 -412 1293 -475 -118 72 -600 58 758 -644
3887f44Q33k78r18K084j158M4N76j251N09O26q23J161j16j957K143j210j23J311
$$ -644 189 -89 -1007 1077 -81 -37 539 -712 -203 423 -400 761 645 -1312 831 -379 -502 809
3905H09j150L74L4r12R08N86j205J442j375k41J407j401J131K6j088P03J77j034
$$ 809 -341 33 67 -845 63 649 -556 886 -489 -730 677 -724 407 433 -655 48 225 -809
3923h09J355j83j193J579j656P65O59o72N03l25q80O92J48j81J122j349j03N64
$$ -809 546 363 -830 749 -907 -142 517 -155 348 23 -857 -165 -17 -198 924 -425 -528 36
3941C6p23J082Oo66N20n10k90J367q43o3Q81j542P81K32n72Q26k58q28Q78n21
$$ 36 -687 395 401 -265 255 -255 -545 822 -21 -84 797 -745 36 268 -304 522 264 -564 314 -207
3961b07q7J176j545R59j50q57J146j04k02L56o32n05J431r29L13N05j298Q17k55
$$ -207 -294 882 -663 296 146 -711 435 331 129 485 -147 -652 779 -150 163 668 -630 187 -68
3980f8N9K12J07p93P48q47N19P11j261J154o44m38O57j12j72P93r07j42P06r19
$$ -68 -9 203 310 -483 265 -582 -63 648 -613 541 -103 -541 116 4 -168 625 -282 -424 282 -637
4000f37J062pq73O45o49L80L76p8m62O15q60K9Q11p53J041p41j34L02k54M59J00
$$ -637 425 418 -455 190 -459 -79 297 219 -243 372 -488 -459 352 -401 640 -101 -235 67 -187 272 372
4021C72k85m71O18n31R07k86m34L41o50J40L18K96k67O16r94N25k84j93J097n72
$$ 372 87 -384 234 -297 610 324 -110 231 -419 -279 39 335 68 684 -310 215 -69 -262 835 263
4041B63j64q5o0j5O79m23P7l23m71R59l86K45k16l79L3J03r7M25J04q46P53l74
$$ 263 99 14 -46 -61 618 195 272 -51 -522 437 51 296 80 -299 -266 -163 -260 165 269 -577 176 -198
4063a98J87J1K20M9k41k55k83Q65m46N58l62m45M90n12P07l2j93k45K2p7L91K93
$$ -198 -11 0 220 269 28 -227 -510 355 -91 467 105 -340 150 -362 345 313 120 -125 -103 -180 211 504
4085E04o06M18n49M38N1p5j8j7j82k31L90K71J55l65k97K11j07M10l60K44o22
$$ 504 -102 316 -233 205 256 181 163 146 -36 -267 123 394 549 184 -113 98 -9 401 41 285 -337
4106c37K97k39N63M6m4p3l86L41j99L56J7k49j23k86M00k19M32j46J84p43K63
$$ -337 -40 -279 284 330 286 213 -173 168 -31 325 342 93 -30 -316 84 -135 297 151 335 -408 -145
4127a45P5K00L00p63P01o16K35l2M3J37k01J1l09P78k13L37m13k42K59l67M08
$$ -145 -70 130 430 -333 368 -248 -13 -45 -2 135 -66 -55 -364 414 201 538 125 -117 142 -225 183
4148A83pN6l98J17j45J19K49m25O19m49j59K3M95o9Nk38l44N58n15O71n56K14
$$ 183 176 232 -166 -49 -194 -75 174 -251 368 -81 -240 -217 278 209 214 -24 -368 190 -325 346 -210 4
4170Dk45j40J94L07N4p0m5n94O80K46k81M17q72k35M70Q0L7N88j005J05L55o71
$$ 4 -241 -381 -187 120 174 104 59 -535 145 391 110 527 -345 -580 -110 -30 7 595 -410 -305 50 -621
4192f21J096m90m5Lj37JL71l29K20J07o22P47m83J45L01j90r6j8j29Q2N59q70
$$ -621 475 -15 -60 -57 -194 -193 178 -151 69 176 -446 301 -182 -37 264 74 -22 -40 -169 -87 472 -398
4214c98N26k41m35Q95n89M19j57k09m51R68p01O81Nr62M35j92M04K20j94kJ80
$$ -398 128 -113 -548 347 -242 177 20 -189 -640 328 -373 308 313 -649 -214 -406 -2 218 24 22 202
4235B02q39P56M85o95N69q45r0N17k80O19j62n87J58L52o02J202p66m40O61r22
$$ 202 -637 119 604 -91 478 -367 -457 60 -220 399 237 -350 -192 160 -442 760 -6 -446 215 -707
4255g07P10J39l33L60J5r28Q45k46j97J092j163K42K50m30P20M3o65K72N0r26
$$ -707 3 142 -191 169 184 -744 101 -145 -342 750 -413 -171 79 -351 369 412 -253 19 69 -857
4275h57J556j124O31L87j277L93N29m25L45P1o90J044o08J05N69j080M60p2m28
$$ -857 699 -425 206 593 -684 -291 238 -187 158 229 -461 583 -25 80 649 -431 29 -43 -471
4294d71M15O42q98O51m24o08R32q42Q17K86j178O81J1l01L01K78q74J104j170
$$ -471 -56 586 -312 339 -85 -693 239 -603 214 500 -678 3 14 -287 14 292 -582 522 -648
4313f48M78O44r47Q09j94l42L64j20j97P69j040R3P77r94R92Qq35O03l37j20P11
$$ -648 -170 474 -473 336 142 -200 164 44 -153 616 -424 -331 446 -548 444 452 -383 220 -117 -237 474
4334D74j02n29O86j112N86K53o62R79m32m76M77k46j07J124j189M12Jp75J051
$$ 474 372 -157 529 -583 3 256 -406 573 141 -335 142 -104 -211 913 -276 136 137 -638 413
4353D13m78m3M90o01k68J084o97J42M95j260J215m78m07R19q18o2N25l75p8J002
$$ 413 -65 -108 382 -219 -487 597 -100 42 537 -723 492 14 -393 526 -292 -354 171 -204 -282 720
4373G20j275R15j07j057J099k20J3K87p32j31P72p39Q57j76r14P36m46J07Q89
$$ 720 -555 360 253 -804 295 75 88 375 -357 -488 284 -455 402 226 -688 48 -398 -291 598
4392E98o12k10Q85j162M38O53j092J146o56m01Q41o61L17K99n22J16L32j171J334
$$ 598 -14 -224 661 -501 -63 590 -502 644 -12 -413 428 -233 84 383 -139 -23 309 -862 472
4411D72n8q33Q28j053O48K06k67pN38j009Q05J4q53J445j022J31L00o79M29L93
$$ 472 414 -419 409 -644 4 210 -57 -64 474 -535 270 284 -569 876 -146 -15 285 -394 35 428
4431D28p73N51J4r62J071k11j7J16q39M03L43m10K60K65j003Q50l91l28J283r37
$$ 428 -345 206 220 -742 329 118 101 217 -622 -219 124 -286 -26 239 -764 86 -305 -633 650 -287
4451b87K38J26o76M91K56l37M06j87p07J234r77N38L80q19K24L61m67L19L42r31
$$ -287 -49 77 -599 -108 148 -189 217 30 -677 557 -420 118 498 -321 -97 264 -203 116 458 -473
4471d73P45o92Q6M90l68M32l46N2J73j05p0P03m77n30R15q36P74j78n24M59j67
$$ -473 272 -420 -334 156 -212 220 -126 -74 99 -6 -76 627 150 -380 535 -301 473 295 -229 230 63
4492F3m54O58k57m2M26r09O88R8m88N54j17o18L46j5l40Q44p82N18j16m92P79
$$ 63 -391 267 10 -32 394 -515 173 271 -217 337 220 -398 -52 -67 -407 437 -345 173 57 -435 344
4513C44j19k96p6L05m39M89l02J17M15j022N18m5j18N29l45j10K02l96J81O84
$$ 344 225 -71 -147 158 -281 208 -94 23 438 -584 -66 -111 -229 300 -45 -155 47 -349 -168 516
4533E16o83M45l86j72L91l28N88q6k04k64L51n86M64M25r39Q45l55q0K23j95Q7
$$ 516 -167 278 -108 -280 111 -217 371 285 81 -183 168 -418 46 471 -468 377 22 -58 165 -30 57
4554E7J97n47K03L48m59N53k00m86M56m2kM41m18k26J21m02N76J61n34M32n26
$$ 57 254 -293 -90 258 -201 352 152 -334 122 80 78 519 101 -125 -4 -406 170 331 -203 229 -297
4575b97N8J80J12l5K68n87L87j1l03P29n95R4j37Q1j47N08m33P0J60n76P69k32
$$ -297 -239 -59 53 18 286 -301 86 75 -228 501 -94 0 -137 -56 -203 305 -128 -58 102 -474 295 63
4597F3j46J87k39j51L30l38J49K72m75L47l17R1K75O6nk76R2k15L54J48J62l26
$$ 63 -83 104 -135 -286 44 -294 -145 127 -348 -1 -318 -227 48 114 109 -167 -75 -290 64 212 374 48
$$ [...]
8191b2
##END NTUPLES=NMR FID
##END=
