##TITLE=1H_N1'-03.09.20
 CDCl3, 8 sc, 
 4.9.2020
##JCAMPDX= 6.0         $$ Bruker NMR JCAMP-DX V2.0
##DATA TYPE= NMR FID
##DATA CLASS= NTUPLES
##ORIGIN= UXNMR, Bruker Analytische Messtechnik GmbH
##OWNER= root
$$ XWIN-NMR		Version 3.5
$$ Fri Sep  4 10:20:19 2020 Russian Standard Time (UT+4h)  she@DPX200
##.OBSERVE FREQUENCY= 200.1315066352
##.OBSERVE NUCLEUS= ^1H
##.DELAY= (6, 6)
##.ACQUISITION MODE= SIMULTANEOUS
##.ACQUISITION SCHEME= undefined
##.AVERAGES= 8
##.DIGITISER RES= 18
##SPECTROMETER/DATA SYSTEM= spect
##.PULSE SEQUENCE= zg30
##.SOLVENT NAME= CDCl3
##.SHIFT REFERENCE= (INTERNAL, CDCl3, 0, 15.7039)
##AUDIT TRAIL= $$ (NUMBER, WHEN, WHO, WHERE, WHAT)
$$ ##TITLE= Audit trail, XWIN-NMR		Version 3.5
$$ ##JCAMPDX= 5.01
$$ ##ORIGIN= Bruker BioSpin GmbH
$$ ##OWNER= she
$$ F:/spectra/data/she/nmr/H-F/1/audita.txt
$$ ##AUDIT TRAIL=  $$ (NUMBER, WHEN, WHO, WHERE, WHAT)
(   1,<2020-09-04 10:18:43.12 +0400>,<she>,<DPX200>,
      <created by zg, POWCHK disabled, PULCHK disabled
       configuration hash MD5:
       00 E9 B6 7A A2 85 ED C7 34 08 36 98 17 FE 4E 26
       data hash MD5: 16K
       FB 5C 26 0A A9 3A 5C 2E 69 EF BE CE FD 1C 02 CB>)
$$ ##END=
$$ 
$$ hash MD5
$$ AA 81 BF 29 41 07 18 4D 47 F9 71 76 3A 27 A6 00
##$RELAX= 
##$RELAX= 
##$RELAX= 
##$RELAX= 
##$RELAX= 
##$RELAX= 
$$ Bruker specific parameters
$$ --------------------------
##$DU= <F:/spectra>
##$EXPNO= 1
##$NAME= <H-F>
##$PROCNO= 1
##$TYPE= <nmr>
##$USER= <she>
##$AMP= (0..31)
100 100 100 100 100 100 100 100 100 100 100 100 100 100 100 100 100 100 
100 100 100 100 100 100 100 100 100 100 100 100 100 100 
##$AQSEQ= 0
##$AQ_mod= 1
##$AUNM= <au_zg>
##$AUTOPOS= <>
##$BF1= 200.13
##$BF2= 200.13
##$BF3= 200.13
##$BF4= 200.13
##$BF5= 200.13
##$BF6= 200.13
##$BF7= 200.13
##$BF8= 200.13
##$BYTORDA= 1
##$CFDGTYP= 0
##$CFRGTYP= 5
##$CHEMSTR= <none>
##$CNST= (0..31)
1 1 145 1 1 1 1 1 1 1 1 1 1 1 1 1 1 1 1 1 1 1 1 1 1 1 1 1 1 1 1 1 
##$CPDPRG= <>
##$CPDPRG1= <>
##$CPDPRG2= <>
##$CPDPRG3= <>
##$CPDPRG4= <mlev>
##$CPDPRG5= <mlev>
##$CPDPRG6= <mlev>
##$CPDPRG7= <mlev>
##$CPDPRG8= <mlev>
##$CPDPRGB= <>
##$CPDPRGT= <>
##$D= (0..31)
0 1.2 0 0 0 0 0 0 0 0.06 0 0.03 0 0 0 0 0.0002 0 0 0 0 0 0 0 0 0 0 0 0 
0 0 0 
##$DATE= 1599200322
##$DBL= (0..7)
120 120 120 120 120 120 120 120 
##$DBP= (0..7)
150 150 150 150 150 150 150 150 
##$DBP07= 0
##$DBPNAM0= <>
##$DBPNAM1= <>
##$DBPNAM2= <>
##$DBPNAM3= <>
##$DBPNAM4= <>
##$DBPNAM5= <>
##$DBPNAM6= <>
##$DBPNAM7= <>
##$DBPOAL= (0..7)
0.5 0.5 0.5 0.5 0.5 0.5 0.5 0.5 
##$DBPOFFS= (0..7)
0 0 0 0 0 0 0 0 
##$DE= 6
##$DECBNUC= <off>
##$DECIM= 32
##$DECNUC= <off>
##$DECSTAT= 4
##$DIGMOD= 1
##$DIGTYP= 9
##$DL= (0..7)
0 120 120 120 120 120 120 120 
##$DP= (0..7)
150 150 150 150 150 150 150 150 
##$DP07= 0
##$DPNAME0= <>
##$DPNAME1= <>
##$DPNAME2= <>
##$DPNAME3= <>
##$DPNAME4= <>
##$DPNAME5= <>
##$DPNAME6= <>
##$DPNAME7= <>
##$DPOAL= (0..7)
0.5 0.5 0.5 0.5 0.5 0.5 0.5 0.5 
##$DPOFFS= (0..7)
0 0 0 0 0 0 0 0 
##$DQDMODE= 0
##$DR= 18
##$DS= 0
##$DSLIST= <SSSSSSSSSSSSSSS>
$$ [...]
##$SUBNAM2= <"">
##$SUBNAM3= <"">
##$SUBNAM4= <"">
##$SUBNAM5= <"">
##$SUBNAM6= <"">
##$SUBNAM7= <"">
##$SUBNAM8= <"">
##$SUBNAM9= <"">
##$SW= 16.880792210976
##$SWIBOX= (0..15)
0 0 2 0 0 0 0 0 0 0 0 0 0 0 0 0 
##$SW_h= 3378.37837837838
##$TD= 16384
##$TD0= 1
##$TE= 0
##$TE2= 300
##$TE3= 300
##$TEG= 300
##$TL= (0..7)
0 120 120 120 120 120 120 120 
##$TP= (0..7)
150 150 150 150 150 150 150 150 
##$TP07= 0
##$TPNAME0= <>
##$TPNAME1= <>
##$TPNAME2= <>
##$TPNAME3= <>
##$TPNAME4= <>
##$TPNAME5= <>
##$TPNAME6= <>
##$TPNAME7= <>
##$TPOAL= (0..7)
0.5 0.5 0.5 0.5 0.5 0.5 0.5 0.5 
##$TPOFFS= (0..7)
0 0 0 0 0 0 0 0 
##$TUNHIN= 0
##$TUNHOUT= 0
##$TUNXOUT= 0
##$USERA1= <user>
##$USERA2= <user>
##$USERA3= <user>
##$USERA4= <user>
##$USERA5= <user>
##$V9= 5
##$VALIST= <valist>
##$VCLIST= <CCCCCCCCCCCCCCC>
##$VD= 0
##$VDLIST= <DDDDDDDDDDDDDDD>
##$VPLIST= <PPPPPPPPPPPPPPP>
##$VTLIST= <TTTTTTTTTTTTTTT>
##$WBST= 1024
##$WBSW= 4
##$XGAIN= (0..3)
0 0 0 0 
##$XL= 0
##$YL= 0
##$YMAX_a= 537940
##$YMIN_a= -436635
##$ZGOPTNS= <>
##$ZL1= 120
##$ZL2= 120
##$ZL3= 120
##$ZL4= 120
##$ABSF1= 10
##$ABSF2= 0
##$ABSG= 5
##$ABSL= 3
##$ALPHA= 0
##$AQORDER= 0
##$ASSFAC= 0
##$ASSFACI= 0
##$ASSFACX= 0
##$ASSWID= 0
##$AUNMP= <proc_1d>
##$AZFE= 0.1
##$AZFW= 0.1
##$BCFW= 1
##$BC_mod= 2
##$BYTORDP= 1
##$COROFFS= 0
##$CY= 11.3945322036743
##$DATMOD= 1
##$DC= 2
##$DFILT= <>
##$DTYPP= 0
##$F1P= 16.9975609425685
##$F2P= -3.02152046262296
##$FCOR= 0.5
##$FTSIZE= 0
##$FT_mod= 4
##$GAMMA= 1
##$GB= 0.15
##$INTBC= 1
##$INTSCL= 1
##$ISEN= 128
##$LB= 0.24
##$LEV0= 0
##$LPBIN= 0
##$MAXI= 10000
##$MC2= 0
##$MEAN= 0
##$ME_mod= 0
##$MI= 1.114404
##$NCOEF= 0
##$NC_proc= 0
##$NLEV= 6
##$NOISF1= 3.799351
##$NOISF2= 2.8
##$NSP= 1
##$NTH_PI= 0
##$NZP= 0
##$OFFSET= 15.70392
##$PC= 1
##$PHC0= -9968.342
##$PHC1= 7.4009
##$PH_mod= 1
##$PKNL= yes
##$PPARMOD= 0
##$PSCAL= 0
##$PSIGN= 0
##$REVERSE= no
##$SF= 200.130013532006
##$SI= 16384
##$SIGF1= 3
##$SIGF2= 2
##$SINO= 400
##$SIOLD= 16384
##$SREGLST= <1H.CDCl3>
##$SSB= 0
##$STSI= 0
##$STSR= 0
##$SW_p= 3612.71676300578
##$SYMM= 0
##$S_DEV= 0
##$TDeff= 0
##$TDoff= 0
##$TI= <>
##$TILT= no
##$TM1= 0
##$TM2= 0
##$TOPLEV= 0
##$USERP1= <user>
##$USERP2= <user>
##$USERP3= <user>
##$USERP4= <user>
##$USERP5= <user>
##$WDW= 1
##$XDIM= 8192
##$YMAX_p= 0
##$YMIN_p= 0
$$ End of Bruker specific parameters
$$ ---------------------------------
##NTUPLES= NMR FID
##VAR_NAME=  TIME,          FID/REAL,        FID/IMAG
##SYMBOL=    X,             R,               I
##VAR_TYPE=  INDEPENDENT,   DEPENDENT,       DEPENDENT
##VAR_FORM=  AFFN,          ASDF,            ASDF
##VAR_DIM=   8192,          8192,            8192
##UNITS=     SECONDS,       ARBITRARY UNITS, ARBITRARY UNITS
##FACTOR=    0.000296,      1,               1
##FIRST=     0,             0,               0
##LAST=      2.424536,      0,               0
##MIN=       0,             -436635,         0
##MAX=       2.424536,      537940,          0
$$ Real data points
##PAGE= N=1
##DATA TABLE= (X++(R..R)), XYDATA
0@%%%%%%%%%%Mj2J6j6J6k4L2m0M8n6P2q8J05j25J50j79K10k45K85l32L84m42N07
33B70n77O56p43Q41r50J068j198J340j495J665j851K054k277K520k783L071l386
50a775L731m109M525m982N486o046O669p368Q157r057J0088j1287J2703j4392
64g657J6452j9012K2252k6394L1393n1923L45333o42348L78984K51096p34811
75d36635O35046j75308k56631N79994m31204k6965M15596n10431K45541O1781
85A00784l29696L58927l8618k56980K47686j60562j16954L71939l11706M5613
95h9567K65431l67300K77481k1146k93959L88874j08000j07782L24417l69247
105a00798J10682K14556l54635K91269p8446j43828K74654k04677p1957J38612
$$ y = [0, 0, 0, 0, 0, 0, 0, 0, 0, 0, 0, 4, -8, 8, -8, 8, -16, 16, -24, 24, -32, 40, -48, 57, -68, 82, -97, 113, -132, 153, -179, 205, -237, 270, -307, 349, -394, 447, -503, 565, -633, 707, -788, 877, -974, 1080, -1197, 1323, -1460, 1611, -1775, 1956, -2153, 2372, -2610, 2876, -3170, 3499, -3869, 4288, -4769, 5319, -5968, 6735, -7657, 8795, -10217, 12035, -14359, 17034, -34889, 310444, -331904, 47080, 298176, -436635, 198411, 23103, -233528, 346466, -84738, -111703, 303893, -206538, 39003, 100784, -228912, 130015, 91397, -165583, 82103, -78459, -195413, 176526, -135180, -89567, 175864, -191436, 86045, 64899, -229060, 159814, 51814, -55968, 268449, -100798, 9884, 224440, -130195, 161074, 82628, -61200, 213454, 8777, -63180, 75432]
115G5432j35669N6551J22816k22418P8377N4137j45299J09624j5598j12989J80213
126D5177q008j68645J96533j67050K4796K27605k56976J33809N0003j64135J84083
137I7192o5180j37962K25992q7637l3312J45306k19553Q8369R6115j35592P4861
148D8599K7947j16543J30757r78j92101K02368r0261l2715J93536k36046M6830
159a8607J36628k05175J38479J6611k16914K84625j25484j12383K21079k52044
169a33185J26689J23337k33842J44181J2075j51337K18275j10143j10304K49301
179A35047j80127N6749J05072k27235J51201O2180j74817J63223n7166j29864
189i5737K65970k03284j8859J75693k34010J76915K3739k20120J95614m6691j08222
$$ y = [75432, -60237, -3686, 119130, -103288, -24911, 29226, -116073, -6449, -22047, -135036, 45177, 37169, -131476, 65057, -101993, -77197, 150408, -106568, 27241, 77244, -86891, 97192, 32012, -105950, 120042, 32405, -907, 144399, -75154, 13215, 109330, -26262, 48599, 76546, -39997, 90760, 89782, -102319, 100049, 9788, -22927, 170609, -65437, -18607, 118021, -87154, 51325, 67936, -148978, 135647, 10163, -102220, 118859, -133185, -6496, 116841, -117001, 27180, 39255, -112082, 106193, -3950, -114254, 135047, -45080, 11669, 116741, -110494, 40707, 102887, -71930, 91293, 34127, -95737, 170233, -33051, -51910, 123783, -110227, 66688, 90427, -129693, 65921, 19230, -88992]
200h8992K21467k01532N837J99727k31325J38105L171j60534K04634n0518j09473
211f9433J50553j11294q677J68586k09962P3689P1522j43186J46153n6984j09495
222i8528J50235n1800n6531J28343j57953O0704J04078j61527J08959l2578n2859
233e9457J26442o3766n2474R2186o2060K8510O1569j28823Q2194R498l9070N1487
245D6236n3005j3926O2893j6469m1526M4956o2126M8619K8346p7094L5395p492
257e193j48K8825k2808m8649O6549j7667r671L1125p4455N4787J9787l4858M010
270h366J646k1133N4384j1021o5535O9618l9614K4044K7005p1415K5768L9870
282B5251l5960J7325L025o6986J01897l4374l8158N5404o4579M5750L3109o8402
$$ y = [-88992, 132475, -69057, -63220, 136507, -94818, 43287, 46458, -114076, 90558, 40040, -69433, 81120, -30174, -38851, 129735, -80227, -6538, 64984, -78202, 67951, 10967, -98528, 51707, -93, -56624, 71719, -86234, -25530, 78548, -82979, 25980, -6598, -59457, 66985, 3219, -49255, 42931, -19129, 9381, 70950, -57873, 24321, 33819, -5251, 46236, -6769, -20695, 42198, 25729, -15797, 29159, -32967, 15652, 43998, -33096, 2299, -5193, -5341, 23484, 676, -47973, 18576, 909, -8762, 22363, -52092, 2695, 22482, -12376, -8366, -6720, -27853, 26531, 15510, -50025, 19593, -20021, 4023, 31028, -40387, -14619, 25251, -10709, 6616, 9641, -57345, 44552, 10178, -27980, 27424, -37155, 8595, 41704, -26698]
294b6698J1902L7420n1368O8088l4589o0104R6164n3031J6796J5502o1644M1090
306d72L6576n6336K4686m201l6608R2400o5507p171L4275l6484N0714j0428m3799
319b2355K7474J8362k3772L9475n7093Q121M9903m6017L0040l6419m187L8076
331B1608j2029k3919Q113j7024K0021K4163o4242L5745j7176J3358K6235n1212
343c6359J4995J2455M678Q032q830k9868N3182j1126k973J2297m6020O0563j0881
356B0145j1377M031k0684K1150K1925l5233o458J6894k8122N6596n1269j6811
368b9213L9670l4779L6485j6382m1368L7112J5033l7057M3621n1269L668P4868
380D0389p9115L7710m541l6527P2347k3161m9889N9305l0598l26O5936j06508
$$ y = [-26698, -14796, 22624, -28744, 39344, 4755, -55349, 40815, -12216, 4580, 20082, -41562, -472, 36104, -20232, 4454, 253, -36355, 56045, -9462, -16633, 17642, -18842, 31872, 21444, -22355, 5119, 23481, -291, 39184, -17909, -9788, 40115, -5902, 24138, -12281, -16468, 21608, 9579, -14340, -6227, -23251, -3230, 20933, -43309, -7564, -24740, -11382, 14853, -36359, -21364, -8909, -4231, 3801, -5029, -34897, 18285, 7159, 4186, 16483, -29537, 31026, 20145, 8768, 12799, -7885, 13265, 35190, -43, -6501, 10393, -17729, 38867, -12402, -29213, 10457, -24322, 12163, -4219, -45587, -8475, 6558, -30499, 13122, -38147, -34479, 40389, -38726, -1016, -5557, -42084, 30263, 7102, -42787, 16518, -14080, -14406, 51530, -54978]
392e4978N1384K9750n8489O6089m5656k9715P6728l0933k9442N7232p6167N0290
404F093M0806r3869O2906k0224j8021O2477m9143l1541O9046m4792J2206L4596
416C0540r4051P7269R14m4312M7047m4398j666O2632m7560j6064M7615o1708O1505
429A7763k224o9073O2135k0788n261L2809m7013j2845O6118n2233J1032J9804
441B24o7876P7145j0212m5000M1474j6999p027O5382n6461j2942P4584o5740N6013
454C2565K794o8234P6633l681m0414M8559m0511k1982R2991q7518O013L9869q2147
467d5063P2067j1469p8450O3364q299m8522Q3046q3150j1364J02888r9121N3738
479a0335J7882q1850R8605l143p5481R5065m5935j5099J16255j28089L8865N5824
$$ y = [-54978, -3594, 26156, -32333, 33756, -11900, -41615, 35113, 4180, -25262, 31970, -44197, 6093, 46899, -46970, 15936, -4288, -22309, 40168, -8975, -40516, 28530, -16262, -4056, 30540, -63511, 13758, 14672, -29640, 17407, -26991, -28657, 33975, -13585, -29649, 17966, -43742, 17763, 15539, -53534, 8601, -12187, -17448, 15361, -31652, -44497, 21621, -30612, -19580, 224, -67652, 9493, -719, -45719, -4245, -21244, -28271, 37111, -19350, -32292, 42292, -23448, 32565, 35359, -32875, 43758, 40077, -337, 48222, 7711, -14271, 78720, -8798, -2785, 37084, -45063, 27004, 15535, -62915, 449, -7850, -56372, 26674, -56476, -67840, 35048, -64073, -10335, 7547, -74303, 24302, 21159, -54322, 40743, -5192, -20291, 95964, -32125, 6740, 62564]
491F2564r6634R4216k5644q1733J06053m2674n0639R5579j17141L9452Q2325j29424
503f3700P9238j1819p2444J14579m7928n9144J17087q1735J7057Q6058j49029
514g1780R4361K9163r0337J10085n9921n6185J24503q8974j7238R5618j33196
525f3901R1575K8473j35452J08081m1733m3897J15657q6746k3744J10576j09778
536e0889M6938M7159j24648J26596m687p4954R3856o5199k5081J17097r5005O092
548b725Q5327j19925Q9612l302j09667J11078l0866l6315Q9179r2271j2756R6602
560F3971j09283N2344K8575r1870J07268l2503o7281P1874m2199q127R2194r2104
572b7141Q667O4421r9795P2794p453p1059J01182k3176n2306P3345p7412J398
$$ y = [62564, -34070, 60146, 34502, -47231, 58822, 16148, -34491, 61088, -56053, -16601, 65724, -63700, 15538, 3719, -68725, 45854, -2074, -61218, 55869, -25866, -8809, 77249, -71780, 22581, 51744, -38593, 71492, 11571, -44614, 79889, -9085, -26323, 69295, -63901, 27674, 56147, -79305, 28776, -12957, -56854, 58803, -27943, -51687, 58889, -50889, -3951, 43208, -81440, 45156, 40469, -34485, 59371, -5828, -30909, 86188, -8817, -2725, 82602, -37323, 52289, 48987, -60680, 50398, 19532, -16783, 72396, -19875, -32631, 63971, -45312, 7032, 35607, -56263, 51005, 18502, -48779, 23095, -19104, -27231, 64963, -27141, -18474, 45947, -53848, 18946, 11493, -59566, 41616, 18440, -33866, 39479, -37933, -36535]
584c6535J03908j11211N8341K6568r0424R9257m0193o2209J02007m1161j3723
595e375Q5797j21156L4924O3222j04488Q7570j4517o7374J00739m9281o4179R5627
607D1509p8088K0079R5382j38685O5074K2026r5392J07421l8609n9522J25604
618F6799p0396k5943Q9935j31644P6460N7138j13021R7629l3513o0330J04036
629E7150p0082l4772J07799q9279L7322M9141j33431Q9453L854o6377R6423n3368
641f167l8096J06430r1274k470P8408j10800R9622J1386j04357R6496m7088l0681
653c8591R8792q5784J689Q9396j07957N8576O427r6577J14358k9088m3012P2656
665D0885o7810m274Q0680r2026K8687N2017q6772Q7472k6145p1774Q8274l4579
$$ y = [-36535, 67373, -43838, 14503, 41071, -49353, 49904, 9711, -52498, 49509, 8348, -5375, 80422, -40734, -5810, 57412, -47076, 40494, 25977, -41397, 59342, 10061, -54118, 41509, -36579, -16500, 78882, -59803, 5271, 27297, -68095, 39326, 717, -58805, 66799, -3597, -29540, 60395, -71249, 5211, 62349, -50672, 46957, 13444, -46886, 57150, -12932, -47704, 60095, -29184, 8138, 57279, -76152, 13301, 17155, -49222, 47201, -6167, -44263, 62167, -29107, -31577, 46831, -63969, 35653, 47039, -57318, 39178, -7910, -38591, 60201, -25583, -23894, 65502, -42455, 16121, 22548, -74029, 40329, 11241, -31771, 40885, -26925, -31199, 49481, -42545, -13858, 38159, -48613, 38859, 12714, -59060, 29214, -5365]
677e365j7369P3843q0848J1338P2638j00625O0077K305o4170R8967m1421m1639
689c2269O1853m9934O104O5884q7409L6209L5528p0456O5316l0140l9786P3243
701C4143k4248k7728N2628o1392J3686O0746q6647M8673O149m8250O8688l6352
713I6m1000O6724l5634l091N4727q6703M5214K7366o3525N7789k7657k4291O5887
726C5902l5217k7101N3605n4743K9375L8764q1509N4759j036l6709N5041l7296
738f165k7765P1040m5403l814M5665q2309O2123J2629o4161N9568k8908j8761
750b6261O5157n3287j4205O1890o3457M3681J3492p3034P0204j3977k7464M7865
762C0604m0590p700O3612n7054Q400L1333o1573O4172j1878m7066M9058k3373
$$ y = [-5365, -22734, 51109, -29739, -18401, 54237, -46388, 13689, 15994, -48176, 50791, 9370, -32269, 29584, -20350, -14246, 51638, -35771, 438, 35966, -34490, 30826, 686, -39100, 34143, 9895, -17833, 34795, -26597, -12911, 47835, -38812, 9861, 16010, -32240, 36448, 96, -40904, 25820, -9814, -12905, 41822, -44881, 333, 27699, -35826, 21963, -5694, -29985, 35902, 685, -26416, 27189, -27554, 1821, 40585, -40924, 13835, 12799, -23910, 31131, -6165, -33930, 37110, -8293, -12107, 33558, -48751, 13372, 26001, -38160, 21408, -7500, -26261, 38896, -14391, -28596, 33294, -30163, 13518, 27010, -46024, 24180, 10203, -17261, 30604, -9986, -17686, 45926, -11128, -2728, 28605, -32968, 31204, 19326, -27740, 21318, -2055]
774b055q867M3072n2183J044M7891n5755L8094r078m1320N9438k3060j4733K6340
787H828k8617R024L7769n0678K0181J2173k9649M8442l0417j4310L1882j3545
799A083O49J6491l5248J6073K6380l9561K8310j9495q746L6299k4225q648J3943
812C305j2559Q184J8105m2268K3303N605j4881K4855k7472J76K0855m560r269
825f621J0776j8844J6011J6256l0710J6274o908L823J2992j1336j3067J5890K276
838F812p269J3035k8234J7584R568j2584K661p250L11J1996J230k2463J5910p777
852f470Q156P018k2895J0198L780M720l702j098j0786J8837K268j1672P324j3393
866g715J8191M69p205n970L598M552K259l151j7504J6050n574O182q697j0489
$$ y = [-2055, -10922, 32150, -20033, -18989, 28902, -26853, 11241, 2163, -39157, 20281, -2779, -17512, 8828, -19789, -10765, 27004, -23674, -3493, 8680, -20969, 27473, -2944, -17254, 14628, 1083, 1732, 18223, -17025, -952, 25428, -14133, 14177, -5318, -14064, 22235, -1990, -10638, 3305, -9254, -1070, 17035, -25233, -1930, 3675, -11206, 13649, -13823, -13647, 7208, 2648, -6621, 4155, -14689, 1322, 17578, -13132, 3142, -3766, 57, 13049, 1713, -11354, 4536, 6812, -457, 12578, -15656, 1928, 11496, -1088, 1573, -5677, -5366, 6630, 7860, -14603, 1307, -6470, 1686, 8704, -14191, -3993, -213, 4507, 805, -293, -11079, 7758, 10026, -1646, 5678, -7715, 10476, 10945, 3740, -2230, 1368, 5920, 8179, 5028, -12476, 3574, -2000, 4182, -4515, -15004]
880a5004R854Q12L647j2477J500j112J4900p092m832J569P55J7467j1517K615
894A085n951J1632P030o389j466m786J1681K72p5j5696R404q31K381K02k1574
909a3081J5138k210R48l453q253j338J6616n905j0803J2859j7461K6037k548j8099
923a1553J5065l089L307J2535j5518r215L0331k3150J3146p29k8725L5122j0487
936G040j2515J1814j4984l53K8189l3115K657J7629k8214L6106j6595j9547K8995
949G107q994k747J8162k7019O177L2605l7607K3407o638k0114M0524k1232j2931
962i300K0669j7427N101K4414m5820K1666J1162k8442L7822l0389p852L3943k0385
975d838j251J7512l2174K4426J7699m3070L4675j6290o836L5664l1291m880K5916
$$ y = [-15004, -5150, -4338, -691, -13168, -11668, -12780, 2120, -4972, -9804, -8235, -7480, 9987, -1530, 1085, -4866, 6766, 13796, 7407, 5941, 1155, 12836, 13108, 13033, -2663, 6741, 5910, 8291, 8493, -13081, 2057, -153, 795, -2658, -10911, -12249, 4367, -1538, -12341, 518, -16943, 9094, 6546, -11553, 3512, 423, 3730, 16265, 747, -8468, 21863, -1287, 11859, 11130, -17595, 17527, 7040, -5475, 6339, -8645, -8998, 19191, -13924, -11267, 6362, -21852, 14254, -2341, -21888, 7107, -1887, -4634, 13528, -13491, -7314, 25291, -12316, 11091, 4453, -15661, 24863, 3631, -9300, 11369, -6058, -957, 23457, -22363, -697, 10465, -17977, 19845, -10544, -18396, 15547, -4838, -6089, 11423, -20751, 3675, 21374, -21696, 12979, -3311, -10147, 25517, -5774, -10654, 15262]
988A5262k2017R572J6908m7492L7848K147k7928L5313l1706q3L5294k9005k994
1001h881K5203l6091L1652P118m6327M3227j6309p107L1508l3910l157L4582l1384
1014i876Q905J6835m6108M5456n019l2339L4622k4424j440L6678l5451l199L5206
1027A9846m2885L3654J651m4900N2565j6404j3858L1512l5323J707M2127m5050
1039a5358J6597J5850m5504N2695j9991k9241M0803k3673p9L3981m6786Q275L5491
1052B3060n0166M1668q431l6281N8300k8249j6088L6679l8804J3507M1867o2003
1064b4941L3123Q157m5525O0934l4901j9893N2604l5885J169L2043n9381L2221
1076b75K7423n6723N2750k3473k6071N7661m2314q753M2725m1440K1371K8910
$$ y = [15262, -6755, 2817, 19725, -27767, 10081, 12228, -15700, 19613, -12093, -12176, 23118, -5887, -8881, 16322, -19769, 11883, 19001, -27326, 15901, -408, -7515, 23993, -9917, -13074, 21508, -9876, -971, 15864, -30244, 15212, 10193, -22146, 12476, -11948, -13388, 23290, -12161, -15360, 19846, -23039, 10615, 12266, -32634, 19931, 3527, -10331, 21181, -14142, -12435, 29692, -15358, 1239, 17089, -28415, 24280, 4289, -24952, 15851, -7822, -7901, 26080, -20706, -12431, 23060, -27106, 14562, 6131, -30150, 28150, -99, -16187, 20492, -18312, -4805, 37062, -24941, 8182, 16339, -29186, 31748, -3153, -23046, 29558, -6327, -5158, 26885, -32496, -275, 27148, -29575, 23175, -298, -26369, 31292, -11022, -19775, 22950, -18490, 2881, 31791]
1088C1791o9244M6636K22l7579N9382m0492r763M9695m4208K744L1120n4610M6488
1101A2182J2635n5588N2168l0010j2358M8947m2762J977L9708m3360K1265J2588
1113A7392n7486N6837q222k6086M5345m1479p74M0167m4560J0179L0244m7577
1125b6020M7465p402m9453N3891k7819k389M1560m5344P581L5803n0972K7657
1137D558P401m4612O3134k2155k5626L8914l8402O671L9204m7097J6551K7520
1149B6061n1714M4577j6180l7155N8555k5618p446L4279m6352Q931L7774n4383
1161b8671L4271P762m1055N7519l2539k3929M3878l0875Q239L5425n3359K2420
1173i14K2062n1163M7875j9246k2399N5203l3869r837L0507m1728K0930L1086
$$ y = [31791, -37453, 9183, 9405, -28174, 31208, -9284, -19047, 30648, -13560, -10816, 20304, -34306, 12182, 24817, -30771, 21397, -8613, -20971, 27976, -14786, -12809, 26899, -16461, 4804, 17392, -40094, 16743, 8521, -17565, 27780, -13699, -14473, 25694, -18866, -8687, 21557, -26020, 21445, 14043, -35410, 18481, -9338, -11727, 29833, -15511, -7930, 27873, -23099, 4558, 11959, -32653, 30481, 8326, -17300, 21614, -16788, -10117, 29087, -18010, -1459, 26061, -25653, 18924, 2744, -34411, 24144, -1474, -8920, 25359, -20993, -12062, 25712, -28671, 5600, 13362, -27693, 29826, -2713, -26642, 17236, -13639, -5400, 30025, -23334, -914, 21148, -30015, 17860, -1386, -23785, 31418, -2451, -12288, 18219, -23509, -2579, 28507]
1185B8507n6274M0657l238l4836N1148l8648r159M5818l4152Q461K4125n5411
1197c3002L7794J0924m4116N1335k8775r730M5209m3262J23L2242l8387K9627
1209I982J3807n4276M7759j4613k1410M4441l9072L527L7716l9808R474J8240
1221A5767m6474M7071k758l7673M6107l1278j280L4608m1253Q292L1083l8618
1233a6406K8474J26m2628N0892j9304j2298L2495l4395Q672K7387l8328J2570
1245b743J5542l4713M2089j5575k7004L7460k4498K891K2016l2817J0484K3902
1257A7034l5617K3814m197k6054M4444k2488q398K2814k3937R923K0504l4717
1269a6875J7010J2807k7909L5048k1753j3590L3378k0232J706J5501k7643J4237
$$ y = [28507, -27767, 12890, 9652, -25184, 25964, -12684, -21843, 23975, -10177, -1716, 22409, -33002, 4792, 15716, -28400, 22935, -5840, -15570, 29639, -13623, -13500, 18742, -19645, 9982, 23789, -30487, 17272, 2659, -18751, 25690, -13382, -9855, 27861, -11947, -2473, 15767, -30707, 16364, 13606, -24067, 22040, -9238, -10518, 24090, -17163, -8871, 22212, -16406, 12068, 12194, -30434, 20458, 1154, -11144, 21351, -13044, -4372, 23015, -15313, -2743, 12799, -21914, 20175, 4600, -22404, 15056, -9442, -6551, 15465, -17352, -6868, 17034, -18583, 5231, 1034, -25020, 19424, -3064, -11462, 11352, -12585, -2662, 17842, -16875, 135, 12942, -14967, 20081, -1672, -15262, 18116, -2116, -410, 15091, -12552, 1685]
1281A685J8596l5877K4941o598j6750L6393k6878o410K1956j9641Q083J5360l5706
1294b0846K2659Q244k7166L0547k2506m922K9543k1226j456J5714k3168J7097
1306B514J2113l4485K7480p389r685K6056k4984r13K0693j6450M516J0582k8881
1319a8833K5585J208k1225K3190j8779L338J8935k0110j67J4247j7525J6393J430
1332G687k5594K7662j1123k083J3421k0386O949J3702j5158M328L819j8198K5371
1345A0397j0041j1541J5679j4394Q942O687j6293L378J0880j2669J3314o613j2612
1358a4886K2916j1008J561L821j0498Q561Q976j3833L888L938q954J8548j3184
1371a54m086R660n504N216q19q768K591J0038j0920N981o191k861J2819q371j074
$$ y = [1685, 20281, -15596, 9345, 2747, -14003, 22390, -4488, -10898, 11058, -8583, -500, 14860, -20846, 1813, 10057, -17109, 13438, -9068, -13990, 15553, -5673, -7129, 8585, -14583, 2514, 14627, -19858, 7622, 233, -9452, 16604, -8380, -9293, 11400, -5050, -534, 10048, -18833, 6752, 7960, -13265, 9925, -8854, -5516, 13419, -6691, -6858, 7389, -10136, 6257, 7687, -17907, 9755, -1368, -3451, 9970, -10416, -3467, 10235, -4923, -595, 3224, -14974, 10397, 356, -11185, 4494, -9900, -958, 5729, -10564, -7186, 3694, -8975, 4339, -2274, -14886, 8030, -2978, -1417, 2404, -8094, 467, 9443, -4390, -502, 3436, -5518, 13030, -154, -4240, 5420, -84, 5132, 4313, -4455, -1864, 8174, -2746, 3235, -2956, -5817, 7002, -1369, -2443]
1386b443j521J156J752M958j0755J194O318m443O962r626J015L794K575k433k568
1401d065n26J160Q219r071J700j924M509K878m072j446j649Q934l966J732o058
1416c645K361N887j615j257m820N346k55M551p657n99M201j11L094p690R87N76
1432f46N963n174q80j665J91Q241q243R21k306L460K601j045o187J609O406m905
1448a659O101j0521L489O874l905J72k525q28M838M889j2549P162k344L05R342
1463H841j3192K254N310k039P80K310j2335J1442L454j2071J1590j1834M273J0109
1477H892j1175j233O416q261R048K066j8792J7913n641k617J0510j5854M377J0995
1491F644j0508K060M748j5518J9877l823j3526J6014j2239N572J0120j6318K815
$$ y = [-2443, -3964, -2808, -1056, 3902, -6853, -5659, 659, -3784, 3178, -6448, -5433, -1639, 936, -1497, -4065, -4591, -3431, 4788, -4283, -2583, -4507, 2, 2880, -1192, -2638, -4287, 4647, 681, 2413, -3645, -1284, 4603, 2988, 1731, -3089, 2257, 2002, 6553, -1104, -1703, 2498, 2387, 5481, -2209, -1222, -646, 5317, 143, -737, -2402, -2211, 6030, -2213, -1292, -3598, -138, 2463, 1418, -4769, -3160, 3246, -1659, 4442, -6079, -2590, 4284, 379, 551, -1974, -2802, 2036, 6925, -5624, 1538, -806, -501, 8841, -4351, -2097, 3213, 1174, 1954, 4264, -8071, 3371, 6825, -5246, 6344, -5490, -1217, 8892, -2283, -3516, 2900, -5361, 3687, 5753, -13039, 4874, -767, -3384, 7126, -8728, -4351, 6644, -3864, -1804, 2944, -12574, 7303, 3480, -10046, 5968, -6271, -699, 9421, -6897, -4082]
1504d082J1331j3590J2812k861j7276K5371j2643j383J0626j7414R694J0863j8537
1517g089Q280L495j5774K5053j5124r048K0173j6587Q118O755k0372J1100R515
1530H495j9172J8350r904j1122K8073k0629Q24J1366j7433J3246P856k4340J6241
1543A851J454j5773K6493k1525k926K1871j9540P655O298k1276J7870O919k3960
1556a4589K2510j2847o284K6252k4597L585J3367j7135J2352N295k5743K2598
1568D764q62j5153K5103k3497K331K0484k1563O659Q938k0160K0618J573k5605
1581a6370K6636j4457k321K2754k6344O866J4077j9738J2127L035k4319K9922
1593A1868p545j5168K4145k5088P604J8000k5006R977J0120k2554K3779o731k3384
$$ y = [-4082, 7249, -6341, 6471, 3610, -13666, 11705, -938, -2321, 8305, -9109, 585, 11448, -7089, 1191, 4686, -11088, 13965, -1159, -10207, 9966, -6621, 1497, 8252, -12120, -1020, 8495, -10677, 7673, -2231, -13353, 14720, -5909, -5085, 6281, -11152, 2094, 9950, -14390, 1851, 3305, -12468, 14025, -7500, -10426, 11445, -8095, -440, 5858, -15418, 2452, 9371, -14589, 7921, -4926, -11210, 15042, -9555, -5970, 7397, -9738, 2614, 7909, -17834, 4764, 3902, -11251, 13852, -9645, -7314, 13170, -8393, -1734, 7204, -12956, 7662, 9235, -16370, 10266, -4191, -6512, 16242, -10102, -3236, 10841, -8897, 3230, 6265, -18054, 11868, 4323, -10845, 13300, -11788, -4184, 13816, -11190, -1213, 8907, -13647, 10132, 3401, -19983]
1606a9983L3194j8576J058J9097k9701J1696J4734k5596J7835J672k3380L5063
1618A7113j8531j2485K6053k5176J2444J5710k8656J4479R262k5871K7500j1857
1630a5j5756L5929k4292J210J5686k7607J6462J3600k8543K1773j929k1097L3680
1643A9101k5799n048K6711k4264J2574R212l0123J9873N384k4262K9909j7506
1655d238p340L0548k9755N145J3417k2285K1008O524k9192K5689q224j4126L1119
1668A8290k7780N383K2388k5754J1481N304k6259K7112K17k2274K9813k2499j460
1681f038K4364l0841J1074J3338k1168J9363j253k8091K9792j1035r596K7264
1693A7173k8264Q107J6895k7216J1713O660k1433K8058o322k2133K8595k2376
$$ y = [-19983, 13211, -5365, -4307, 14790, -14911, -3215, 11519, -14077, 3758, 5430, -17950, 17113, -1418, -13903, 12150, -13026, -582, 15128, -13528, 951, 10213, -15658, 11842, -15, -15771, 20158, -4134, -2924, 12762, -14845, 1617, 15217, -13326, 8447, 6518, -14579, 19101, -6698, -11746, 14965, -9299, 3275, 12487, -17636, 2237, 7621, -16641, 13268, -4238, -11578, 18970, -10785, -5640, 7777, -14508, 6500, 13024, -16168, 9521, 1297, -12829, 18290, -9490, -4107, 18281, -7473, 4008, 9312, -16947, 10165, 10382, -11892, 17921, -4578, -6038, 18326, -12515, -1441, 11897, -9271, 10092, 8839, -19252, 10540, -495, -10091, 17173, -11091, -2984, 13911, -13305, -1592, 5068, -16365, 11693, 5371, -16762, 11833, -10543]
1705a0543L230K0654k7421J2803J2704k3825J7424k788k2006L4221j4730p286
1717g563K2337k6930J1141J3283k4492J4976P101k0304K6116j4189j5607K9072
1729A4941k0455O445J4187k5692J3546R052k4179J9128m572j5546L2167k2617
1741c595m638J8126k3549J4318R139k4741J7672K794k0929K5917j8357o540K8252
1754A3869k3268P579Q810k2303J7161N958k2779K2960p112j1045K7587k5878K295
1767f166J7247j9447J3965M127k3028K0680j141j7728K5048j9857J217K1105k4266
1780h244P662O326j7467J8075N30k0761K2895j1197n596J9786k4091Q320J2283
1793H521j6829J0035Q35j7070K0638m517j3419K0851j7955O097J2682k0651R360
$$ y = [-10543, -7313, 13341, -14080, -1277, 11427, -12398, 5026, 2238, -19768, 14453, -277, -7563, 14774, -12156, -1015, 12268, -12224, 2752, 9853, -10451, 15665, 1476, -14131, 14941, -5514, 931, 15118, -10574, 2972, 12024, -12155, 6973, 2401, -13145, 19022, -3595, -8233, 9893, -13656, 662, 9801, -14940, 2732, 5526, -15403, 10514, -7843, -14383, 13869, -9399, -1820, 6990, -15313, 1848, 7806, -14973, 7987, 875, -10170, 17417, -8461, -6166, 11081, -8366, 5599, 9726, -13302, 7378, 6237, -11491, 13557, -6300, -5083, 16022, -8244, -582, 5744, -11723, 6352, 6882, -13879, 9016, -2181, -7777, 12009, -12082, -3762, 8521, -8308, 1727, 2562, -14508, 6130, 1613, -11806, 9045, -8910, -2813, 9869, -10782, -1422]
1806a422N909j2672J4891l418j5520K2697j2161r84J3660j9679J1713P196j4877
1819d667Q589L72j1958J9723r859r099J7525j6034P604N998j6479R150N439j2493
1833f189J1617n594j0573K0866j3691j92R190j4470J0418M360j3860P897K429
1846B208j0591J6861j1972m644J4968j2506O311K563j1704Q639N290j2033J0232
1859C622m777n282J6816j3525J505O095q304Q116J782j1465Q638J882q348J2562
1873I317j2371Q08J0547j0372M377k38o753Q136J327j0853R003n404n56J0261
1887G229j3847M521L740m848M859q85q068R670n72n818Q654j0793N647N362p765
1902b914K710L04k589N723o22q834R461m779J603M324r861N696J716k167N25j29
$$ y = [-1422, 4487, -8185, 6706, 3288, -12232, 10465, -1696, -2680, 10980, -8699, 3014, 10210, -4667, 3922, 4294, -7664, 12059, 2200, -6899, 10626, -5408, 2196, 8194, -8285, 865, 6304, -6189, 5428, -166, -10739, 10127, -3564, -3756, 5434, -9036, 1382, 5742, -8118, -221, 2208, -8383, 8478, -3494, -8138, 6830, -5676, 635, 3198, -8506, 133, 5423, -6610, 3622, -1155, -6437, 10379, -3146, -1641, 4454, -3850, 4266, 6048, -5417, 3221, 5103, -3245, 9317, -3054, -2246, 8301, -2071, 2306, 2068, -4685, 3451, 4778, -6075, 2928, -2476, -3032, 7229, -6618, -2097, 1643, -3205, 1654, 769, -7299, 2371, 1799, -4019, 4635, -6158, -511, 4851, -2914, -204, 100, -2489, 3234, 2612, -6222, 3239, -1540, 63, 4387, -5474, 222, 1938, -229, 296, 167]
1918A67m710Q214k344m436M991o050O184j15l883p0J792l45J286j316m958O883
1934A290l071J599j477k858L956M29j51k934K002j383M527k628k007J791k84L823
1950B624l757P74k182L876J32k107k99j200M001j974O57l949L295N78m23J81m124
1967c897M170l68J020k790L88O3L059l89m323L411k566M771j745k970J383R49
1983A66Q79l42j121l704O960l364n4N90m534O130j073k315o64J498j589N436n083
2000b184k219O381n285M978k191l695M066J785l591K619j971k436R681q095J396
2015g61J992m403O676j126n744L977J737m680P842q429K87Q217p914M361j404
2030F28m507O275J571q064P122l726j694J0310j1815L812L310m904N644j187p293
$$ y = [167, -4543, 3671, 1327, -3109, 1882, -4168, 2016, 1901, -1982, -2052, -260, -605, 681, -635, -5593, 1290, -1781, -182, -1659, -4517, -561, -132, -283, -3217, -1215, -2598, 1929, -699, -2706, -915, -1199, 2624, -1133, -359, -2541, 1335, 1467, -640, -939, -2139, 1862, -112, 545, -3404, -109, 469, 46, 227, -3897, 273, -95, 925, -1865, -1477, -1414, 1645, 1256, -3067, 344, -2222, 2549, 804, -2166, -783, 166, 1045, 703, -418, -4122, 2838, -526, -580, 10, -4524, 1606, 533, -1782, -2446, -948, -2537, 2899, -2184, -4403, 1978, -3307, 1671, -520, -4215, -149, 1636, -1955, 664, -1307, -3743, 5938, -2157, -761, 1231, -3172, 3504, 2378, -3366, 611, 2348, -2332, 5510, -2919, -2632, 5585, -2329, 2032, 628, -3879, 2396, 3967, -4097, 3025, -701, -2395, 7915, -3900, -88, 3222, -1682, 3962, 2775, -4518]
2045d518Q459j16o922R949j0867M133P119j0514M940l94n323P831j641r450J1406
2060D092p062K43Q693j3881P420L252o760O420j831p286J3213n115n556J1637
2074G479j2852Q399N205j2332P785L30o679J0251n174q106J5093j1152K180O796
2088G223j5067J0415J944r743Q166k869p282J5256j0847l019J2304j3755J0020
2101B746K003j2440J0182L75q044J2086p902m770J6402j4572M433N114j2572J2119
2115E160L37j0833R954l544o540J5509j4133J005J1863j4125R893p58j1292J1951
2129D447o8r536J3177j0325j463J4731j7344P181M094j0775J2037k666j1679J2971
2143D782n104n315J5331j7156N487R278j5565J0280j499r716J4400l352j0299
$$ y = [-4518, 3941, 3825, -3097, 6852, -4015, 118, 7237, -3277, 1663, 1269, -4054, 3777, 2136, -7314, 4092, -2970, -2727, 5966, -7915, -495, 2757, -4003, 2417, 586, -6700, 6513, 1398, -4158, 7479, -5373, 3026, 8231, -4101, 3684, 4014, -2665, 7586, 2412, -5694, 9399, -1753, 427, 7223, -7844, 2571, 4515, -5228, 2938, 69, -7213, 8043, -2804, -5823, 6481, -7274, 2746, 4749, -7691, 2491, 2866, -5178, 6908, -994, -5764, 10638, -3934, 499, 5613, -6959, 5160, 5497, -5336, 4618, 1074, -5466, 10043, -4090, -3085, 8778, -5347, 4546, 3788, -7504, 4447, 4379, -5157, 8020, -2305, -3768, 10963, -6381, 800, 4894, -5881, 6156, 3490, -8189, 4782, -322, -5637, 9694, -7462, -1975, 7303, -8262, 2018, 519, -9197, 5203, 1851, -8448]
2156h448J4906j2733J933J3030j8450J0678L305j1039J1743l662j0709J7128p571
2169A11l831J4662j8376Q672O921j5008J1423l65r396J4829p604r560J6747j4073
2183d848N222R334j8060J1387J315j2012J2042m818q106J8167j2547k132J1962
2196F906j8047J2486L526j3654J2544k099q858J4137j0438m474J7848j5953P896
2209A820M502j6378J3562m55j0281J3389n912n870J6913j6584J784J0658j5221
2222h073J3981p10j2606J2975l889q619J5333j2135l3J5249j8241Q371J669j2985
2236i713J4583k019r946J3430q296m200J4791j7568O716Q335j3285J1922l028
2249A722j0690J3493l730o759J4631j3234L123J1008j7573J0072J314r236J3041
$$ y = [-8448, 6458, -6275, -4342, 8688, -9762, 916, 4221, -6818, 4925, 1263, -9446, 7682, 111, -3720, 10942, -7434, 1238, 8159, -6849, 4574, 4209, -5187, 9642, 2038, -7522, 9225, -4848, 374, 9708, -8352, 3035, 4350, -7662, 4380, -438, -8544, 9623, -2924, -5056, 6906, -11141, 1345, 4871, -8783, 3761, 1662, -7196, 6941, -3497, -7971, 9877, -6076, 1820, 6322, -10056, 3506, 3051, -7230, 6159, 247, -5623, 11290, -5294, -3510, 7148, -8073, 5908, 5198, -7408, 5567, 1678, -6941, 8392, -3743, -3776, 11473, -6768, 1603, 3272, -9713, 4870, 2851, -7095, 6335, -1961, -6161, 8630, -8938, -2222, 6113, -7172, 4750, 1722, -8968, 4525, 795, -5964, 8667, -4567, -1444, 9564, -8009, 2063, 3377, -5859, 7182]
2262G182m207r524J3516q950j686J2494j6316R297M977j2525R377l041p287J4033
2276G340o024o251J3372j3950N602O925j4998J1307J9p829J0463o210p642J4631
2290F755j0123O10R397j5718J1022J136j1304J0317k818n666J3420r456m073J2894
2304F393j3698Q630L518j2373J1693j253p745J0033o098m335J4510j2261K504
2317d82O450j3351J1164o21r247R315k312n330J1046j0576n65J1056j2152Q107
2331B502M45r662J0471k315o483R254o057j524J1119j3204M656L969r110R696
2345C757k815o475Q582l099m084R423j0472L337P591j0982P637j737n617R121
2359D167l327n036Q429o210P08P738j2386O537K084o732P271l784m530Q261l835
$$ y = [7182, 2975, -6549, 6967, -1983, -3669, 8825, -7491, 1806, 6783, -5742, 3635, 594, -6693, 7340, 1316, -4935, 8437, -5513, 89, 7014, -7984, 3323, 3342, -4487, 5976, -234, -7876, 6755, -3368, -2758, 6639, -9079, 1943, 3079, -8225, 2092, -726, -6392, 7028, -2428, -6501, 6393, -7305, 1325, 4843, -7530, 4163, 2910, -4835, 5198, -900, -5235, 9275, -2986, -482, 5968, -7383, 3781, 3160, -6087, 3228, 916, -4414, 6632, -3944, -4509, 6547, -5605, 2502, 2947, -6715, 3756, 1441, -5042, 4212, -1845, -3369, 7750, -5454, -798, 3171, -5939, 3757, 942, -5533, 3049, -50, -4134, 5289, -5183, -1846, 5745, -5237, 2400, 663, -4954, 4167, 840, -4196, 4233, -1977, -1269, 6469, -5917, 620, 2704, -4028, 3243, -541, -5071, 3190, -645]
2374f45l318P997r642N304M158r183O461j395l107O729l189m592Q332n524Q50
2389g64N403r787P240M28m908M970k931k812P227m193k840O696p882N612J234
2404B693p180N699j009k205M372k975l045P551n554J464K583o489O894j198k990
2419a389K867j044j599N610n124r00N054n560M980j403l852M342n87j940K406
2434A861k758j287O282o007K134L04l378N295k340k161K018J01j502M156m850
2449b132R09L690m062L784k640q43L146k99j957J939j543J37L813n269K108m39
2465C42n67K184k055j218J332Q05j739K050l418J845J696k172J503j796J486Q76
2481A154M77k045J624j13Q96R87k921J918o31J392j060q38k36J44J168j934J42
$$ y = [-645, -3963, 4034, -5608, -304, 3854, -5329, 1132, -263, -3370, 3359, 170, -4422, 3910, -1614, -764, 4639, -5148, 2092, 2520, -2388, 2582, -349, -3161, 4066, -127, -2967, 3729, -4153, 1459, 2693, -4487, 1212, 203, -2002, 2370, -605, -3650, 3901, -1653, -189, 2394, -4095, 2799, 1601, -1389, 1478, 434, -1165, 4445, -679, -1579, 3475, -2085, 2895, 1492, -2360, 1982, 1395, -545, 1861, -897, -2184, 4098, -1909, 225, 529, -2849, 2446, 106, -2055, -37, 64, -1438, 2718, -2132, -1223, 2467, -1595, 2189, -451, -1294, 1852, 1553, -404, 1535, -8, 129, 3942, -1327, 781, 342, -225, 1959, -96, -1314, 18, 823, -916, 1134, -2284, -439, 1257, -915, 588, -1208, 278, 1154, 1631, -414, 1210, 1097, 1993, 2980, 59, 1977, 1346, 2738, 1678, 840, 604, 748, 1916, -18, 124]
2498A24j399J909j044k40r78k95K239j645J040j742J183Q00L68p32l6J260n06
2515C06K336l291J471M05k10J366k365J71P67P13j998J672k943J743J424l379
2531a812K292j992R20J418j265j401K406q42J73K338n175M214l63j030J681j968
2547d06k22K722j231k011L474m561L744M13m765M108j611n22K300k386j401M713
2563B358l521J048J621n102N717r41k329K607j960m42M564l980j143M645n528
2578b386M603q95m471M953j479j164K658k956j165O167o201K577J234n008O179
2593B646k278k753L513j697j028M751n800R60M404o329N330j991l433N878k324
2608a51k250M470m117M53N981q324M584Q05m743O970l651k863O145l149j243N792
$$ y = [124, -1275, 634, -410, -650, -1628, -1923, 316, -1329, -289, -2031, -848, -48, 320, -412, -448, 812, 306, 2642, -649, 822, 1227, 1017, 2383, 18, 189, 956, 1669, -329, 1343, -1600, 143, 1567, -1812, 480, -1512, -592, 826, -439, -1840, 566, -276, -103, 2235, -2940, 1274, 911, -119, 1562, -406, -628, 2094, 863, -1148, 2326, -2235, 1509, 1922, -2843, 1265, -346, -868, 1432, -954, -2355, 2358, -1163, -115, 1506, -3596, 2121, 1180, -1149, 1458, -502, -944, 3620, -360, -1503, 3142, -2386, 2217, 1322, -3149, 1804, 325, -839, 1819, -1137, -2302, 3865, -2336, 241, 1475, -3533, 2646, 368, -2385, 1128, -569, -1597, 3154, -2646, -1686, 2718, -3611, 1719, -272, -3705, 2173, -151, -2401, 2069, -2048, -1595, 4386, -3938, 646, 1451, -3292, 3678, 27, -2836, 3309, 160, -1083, 4709]
2624D709q188L965L675p892O944l079k642O470m144k556O191n906J953N044r887
2639e343O913r6n085O774l902k670P268m701q11N544r062O309J951p399P156l059
2655b13k623O740m978k307P461p090L777L259r576Q249j945l947O786m598j656
2670b661P783p580P42N588q922P667l10p068P931l957k221O637o000j86P554q641
2686c644M730J337q395R581k779l935O782n009j004P645r107K698N452q773Q496
2701D075k936n977Q116l718k071O958p223J194P022j0879O497M40o402R488l964
2716F20l599O787n391l41P379r550M930L755q919Q340m221m174Q633m573j869
2731b193O900q420K578N677j0483P977n99n474Q502n674l127P702n758J040O239
$$ y = [4709, -3479, 486, 4161, -3731, 3213, 134, -2508, 3962, -182, -2738, 3453, -2453, -500, 4544, -5343, 1570, 1474, -3611, 3163, -739, -3409, 3859, -842, -1653, 3891, -5171, 1138, 3089, -4310, 2846, -213, -2836, 3904, -1074, -3381, 4080, -3010, 767, 4026, -5550, 2699, 754, -3193, 3593, -1005, -2661, 5122, -2458, -1716, 3872, -5050, 2617, 2307, -4761, 3170, -787, -3008, 3629, -2371, -2557, 4997, -3644, 1086, 2423, -5972, 3609, 830, -3105, 3677, -1332, -2336, 5309, -3798, -1100, 4352, -4421, 4075, 1139, -4838, 3278, -440, -2511, 4447, -2776, -1582, 5440, -5439, 1058, 1498, -4904, 4584, 620, -2979, 3808, -1583, -1924, 5455, -4095, 835, 4590, -4329, 4011, -210, -4384, 4249, -324, -2193, 4707, -3713, -1135, 4542, -5941, 2036, 1437, -4037, 4465, -1209, -4336, 3366, -2392, -1352, 4887]
2746D887j0253P024J001p844Q440m206k252Q489o345j912O966q603N074L297r395
2761e632R390k853m524P541o118j162Q473p077J937M661j0418Q606r63o355Q703
2776D209m566j765O987p476l50P324q529N996J179q700R214l887l132O995n557
2791b058K6P400q389K498L423q060R205k448m923P593m604j616O193p299J760
2806a299O395q806O536j356o560Q735m630j981O396n443K22O065r247M657K561
2821B245o920Q656m306l349O931m499o27N612p035L590M247q971P008k198l788
2836c404P669m793j444N485n415J007M730q797O451P07n686P018m870j872O479
2851C265m644n53N558p116M141K510p751P015k198k565O300m607j320N441n127
$$ y = [4887, -5366, 1658, 2659, -5185, 3255, -951, -3203, 5286, -1059, -2971, 3995, -4608, 466, 3763, -5632, 3758, 905, -3619, 3922, -2196, -3358, 5115, -1962, -25, 4636, -5782, 2824, 1861, -4494, 4209, -357, -2122, 4865, -2611, -2961, 4363, -4166, 1830, 3009, -5691, 3523, -364, -3496, 3499, -2058, -2032, 5368, -3021, -523, 2900, -5160, 4045, 1597, -3326, 4267, -337, -1953, 4240, -3059, -1299, 5096, -3710, 2826, 1470, -5090, 3645, -985, -2966, 3430, -2013, -1791, 4274, -4973, -316, 2245, -4675, 3981, -325, -3674, 3257, -1242, -1869, 3743, -3292, 298, 4545, -4426, 2582, 384, -3404, 4265, -528, -1972, 3513, -1902, -895, 3835, -4962, 1489, 2196, -3490, 3528, -1342, -3214, 3265, -1379, -1932, 3626, -3490, 651, 3161, -4590, 2425, 227, -2338, 3962, -645, -1965, 3476, -1651]
2866a651J688L665p784O981j100m488N890m311n43N285m703m98M809p000M978
2881A218L44o154O914l088j231M163m487K1N140n584K614K299o014P236k738k435
2897a782M776l582p9M309n322J134L654o034N273j776l848N852l467j039L344
2912A413l729N27M329n832L311O05m209O205l176j358M023k646K97L073m338J827
2928C22K954n056M683k563j525L939k984m34K253l011J000K569n297L380j51k361
2944b282M202l336k25K766j743l14K583l522K482J654m061L982k153l60K630k346
2960d3p35K190k034Q40J425m317L515j139j328K552k555L36J888j383n10K060
2976G62k692K751J30k960L114j569N97J485j693n30J995j413L83O08k927L392
$$ y = [-1651, 37, 3702, -4082, 2899, 1799, -2689, 3201, -1110, -1653, 3632, -1071, -1569, 3240, -3760, 1218, 1562, -4592, 2322, -766, -1997, 2166, -2321, -2300, 2840, -2744, -130, 2169, -3845, 3391, 653, -1782, 2994, -588, -667, 3642, -1680, -546, 3108, -2926, 2347, 571, -3277, 2575, -892, -1931, 1413, -2316, -1789, 2540, -3292, 19, 624, -3585, 2620, -556, -1914, 2109, -537, -240, 2833, -1505, 322, 3276, -1780, 2903, 340, -1185, 2754, -230, -664, 1589, -1422, -422, 2147, -3150, 230, 79, -2282, 1920, -1416, -1641, 1125, -618, -932, 1651, -1871, 611, 2265, -1796, 2186, 33, -327, 2303, -43, -778, 1412, -622, 218, 1643, -2674, 841, -298, -1626, 926, -1629, -1293, 595, -788, -1298, 762, -1930, 821, 951, -2009, 1105, -464, 133, 1618, -75, -605, 1390, -23, 360, 968, -1959, 1433]
2992A433j253p68R54j216K20J313j101m49J623j800K165o07j620K218q96N25k98
3009D43j50p39K026j547K88L00j594K257j269j68m29O25j56N2l96o85J714j279
3027g07J280j302M14M02K8ro62J052n37J054r19j4k3L15N34j073N43j346J678
3046G08j054r0J99o22R61m43O2j059J548q40J252q29q06K041j152O44m77N8j78
3065g7R24q16j04L00j100K478j829k15O52n00K95N26j304K39J443j927J949j455
3083e21j51K030j633J78L98o12K54J534k722J762J07j528K597k432K46J425j327
3100c95J66J391k450J433J231l109L152k102j23K232k129nJ580j560N29J634l615
3117b140K995q08j176K493k768R18J608j865K26J546k884K513P37l653L869k679
$$ y = [1433, 180, -588, 366, -850, -630, 683, -418, -867, 756, -1044, 1121, 514, -1106, 1112, 216, 741, 443, 293, -446, 1580, 33, 321, 621, -973, 1284, 15, -153, -582, 43, -113, -61, -457, -1142, 572, -707, 573, -729, -315, 87, 115, 106, -556, 496, -41, 1013, 94, 80, 57, 372, 906, -167, 376, -970, 708, -346, -436, -237, -859, 102, -341, -279, -1338, 210, -630, 622, -207, -1013, 1028, -124, 520, 43, 101, -77, 847, 31, -73, 227, -873, 1605, -224, -439, 213, -287, 8, 534, -770, -531, 912, -1015, 934, -521, -672, 1358, -275, -97, 301, -311, -57, 1477, -1245, 517, 624, -904, 1693, -739, -493, 932, -395, -229, 1162, -1288, 145, 1376, -1733, 1419, -683, -806, 1426, -703, -708, 872, -688, -159, 1475, -2140, 855, 47, -1129, 1364, -1404, -486, 1122, -743, -517, 1029, -1855, 658, 1395, -2258, 1611, -1068]
3133a068L79K381k540K17K071k408J490N74l716M501j839j154K950k939R94K053
3149A946l069O31K071l946M213j048k821M234l202O40K186l067R60K490l950K384
3165F52L59l654N205k848r99L276l132P24K346l836K128J660m491M927k602j975
3181b260M724l234J58K582l534J219K890n182L739n56l152N474m244j7L010l197
3197a580J277K387m776L118J198m598N439l796n57M711l897N82K407m000K603
3212E18J986n496M970j321k619M928m508N26L090l531J392J960n034M147j6m054
3228c062N888m182R8M257m685J028K593m198L491R11n264N588k795j489M617m502
3244a706J217L175m163J459J762n217N540j451l454N899m521N00L002m613J794
$$ y = [-1068, -689, 1692, -848, -631, 1440, -968, 522, 1096, -2620, 1881, 42, -1112, 1838, -1101, -107, 1946, -1123, -492, 1579, -2367, 1846, 798, -2023, 2211, -991, -351, 1835, -1232, -272, 2218, -1732, 652, 1011, -2643, 2562, -286, -1285, 1991, -1141, -417, 1929, -1907, 221, 1881, -2610, 2317, -285, -2260, 2464, -770, -612, 1970, -1564, -345, 2545, -2637, 1102, 546, -2606, 2868, -1376, -1393, 1617, -1580, -303, 2084, -2692, 426, 1624, -2974, 2465, -1331, -1888, 2823, -1074, -492, 1915, -2085, 518, 2504, -2992, 1978, 657, -1962, 2966, -1542, -1016, 2074, -1457, -65, 1895, -3139, 1008, 992, -3062, 2826, -1356, -1258, 2999, -1686, -658, 1935, -2263, 1228, 2139, -3125, 2463, -332, -1821, 2796, -1706, -489, 2686, -1477, -18, 1744, -3473, 2067, 616, -2838, 3061, -1460, -960, 2042, -2571, -777]
3259g77K694m181L634m45m608O315l667p20M190m324J500K839n129K562J852n163
3275c428O191k579k610N155m515J263K868m540K455K638n885M470j314l386O251
3290C034m277J72L248m243J719K356n414M114O74m240N898l974j340M922m262
3305a613J540K600m375K760J657n713N367k114k028N739n214O08K912m176J863
3320a87K197n218M764o87l819M955l967K21M009m228J570K213m684L659O78m756
3336c280O163k969q80L910n031J739K468l859K341J489m890M682j904k771N121
3351B329m202J186K780m138J424K032m226M274n60l671N802l741k02L295m100
3366a718J932K348l822K382L57m089N195k702j868M629m286J362K116m066J867
$$ y = [-777, 1917, -2264, 1370, 925, -3683, 2632, -1035, -1755, 2435, -1889, -389, 2450, -2679, -117, 1735, -3428, 2763, 184, -2426, 2729, -1786, -523, 2345, -2195, 260, 2898, -2987, 1483, 169, -3217, 3034, -1243, -1071, 2177, -2066, -347, 2009, -3405, 709, 1383, -2857, 3041, -933, -2273, 2649, -1613, -73, 2527, -1848, 912, 2569, -3144, 2223, 109, -1919, 3820, -1394, -786, 2126, -2050, -187, 2010, -3208, 1556, 869, -2950, 2005, -1962, -1741, 2268, -1960, -390, 1823, -2861, 798, 1476, -3280, 2883, -86, -966, 2944, -2087, -348, 2120, -1739, 602, 2091, -2799, 1883, -21, -2792, 2329, -1873, -687, 2093, -2045, -621, 1411, -2815, 1459, 899, -2772, 3030, -711, -913, 2382, -1718, 214, 2562, -1260, 1122, 1479, -2610, 2585, -117, -1985, 2644, -1642, -280, 1836, -2230, -363]
3381c63J595l631M226j762k653N066l665N84K717l400J866J462l933K935J00l182
3397b038M814l256m33L317l902J569J583l907K700R52m010L997k062j632M766
3412B458l737P09J920k463J293J675l897L390o54k203M135l506L36K422l182J399
3428I5J138l227K705L4l253L838k261k21K810l151J214J282k359J790P72l231
3444b025L647r82j194K998l749J447J496k369J273Q36k718K639p04k491L395k261
3460g62J41J867l039J464J315k368J347M84k517L531j548o06K312k680J577O32
3476A150j624P81Q92k504K594q63j742K776k088L62Q13j729R04P70j599J157P1
3493A21j461K615j926M5J363j311P50N37j240N89Q21j700J734j103n39J829j694
$$ y = [-363, 1232, -2399, 1827, 65, -2588, 2478, -1187, -603, 2114, -1286, 580, 2042, -1891, 1044, 1144, -2038, 2776, -480, -913, 2404, -1498, 71, 1654, -2253, 447, 1399, -2611, 1386, -676, -2308, 2458, -1279, -570, 1350, -1113, 180, 1855, -2042, 1348, 694, -1509, 2626, -880, -544, 1878, -1304, 95, 1233, -1994, 711, 745, -2508, 1330, -931, -1152, 1658, -1493, -279, 1003, -1356, 434, 1206, -2025, 1622, 640, -554, 2444, -1305, 142, 1638, -731, 542, 1378, -1340, 1299, 595, -1896, 1499, -762, -621, 1246, -1793, -329, 986, -1382, -35, 449, -2068, 1463, -85, -691, 1621, -1059, 518, 1150, -474, 307, 1199, -1305, 1289, 426, -1316, 1460, -628, -266, 547, -1182, -278, 492, -1107, 50, 121, -1340, 1275, -651, -606, 757, -554, 196, 733, -507, 82, 903, -797, 937, -166, -705, 1124, -570]
3510e70N55L00p23N46N01j708J136M1j085J944j886O19O94n30J62N68r70O72O32
3529H98j577J620j075K4R72q57K22l2k56J73N55j350J097m13n66J091j387J037
3547A76j35qk31L45n94P65M8r35P49m74P07k01k71m4L43k8o82O81o93M66o3k2
3569a01j40k20M26k11K28m66Q38l58m7K16n57N54n43Q25p54N20l62MO32p85N15
3590B14m81M83l26L67n98L53J45m74R49j208P36K1j58k5J46n14N55J65r93J102
3610D59p25L42M99j004N74q4L8j00L38j127J365q33k58J238j372R59N8q89M65
3629e7M70j022J086m57r95J693j464O81N41j085O06O56j198P04J51j483J874j201
3647e00o7J233j567J362n2j321R46N32j639K164j243p56K034k044Q74K35j086
$$ y = [-570, -15, 285, -438, 108, 609, -1099, 37, 78, -1007, 937, -949, -330, 364, -166, -4, 564, -406, 266, 898, -679, 941, -134, -110, 862, 5, 227, 195, -61, 112, 667, -683, 414, 1, -565, 526, -861, 176, 41, 33, -198, 147, -447, 318, 366, -569, 180, -294, 413, 212, -59, -103, 240, 212, -470, 211, -482, -16, -79, -101, -241, -461, -35, -246, -18, -484, 354, -4, -51, 165, -392, 162, -381, 444, -310, 210, -152, -148, 484, -301, 214, -267, 216, -110, 257, -341, 12, 157, -317, 632, -576, 160, 181, 23, -2, 144, -370, 185, 350, -643, 459, -266, 76, 575, -429, 145, 61, 99, -1, 337, -790, 575, -258, -516, 722, -650, 309, 367, -522, -57, 413, -609, 477, 20, -975, 718, -746, -65, 476, -609, -3, 653, -545, 159, 310, -1173, 701, -500, -567, 666, -901, 461, 409, -912, 34, 566, -1073, 1091, -152, -908, 1126, -918, -44, 191, -895]
3664h95J253J00j496J543j23j361K506k405N97J140j786J475J62j318J024N95
3680A011k110K117j527M8J748k259J049Q23j754J267K75j863J967q16j050K623
3696A549k764J145R97j910J449j30j628K113o57j527K597k031K38J778k443J195
3712b9O27j691J623q7k098L004j721l03K232k983J564Q80k267J479M76k233K713
3729A186j003j531K850k596Q63J445k734J750N27j958J809k76k064L311k306K66
3745d61K103k894J735M98k036J729O0j821L021k196o28K625l004J366J061k719
3761a561K191n1k185K616j063j222L323l248Q08J797k734J832L56k171K152j37
3777G03k204L276k578K27K516l290J906N35k741K265J53k644L166j350j149L066
$$ y = [-895, 358, 458, -1038, 505, 382, -979, 1527, -878, -281, 859, -927, 548, 710, -608, 416, 1011, -1099, 1018, -509, -461, 1287, -972, 77, 900, -854, 413, 688, -1175, 792, -24, -1074, 1549, -1215, -70, 927, -983, 466, 336, -1292, 821, 164, -1363, 1234, -797, -559, 1219, -1224, -29, 598, -1093, 530, 443, -1655, 1349, -372, -675, 1557, -1426, 138, 1018, -1249, 230, 706, -1527, 1186, 183, -1348, 1502, -1094, -231, 1214, -1520, 230, 757, -1201, 608, 332, -1732, 1579, -727, -461, 1642, -1252, 483, 981, -1055, 674, 734, -1087, 1934, -262, -890, 1735, -1269, 97, 1158, -1561, 630, 579, -1606, 1010, -53, -1275, 2048, -1200, -392, 1405, -1329, 503, 859, -1312, 840, 703, -1501, 1775, -803, -576, 1940, -1350, 556, 1091, -1650, 615, 768, -1876, 1290, -60, -1209, 1857]
3793A857l486J242J447k367J925K13k410K719o03j834L076k558P31K017l280J719
3809D08O25k370K045ok170L111j936q39K574l028J546J200k359J733R7k389L081
3826A323j427j233L499k952J070J342k988J978K97k142K667r23k178L517k866
3841a016M65K097k996J817M09k365K220l71k098L560k131p62L183l423J534O79
3857H02k094J888K19k092K558j063j634L410l200R13J763l106J825O12k669K361
3873D93l09j628L143k492j70K381k979J878N15k182K203j48j939K321j180q53
3889i46K959l059J402Q85k415J776j78j929K570r27j391L071l205J076J617k769
3905a463J794J93j668J764p9j830K726j893l11K538k915J400N81k151K121l06
$$ y = [1857, -1629, -387, 1060, -1307, 618, 831, -1579, 1140, 537, -1297, 1779, -779, -48, 1969, -1311, 408, 1033, -1337, 708, 702, -1468, 1643, -293, -1132, 1442, -1586, -40, 1160, -1199, 534, 631, -1758, 1323, -104, -1337, 2162, -790, 280, 1622, -1366, 612, 909, -1233, 1434, 511, -1667, 1850, -1016, -551, 1546, -1450, 367, 776, -1589, 631, 260, -1838, 1722, -409, -1171, 2012, -1411, 123, 802, -1292, 596, 815, -1277, 1281, 218, -1416, 1994, -1206, -293, 1470, -1636, 189, 801, -1868, 493, 184, -1444, 1699, -793, -963, 1418, -1561, 317, 832, -1350, 853, 705, -1234, 1087, -93, -946, 2013, -1046, 356, 1241, -1174, 602, 424, -1505, 1065, 138, -1253, 1818, -1387, -311, 1306, -1463, 331, 524, -1144, 620, 541, -1289, 1437, -456, -767, 1771, -1144, 256, 837, -1314, 807, 501]
3921E01j649K401j282j245K872k948J160R40j978J724j15j765K093n19j466K809
3937A533k312N38J423k378J462L29j626J741k05j674K241j434m15K051k415J545
3953D04K17j795J417k95j120K008p66j167K379k181R82Q03j974J660R1j504J680
3970H39m46j355K225j780J31J524k266J818l96j051J493k87j186J758r29r66K266
3987A392k454J313K68j369J411p9j163J347n94j125K241j768N71R37j765J027
4003A90r4n74Q04n6j007J773j323j86J428j683J139p1r08Q06J2j095J395o76m33
4022e59J427j743Q80J72q92O08L25p77O24J28q86J485j378M27Q42j436Q46J35
4040B28n42M17J79q28J122o56k38J156j496R85n1p08O38l19j56P47j82n41J081
$$ y = [501, -1148, 1253, -29, -1274, 1598, -1350, -190, 750, -1228, 496, 381, -1384, 709, 190, -1276, 1533, -779, -241, 1182, -1196, 266, 595, -1031, 710, 505, -1169, 1072, -362, -777, 1274, -1141, 404, 621, -1174, 243, -52, -1172, 836, 70, -1097, 1282, -899, 83, 886, -1088, 572, 663, -841, 839, 393, -962, 1263, -517, -386, 1138, -1128, 690, 294, -757, 736, 449, -737, 1021, 92, -874, 1392, -1062, 251, 519, -850, 561, 482, -681, 666, 72, -1053, 1188, -580, -9, 928, -837, 190, 96, -478, 326, 270, -737, 1036, -287, -473, 955, -728, 411, 340, -568, 238, 250, -845, 550, -126, -559, 868, -875, 5, 177, -715, -107, 218, -559, 65, 193, -693, 792, -586, -159, 683, -753, 93, 228, -314, 103, 282, -546, 576, -80, -318, 838, -658, 327, 276, -432, 206, -113, -269, 478, 296, -245, 836]
4059H36j175M69L42r38O40N4m66M54P6j074J520r19ON51o42M16k52j2K59J5m57
4080b97O49l53l00P61o81M90l30k45J94j55K3P2K66n08N36n07M56K24o17M19l52
4101b55N30m47J42k32L86k24n5N75n53L19m24N22m07K99J00l67M71l74J11k85
4121a68L66k21J01j27j8L00m17K93l87K91j29J52j47J55K28m01N71n94L66K9k53
4142a0R5j88K47j91J92l28N98p29L28N18j161Q93n09q2L82m2k90O52m28j89O62
4163D20j092J169o45q5L98M7p54N75p9m34J100r80L19L57p59L74k9o2K88K11q96
4184e57J107p87J90N76r74P26j66l30P88p3q11R08o00k25J050j568Q95K3n41Q38
4204D69n42k34O93l13m67J273j287M17N09j079R07k94k52O03l42p62J412r84m2
$$ y = [836, -339, 130, 472, -466, 174, 228, -238, 216, 292, -782, 738, -181, -175, 376, -266, 150, -102, -114, 145, 160, -297, 352, -1, -301, 460, -221, 269, -61, -306, -112, -267, -244, -172, 94, -414, 122, -385, 71, 295, -322, 97, -255, 275, -172, -30, -262, 124, -100, -155, 420, -133, 186, -238, 284, -123, 176, 276, -91, 380, 6, 117, -168, 198, -23, 78, -49, -67, 233, -184, 109, -278, 13, -116, 36, -111, 44, 272, -129, 442, -152, 214, 243, -10, 85, -103, 144, -47, 145, -183, 415, -314, 14, 532, -629, 264, -245, -327, 55, 13, -277, 375, -53, -242, 420, -672, 497, -148, -233, 165, 212, -542, 33, -46, -480, 620, -360, -41, 316, -443, -69, -98, -160, 128, 339, -557, 550, -237, -47, 529, -445, 281, 115, -215, 573, 500, -311, 597, -3, -228, 822, -746, 149, 172, -369, 469, -73, -307, 386, 73, -394, 879, -408, 9, 518, -561, 346, 52, -200, 403, 61, -701, 711, -273, -315]
4223c15J177j789J323j15p58J069o41n67J117o21l93J430j800O89O30j610J541
4240C67k08o61J046m98m66J442j686O46P52j548J263j80j122J407n40p46J325
4257E93j084O0J469k074J305r6r83J413m62n89J140q89m00J594j784J025N34j732
4275i60J515l2j070R96n04n99J704j585L78J144j934J373j52q56J031k99p07J417
4293H60j122k05J527j947J283q0j063J471p24q90J529q22k61J325j872R45N65
4310E19j590J733p30p20J452q25p30J888j585J46J474j906J441k21j291J480p74
4327b39o47J570j051j86J885k660J618K93j485J560o01j001J445n81o70J825j979
4344i04R58Q17k080J824n03p35J382p42o92J856j777M33J390k531J904j50j044
$$ y = [-315, 862, -927, 396, 281, -477, 592, -49, -616, 501, -120, -513, 917, -883, -194, 436, -1174, 367, 159, -502, 544, 46, -420, 1022, -664, -18, 734, -814, 449, 269, -853, 554, 14, -732, 593, -491, -431, 1038, -1036, 269, 173, -810, 603, 141, -448, 692, -197, -597, 997, -787, 238, 772, -960, 555, 523, -547, 449, -55, -654, 1050, -535, -157, 987, -947, 426, 274, -582, 449, 150, -557, 860, -262, -467, 1060, -887, 396, 316, -747, 724, 0, -890, 639, -183, -444, 881, -991, -46, 519, -1071, 662, -68, -788, 664, -161, -891, 997, -588, -442, 1032, -874, 567, 346, -945, 535, -239, -886, 684, -367, -553, 1332, -1328, 290, 583, -902, 658, 57, -944, 501, -80, -750, 1075, -904, 54, 871, -1209, 615, 112, -623, 759, 17, -675, 1181, -596, -163, 1227, -1304, 600, 450, -594]
4361e94J487p54j063J882r61l61K088k604J032K78j471J804n32r04J491j283m38
4378i03J955j660O29P02j982J932k78j604J774p13o46J859j611Q6J232k036J608
4395C44J7j434J878o61p50J339j327k31J844k075J280O00j816J587m96q21J518
4412G96q25n94J823j871P46P40k053J976l81j086J387p44m90J701j563j70J984
4429A376k172J204M1j314J481q45n60J703j069m17J471j703J029M02j414J499
4445G12n95r72J491o88l51J218j456N79O87j776J812j84j441J695p20n52J204
4462F63q91l52J604k058J299K79j364J293l20o56J259p29l79J219j607O44Q38
4479G42j898J801n36r35J461r11l73J472j223K91Q44j580J530m11j090J330l28
$$ y = [-594, 893, 139, -924, 958, -3, -364, 1724, -880, 152, 430, -1041, 763, 231, -673, 818, -465, -903, 1052, -608, 21, 723, -1259, 673, 395, -1209, 565, -148, -794, 1065, -546, -460, 772, -1264, 344, 361, -1073, 805, 144, -606, 733, -594, -825, 1019, -1056, 224, 824, -992, 595, 99, -722, 796, -29, -623, 1200, -671, 75, 815, -1238, 738, 357, -729, 658, -86, -576, 1125, -438, -608, 1376, -796, 408, 449, -865, 616, -229, -789, 914, -155, -572, 899, -804, 225, 627, -787, 712, 117, -855, 636, -52, -403, 815, -641, -62, 625, -1151, 661, 477, -964, 731, 11, -541, 663, -228, -580, 1024, -1034, 265, 544, -820, 473, 153, -503, 756, 27, -352, 867, -740, -96, 742, -1156, 645, 109, -826, 635, -276, -649, 823, -400, -109, 735, -845, 685, 274, -816, 514, 186]
4496A86q66J482q45j74R87j362P13M96j317J372o01n42P36k23m22J205j333L41
4514a67Q65j446J339o03m62R65l97l02R16j058J14R79j409Q74j6p56J040m21n06
4533d51Q64n24k40Q48j305O50K92q10J169n46m69Q43m92j53P51q65K45R85j504
4552g12J162o40m30J186q59J34N99n32l89R55j055R16k6p08O09l58l2M31k92j09
4572a50O23q04L58M57j201J225l07l09K46j54j58L41l50J31M83q80P25k92k08
4591b24K31p5pJ04j14k19N96n67L49n4l77N00l41R1J81k9m4N51p77J91K03l94
4613b25M60m71k15L75o2O4K07k36JJ98k86K81k46J19J8J02o6J40q7k58L74n23
4635c36M73r7j51L59m33K39q9K61j12j43J58p0L69m77L70n16K44n0Q6j72k7J33
$$ y = [186, -680, 802, -43, -217, 770, -592, 121, 617, -700, 672, 71, -471, 265, 42, -380, 825, -508, -167, 698, -748, 591, -12, -474, 491, 94, -208, 708, -350, -236, 743, -666, 208, 192, -564, 476, 55, -451, 413, -111, -351, 497, -808, -158, 134, -676, 493, -53, -522, 321, -171, -324, 427, -438, -193, 792, -712, 450, -190, -620, 566, -293, -159, 440, -92, -481, 474, -581, 335, 309, -399, 210, -148, -180, 251, -41, -150, 473, -331, 27, 484, -717, 508, 201, -108, 138, -16, -174, 167, -183, -52, 431, -449, 276, -16, -224, 7, -68, -75, 29, -85, -304, 292, -275, 74, 20, -357, 143, -198, -107, 74, 45, 1, 552, -225, -34, 169, -225, 235, -236, -451, -76, -138, -74, 133, -103, -102, 96, -190, 91, -155, -36, -18, 84, 18, 158, 71, -187, 187, -336, 137, 40, -111, 248, -185, 54, -35, 226, 114, -29, 129, 59, 428, -49, 321, -195, 49, -1, 85, -87, -114, 19]
4657A9q1K74k39l3j19K74n3%O4j33K99k24k15r5R6M27l30n2j51O47p41M67o5m01
4681c65M99j68qk4o1P8M21n54N0M10l47L68l97L35k50J49k28L37m53L53P0m28
4703b13M25l09N2J58k43M2R3K13k96M06o59L02K09o15P83n67J65M21l32j82M51
4724C04l46J72K59n17N53m28r0L36l25k61M97k46J06L04q87J125l88m29O21m65
4744a05K13K84j70k06M44o86O53j63p35Q75m99P1L41l43l35P79r13M43O18j276
4764g10J022n32o6Q54r01K11M60p10K49O43j117J184l68q98J287n40l93O31p60
4783d54L45O73r50M92j1q41J261o92k20P74m30l66J029r99N87K65p37P69o03m08
4803e16J102p88J04O45o03mO07j103P06K07r68J314p38n19Q01l73j71O52p83O50
$$ y = [19, -62, 212, -27, -60, -179, 95, 42, 42, 106, -27, 272, 48, -167, -262, -166, 261, -69, -121, -272, 375, -366, 101, 36, -365, 134, -34, -42, -66, -127, -49, 372, -182, -132, 278, -69, 299, -98, 237, -13, 136, -92, 245, -208, 145, 215, -213, 212, -97, -45, 113, -130, -88, 5, 218, -78, 328, -331, -29, 180, -435, 348, -219, -54, 367, 35, -147, 304, -42, 130, 389, -128, 425, -3, -93, 243, -82, -343, 154, -92, 14, 318, -569, 556, 168, -261, 360, -105, 108, 392, 222, 16, 460, -226, 427, 264, -471, 404, -95, -24, 317, -26, -361, 418, -495, -52, 566, -710, 312, -220, -286, 568, -333, -122, 338, -372, -123, 520, -597, 587, 219, -679, 608, 68, -325, 306, -454, -109, 564, -386, 106, 95, -746, 515, -177, -397, 377, -53, -419, 610, -389, 198, 463, -274, 495, -108, -516, 586, -202, -98, 547, -56, -60, 547, -556, 150, 357, -611, 703, -35, -554, 247, -126, -297, 355, -428, 222]
4823B22J55r89J259m56m10J048r55j71R09j114L76P21j211R59j58q10J167q54
4841c12Q7Q91j141K00P34j229J056J39j471J625o26m11P99m40j35Q84j042L97
4859EM84j336J221k67n13J145j075M12N39j180M33P10j281J448n40p53J384q33
4877Ck47N99p58M94M09j018P52j4q44J440j037l33J126o54k62Q40j250O62O36
4896E44j504J414n37m29J184r92o7J114j076M50O93j604J058j11j068J592r79
4913c18N9J012j158K41Q03j255P86O30j481J282q82j52J023j092L31Q04j269P73
4931A37L81j330J479n64n83J042q50k4J065j187M93O43j348J038P5q93J174q01
4949e3m2R40j100L2Q00j254O62K80j041J269m53m54J157j129m4J071r65K86N66
$$ y = [222, 377, -612, 647, 191, -219, 829, -126, -297, 612, -502, -126, 595, -616, 343, 185, -625, 542, -312, -225, 666, -475, -275, 459, -770, 286, 425, -1046, 579, -47, -458, 341, -99, -234, 650, -392, 5, 489, -847, 374, 107, -406, 739, -336, 76, 615, -565, -132, 578, -703, 745, 205, -548, 836, 3, -244, 355, -403, 91, 500, -518, 234, 220, -624, 816, -221, -554, 572, -82, -344, 496, -754, -92, 544, -960, 454, -83, -512, 672, -320, -387, 727, -349, 101, 794, -810, 248, 137, -931, 661, -318, -259, 753, -405, -164, 639, -616, 170, 800, -681, 601, -281, -433, 590, -502, -171, 633, -636, 137, 518, -812, 667, 103, -480, 562, -288, -312, 753, -434, 59, 702, -646, 392, 467, -426, 748, -53, -95, 845, -255, -223, 577, -677, -15, 265, -776, 493, 40, -414, 743, -386, -430, 641, -324, -38, 528]
4968E28j220J284m13r55J248q32qJ024j055K47P58j141J103k62r53J449r53l14
4986d65J227j029L13M23p76K18K79r65J320q04k27J207j088J32O35q89L92P12
5004F15j253Q74j01p38J442r19oO19n76k00Q24j145P01K19q13R27n67l71J223
5023G55j089J47N70q84O60J91r50P54k41k53R36r84L30L92p97M64L42q38P33L9
5043B77p22J091j167M48N42n66P3N54o73K35J53j036J328j99n73O37o97L02M25
5062D32p07J83J42o56P72l75j75O17m85J1M78p18K97O71r95L71K22m95R02m56
5082C6j43M33k72j44O15j009N54J48p92J073p18n3K85k83K21K73n61M51L42p08
5102b52M64j72j91M95l61j5L06j12j90J89j32k3O2k52N14p08L94j0l10J92L64
$$ y = [528, -692, 592, 179, -776, 472, -360, -368, 656, -399, -152, 606, -535, 568, 306, -647, 802, -151, -465, 762, -267, 46, 469, -307, -89, 190, -775, 545, -259, -486, 721, -367, -235, 400, -489, -97, 615, -638, 236, 135, -603, 839, -80, -86, 533, -43, -243, 581, -564, 137, 356, -457, 470, -97, -468, 755, -334, -187, 383, -501, 159, 350, -600, 154, -87, -340, 596, -388, -58, 334, -463, 1, 343, -495, 238, 277, -445, 646, -521, -73, 469, -97, -24, 530, -143, 92, 245, -791, 537, 338, -235, 402, -295, 7, 432, -275, -92, 50, -606, 166, -209, -384, 233, -252, -241, 237, -481, -184, 487, -508, -137, 85, -410, 492, 36, -107, 326, 54, -90, 525, -484, 70, 218, -574, 499, -219, -272, 13, -270, -49, 224, -337, 114, 456, -252, 212, 40, -151, 344, -17, -32, 274, 162, -28, 161, 29, 6, 68, -184, 330, -378, 16, 6, -304, -112, 252]
5123B52n59J37O22p32L42k30M4N24o29J53K58n7k32L69n90K53N4l74M39k28L11
5144A27j82K47m30L03l40L10J51m85N55l26J76l3n5l3J03j56Q9M71o14M94m14
5165d2J88J7n90M54j59Jj02L01l90N10k67l08N25j03j61m2J19qJ6L00k26M80n66
5188e3N24m41N2O6j59K39r2M7k53K49k89N7N1j1J26j56L3k74K01K45j4N7l62J63
5212FQ8M8m96P76m20K19n8r9J19k62L41k89j07J51n9j0j1J54m43N22j92J04k99
5235b17J08K57J32l09Q6J62l16L77j89l2O6l9J53j74J76l21M38k92K07l39o8L04
5257A70m61K50J5k93M28J59p82M16J20k75M44j91K4P2j01rp2l2K03l1n37P70l36
5280d9k65O55p48M01N0j49J11j7l44M88K5m22N98m79L66J32k62m0K5j11J49L7
$$ y = [252, -307, -170, 452, -280, 62, -168, -124, 400, -229, -76, 182, 125, -107, 262, -328, -75, -21, -395, 44, -184, 127, -55, 192, -238, 65, -275, 35, 186, -299, 256, -70, 106, 73, 18, -15, 88, -68, 21, 492, -122, 372, -42, 146, 163, -427, 27, -132, -131, -233, 68, -322, 188, -79, -387, 138, 35, -126, -168, -49, -57, -41, 259, 33, 513, -53, 471, 30, 82, 148, -11, 228, 136, 183, -70, 179, -110, -53, -2, -13, 113, -43, -10, -284, -83, 162, 148, 205, -157, 6, 94, 142, -354, 422, 2, 221, 163, 64, 183, -79, 262, -27, -134, 17, -42, -52, -63, 91, -352, 170, -22, 82, -217, -109, 148, 280, -29, 57, 219, -97, 280, 91, 59, 125, 86, 239, 65, 241, -80, 358, 66, 273, -66, -134, 170, -291, -41, -26, -319, 109, 268, -514, -98, 22, -253, 191, 0, 24, 96, -5, -14, -86, -118, 85, 54, -483, 287, -49, -314, 341, -407, -6, 44, -105, 6, -11, -355, 133, 158, -264, 334, -145, 221, 353, 91, 51, 76, -35, 114, 151]
5302A51p02P29l29j33O72p11L19J94o92O35J39p28P23j06n04N29o54M44N03m50
5322B9KK87n55O37k20m69Q24n86k8L41m16J4M44l82J00km64O77l25j81M59m77
5344b91L83K14n90R5M90o58O02j69o13J066p41J84K00k65N6M32q94N30J43p85
5364f11J040o79j18P82o13L04l7m67M81J55o41Q07l32l64O86r20N43J36l69K50
5384C3K67p81O61Kq36J169p05KQ45j154N09J35n57O75k81n46J145p97J85M46r36
5405e19M28K85l82M36pq06R69m76l28Q53o30L83J93q11N04J21m25M87r1o15Q17
5426C86p00K35M13p23K21K93o40Q49l04n43R49n43k96Q91j071N97L74n64L43p
5446A60m72O45l77l15R84j019M49K77q11M17L80m54O68m10n39J262j102J26M14
$$ y = [151, -551, 178, -151, -284, 388, -323, -4, 190, -502, 133, 272, -456, 267, 161, -343, 186, -468, -24, 479, 29, 31, 318, -237, 400, 180, -289, 535, -51, -79, 262, -154, -140, 304, -78, 22, 20, -444, 233, -92, -273, 186, -291, 92, 306, -284, -189, 301, -357, 245, 76, -537, 529, -212, -28, 172, -93, -37, 395, -499, 31, 174, -611, 429, -250, -368, 414, -199, 105, 68, -399, 82, 237, -404, 403, 71, -293, 393, -527, 16, 152, -217, 33, 300, -481, 180, 182, -654, 515, -190, -188, 657, -497, 12, 147, -410, 265, -16, -562, 583, -214, -29, 417, -519, -91, 194, -188, 248, 241, -565, 404, -72, -400, 453, -177, 206, 399, -412, 92, 213, -212, 275, 184, -431, 386, -314, -79, 334, -389, -168, 125, -515, 334, 30, -513, 436, -107, -403, 488, -583, 14, 388, -176, 167, 160, -312, 333, -44, -359, 625, -394, 55, 332, -479, -62, 318, -136, 532, 122, -417, 845, -257, -131, 283]
5465B83o27N75L3o25N24M1o80R43o50N9P10q58L01J78n04O59K92j111Q18j92n21
5486c52J013j011L41M08o21M19l8n65O79M6m71M53o15J95N49o28L31K0o08O00
5506A45J04q27O12k22j35Q20p43J52N52p92N61k30n96Q50k48l22P01p41p9O75
5526B37q82P67Jm55L94n1l33O54l85j26O12r38O11K54m37L70J34p56Q24m12m16
5547c33Q28p57M33N4o73Q37k11m57N54k69l86R18o39j02L92n65N06J64p01N99
5567A92J1o74J014m28l18O27p67M27Q1m25Q1K24m18Q07n91k76O79p67L76L15l59
5588a89J05K45m57O07j84l70Q40o14j34O84p22L37J49m23K75K57n42M16l79l3
5608a32J81m93K20M01l86K81j77l30M78q2j97M97l23L2K81k45J76J48m61K27J96
$$ y = [283, -344, 231, 264, -361, 163, 204, -476, 467, -183, -124, 586, -272, 29, 207, -297, 362, 654, -457, 361, 169, -352, 661, -350, -9, 399, -222, 197, 159, -406, 273, 319, -152, 301, -314, -119, 430, -198, 133, 153, -455, 145, 249, -578, 34, -188, -323, 497, -246, -94, 458, -334, 227, -3, -599, 251, 3, -319, 382, -359, -438, 237, -645, 122, 123, -332, 62, 11, -322, 332, -53, -179, 433, -505, 106, 360, -77, 293, 427, -329, 495, 83, -333, 495, -262, 171, 225, -448, 389, 178, -279, 275, 6, -380, 538, -101, -203, 189, -376, 130, 294, -407, 192, 203, -471, 543, 115, -203, 424, -343, 84, 165, -260, -179, 45, -373, 434, -157, -433, 246, -521, -145, 170, -189, -84, 161, -296, 311, 127, -243, 597, -17, -151, 533, -189, 148, 297, -126, 149, 406, -136, 280, -99, -132, 49, -444, -224, 177, -209, 72, -105, -435, 43, -39, -236, 261, -62, -30, 251, 6, 182, 330, -131, 96, 292]
5629B92n21O82m26J69O2m07L25P1k59O6J52l18K47j98j93M51m41N12j08k83K75
5650A50J01j85O2j18l14N10l12J73J18l85J12M21l43j72L31p22O31J1j28O0o8
5671f7J89l69N7J17N0j58RR0m6N79n57J69k89J16K93m56N29k64J98k65L60o34
5693c49K38Nj18L58j58M7r7Q1j38J77j5j97K76k30K27Q7k28j34N8j39L6nJ00J41
5717B3k69L12q8R5q7j69M10k56O3j53J72K0Q9j97J39K6l42L61n9O3l56M25l41
5740a19L6Q9j00J13L7ok88J15J83k66N7j01oL7K60o3R0q7K37j09j63j5O2J09r6
5765Fk5O7O2p0m5j9k02QJ07Q9J83n53M01J21j92j66O6M6r9J76j62L45k4l33M83
5790B70k37Pk4J49j15L1j3j24k7O4pJ30k45K09r7j72L63l50K27j06j04L26j97
$$ y = [292, -229, 453, 27, 196, 258, -149, 176, 247, -12, 54, 206, -112, 135, -63, -256, 195, -246, 266, 158, -125, 150, 251, 66, 128, 10, -304, 206, -106, 67, 185, -200, -88, 333, -10, -182, 149, -573, 58, 69, -59, 1, -67, 122, -247, -190, -73, -23, -181, -172, -82, -128, 451, -106, 63, -226, -110, 183, -273, 256, -8, 190, -75, 285, -349, -111, -106, -224, 134, -24, 23, -74, 7, -131, 46, 31, -166, 110, -120, 107, 194, -34, -168, -110, -249, -213, -218, -118, 23, -246, 66, -22, 73, -14, -183, 227, -29, 34, -119, 53, 73, 162, -35, 104, 130, -212, 149, 90, 153, -203, 222, -119, -83, 6, -94, 19, 56, 50, -238, -123, 60, -206, -149, -250, -256, -219, 41, -22, 68, -19, 218, 109, -54, -69, -7, 102, 6, -19, 48, 110, 40, -5, -24, -226, -218, -111, -22, 161, -392, 9, 130, -62, -228, -162, -116, -215, -39, -201, 144, 120, -213, 270, 33, 40, 16, 165, 50, 81, 68, -56, -83, -19, -26, 104, -141, 68, -29, -201, 162, -188, 39, -67, -171, 155, -42]
5813d2j18J38j46r6N93m03j93M92o01O36l4l97J22K01k25K26l98P9L54l99L04
5834I3m6q5n7K42k88K20J28l89J46j65N7L44n58M48J06l13K25j6k48J64n8J30
5856H0L71p26M84r3k63L82j53j62K26k16j31N33n21K68J43l14L56k06l84L23j21
5877a24l08P86l74K3J27m37M01L1k50K14q9k01J92J43q9J49m88J89L28m69L36
5898I0pl3J79o7l45O60n36M25p2n64N60j12j77J84k0m91O95m97J15K88m50J71
5920dJ90l35K83R2n85L17J1j45N07n31l6M54m26N12p5n73M20q3k33N17o59M29
5942D7J67n70M42q7k9J21M1k12L99n99M02R7l27M32l40k38N86r1n27M70k53k95
5964c64N44p13M19K31l21M35j50m08N05k02J27J79p82L58J80k86K85Qm9K02l51
$$ y = [-42, -160, -22, -168, -264, 329, -74, -267, 225, -376, 260, 226, -171, -49, 152, -73, 153, -245, -166, 188, -211, 93, 47, -38, -95, 147, -141, 79, 207, -182, -36, -201, -144, 200, -358, 90, 196, -117, 108, 92, -156, 8, -50, 80, 451, -275, 209, 116, -147, 235, 82, -80, 146, -70, -201, 332, -189, 79, 222, -92, 264, 58, -326, -3, -124, -432, 354, -20, 3, 130, -307, 94, 125, -125, 89, 0, -201, -9, 134, 45, 194, -294, -105, 223, -246, 90, 83, 50, 229, 162, -183, 477, -59, 366, 294, -270, 290, 178, 1, 185, 165, -326, 369, -128, -13, 275, -175, -4, 186, -149, 134, 226, -359, -42, -31, -176, 331, -200, -236, 218, -208, 304, 229, -344, 76, -7, -240, 277, -382, 47, 214, -356, 86, -1, -30, 91, 132, -80, 319, -280, 122, 219, -108, 324, -16, -254, 332, 241, -286, 184, -69, -364, 180, -533, -114, 117, -204, 231, 81, -327, 178, -24, 103, 282, -500, -142, 38, -248, 37, 45, -4, 198, -153]
5985a53n1N35l37q3M32n80L39m8k17M88m87j2M54j95o6L79o95M59J10n25M65j82
6007C0j83K52k63q1L70j00j21N88q72L96q1l39K16N3J02L37m54OL13n72M20P8
6029I5l28K80j30R4K17k70k63N99l97K64N4n27P91k89n27O31j55j15M73m21o9
6050GK54n50M54O0l84J10J19m68O17m35K11L38o02M30K63p38O45n92P0N34m23
6071h0k19N21l25K44J75o98N60k24k01J55N7n7L50j77j51K65m45K57K92k90L59
6092C68k79l89K70n4n3N22o64K75K80m30J72j29m3J02N6m04N80l82J11Q7n07P45
6114B34l67K18J54k63m4M16n49l1N12n71M43J2m22K09q1M7J41J51k58K10j08q2
6136b9K75n44L43p6k1J00q2j50M87l61k56N78j93K18l55j88P4J41k07J47q7O5
$$ y = [-153, -204, 331, -6, -89, 343, -237, 102, 54, -163, 325, -162, -174, 280, 85, 19, 398, -297, 162, 272, -253, 212, 30, -153, 99, -164, -245, 125, 25, -96, 492, -380, 16, -65, -404, -188, -135, -33, 304, -150, -144, 169, -403, 17, 95, -233, 47, -83, 11, 228, -42, -305, 294, -103, 161, 215, -312, 479, 190, -337, 294, 139, 24, 497, 76, 7, 261, -289, 165, 225, -159, -49, 70, -398, 219, -216, -5, 333, -269, 161, 424, -314, 331, -261, -191, 343, -80, -299, 222, -103, 141, 316, -382, 178, -46, -247, -92, -35, -92, 258, 81, -70, 195, -250, 7, 299, 9, 368, 89, -300, -30, -84, -137, 385, -279, -4, 276, -154, 18, -111, -154, -52, 4, -400, 180, -202, -91, -4, -511, 234, -133, 85, 239, -24, -68, 348, -201, -232, 280, -291, 152, 164, -258, -49, -130, -83, 58, 209, -49, 161, 53, -29, 246, -298, 45, -31, -52, 48, -34, -184, 303, -58, -314, 264, 71, 289, -66, -254, -180, -39, -246, -99, -186, -121]
6158a21M9j15M85m65n7M93l32j5l0K02j93K66k23j20M66l07K37k91J75J39k16
6179B7o2Pj50J75L05l91P9j3m6J65j9j83J98k56J36L5k46J19J00j83K53j25K51
6202A76K32k05r4k38K76q8L79q56L59P3k00J00PQ2Mj36K90k36j04L94k00K1J56
6225A92k09J22J01j85j57J90mJ79m18K7L06J07k19q0RK45k55L02l04L6m6k89K90
6248f0J9P7j70J11J63l46J74L10n28J13K96l04K41j37O3k5J01KQ0k04J69k58L4
6271g9Q6j80M13k31pN5j04J26j15%O4R8j86pJ80j76R6j94J63p4J52k08k09K80
6295e7L34m94Q1P3n2L14k48J61R4j31j18k19K67l9Q6j32j27K66j8j00J06n1k17
6318b21K29K8M3k07J75m1l7L33m15n2K42k49qJ63K3o2K70k06j55L35j70j16J91
$$ y = [-121, -72, -187, 298, -167, -224, 269, -63, -78, -108, 94, -99, 167, -56, -176, 290, -17, 220, -71, 104, 243, 27, -35, -28, -178, -3, 302, -89, -10, -23, -69, 96, 77, -106, 92, -164, -28, 7, -239, -120, -20, -203, 50, -75, 176, 408, 203, 109, -129, 147, 59, 438, -418, -59, 14, -186, -86, -79, 3, 7, -129, 161, -75, -179, 215, 15, 36, 192, -17, 105, 206, 21, -136, 54, 50, 229, -189, -162, 144, 251, 32, -48, -39, 206, -49, 253, -51, -15, -61, -350, -60, -41, 36, -134, -23, 140, -206, -32, 278, -250, -137, 159, -145, 96, -41, 22, -3, 98, 100, 180, -24, 145, -113, -79, 7, -173, 240, 9, 2, 57, -47, 79, -36, -36, 28, 126, -60, -67, 113, -63, 33, -161, 2, -72, 80, -128, -337, -57, 277, -217, -136, -63, -115, 199, -49, 112, 206, 75, -43, -262, 5, -34, 52, -80, -207, 59, 41, -59, 47, -4, -221, 8, 36, 79, -128, 47, 6, -31, 302, -113, -165, 77, -172, -180, -17, 6, -56, 214, 8, -147, 188, 18, -98, 93]
6341I3k86J49K13k6L3j56K8R5k57J70j83K33K63k78k67M25k76J09nm2K27k30L4
6364F6M0q7j47J04k0k02K99l55K34K70l51K87k23K08J23k14KJ29m76L60j76P6
6386e3K48l53J29k18L18l8O1j60J32J0j55l6KK0J18j37K26K5j5k09L10j19p6m
6410B6l12N36l76J32n3L2k33O00m29N9q5j49N14m66K46M4j13o4J48j28j6M41q83
6433e29M14J26j87K75j78K32j46q0L5L72m56J53j2J19K9rk00OQ7P3n7K7r2L39
6457C41n40L33l09PK71Pj77R1o1L9j34l26N52ok65J85r4K68j13J9l78N06l21J45
6481D0P9k25J04q9M7O5J05m51L33k4J54n5n33O39j07q4K36l41K97j56q9l7K79
6504A87l56K04l3j21M89n06J12K87l43m1L72l00oK15j52J58L6k49J35l78O4L14
$$ y = [93, -193, -44, 169, 143, 176, 20, 48, 143, -114, 56, -127, 106, 369, 91, -176, 249, -27, 82, 77, 35, 262, 32, 66, 106, 19, -128, -24, -44, -246, 53, -302, -68, 202, -149, 138, -85, 123, 246, 32, 34, 163, -313, 47, -129, -53, 195, -158, -29, -247, 71, 33, 94, -66, 66, 76, -79, -115, -113, -93, 25, -112, 114, 139, 124, -85, 225, 106, 30, 26, -286, 250, -126, 6, -47, -15, -248, 352, -77, -18, -103, -252, 262, -204, 42, 86, -27, -91, 57, -71, -87, 354, -529, -115, 11, -176, 99, -79, 153, 7, -73, -38, 334, -122, 31, 19, 138, 167, 158, -42, -36, 51, 124, 67, 94, 2, 341, -199, 134, -175, -168, 103, 110, -67, 24, -37, 2, -132, -458, 94, 88, -177, 8, -86, 182, 69, 88, -290, 216, -105, 40, 119, -106, -2, -91, -44, 21, 126, -325, 8, -16, 138, 83, -450, 189, 82, -2, 234, -107, 190, 34, -55, -92, 187, -169, 35, 2, -119, 370, -136, -24, 263, -80, -121, 251, -49, -55, 160, 8, 166, 202, -47, 88, -290, -226, 88]
6526H8j83k1L76m58M33j70j84J35j4j43J75j91K30K78n33M9K50k73K25n4j61N74
6548D28m24O2R2l28P3K51l72K40K07k96O8J19j79K48n2j56J96m21J15ln3K74j4
6571G5l31L46m3m21K99j24J71L02l78L27j07j94K36L7m05L28k05J53J48j60Q2
6592A36j96K06j38J64l10K67j85j77J91K04j81j65m6K83j06L85k6n57Q6L76j57
6613E4P1j69K9M3P6r9m3j32J35K56l82K36K22j96J18j85m21O69j6k14RN2j02P5
6637H6M5m5j1k76K58l49j86L94j92K94P4L2j50J23l22N89l04M9j39K84m01J08
6659c9k6mL74m43R6K12k20L96l67n5L91l18k13L40K8j71J66k54J17j74J66M0k62
6682b20J92KJ90j82J46j32L8j75M2K27r4K25n0j15j23JJ17j36K5J01j97o4J41
$$ y = [88, -95, -116, 260, -198, 235, 65, -119, 16, 2, -141, 34, -157, 73, 351, -182, -133, 117, -156, 69, 15, -146, 428, 4, 66, 158, -170, -97, 154, -218, 22, 229, -67, 1, 120, -59, 189, 137, -19, 177, -244, -129, -132, -185, 89, 75, -256, 90, 47, -374, -75, -199, -28, 274, -104, 223, 116, -78, 158, 195, -210, 118, -87, 66, 214, 54, 136, -60, 146, 8, 172, -138, 129, -56, -233, -42, 162, -19, -184, -230, 53, -53, 332, 306, -251, -165, 211, 54, 125, -44, -15, 28, 104, 5, -38, -170, -35, 221, -161, 75, 297, 101, 219, 34, -387, 282, 266, 52, 61, 113, 11, 86, 131, 86, 75, -201, 57, -292, -478, -84, -276, 18, 92, 124, -26, 97, -225, 364, 60, 109, -30, 254, -147, -39, -65, -69, 305, -138, -42, 170, -50, 346, -21, -76, 315, -3, -216, 124, 152, -19, 147, -107, 10, -164, 2, 42, -220, -28, -26, 164, -18, 128, -4, 34, -141, -99, 128, 34, 259, 209, 94, -29, -28, 89, -47, -22, 79, -118, -182, -41]
6705d1N4j62K63Lj02j58J34m8p9j48K96k0P0j11L25j65j69Q5j9L8L3n0j06R6j54
6730a35K09q0J3J19j53J45j84k4M24m63K88j45k1J10K1o9k34J40O1J80k25j90
6752b13L82l07J39J55j27j54L21j73k21L76Nj05j98L24m63M36J50k99j72J32J62
6773A50n3r0Lj04L97k84j98K28M5r3J15Pj84J50j09O5l11J91J6j00L9J54q7P1
6797A8N1l31L23j64Q7r0J7J93j96K00j16p7r2K97j66J13%j74rJ77o8j83J56j86
6821b20M56j54lM4j11L4j6MJ15j86M1K3q2K5j20J4K34O2j72q3K65q6j90L17l43
6846a32Q8j85L64N3q2O4l07K45j32l4J0l0N7q1O3J08J38k55J14j26oq2J97j53
6870a04K7O4J15j4k01K90m36J2L88q8p8j47L92k61R0k8j60J89j39K20k6j68K4
$$ y = [-41, 13, -149, 114, 117, 15, -143, -9, -57, -136, -284, 12, -8, 62, -49, 276, 111, -58, 27, 8, 46, 79, 29, -77, 19, -135, 74, -6, 7, 126, -27, 118, -66, -90, 334, -129, 159, 14, -7, 103, 124, 55, -179, -39, 22, 202, -23, -213, 169, -138, 1, 156, 29, -125, 196, 23, -198, 178, 183, 78, -120, 204, -259, 177, 327, 28, -144, -12, 150, 97, 7, 10, -94, 303, 19, -179, 49, 94, 1, 116, 123, -61, 89, -20, 45, -266, -75, -59, -159, -120, 34, -53, 18, 69, -262, 61, -103, -16, -106, -89, 104, -92, 108, -8, -85, -177, 120, -46, 67, 67, -107, -116, 61, -7, -190, -34, -220, 236, 82, 79, 123, 12, 46, 30, 34, 149, -37, 4, 27, -55, -30, -150, -136, 98, 160, -12, -95, 170, 84, -106, 211, -132, -44, -229, 135, 188, 106, 170, -137, 108, -24, -58, -48, -78, -21, -102, -39, 69, 207, -48, 66, -60, -66, -148, 49, -104, -77, -13, 102, 88, -113, 177, -259, -247, 141, 53, -25, -172, 220, -41, 49, 21, -139, 50, -89, 131, 105, -63, -39]
6893c9J5m0J39j74J08o7J52j99K78j77l9K10k31P8j65J78L1r5K77o2l9k18P8n7
6917e8J58k15P0m68O54k12R8nKN6k45P3J97k78R1j57K62j1q8K14m4J02k33j40
6941a77J64P5k93L18j1l25K31k14L52p0Q4p0N8k31J06j18J49k8L2n5O2l0K7O5
6965A01l0K0q6P1j01L41m02J01p1j33J69K2J51k61L82j15oJq8n8O1rMk11Q8K31
6991A72j90Jq0j23K49j90L14l78L9J39LM2m5P5j25J81r4L0j52N8J30M5l49J99
7015d9O1j41J16J00k15P9K3l8ML2M7j52J96j67J29J0l1K00j61j2o4L1P1Pj04N1
7041B3K23j02k72J77J44l41R8M1q0L4J00p1p2K61l7J17j18Mj19j46K88l13o7K81
7065E3l54K62J1l9r0L01j66P3j24P1J06l17K00J09j3o3P7j78O0j13J68r2N1j19
$$ y = [-39, -24, -64, 75, -99, 9, -58, 94, -105, 173, -4, -43, 167, -64, 14, -151, 27, 58, -37, 240, 178, 139, -79, -1, -58, 100, -115, -45, -513, 141, -71, 27, 22, 24, 80, -165, -92, 105, -173, -82, -239, 23, 12, -76, 138, 94, 196, -37, -177, -13, 62, -231, 87, 76, -249, -18, -232, 120, 50, 134, 64, 122, -109, -3, -121, 28, 0, 32, -23, 39, 9, 36, 101, 71, 91, 5, 76, -25, 316, -86, 15, -56, -189, -20, 2, 153, -108, 274, 159, 153, 154, 66, 8, 69, 60, 64, -147, -59, 172, -18, -17, -97, -220, 29, -161, 153, -225, -186, -47, -44, -2, -47, 28, -97, 84, -10, 20, -132, -74, 56, 101, -248, -49, 12, -129, -13, 87, -128, -49, -26, -64, -60, -28, 19, -133, 63, -104, 25, 35, 4, 204, 43, 31, -33, -2, 69, 76, -28, 23, 246, 144, -128, 49, 193, -148, -50, -9, -89, -55, 45, -26, -98, 163, 126, 243, 125, 129, 10, -136, 152, -161, -228, 53, -301, -39, -28, -67, -157, 144, -22, 51, -73, -2, 104, -213, -13, 96, 83, 20, 97, -81, -21, -134, 34, -58, -7, -126]
7089a26J39j58n4L53R5k59J13J4j70j09K44K5n0q4J43j42J95q3L0r9j40L7R7K78
7113B89j72m7j85p1K77r8M5j35N1J42k49q7L12j80K10k4k38K45j04J0J62j12j90
7136a49K09r1O8k04J81m6K80m27J57Q6pM1k35Q9rQ8j42J82j89K95N7l24k68K84
7160g4J97j38n6P5K54k74j09K59l15L2J62N1j91Q0J61j29m9J28p6l08M24J93j45
7183A52l27Q8j72K55J50k97K48J03j04m4p7k17K60l93N99m69N0K20qj62j62K07
7205a00J65K93k19l4j01j23Q5K04l33J22O2j7J4j31K8m2K14o1J85k51PL8m5k45
7229b85K05O7n5K71q7l6o7K10k1l86K73k9L8k03j57L67j20M6j41K05l03J0L49
7252A51j11j07J56k3k5k90K31O5K56j29n1k06P2o0j54K89J03k92K88p0j7n6j31
$$ y = [-126, 13, -145, -199, 154, 249, -10, 103, 117, -53, -162, 82, 107, 57, -27, 116, -26, 169, 86, 116, 17, -123, -86, 11, 289, 117, 70, -115, -186, 91, -7, 38, -97, -46, 96, -153, -240, 72, -108, 102, 78, -160, 85, -19, -9, 153, 41, -149, 60, -31, 37, -167, 14, -32, 248, -179, -22, 64, 57, 98, -137, -48, -57, 31, -111, 71, -118, 177, 234, -90, -358, -74, 123, -15, -71, 4, 258, -16, -125, 134, -181, -149, 13, 64, -127, -47, 114, -15, -64, 64, -12, -320, 104, 297, 152, -175, -87, -259, -4, 146, -151, 97, 200, 96, 52, -25, -242, 18, -375, 224, -245, -195, 25, 17, -145, -307, -100, 65, 358, 139, 105, 4, -119, -34, 170, -163, -41, 21, 4, 18, -113, -85, -127, 87, 26, 211, -40, -33, 5, -40, -285, -80, -13, -68, 203, 116, 80, 13, 223, 202, -184, 89, 60, 98, -105, -262, 105, -15, 31, -110, 95, -208, -198, 151, 40, -67, 89, 66, 41, -249, -18, 47, 303, 174, 123, -83, -11, -71, -225, 64, 167, -125, 163, 93, 76, 20, -111]
7275a11j17L5m5K28L53n42Q3J36j21K45j54K56j61k05K61j77KJ7j80K06j10n9
7297a60M0j35K77K41m36K0K11k16L42l08J85k39Q2L52l5k93K03k30L66m62K01
7318F%j41K13k22J33r6O2J31r0mJ52k24j01K33p6j13L20l82J80k0QQ3m1k7K4J14
7344A22k31L2J43k7M0r0J61l05N7K23l9j98K31j97n5O5L3K12l67J79L21m00J6
7367g4J0n4R3j34Q1J57j39J63J36l65Q4K3K20J6k24K09l34l4K22o7R7Rj50j1r3
7392a59L15o2o6J90m19J8K64J57r8p0k09M3J45N4J08l83L41q1nn9J7J12l4N1j08
7417F2j5J60l94K9L29n1J8Q4j52n4j08J26Q6k36j5j22L17l5j33L8q9k4J60K2j49
7442a46O3j7kK98j4j71M4j29O4K0j66R8R5m0j22k4J52p4L3O9K%n3L05k89q6j20
$$ y = [-111, -228, -193, -238, -10, 343, -199, -116, 20, -101, 144, -10, 246, 85, -120, 141, -36, -34, -17, -197, 9, -101, -160, -120, -255, 22, 263, -173, -153, 58, -158, 184, -124, 61, -178, -96, 256, 221, -72, 131, -99, 267, -195, 6, 6, -135, 78, -144, -11, -107, -45, 86, -4, -8, 144, -80, -181, 52, -24, -137, 183, -199, -19, -39, -31, 52, 11, -16, 8, 122, -109, -77, 66, 39, 79, -11, 150, -155, -98, 125, 86, -112, 119, -78, -133, -68, -35, 177, -190, -11, 310, -90, -74, -64, -118, -25, -159, -78, 79, -60, 103, 239, -126, -42, -19, 201, 217, -7, 202, -132, -166, 56, -11, 86, 95, -55, -66, -159, 156, 94, 28, 218, -201, -183, 81, 238, 140, 70, -139, -96, 49, 103, 211, -172, 169, 88, 83, 24, 41, 153, 119, 170, 62, 47, 207, -187, -158, 171, 120, 138, 222, 70, 16, -92, 34, 120, -116, -131, -253, 64, 29, -104, -66, -155, -179, -19, 3, -146, -83, -100, -102, 196, 182, 11, 55, -74, -10, 10, -156, -58, 37, -3, -125, -149, 3, -71, -38, 31, 33, 33, -20, 285, -4, -90, -210]
7469b10K82m2p7R8q8Q8n2j4j82L9K03q1J99p4j86K24k31J79j38oo2P5o6J33J6
7494B7k06J72l0J04J91j52k22J13n6J16J57j87J77j20L1k39n1J4M19k23Mk6j83
7517a70J48J49k24Q0J13p9M9o0J10k25p4M9k2K90j53K82j67Nj29l2J88j74r6K94
7541A52j7o4J29j47o7j18M5L16k44J19n2k98K55k22J64j24L26j83r7K42j35J34
7563A14k49j2m9R2J47p5no1J47p8m3K66q6p3j01K5M6j50J62n0r2J88j08Q6j59
7588a18J43m0Mj98M1mJ72q2p6K39J95l94J70j07j71K75J47k64Q7J83m01L02k47
7611a44J65o1J87j27R1Pk05J50R3j49k4pQ6K25k21j8O5J4L4k87K30j11M6j69J36
7636Fn9n1K3j28K92Lj22j8l9q4J70J85J70m42p7Q4J2J87J20m29J07J0J31O9l74
$$ y = [-210, 72, 30, -47, 51, -37, 51, -1, -15, -197, -158, 45, -36, 163, 89, -97, 127, -104, 75, -63, -69, -131, -56, -122, 11, 27, -179, -7, -37, 67, 258, 106, -116, -3, -59, 57, 214, 27, 204, 84, 115, -124, -175, -161, 258, 35, 39, 13, -170, -22, 127, -97, -17, 96, 17, 66, 6, 116, -109, -183, -134, -156, 134, -19, 263, 96, 101, -28, -60, 128, -46, -142, 152, 135, 71, 200, 53, -14, -132, -87, 229, -15, 104, 52, -246, 9, -213, -49, -173, 153, -30, -127, 115, -20, 114, -135, -147, -196, -104, 43, -32, -37, -98, 49, -29, -72, 194, 108, 35, -66, -41, 5, -145, 17, -33, -125, 63, -45, 41, -118, 25, -15, -11, -209, -168, -172, 0, -82, -158, 81, 276, -118, 52, -55, -226, 49, 196, -68, 19, 202, -199, 103, -144, 21, -40, 147, 20, 111, 118, -87, 63, 156, 7, -17, -24, 62, 287, 66, 48, 113, 127, 161, -126, 104, -7, 39, -130, 6, -53, -104, -81, -209, 83, 86, -36, -54, -93, -177, -7, 178, 348, -94, -171, -87, -75, 112, 232, -197, -90, -80, 51, 120, -254]
7661b54K57K57m00K21J15j32J9j76j08K12j44J0J74P2K0K5j6j60pk59L18K63k08
7684I9k03J25J9J1J58m50K07k04M26k75j13O9j17K75K5l00L19j39j5L1L1j63J40
7707d4N7N2J9p5K2K9r3n3K35O0p5l0j64J60j32N6m8l0j0k3J2m7K68q2M1n9j32
7734h6J34j32K82l01J25L0K1k77M50k02K80l44R6m7j66K03n8R8k52J46P4M0N8
7757A72k49j36M33n45K46O2O9k28J81j13K61j93P3n8n4o5K66nq5Q5j46J21j49
7780e7K08j55j5j00J01Q1J65j81o7R8K50l99J94k87J73M6R6O0k68J96J06r5j02
7803D8l8m7j32K73j06J05J08m14K27j5r0K79Q6l29N5J64l42J41Rk7J48m26L41
7826A8K3m9J31r3k0Q4j13K30k11K06j4m30J48K10M4j81J29j59K93l45J58K05j89
$$ y = [-254, 3, 260, -140, 81, 196, 64, 83, -93, -201, 11, -133, -123, 51, 123, 143, 168, 152, -8, -15, -274, 44, 307, 99, -104, 21, 40, 51, 209, -241, -34, -238, 188, -87, -200, -131, -248, 27, 52, -248, 71, -68, -83, -52, -21, -184, -44, 13, 65, 84, 9, 31, 60, -33, -86, 149, 209, 134, 104, -60, 100, -32, 24, -24, -54, -64, -87, -75, -122, 146, 64, 105, 46, -86, 48, -84, 198, -103, 22, 52, 73, -204, 246, 44, 324, -20, 76, 29, -137, 66, 8, 106, -146, 0, 74, 114, 172, -77, -213, 220, -325, -79, -17, 52, -176, 5, -108, 153, -40, 33, -25, -79, -144, 122, 117, 32, 117, -29, 92, -57, 151, -4, -19, -119, -18, 63, 228, 47, -20, 78, 328, -71, 123, -164, 9, 55, 151, 211, -57, 139, 245, 150, 48, 10, -37, -169, 104, -2, 103, 211, -203, 24, 9, -81, 198, 284, -45, 10, 174, -168, -27, -18, -45, 103, -323, 18, 41, -8, 123, 30, 10, 94, -19, 211, 0, 206, 192, -238, -90, 120, 164, -17, 112, -47, 246, -99, 59, 264, 75]
7849G5n7M1k06RM44o43M34j23K19j63l4lm7j14K13r8j5M6J05kj3M5k54J99J1j93
7875a24J60j9k06%J12Q0J03o4j1k21K54q0K7Q5j10j52K06j34k18L97l16L21J77
7898B67l98J05N2q2K53k14j98N04k13r5k7J36o7j15qQ5K2P8N1k67J20m3J95J41
7922B82k58j72K03j13J02q6M2j12J45j95L56k30P5q0j3J44m0R3k75K14j64K03
7944A21j34j60L17l1K7j70K70k21j58L85l49K14o2j4j53K29j26M4p1m2jm1M6K28
7968A48q0j02K08j03j82J78o4M9j37K10k1Q7N7m69L05m4K21j29j25J08l01J90
7990DJ80l28K83l1n4M5m9l1J13l3n4J2Kk20L66j88L5j1j42J41Q1k44K46J1l13
8015a79J83k98K91P4J14j19Oj33J10L3j00P4J12k05K06l09j51J18J04J49k23J84
$$ y = [75, 18, 59, -147, -138, 306, -337, 97, -26, 193, 30, -4, -7, -54, -168, 45, -53, -68, -22, 83, 81, 68, 113, -141, 58, 69, -124, 36, 17, -189, -189, -77, 3, 106, 42, 31, -190, 64, -16, 11, 96, -14, -166, 40, -94, -312, 85, -231, 90, 267, -131, -26, 26, -56, 197, -17, -215, 289, 76, -19, -46, 90, 23, -92, -100, -15, 7, 85, 136, -131, -11, -54, 141, 282, 24, -148, 55, -58, 44, -42, 0, -112, 33, -162, 194, -36, 39, -41, -54, 90, 50, 143, -132, 82, -82, 121, -13, -173, 144, 113, 140, -30, 240, 19, -139, 246, -103, 111, 49, 35, -118, 111, -15, 29, -42, -84, -85, -126, -80, 148, 68, -34, 174, 71, -111, 67, 3, 52, -85, 125, 104, 191, 248, -221, 84, 40, 261, 132, 7, 115, -186, 4, 184, -144, 139, 108, 54, 99, 50, 19, 132, 99, 45, 57, 59, -161, 205, 17, 52, 41, -101, 40, 121, -123, 123, 134, -179, 4, -294, -3, 71, 185, 66, 72, -61, 49, 82, -18, 56, 168, -37, 169, -140, -291, -173, -69, 80, -143, 41]
8037D1j41J73m12M89k08j17J84m5J49q3mJ71m16o9L78k6k20K30r7J21q1K9p9j75
8061b08J66N7j48l7K56j92J50j43K64l79K34j39M2K18j13j0J51j82K55m51L41
8082A32j35N5R2l35k1M21l55J16N2n9J42Q8j97J77j90j0j4j8N4K03l07K50j43
8105bj51K92J10j59p8J38j17K09j70J3J0k55J89L9P7r3r5l3K6J45j19K18k67N6
8129a7np1J36j68J11J82j71J10L5m19J23K44m0j4o6J4J00p2P9j05J79j75J12J13
8153B15j19j3k23K01r2o3P8j71M8J64j24K96m72j06K90l7Q4o0q7K38j46J46K10
8176B57k55j26J36L8l14J65K19l2J7j11j5J63k34P8j31
$$ y = [41, -100, 73, -339, 150, -58, -175, 9, -36, 113, 30, 26, 197, -219, -288, 90, 64, -156, 74, -23, 98, 17, 46, -33, -208, -42, 15, -133, -170, 86, -106, 44, -99, 165, -214, 20, -119, -77, 141, 28, 18, 169, -13, 242, -209, 132, -3, 52, 144, -191, -212, 209, -146, -30, 22, -37, 105, 193, -4, 173, -17, -27, -41, -59, -5, 198, -109, 141, -2, -153, 139, 249, 90, 12, 150, 33, 242, 72, 85, 95, -160, 29, 68, 145, 52, -43, -76, -50, 95, -24, 194, -73, -17, -22, -93, 43, -125, -14, 168, -3, 107, 142, -277, -154, 90, 50, 36, -30, -16, 84, 12, 91, -14, 165, -10, 102, 215, 96, 83, -140, 61, -31, -94, -16, -187, -139, 25, -99, 197, -275, -381, -91, -128, -44, -104, -191, 47, -99, 47, 257, 2, -124, 12, 50, -264, -99, 120, 88, 105, -6, -21, 142, -92, -14, -145]
8191a45
$$ Imaginary data points
##PAGE= N=2
##DATA TABLE= (X++(I..I)), XYDATA
0@%%%%%%%Qj6J6j6K4l2M0n6P2q8J04j22J46j77K17k58L01l55M16m82N57o45P41
30C95q47R68j099J243j404J582j779J993k228K484k764L072l408L776m176M611
46B419n088N611o182O808p499Q260r100J0034j1077J2253j3587J5112j6880J8955
60A0039k1424K4426k8166L2967l9378M8397o2086Q5468j35586M11678k09981l15199
72a98845P36785p62428L39150K11074n98592N14647m8058m33675M92072m05224
82a53094k6652M10969m05011J33648J34539l17564K36750L1078k93558L23213
92G4318k4017j81471L70973l52790K8847L03375l28166K30708O0814l10767L58515
103B30339j36963k10564L44415l08597J37597J91599l64451K04002m6748j33964
$$ y = [0, 0, 0, 0, 0, 0, 0, 0, 8, -8, 8, -8, 16, -16, 24, -32, 40, -48, 56, -66, 80, -97, 120, -138, 163, -192, 224, -258, 299, -346, 395, -452, 516, -583, 660, -744, 838, -941, 1052, -1176, 1308, -1456, 1616, -1792, 1984, -2192, 2419, -2669, 2942, -3240, 3568, -3931, 4329, -4771, 5263, -5814, 6439, -7148, 7964, -8916, 10039, -11385, 13041, -15125, 17842, -21536, 26861, -35225, 50243, -85343, 326335, 116354, -198845, 537940, -224488, 114662, 325736, -272856, 241791, 193733, -239942, 252130, -153094, -179746, 231223, -173788, -40140, 94399, -223165, 13585, 44663, -248895, 74318, 50301, -131170, 239803, -112987, -84140, 219235, -108931, 121777, 182591, -128176, 230339, 93376, -117188, 227227, -81370, 56227, 247826, -116625, 87377, 40629, -93335]
113i3335K12141j07368q9379J97431j12889l6234J11226j80559R5076J25840j37594
124a5644M1274N5374j71732J69766m896k01848K64973j42218j1102J61239k65159
135a19973R3923J11563j64165J36766j7860j66840K22457j04760p6338J52847
145F7620j29048O7062J01871j51310N609J15793j45973J29635K6673k01723K33674
156A19883q3167r4219J77223j84910L6942K00414k45999J05897N5100k31624K89178
167A44718j30956j13576K36651j92766O2024J13603k37651J22085Q9029j94173
177a01012J99211j01176j20746K45940j77586l978J27989j82992J09092R5015
187H9757k42952J67059r676j47126K69339k04511j8102K01370k06791J14031N8925
$$ y = [-93335, 118806, 11438, -77941, 119490, 6601, -29633, 81593, -98966, -3890, 121950, -15644, 25630, 81004, -90728, 79038, 74142, -127706, 137267, -4951, -16053, 145186, -119973, -26050, 85513, -78652, 58114, 40254, -126586, 95871, -8889, -85227, 67620, -61428, 5634, 107505, -43805, -38196, 77597, -68376, 61259, 87932, -113791, 119883, 36716, -57503, 119720, -65190, -28248, 172166, -73833, 32064, 87164, -144460, 144718, 13762, -99814, 136837, -55929, 6095, 119698, -117953, 4132, 93161, -101012, 98199, -2977, -123723, 122217, -55369, -59347, 68642, -114350, -5258, 89757, -153195, 13864, 4188, -142938, 126401, -78110, -96212, 105158, -101633, 12398, 71323]
198G1323k12753K12021j903j64132K25013j80226J2946J94454k24882R3364M8098
209G3323j44048J52394k6636j59460J82613q2681m2660J53754k02005O9876R2958
220F7428j41305Q9375m530j14395J62836m7922r8728J49857j33420O5284Q1870
231G6350j53298Q4822J2960n7827Q7243m7186o8647J24625o7290L732M3086j01085
243f2515Q1430J2039m9622J7543l098k4607O7938l5378n0579O9880m6653M0260
255A6638K427n8311L0153L0257k6750J1712p190m4069Q8083m0342k0136K6434
267H906l6921M0744J5846m7805m019M5708m2237N0262k7388n2533Q3236l0840
279B959l614J6543m1891J5299O3767p3918J5082K4034o0005R6832n3342l9865
$$ y = [71323, -141430, 70591, 68688, -95444, 129569, -50657, -37711, 156743, -68139, 25225, 73323, -70725, 81669, 55033, -104427, 78186, -4495, -47155, 106599, -95406, -25530, 67428, -73877, 15498, 10968, -103427, 59409, 11487, -87241, 62616, -70804, -5520, 76350, -76948, 7874, 20834, -36993, 50250, 3064, -65583, 59042, -8248, -4516, 38570, -62515, 18915, 30954, -18668, -1125, -4223, -28830, 39108, 3730, -46849, 23031, -23622, 16638, 19065, -39246, -9093, 21164, -5586, 6126, -1064, -45133, 42950, 2608, -17528, 8906, -28015, 12729, 28575, -19230, -23249, 22459, -19778, 30484, 3096, -49437, 33799, 2959, -655, 15888, -26003, -10704, 53063, -20855, -5773, 18261, -41744, 55088, 1746, -38119]
291c8119N9071k8913Q396L3237p2937J8808O4391p8459N9031l6777l3765R0172
303D4136m8254j2874K5430l1727K5678M3887q5409M2810R873l0360P0024p2220
315a9006M882M0063j9692J0282j629m3434M4957J5638m8851L8724n2214L2232
327A952K7779m8820J3510j1414O283K4667j6522l6745M1549j8919K2239K141n4613
340d6913N4101j2122R485K64k9908J6123L0041k0790k680j419k2314O2611m3019
353f540k645N838k1553M8276k4614k0658R845M498K938K3699n4592K1174K8360
366A4026l1866M8950n5648Q391M6655k7701Q279L533l5124M9168J4775o7490O1280
379C7228m6489J3281N6626q7471K8171J9023l7978M4255j6975o8173Q8106l6796
$$ y = [-38119, 20952, -7961, 435, 33672, -39265, -20457, 43934, -34525, 24506, -12271, -46036, 44136, -4118, -16992, 8438, -23289, 2389, 46276, -39133, 3677, 13550, -16810, 53214, -19006, -14124, 25939, 6247, 16529, 14900, -28534, 16423, 32061, -16790, 21934, -30280, 1952, 29731, -19089, -5579, -16993, -10710, 13957, -2565, -39310, 2239, -16680, 5559, 7700, -46913, 7188, -4934, 4551, 4815, -25093, -8970, 21071, 281, -2399, -3818, -26132, 36479, -6540, -9185, -3347, -24900, 23376, -1238, -21896, -12051, -7553, -4615, 19084, -35508, -14334, 14026, -17840, 31110, -24538, -16147, 30508, 2807, 11086, 14619, -20505, 28663, 43438, -24052, 37228, -9261, 4020, 60646, -26825, 1346, 20369, -17609, 26646, 9671, -58502, 29604, -7192]
391g192k0419N8231r6906N9574L0574o6967L9223q592l6442Q1341l9279m6548
403e3402Q2773o7550M5857K4628q3626O0223J1685l4667M6091l0380l4882R5363
415F2113o0096J636L7298p1110P3589j667n5666L8528p634k1422O1507o2684j6845
428b2453O5949o4421M3484j2981n4988N6499j205l8233L2288k7067j4860P8923
440D0935p1314R108L3501m5814N8973l907n3110M9459J2534l9550O6832o2004
452d357n065Q2395p4438K7589P842n6443N8763Q657p7262O0297k1851l3453Q9169
465F1843r6319Q721O1959o3477M2317J3106p9835P7810J5263p7783R7058o7590
477f927j710J00856j04828K5209M1706p7970P3848N527j10126J07587m5680m2575
$$ y = [-7192, -27611, 30620, -66286, -6712, 23862, -43105, -3882, -12474, -48916, 32425, -6854, -53402, 29371, -38179, 7678, 32306, -51320, 8903, 20588, -14079, 32012, 1632, -33250, 62113, 2017, 3653, 40951, -30159, 43430, 41763, -13903, 24625, 16991, -4431, 57076, -5608, -22453, 43496, -20925, 22559, 9578, -45410, 11089, 9884, -28349, 3939, -23128, -37988, 40935, -30379, -21271, 12230, -33584, 25389, 21482, -31628, 17831, 30365, -9185, 57647, -4357, -9422, 72973, -1465, 26124, 33966, -22477, 36286, 44943, -32319, 27978, 6127, -27326, 61843, -34476, -25755, 36204, -27273, 15044, 28150, -51685, 26125, 41388, -36395, 60663, -6927, -8637, 92219, -12609, 12600, 54306, -23664, 50184, 55711, -54415, 53172, 7492, -35083]
489c5083J00359j26420L6805O8977j01522N5762K464q9253J19350l0951o9232
500f8744J20640r7434L6788P8203j23314P1072L6740p6628R9238l5159q3435J39827
512I7794q6308m258Q8162j35020Q2179L2667j19250Q2092k2724p1446J37061r4728
524a3779l7584J12096j29056P2581L3202j20720J08274Q11p7307J01095p2785
535b3172l5345J38923j11006L0823N6827j15789R4812J617r8328R5654j9601n2069
547c6654J15896j11936j0397J01031j11762P3568J6115r6623R8537j3264p9010
558e4499R4808o1781n993J13383j17567L2277L4917q3511Q0134o889p1139Q6506
570D0646k1361n3147Q2271r6429J6977Q6734r1673M8751P569p9502Q1260j0201
$$ y = [-35083, 65276, -61144, -24339, 44638, -56884, -1122, 1342, -87911, 31439, 488, -68744, 51896, -45538, -8750, 69453, -53861, 17211, 53951, -22677, 76561, 41402, -42033, 97794, 11486, 7228, 95390, -39630, 42549, 75216, -44034, 38058, 15334, -56112, 80949, -13779, -51363, 60733, -68323, 4258, 37460, -83260, 25014, 25825, -51482, 49613, -23172, -58517, 80406, -30600, 223, 57050, -58739, 36073, 37690, -60638, 35016, 15415, -36654, 79242, -32694, -43091, 57940, -53822, 19746, 35861, -60762, 37775, 24511, -54499, 40309, -21472, -27465, 85918, -31649, 628, 35545, -47966, 32168, 25279, -45860, 40646, 19285, -33862, 48409, -48020, -31043, 55691, -35982, 12769, 20338, -59164, 22096, 11895]
582A1895p7253J06784n3781q649R0575j29396M3921M8203p8039Q1639j1670q0478
594e6249J02744m6458n1868J00218r7335M5482P0809j15232N1092J1776p6289
605f1310R9847j9621p7011J24682p8517j2657Q6051j27916P1464N8242j00277
616c7023P8621k0470q9051J29181o9446l7846J14513j14792N5428L9400j26243
627g7728P8429J1542o7407J02589n5856n6826J17724r8482J8489O4556j02651
638f5621Q7725K0152r6708P6100k5322n1110J26463q8985q090R0910j14455O8988
650B0047J1251r7546J02836j0078o0927R0770q5868j0886J03218j08785N3144
661G176K6300q3325Q8008k3770o9862Q2730l2506j9023Q9884j01734J9550N9765
$$ y = [11895, -65358, 41426, -12355, -21004, 69571, -59825, -15904, 32299, -45740, 35899, 24229, -56249, 46495, 37, -51831, 48387, -48948, -3466, 67343, -47889, 3203, 14979, -61310, 38537, 18916, -58095, 66587, -11930, -24587, 61464, -66452, 5012, 63254, -37023, 41598, 21128, -67923, 61258, -8188, -46034, 68479, -46313, 9115, 48515, -77728, 701, 12243, -55164, 47425, -8431, -65257, 52467, -46015, -27526, 37030, -65621, 22104, 42256, -54452, 21648, -3674, -54784, 71679, -17306, -25396, 65514, -48941, 20047, 31298, -66248, 36588, 26510, -34417, 56353, -29515, -40401, 62817, -45968, 7176, 33476, -49849, 38159, 14389, -55473, 27257, -5249, -24272, 65612, -36122, -16572, 43193]
673D3193q8627O6644l671o4328Q7906k3326n9014P9898p0782J3286Q1576j04039
685d1284M9982J4533o3492P1463k4784n2300Q2771l4048k0252O2840q9359L7287
697f643M3732o7233M5743m878m5224O3786k0551n3213P4708m9271J0406N4390
709D5752q9432M0670K2411n0528N2069j4944m7940Q1087l9879k3304N8511p3726
721c9253M8278K8417o6143M0931k086l5704O0060l1824l7463P4765n4303J5263
733I38L0477p4075N0575J6458n0384M3990j7613l8648Q1532n6707j2192N7370
745C1721o9816N3171J1097o7737N3528j513l6724O4159n0058j6493P6074o9501
757b2092K9161J4983n8157O0722j804m8071M5369k1751k0193O7621o7343P302
$$ y = [43193, -45434, 21210, 17539, -46789, 41117, 17791, -41223, 38675, -32107, -18821, 62755, -41284, 8698, 23231, -40261, 31202, 6418, -45882, 36889, 2841, -17411, 45429, -43930, -6643, 37089, -30144, 15599, 10721, -34503, 29283, 8732, -44481, 30227, -19044, -8638, 45752, -43680, -3010, 19401, -31127, 20942, 5998, -41942, 39145, -734, -24038, 34473, -39253, 9025, 37442, -28701, 12230, 10144, -25560, 34500, 2676, -34787, 39978, -14325, 938, 31415, -42660, 7915, 24373, -26011, 17979, 366, -38282, 43250, -13457, -25649, 31721, -38095, 15076, 26173, -41564, 11964, 10451, -26273, 37886, -12172, -28665, 47409, -22092, 7069, 22052, -36105, 24617, 22813, -25258, 20111, -1640, -21833, 45788, -21555, -14253]
769a4253M1012n4429M5502r042m5809N0244n231l0919M6780m7466O661N1854o1356
782b6452L0945k01k7675M7139j6784k9871L7509j8092j361L5319n6823K7025J5699
795A6377k9369K8564k1702j3128L4169j0992k0014K6754l3065K2044J9564m3958
807b4756K6647o389m053K2744j7473j6209L2179j2316j91J6824l8233L1973M909
820A5656j6833J0847j0112r18K1106r064k0130K2735j6703J4923L174k7371J4570
833A880L839k388q54l709j5879K7378p734j2998J0969j7205J8750K489j2962m040
847a2464J1276m040R837m219j9299K6244o935N169k974r592J0059J0205n250q971
861i54P245q648K1375j2010r835O218k842J0730q471o381n834J5563o998J042
$$ y = [-14253, 26759, -27670, 17832, 8790, -37019, 13225, 7994, -22925, 23855, -23611, -16950, 34904, -26452, 4493, 4292, -23383, 23756, 6972, -22899, 14610, -3482, -4843, 30476, -26347, 678, 16377, -12992, 15572, -6130, -19258, 14911, 3919, -16095, 10659, -22406, -362, 19202, -24756, 1891, -4498, -8551, 14193, -3280, -19489, 12690, 374, 183, 17007, -21226, 10747, 15656, -1177, 9670, -442, -1360, 19746, 10682, -9448, 13287, -3416, 11507, 14681, -12690, 1880, 5719, 3331, 2477, -1232, -17111, 10267, 2533, -10465, 504, -16701, 2049, 4538, -8424, -12464, -1188, -5228, 4609, 390, -18909, 7335, 400, 5569, 2595, -6997, 3062, 13267, 8017, -954, 6291, -2357, 19018, 7008, -2827, 3391, 549, 11279, 2808, -3573, -9407, 6156, -842, 200]
875B00q827n144J9041r029L037j0943N499P878L987o892n124R079J247J1645j6777
890a123M298J046P463L184j5287M510l358J2761q021o761m683O546L374m691l705
905d447j2492K1187q397K428m122q080J7536O88n689k601N883l358K1869j8559
919A846n554J8363j4251J7944r337j5925J4039N990j5696J2737j7642o012L3771
932B0273l4422R419J402j7704K7869o763k2356K0198k643p843L0946l8578J2228
945g974K3640k6441K3944j1401j5359K9669l431k1654K5742k5134P979K8785m5375
958a7010K1223N11j5957K7908j6369k1909L4009j5110m914K6575m6265L1193J1576
971A5461l0336K7067j7108p449L4494k0584j5065L1563l2697K3329J1022m4497
$$ y = [200, -8627, -13771, 5270, -3759, -722, -11665, -6166, 1712, 5699, -1193, -6317, 2762, 4009, 15654, -1123, 3175, 4221, 11684, 14868, -419, 4091, 733, 13494, 5473, -1288, -5971, 575, 3949, -742, -4447, -16939, 4248, -4149, -1721, -5843, -13923, 3613, 4301, -1388, -3989, 1894, -1464, 20405, 1846, -3708, 14655, 404, 18348, 9011, -6914, 7125, 13115, -2581, 10156, -7486, -13498, 20273, -14149, -4730, -3328, -21032, 6837, 74, -22282, -2084, -4727, -12570, 18376, -20202, -7974, 15666, -10775, 13169, 1768, -13591, 16078, 12647, -9007, 16735, -8399, -420, 28365, -17010, 4213, 4724, -11233, 16675, 306, -21603, 12406, -2704, -7618, 18957, -27308, 3885, 15461, -14875, 12192, -4916, -12365, 22129, 1545, -13520, 18043, -14654, 8675, 19697, -24800]
983b4800L4797n927j2763K4790k3256j1863M0114k8110N62K2567m4330M0923o3
996A2641l2912L0019j2649q413L5977l1990j0345M0000l9723K6727L656m1499
1008b8511M1760o792k0892K5869k0943r252M5809m0795L878K4236m0744M0420
1020A4043m116l4210L5121n870j7889L7960l7535l703M7505m7932K6434L163l8778
1033b5807M5097j0138k9077L5684k1709o472M5519n5844J5444K3418m0499M2153
1045A7769j2812l1019M3064j3479k1265M1245m3750J3581M2137n8157L3050j924
1057H440l3806N0895j9213k9690M9612l3790j132M1679o8597L7750J8698m5346
1069b4500M7503k4794k7730N4799l1277j4510M8348n4487L0936K4974o5620M6412
$$ y = [-24800, 9997, 4070, -8693, 16097, -7159, -19022, 21092, -7018, -6456, 16111, -28219, 12704, 12641, -20271, 9748, -2901, -11314, 24663, -7327, -17672, 22328, -17395, 9332, 12988, -28511, 13249, 6457, -14435, 11434, -9509, -18761, 27048, -13747, -9869, 14367, -26377, 14043, 9927, -24283, 10838, 4968, -12921, 25039, -12496, -16199, 31306, -16626, 9808, 12971, -25807, 19290, 9152, -19925, 15759, -5950, -12422, 33097, -22747, -7303, 16115, -24384, 17769, 4957, -26062, 17002, 3523, -17742, 23503, -20247, -6666, 35471, -22686, 10364, 8440, -25366, 25529, 6316, -23374, 26238, -7552, -8684, 32995, -35602, 2148, 20846, -24500, 23003, -1791, -29521, 25278, -5999, -20509, 27839, -26648, 4288, 29262, -36358, 10054]
1081A0054o904k6034N2242l1090k3487N4751m5909P939L4863o4148N3021N738
1093B1036m6514M3736k5933j7949N7062m0147o823M5905n7454L6856P122n4235
1105c7338N4237r916k0402M0519l7702j1666N1253m7957J8083K3344n1663N1365
1117B2157j1548l8664M1695j9718p535M8294m8143J183L8255n4853M1291j602
1129A0812l9874N5423j8564k4543L7321l8079K786N0492n5634K5076J3235m7142
1141b8691M9378j9439k9044M7687j9282j1105L9940n4872J2477L7367n2018M1790
1153A4188n233l5110M9075k2240k7532M5202l1817O598M4090o4455K8347J1923
1165A3036m1005M8584j8511k5071M9681k7347j5377L9556n2877K8526L0009n3454
$$ y = [10054, 3150, -22884, 29358, -1732, -25219, 29532, -16377, -8438, 26425, -37723, 15298, 21036, -25478, 18258, -7675, -25624, 31438, -8709, -15532, 30373, -27081, 9775, 16897, -37338, 16899, 6983, -13419, 27100, -10602, -22268, 28985, -18972, -889, 22455, -29208, 22157, 10609, -28055, 13640, -6078, -13613, 34681, -13462, -12279, 25976, -28877, 12414, 10812, -29062, 26361, 7797, -16746, 20575, -17504, -14718, 35774, -19860, 5216, 18451, -28691, 20687, 1248, -27796, 19891, 609, -10496, 29444, -25428, -12951, 24416, -27602, 14188, 8955, -26155, 22920, 680, -26852, 18350, -13467, -6869, 37221, -27234, 1113, 13036, -27969, 20615, 2104, -22967, 26714, -633, -16010, 23546, -29331, -805, 29204, -24250]
1177b4250L9721j2015k7899M6382k5860j9199M9276l7247R879K8224o2766M2012
1189F258O617l3136M4550k5253j8417M7743l7299m622L9105m9707L9671Q943n1309
1202b6856M3277j6644j5463M3071l3606q380M4436m6618J7948J5088n0633N1552
1214A7172o738k9290L6177k7616q530M4140m2171N990L2541m7004M0123o295l9231
1227c0732M5961j5295j1415L5127l6352P57L8926m6712K4419P702l5804M6863
1239B3445j7771k3135L1062k0950r20L3527m1873J2029K3080l8489L3227j2419
1251H13k2431L8411j5270j2391K4983k8784P571K9727m2067K3934K087k3209L4956
1264A8330j9838j5184K9197j5447j835K3849l8584J9382J5334l1650K8379j4365
$$ y = [-24250, 15471, 3456, -24443, 21939, -3921, -23120, 26156, -11091, -1212, 27012, -35754, 6258, 12875, -20261, 24289, -964, -19381, 28362, -8937, -13559, 25546, -24161, 15510, 24453, -26856, 16421, -223, -15686, 27385, -6221, -14601, 29835, -16783, 1165, 16253, -34380, 17172, 10434, -18856, 17321, -10295, -18825, 25315, -16856, -10866, 21675, -25329, 14794, 8499, -30732, 15229, -66, -11481, 23646, -12706, -11949, 26977, -19735, 4684, 12386, -23418, 23445, 5674, -17461, 13601, -7349, -8269, 25258, -16615, -4586, 18494, -19995, 13232, 813, -21618, 16793, 1523, -10868, 14115, -14669, -7098, 22629, -19438, 4496, 6583, -16626, 18330, -1508, -16692, 12505, -2942, -4777, 19072, -19512, -130, 15204, -16446, 11933, -2432]
1276b432j1258L0743j7327j2320K4775k4365J2195J9324m0434K6941l91j7396
1288a1945K6826j8745j0256L0627j8404l577K1114l5165K6105Q046k9629K5222
1300A0219j2042p456K5770j9968r965K6949k4496J2734R114l3842K8293l292j3374
1313a1356J8087j5428n141K6454k0632j628J7176k6303K6426k118k1250K1526
1325E813p787k422J7107j8594j987K3766k2400J3927n07k0223K7362r193p797
1338b935J0565j1082K087J7108k2401M651R127j6841K2034j3201r242J5757o011
1351c84j108P693j5192M802J5849j9871J2156o121o495J8902j0881m665O648l948
1365b615J977R798j8953P955O450r687J2141j2104p61J0070j806m382L685o686
$$ y = [-2432, -13690, 17053, -274, -12594, 12181, -12184, 11, 19335, -21099, 5842, 5451, -11945, 14881, -3864, -14120, 16507, -1897, -5474, 15640, -19525, 6580, 14626, -15003, 10219, -1823, -9279, 16491, -3477, -13442, 13507, -10989, 1745, 10859, -22983, 5310, 2018, -11356, 6731, -8697, -13838, 12616, -8016, -9644, 7532, -18771, 7655, 5537, -15713, 5813, -1974, -4396, 12711, -5883, -7870, 15896, -6504, 7423, 6916, -13307, 14055, 4862, -2935, 7630, -3452, -1365, 15743, -6658, -2007, 7120, -9721, 12313, -888, -10130, 5627, -384, -1492, 6201, -8991, -4189, 11660, -8211, 3945, -2176, -8671, 10231, -650, -5315, 1333, -2615, -638, 9160, -9793, -1838, 4612, -5075, 7066, -5038, -5799, 4271, 2465, -1917, 1768, -4918]
1379d918N202R232j4809P417l116K340O122o321l603M244L299l456M422j1362
$$ y = [-4918, 284, 9516, -5293, 2124, -992, 1348, 7470, 1149, -2454, 1790, 5089, 1633, 6055, -5307]
$$ [...]
8191f
##END NTUPLES=NMR FID
##END=
