##TITLE=1H_Bor ONS
 200.13Hz, DMSO-d6.
 8 sc
 
30.3.2026
##JCAMPDX= 6.0         $$ Bruker NMR JCAMP-DX V2.0
##DATA TYPE= NMR FID
##DATA CLASS= NTUPLES
##ORIGIN= UXNMR, Bruker Analytische Messtechnik GmbH
##OWNER= pz
$$ XWIN-NMR		Version 3.5
$$ Mon Mar 30 15:32:42 2026 Russian Standard Time (UT+4h)  she@DPX200
##.OBSERVE FREQUENCY= 200.1313
##.OBSERVE NUCLEUS= ^1H
##.DELAY= (6, 6)
##.ACQUISITION MODE= SIMULTANEOUS
##.ACQUISITION SCHEME= undefined
##.AVERAGES= 8
##.DIGITISER RES= 18
##SPECTROMETER/DATA SYSTEM= spect
##.PULSE SEQUENCE= zg30
##.SOLVENT NAME= CDCl3
##.SHIFT REFERENCE= (INTERNAL, CDCl3, 0, 14.3821)
##AUDIT TRAIL= $$ (NUMBER, WHEN, WHO, WHERE, WHAT)
$$ ##TITLE= Audit trail, XWIN-NMR		Version 3.5
$$ ##JCAMPDX= 5.01
$$ ##ORIGIN= Bruker BioSpin GmbH
$$ ##OWNER= she
$$ F:/spectra/data/she/nmr/H-C/1/audita.txt
$$ ##AUDIT TRAIL=  $$ (NUMBER, WHEN, WHO, WHERE, WHAT)
(   1,<2026-03-30 15:30:53.96 +0400>,<she>,<DPX200>,
      <created by zg, POWCHK disabled, PULCHK disabled
       configuration hash MD5:
       00 E9 B6 7A A2 85 ED C7 34 08 36 98 17 FE 4E 26
       data hash MD5: 16K
       B0 6A 3B 39 DF 9E C3 E3 AC 77 70 F9 69 77 10 72>)
$$ ##END=
$$ 
$$ hash MD5
$$ 87 0D E0 C0 95 5B 08 E7 53 03 35 78 59 8C 3E 94
##$RELAX= 
##$RELAX= 
##$RELAX= 
##$RELAX= 
##$RELAX= 
##$RELAX= 
$$ Bruker specific parameters
$$ --------------------------
##$DU= <F:/spectra>
##$EXPNO= 1
##$NAME= <H-C>
##$PROCNO= 1
##$TYPE= <nmr>
##$USER= <she>
##$AMP= (0..31)
100 100 100 100 100 100 100 100 100 100 100 100 100 100 100 100 100 100 
100 100 100 100 100 100 100 100 100 100 100 100 100 100 
##$AQSEQ= 0
##$AQ_mod= 1
##$AUNM= <au_zg>
##$AUTOPOS= <>
##$BF1= 200.13
##$BF2= 200.13
##$BF3= 200.13
##$BF4= 200.13
##$BF5= 200.13
##$BF6= 200.13
##$BF7= 200.13
##$BF8= 200.13
##$BYTORDA= 1
##$CFDGTYP= 0
##$CFRGTYP= 5
##$CHEMSTR= <none>
##$CNST= (0..31)
1 1 145 1 1 1 1 1 1 1 1 1 1 1 1 1 1 1 1 1 1 1 1 1 1 1 1 1 1 1 1 1 
##$CPDPRG= <>
##$CPDPRG1= <>
##$CPDPRG2= <>
##$CPDPRG3= <>
##$CPDPRG4= <mlev>
##$CPDPRG5= <mlev>
##$CPDPRG6= <mlev>
##$CPDPRG7= <mlev>
##$CPDPRG8= <mlev>
##$CPDPRGB= <>
##$CPDPRGT= <>
##$D= (0..31)
0 0.7 0 0 0 0 0 0 0 0 0 0.03 0 0 0 0 0 0 0 0 0 0 0 0 0 0 0 0 0 0 0 0 
##$DATE= 1774870253
##$DBL= (0..7)
120 120 120 120 120 120 120 120 
##$DBP= (0..7)
150 150 150 150 150 150 150 150 
##$DBP07= 0
##$DBPNAM0= <>
##$DBPNAM1= <>
##$DBPNAM2= <>
##$DBPNAM3= <>
##$DBPNAM4= <>
##$DBPNAM5= <>
##$DBPNAM6= <>
##$DBPNAM7= <>
##$DBPOAL= (0..7)
0.5 0.5 0.5 0.5 0.5 0.5 0.5 0.5 
##$DBPOFFS= (0..7)
0 0 0 0 0 0 0 0 
##$DE= 6
##$DECBNUC= <off>
##$DECIM= 32
##$DECNUC= <off>
##$DECSTAT= 4
##$DIGMOD= 1
##$DIGTYP= 9
##$DL= (0..7)
0 120 120 120 120 120 120 120 
##$DP= (0..7)
150 150 150 150 150 150 150 150 
##$DP07= 0
##$DPNAME0= <>
##$DPNAME1= <>
##$DPNAME2= <>
##$DPNAME3= <>
##$DPNAME4= <>
##$DPNAME5= <>
##$DPNAME6= <>
##$DPNAME7= <>
##$DPOAL= (0..7)
0.5 0.5 0.5 0.5 0.5 0.5 0.5 0.5 
##$DPOFFS= (0..7)
0 0 0 0 0 0 0 0 
##$DQDMODE= 0
##$DR= 18
##$DS= 0
##$DSLIST= <SSSSSSSSSSSSSSS>
$$ [...]
##$SUBNAM0= <"">
##$SUBNAM1= <"">
##$SUBNAM2= <"">
##$SUBNAM3= <"">
##$SUBNAM4= <"">
##$SUBNAM5= <"">
##$SUBNAM6= <"">
##$SUBNAM7= <"">
##$SUBNAM8= <"">
##$SUBNAM9= <"">
##$SW= 18.0517328524113
##$SWIBOX= (0..15)
0 0 2 0 0 0 0 0 0 0 0 0 0 0 0 0 
##$SW_h= 3612.71676300578
##$TD= 16384
##$TD0= 1
##$TE= 0
##$TE2= 300
##$TE3= 300
##$TEG= 300
##$TL= (0..7)
0 120 120 120 120 120 120 120 
##$TP= (0..7)
150 150 150 150 150 150 150 150 
##$TP07= 0
##$TPNAME0= <>
##$TPNAME1= <>
##$TPNAME2= <>
##$TPNAME3= <>
##$TPNAME4= <>
##$TPNAME5= <>
##$TPNAME6= <>
##$TPNAME7= <>
##$TPOAL= (0..7)
0.5 0.5 0.5 0.5 0.5 0.5 0.5 0.5 
##$TPOFFS= (0..7)
0 0 0 0 0 0 0 0 
##$TUNHIN= 0
##$TUNHOUT= 0
##$TUNXOUT= 0
##$USERA1= <user>
##$USERA2= <user>
##$USERA3= <user>
##$USERA4= <user>
##$USERA5= <user>
##$V9= 5
##$VALIST= <valist>
##$VCLIST= <CCCCCCCCCCCCCCC>
##$VD= 0
##$VDLIST= <DDDDDDDDDDDDDDD>
##$VPLIST= <PPPPPPPPPPPPPPP>
##$VTLIST= <TTTTTTTTTTTTTTT>
##$WBST= 1024
##$WBSW= 4
##$XGAIN= (0..3)
0 0 0 0 
##$XL= 0
##$YL= 0
##$YMAX_a= 209351
##$YMIN_a= -241697
##$ZGOPTNS= <>
##$ZL1= 120
##$ZL2= 120
##$ZL3= 120
##$ZL4= 120
##$ABSF1= 10
##$ABSF2= 0
##$ABSG= 5
##$ABSL= 3
##$ALPHA= 0
##$AQORDER= 0
##$ASSFAC= 0
##$ASSFACI= 0
##$ASSFACX= 0
##$ASSWID= 0
##$AUNMP= <proc_1d>
##$AZFE= 0.1
##$AZFW= 0.1
##$BCFW= 1
##$BC_mod= 2
##$BYTORDP= 1
##$COROFFS= 0
##$CY= -3
##$DATMOD= 1
##$DC= 2
##$DFILT= <>
##$DTYPP= 0
##$F1P= 0
##$F2P= 0
##$FCOR= 0.5
##$FTSIZE= 0
##$FT_mod= 4
##$GAMMA= 1
##$GB= 0.15
##$INTBC= 1
##$INTSCL= 1
##$ISEN= 128
##$LB= 0.25
##$LEV0= 0
##$LPBIN= 0
##$MAXI= 10000
##$MC2= 0
##$MEAN= 0
##$ME_mod= 0
##$MI= 1.114404
##$NCOEF= 0
##$NC_proc= 0
##$NLEV= 6
##$NOISF1= 3.799351
##$NOISF2= 2.8
##$NSP= 1
##$NTH_PI= 0
##$NZP= 0
##$OFFSET= 14.38212
##$PC= 1
##$PHC0= -3712.117
##$PHC1= 12.1923
##$PH_mod= 1
##$PKNL= yes
##$PPARMOD= 0
##$PSCAL= 0
##$PSIGN= 0
##$REVERSE= no
##$SF= 200.129724274929
##$SI= 16384
##$SIGF1= 3
##$SIGF2= 2
##$SINO= 400
##$SIOLD= 16384
##$SREGLST= <1H.CDCl3>
##$SSB= 0
##$STSI= 0
##$STSR= 0
##$SW_p= 3205.1282051282
##$SYMM= 0
##$S_DEV= 0
##$TDeff= 0
##$TDoff= 0
##$TI= <>
##$TILT= no
##$TM1= 0
##$TM2= 0
##$TOPLEV= 0
##$USERP1= <user>
##$USERP2= <user>
##$USERP3= <user>
##$USERP4= <user>
##$USERP5= <user>
##$WDW= 1
##$XDIM= 8192
##$YMAX_p= 0
##$YMIN_p= 0
$$ End of Bruker specific parameters
$$ ---------------------------------
##NTUPLES= NMR FID
##VAR_NAME=  TIME,          FID/REAL,        FID/IMAG
##SYMBOL=    X,             R,               I
##VAR_TYPE=  INDEPENDENT,   DEPENDENT,       DEPENDENT
##VAR_FORM=  AFFN,          ASDF,            ASDF
##VAR_DIM=   8192,          8192,            8192
##UNITS=     SECONDS,       ARBITRARY UNITS, ARBITRARY UNITS
##FACTOR=    0.0002768,     1,               1
##FIRST=     0,             0,               0
##LAST=      2.2672688,     0,               0
##MIN=       0,             -241697,         0
##MAX=       2.2672688,     209351,          0
$$ Real data points
##PAGE= N=1
##DATA TABLE= (X++(R..R)), XYDATA
0 0 0 0 0 0 0 0 0 0 0 0 0 0 0 0 0 0 8 -8 8 -8 8 -8 9 -16 16 -16 23 -24 29 -32 37 -40 47 -53 60 -66 74 -83
38 -83 93 -102 111 -126 139 -152 168 -187 204 -226 250 -273 301 -332 368 -404 448 -497 557 -624
58 -624 703 -800 919 -1071 1268 -1541 1930 -2545 3615 -5835 12217 -68271 -241697 18956
72 18956 156109 14430 2139 35201 -63124 -27120 71496 -24590 -73768 66076 63711 -69372
84 -69372 -25347 104013 68071 -74811 -147174 -60005 93187 101610 -23232 -71929 -24694 29797
96 29797 57954 -7321 -87235 206 84827 -30197 -62916 93619 77455 -87296 -58950 42694
108 42694 36338 59860 32032 -136949 -109977 126546 106992 -95239 -64515 54481 13652
119 13652 -24724 953 -17928 -11218 21581 -24608 -30902 71258 78033 -45961 -95227 -14936
131 -14936 85918 92818 -28219 -107240 -9031 79481 15301 -41342 -14921 4409 16031 12310
143 12310 -33436 -14752 49182 -18984 -104044 2524 114938 42386 -51544 -57090 -27198 49409
155 49409 85389 -27694 -92455 25025 81434 -14292 -43151 14965 16492 -11445 -14945 -9012
167 -9012 29848 47346 -41638 -102378 -5993 92461 50903 -40202 -65812 -7903 61560 32016
179 32016 -52885 -38587 37404 32681 -11451 -7249 14315 16717 -8964 -49779 -16574 79203 59214
192 59214 -68569 -86156 13902 56974 21931 -21767 -42704 1330 60096 14338 -62654 -26867
204 -26867 34441 1588 -30196 17287 58163 28594 -35509 -64841 -11644 61599 38626 -46460
216 -46460 -54813 21360 64978 19476 -47787 -41865 20458 29521 -19959 -23198 20784 20240 -20601
229 -20601 -29727 6714 50693 38914 -41342 -75805 6437 71909 15783 -51156 -24934 31663
241 31663 40719 5364 -32848 -26538 11446 9846 -23670 -6225 44426 30702 -36063 -51349 8753
254 8753 54235 16821 -46897 -41442 24003 52636 10120 -40060 -30198 19815 32038 -9649 -24353
267 -24353 14665 23712 -21803 -34483 12929 42678 13423 -35448 -42310 10800 56392 17371
279 17371 -49985 -34887 31913 37940 -11548 -31120 -4943 17720 8203 -10890 -2524 23446 14414
292 14414 -31635 -42339 10685 51659 16592 -39894 -29108 28243 40057 -8526 -41536 -19292
304 -19292 19605 26529 161 -15554 4985 17562 -14184 -33520 6541 40664 8159 -35455
316 -35455 -22741 21240 36151 2775 -38213 -27445 25435 38616 -7607 -32790 -2669 20026
328 20026 1580 -14527 1146 19327 5899 -23668 -24638 12317 36909 7974 -34232 -22819
340 -22819 26547 35156 -11086 -39003 -10434 24731 20117 -3412 -7633 4932 6586 -11863 -22590
353 -22590 336 26372 9253 -26418 -16589 26645 31089 -11657 -38570 -16646 19458 24728 -978
366 -978 -17824 -928 20153 7383 -15802 -6518 15302 3806 -21530 -12416 19686 25079 -2991
379 -2991 -27318 -15505 18238 25397 -9069 -32963 -8856 21556 12314 -10880 -8257 8729 10222
392 10222 -4064 -8668 6275 15831 -1875 -23237 -10741 21235 27320 -2185 -25639 -8582 20811
405 20811 13245 -18260 -22833 -1143 9210 3643 -1905 -522 6418 5801 -12314 -16296 11668 21309
419 21309 -9890 -23822 3884 25516 18263 -310 -14978 -9027 13546 10190 -17826 -17418 7491
432 7491 8341 -4886 -459 9629 5860 -9387 -22776 -14276 11709 16497 -5790 -12827 6518 22127
446 22127 16012 -7028 -20445 -3059 14309 1137 -7495 9358 11854 -4108 -4845 -163 -2387
459 -2387 1926 -4901 -26178 -11727 25345 15142 -17055 -10263 6189 2921 2446 -309 -9953 1602
473 1602 18268 4699 -4600 11056 8537 -11478 -10888 1906 9963 12533 -3662 -20218 -3372
486 -3372 13066 -4563 -16962 -6448 -1623 4329 12059 -1970 -10964 6515 4729 -15033 597
499 597 21781 4457 -7558 3429 4170 6603 15220 -4108 -20765 1353 12198 -8518 -10916
512 -10916 -94 -3369 2384 9728 -5098 -7340 3446 -12291 -21765 7486 19087 2982 5748
525 5748 8953 -3605 5615 12298 -16351 -18837 14403 14337 -3738 7392 7732 -12141 -7221 373
539 373 -10838 -3300 8299 -9687 -14135 7906 8114 -2921 691 -2562 -2565 14910 7443 -15543 -2984
554 -2984 10989 -3334 2810 20182 2257 -8026 6907 -5567 -18857 6317 8323 -20398 -7173
567 -7173 18133 914 -8529 4674 -6570 -12778 9185 6880 -11893 27 9808 -2190 3452
580 3452 14586 5147 217 675 -10285 -5325 8351 -3811 -9101 9017 7283 -2840 6819 -2453
594 -2453 -24578 -6648 10273 -9304 -4733 19651 2812 -13061 9240 10040 -11138 -125 8184
607 8184 -9164 -1372 16918 1376 -9482 5072 5411 -2546 2671 -2812 -12334 -4264 -565 -4293
621 -4293 6640 9868 -4781 -3585 2439 -8135 -5435 6721 -3318 -4714 17394 11996 -8779
634 -8779 -1265 2197 -13398 -1380 16555 800 -4852 9823 -1870 -16118 887 4886 -10102
647 -10102 -1049 11543 1771 -1599 2476 -8498 -10252 3654 5422 2425 6981 1600 -5087 2155
661 2155 1545 -5268 2730 5161 -5909 -922 7792 -3717 -7898 4234 1531 -2889 7348 3068
675 3068 -12346 -6066 2501 -3290 2175 12071 1884 -3835 3546 -2084 -9635 -459 2064 -3135 5834
690 5834 11827 373 -4836 -2185 -6527 -4930 4780 3702 -523 2414 62 -4072 489 891 -4253
705 -4253 288 4317 -693 369 3028 -4198 -5268 3634 3919 -103 2578 137 -6007 -963 3806
720 3806 34 588 2402 -2500 -2834 2261 -640 -3049 2717 3199 -412 2380 1290 -6629 -5989 802
736 802 1759 3601 6921 2445 -4101 -3225 -3104 -3873 -162 2258 2017 4436 4395 -1030 -3703 -3687 -4495 -926
754 -926 4855 4220 557 181 -1876 -3306 339 1886 -370 560 1268 -1120 -830 0 -2042 -1179 3617
771 3617 3496 759 416 -2484 -6008 -2096 2874 2920 2902 2768 -1048 -3523 -2115 -1840 -2060 932 3266
788 3266 3694 3267 15 -4117 -4824 -2758 348 4213 5470 2388 -817 -1978 -3351 -3206 -702 99
804 99 855 3561 3207 -303 -2014 -3042 -4516 -1488 2947 3018 1401 1624 -128 -2047 532 1574 -970
821 -970 -752 1182 615 100 1017 203 -1333 -362 565 -538 -1541 -1818 -2579 -1360 1289 2439 1871 72
839 72 -2036 -1545 -185 338 991 2519 2564 1978 2335 187 -2777 -1998 -685 -517 1512 3717 918 -2577
857 -2577 -2202 -2134 -3024 -1437 274 -1396 -1 2936 1739 -1093 207 668 -995 128 2058 716
873 716 181 1876 2060 1784 2726 584 -3639 -4272 -3015 -2011 -619 800 1497 1554 1060 -1943 -4080 -3947
891 -3947 -3442 -1084 3238 5710 5176 4389 959 -2780 -2056 267 -686 -124 3156 3237 1130 675 -1722
908 -1722 -5348 -3371 -703 -2295 -1147 1815 -843 -3290 -232 992 -258 1761 1852 -508 1142 3679
924 3679 627 -692 2662 2801 1002 1893 794 -2388 -1711 -1359 -2876 -1054 1146 -1433 -3035 -1302
940 -1302 -1864 -1585 432 -591 -950 2872 3168 -1028 408 2287 192 1684 4752 2040 598 2866
956 2866 -739 -4675 -590 980 -3760 -2040 2168 -780 -1679 179 -3664 -5461 -297 874 -1894
971 -1894 1839 4289 1400 1874 2648 -189 127 1869 -1132 -849 4537 3039 -837 617 -475 -3963
987 -3963 -1555 -1000 -5472 -2234 3474 -768 -2533 2540 -20 -4755 -293 1290 -1176 3008 5810
1002 5810 -176 -103 5024 889 -2950 885 814 -885 2751 1480 -3243 -657 162 -4926 -3271 1375
1018 1375 -1648 -2210 1973 -630 -1903 3638 1018 -4554 1223 4589 -1267 243 4863 548 -265
1033 -265 4285 326 -3976 1598 712 -5358 -1070 3169 -1598 -1074 1531 -2800 -2793 915 -2745 -4631
1049 -4631 2685 2934 -355 3518 3588 -2089 104 2145 -3676 -1404 5518 1046 -1930 4488 2511 -3986
1065 -3986 -1333 -990 -5458 -908 4015 -1463 -1636 3771 102 -3793 -364 -473 -2268 2212 2448 -560
1081 -560 2845 3538 -2939 -1749 2167 -1384 -580 3811 -352 -2371 3328 340 -5881 -531 2707 -3408
1097 -3408 -1303 4006 -1124 -2650 2979 -573 -4235 2730 3431 -2901 -208 3603 -604 -618 2443 -1094
1113 -1094 -1510 2446 -532 -2965 1208 569 -1779 1422 1279 -1827 693 665 -4696 -1561 3690 -503
1129 -503 -1205 4222 1579 -3046 1178 415 -5046 -136 4479 -1079 -539 4932 373 -3698 242 -554
1145 -554 -3375 856 2299 -1461 994 3464 -1241 -2233 258 -1353 -1379 1854 202 -649 2944 1150
1161 1150 -2540 293 1209 -2658 -991 2087 -670 157 3594 -478 -2817 1336 427 -3505 -41 2712
1177 2712 -757 625 2833 -928 -2206 683 -1079 -2750 1234 2251 -8 735 826 -1472 -675 197
1193 197 -2152 -629 2331 545 -330 1674 -126 -1752 491 -76 -1794 839 1712 -1544 -348 2204
1209 2204 -27 -797 1195 -464 -1911 496 314 -1860 542 2764 356 -32 1260 -1192 -2481 -487
1225 -487 -653 -444 2443 2285 161 337 -231 -2273 -1965 -393 -430 1444 2962 1036 -461 337 -1413
1242 -1413 -2816 -71 1112 163 1676 2069 -876 -1087 -105 -1662 -1549 953 1171 77 1279 717 -1637
1259 -1637 -837 148 -1072 -180 1507 315 -129 1281 461 -625 123 -8 -968 163 621 -516 68
1276 68 749 86 -5 194 -1291 -1347 -341 -892 -705 1283 1307 -90 334 616 -1311 -733 255 -26 459 1807
1296 1807 1251 177 626 -234 -1216 -706 2 -826 -85 465 -462 -562 238 -535 -1242 -166 -26 -538 215
1315 215 359 -118 540 1178 40 258 805 -215 -78 1268 797 295 771 -94 -1758 -1164 -617 -1335 -176
1334 -176 1122 404 -353 -392 -1673 -2362 -845 77 977 2758 2708 1115 619 -454 -1925 -1462 341 780
1352 780 1287 2707 1616 -696 -1095 -1671 -3083 -2102 -313 -256 20 1035 310 -463 224 -267 -742 -56
1370 -56 364 27 885 1766 993 1518 1991 693 -306 -395 -1526 -2204 -653 28 -185 863 1005 -1034 -1706
1389 -1706 -1204 -2320 -1958 497 1155 929 2185 1898 99 -150 320 -454 183 1411 911 544 734 74
1407 74 -1113 -609 -793 -1238 -530 29 -951 -846 -332 -1242 -860 421 126 -193 1437 1203 402 1115 1323
1426 1323 -376 -57 871 184 8 1467 927 -455 -136 -396 -1967 -1731 -888 -1439 -671 950 415 -232
1444 -232 219 -582 -1087 -179 322 -42 1676 2221 930 924 1447 -310 -686 243 -33 -577 599 -18 -1262
1463 -1262 -373 232 -1160 -1122 -110 -642 -779 85 -346 -618 806 952 -97 936 1528 17 28 685
1481 685 -102 180 1166 136 -837 175 182 -1803 -693 500 -610 -400 -39 -1383 -1329 20 -419 -920
1499 -920 1052 2121 827 660 295 -941 -833 44 -446 373 2394 2049 298 487 -557 -2226 -1745
1516 -1745 -1374 -1360 573 2171 496 -233 970 -170 -1982 -1115 -594 -635 1147 2040 480 839 1774 67
1534 67 -1727 -326 -384 -756 43 404 -69 1116 1083 -1169 -1224 67 -912 -1461 -132 -123 470 1439 422 -883
1554 -883 735 1167 -1187 -935 640 158 119 1112 -290 -631 1270 336 -2033 -608 1095 -343 -618
1571 -618 252 59 114 434 -712 -1096 1019 885 -467 -256 692 285 137 -565 -1465 290 1749 -140
1589 -140 -863 1278 780 -1138 -973 -1111 -1403 857 1551 -649 115 2507 191 -2414 -806 -135 -565
1606 -565 454 733 -159 1337 1943 -1281 -2358 -151 453 -804 -74 552 786 1676 -320 -2117 -170
1623 -170 876 -657 -1301 236 822 600 548 -1032 -1014 1246 555 -1960 -674 1403 384 -710 -54
1640 -54 -327 358 1247 -816 -1848 878 1684 -664 -1184 783 878 515 -324 -1503 -452 1563 -95 -1605
1658 -1605 401 1695 346 -606 -1097 -809 788 526 -1382 -599 2293 1413 -1112 -992 110 132 149 -662
1676 -662 -1272 1478 2350 -923 -1801 -4 691 -148 -725 -635 678 1904 361 -1900 -755 1327 188
1693 188 -1268 -515 876 1344 561 -1619 -1346 1434 1007 -1704 -1006 1444 1466 -21 -1155 -1519 343
1710 343 1226 -1008 -1972 1310 2937 431 -1136 -781 144 442 -610 -2007 -139 2852 1222 -1348
1726 -1348 -468 917 501 -1181 -2264 -1131 1568 1478 -1031 -902 1792 1860 -970 -1959 -585 654 1253
1743 1253 -561 -1449 1623 2965 103 -2044 -441 629 30 -1387 -1784 231 2686 737 -1816 -934
1759 -934 1550 107 -2014 -1880 250 2089 1749 -804 -746 1770 1606 -1528 -2015 76 1818 1143 -717
1776 -717 -1100 622 1483 -1428 -3017 -743 1720 806 -806 -1200 641 1523 -417 -2874 -1030 2168
1792 2168 1900 -667 -520 1526 1925 31 -2103 -1742 1227 1669 -1152 -1289 1021 1917 -223 -2284 -1901
1809 -1901 397 1162 -1279 -2336 607 3190 1121 -1362 -745 975 1544 -647 -2238 -312 2814 1690
1825 1690 -1202 -750 1592 1637 -1022 -2995 -1815 938 1149 -1710 -1886 1564 2386 -451 -2148 -1264 976
1842 976 1135 -962 -1842 1215 3491 1090 -1450 -221 1687 1361 -991 -2152 -256 1994 688 -2115
1858 -2115 -1382 1771 1789 -1201 -2287 -709 1061 431 -2354 -2019 1697 2997 294 -1175 541 2109
1874 2109 819 -1913 -2661 393 2706 682 -1606 346 2731 923 -2366 -2925 -1138 926 92 -1987
1890 -1987 -424 3111 2608 -1156 -2209 -208 1338 71 -1886 -763 2766 3530 -54 -1701 342
1905 342 1896 -189 -2553 -2087 749 2295 -449 -2217 -105 2108 325 -2502 -2292 463 1664 -32
1921 -32 -1701 -326 2785 2355 -1553 -1947 979 1728 -200 -1855 -467 1923 2072 -990 -2667 38
1937 38 1840 -376 -2475 -1151 1468 2008 -874 -2508 -450 2017 668 -2098 -531 2259 2368 -74
1953 -74 -1978 -585 1761 997 -2112 -1550 1944 2767 -338 -2014 -746 1002 341 -2234 -2338 1046 2967
1970 2967 800 -2163 -435 1876 928 -1661 -2234 333 2592 1155 -1648 -413 2480 1729 -1540 -2317
1986 -2317 -258 1604 615 -1950 -1472 1616 2395 -738 -2453 -310 1740 568 -1882 -1743 1001 2427
2002 2427 -133 -2019 -58 2401 782 -2029 -1828 619 1975 141 -1761 -658 2387 1304 -1740
2017 -1740 -1932 685 1804 -101 -2013 -1187 1463 1997 -979 -2087 708 2425 506 -1961 -1081 1059
2033 1059 1395 -648 -1922 308 2508 1171 -1667 -1542 1046 1243 -1028 -2198 -453 2318 1832 -948
2049 -948 -1310 1182 1780 -767 -2605 -1008 1504 1674 -358 -1305 1110 2357 -122 -2574 -1092 1317
2065 1317 1309 -688 -1333 552 2162 850 -2141 -1661 1470 1396 -1226 -1587 336 1903 641 -1638 -1287
2082 -1287 1197 1661 -617 -1844 168 1670 713 -1153 -1481 558 1823 87 -2095 -271 1922 653
2098 653 -1420 -1410 402 1514 280 -1628 -1017 1539 1386 -1078 -1745 482 1469 -275 -1601 -1100 1010
2115 1010 1768 -362 -1576 330 1867 105 -1737 -1183 702 1410 -190 -1384 203 1953 533 -2098
2131 -2098 -1636 535 1085 -111 -1113 8 1696 1215 -1435 -2082 348 1389 -342 -1135 299 1500
2147 1500 1010 -904 -1924 -339 1330 147 -1331 -164 1710 1371 -490 -1499 -564 922 171 -1540
2163 -1540 -848 1580 1632 -263 -992 -339 664 155 -1390 -1569 1099 1848 -36 -1076 109 1105 -87
2180 -87 -1469 -1516 58 1455 259 -1052 198 1710 856 -1184 -1345 -254 690 221 -842 -240 1674
2197 1674 1622 -715 -1290 -351 406 -557 -1101 -747 1066 1819 -149 -1133 58 907 -353 -1249 -728 850
2215 850 1206 672 -748 187 1488 426 -1257 -832 465 833 31 -653 -663 905 539 -1064 -1098 371
2233 371 878 -78 -865 -250 338 734 -270 -761 695 1565 222 -1025 -200 565 320 -389 -842 -119 1271
2252 1271 632 -1098 -767 360 319 -726 -1094 -83 866 646 -536 -683 606 1020 -392 -652 -188 797
2270 797 564 -218 -619 437 1196 -148 -1109 -292 437 40 -701 -842 96 556 46 -881 -489 787 473
2289 473 -399 -461 236 916 604 -377 -344 581 775 -246 -567 385 837 278 -448 -706 -115 -23 -707 -1240 -32
2310 -32 922 459 -210 -442 -316 36 -559 -1007 -369 1270 1277 227 141 585 203 -435 -1157 -1053 282 920
2330 920 173 -194 751 591 -345 -1237 -1212 -555 59 5 -348 666 1545 509 -647 -494 50 -20 -134 -384
2350 -384 69 1308 985 -7 -136 357 -102 -908 -931 -496 -12 400 -312 -284 546 349 -167 -569 -505 -162 224
2371 224 19 119 589 1229 561 -440 -303 143 -321 -478 -376 -14 330 404 -560 -418 294 149 -518 -589
2391 -589 -65 75 -3 -199 -513 216 746 45 -203 187 471 158 -356 -486 -66 493 223 -209 98 657
2411 657 -84 -529 -575 -464 -227 116 -50 22 679 643 -178 -362 -49 -101 -223 -9 -46 450 746 288 -282 79
2433 79 8 -606 -439 -241 -159 302 211 -268 -70 255 5 -553 9 106 62 51 -88 -271 252 451 -11 -237
2455 -237 138 88 -283 -219 -141 9 215 30 -203 -27 364 -225 -153 198 164 111 161 -97 -317 -41 -255 -18
2477 -18 185 501 372 98 -187 -392 -206 -221 -257 -20 519 616 36 -170 -135 -429 -488 -161 -154 264 731 441 9
2500 9 218 98 -427 -626 -129 92 455 508 203 196 168 -128 -451 -139 -182 33 331 355 75 331 72 -221 -404
2523 -404 -136 84 57 79 253 163 204 -222 -185 -443 69 51 -8 -132 38 48 -25 -226 -162 -42 49 -120 -141 262
2547 262 53 -57 42 -198 -46 -121 -182 50 144 62 22 -30 -113 -246 -432 -388 -282 -265 168 325 90 159 66 -422
2571 -422 -384 -302 -51 214 331 548 334 274 -122 -495 -605 -128 -121 252 372 256 366 66 -178 -619 -357 -165
2593 -165 9 70 295 260 119 -146 -210 -384 -167 -162 73 32 132 347 77 15 -271 -66 -153 -105 -88 167 161 108
2617 108 103 95 155 -15 153 -33 -179 2 -48 69 220 52 -81 -221 129 -117 -65 227 2 -56 207 30 -194
2640 -194 -76 121 18 -17 155 65 16 14 -93 -226 -48 180 -262 -4 184 31 -194 -2 -17 -5 93 -66 -131
2663 -131 97 88 -27 40 -109 -251 6 219 -183 -57 -12 -5 77 132 -359 -402 -156 228 26 376 405 178 70
2686 70 -100 -327 -271 -45 199 307 607 368 151 6 -320 -304 -351 9 -47 258 529 -68 -131 -171 -407 -610
2708 -610 -235 212 176 258 665 167 103 183 -14 -191 -2 -209 -83 152 402 95 -1 62 -322 -500 -154 -322
2730 -322 -378 10 -34 138 265 279 -147 -33 -260 -411 79 390 145 529 418 139 -216 -230 -39 -86 16 414
2752 414 83 163 105 -256 -317 -408 -239 -229 174 23 145 241 -100 -229 -145 97 -70 161 534 96 328 353 -15
2775 -15 -230 -157 -139 -188 169 108 -110 -16 175 -270 -230 -238 -370 -184 166 243 -25 331 334 13 -111 49 -99 106
2799 106 202 -96 -38 140 -7 -88 -189 -80 -332 -201 -245 -33 -237 -22 -26 -26 268 -73 -149 39 -233 40 -205
2822 -205 167 348 74 229 -159 16 27 -39 -178 -22 -12 -52 -36 -168 -317 93 -6 88 -27 336 -149 -148 -44
2845 -44 -125 124 170 328 -43 500 104 62 -113 3 -281 -139 458 206 255 220 -34 -406 -364 -503 -531 199 386
2868 386 239 322 268 112 -202 -360 -122 -229 329 409 113 267 474 -106 -308 -161 -109 -219 12 -26 111 63
2890 63 48 141 -31 -85 -265 -257 -60 34 69 139 214 78 39 -146 -271 -108 239 -52 -52 279 -52 -19 88 -307 -143
2915 -143 110 174 -263 -2 272 167 -243 -139 -68 -152 108 125 208 220 176 61 -117 -95 -316 -187 0 109 363
2938 363 241 74 87 3 -12 -231 -133 50 153 344 171 -92 -118 -10 -194 -312 31 -160 69 215 369 37
2960 37 -276 -71 -341 -183 -81 46 154 301 -124 4 148 -297 -24 -26 -58 26 27 158 9 -193 61 -162
2982 -162 -10 -53 -26 -85 -92 143 -3 -18 101 -107 1 29 -21 10 88 181 73 231 51 -296 -183 -71 -110 93
3006 93 344 114 46 43 -34 -248 -193 -22 31 145 199 195 4 81 -237 -151 -316 -240 9 273 27 12 68 -118 -483
3031 -483 -175 -32 81 158 391 391 34 225 -84 -241 3 -43 149 273 292 172 23 -44 -266 -135 70 -81
3053 -81 -95 149 131 -34 15 184 -165 -238 105 -21 81 276 34 -80 -47 -350 -188 -32 -64 24 12 125 -51
3076 -51 81 -1 -73 41 -50 -304 -25 141 150 73 -113 11 -173 -201 -40 -222 214 61 178 79 -129 -18 -239
3099 -239 -384 -57 61 12 196 79 113 -28 -69 -305 -313 90 171 214 247 364 567 73 26 -229 -72 38 -52
3122 -52 126 119 23 107 -358 -98 -102 -202 -163 -186 211 324 -73 57 -9 -143 -239 50 139 311 245 112 -3 -183
3146 -183 -24 -300 -103 0 -48 82 134 -155 -62 -74 -212 -82 -219 -86 99 138 172 72 50 59 181 132 -28
3169 -28 72 56 101 113 104 -101 -27 -242 -223 7 -153 -107 -28 85 -230 -81 -61 -129 8 -159 -85 116 183 137 115
3194 115 292 76 -216 -13 -174 56 79 362 137 9 -326 -102 -464 -104 -123 40 232 307 280 43 26 127
3216 127 -66 -78 38 129 431 121 170 169 -178 -61 -293 28 -7 -171 -60 84 -59 -3 -127 -498 -25 -23 198
3239 198 305 365 200 104 168 73 -242 32 31 -41 421 27 142 -193 48 5 -279 -190 -313 -18 -54 14 -33 3
3263 3 120 -254 44 56 -123 -15 250 96 185 207 87 -226 11 24 -296 -80 312 -146 -5 137 185 -213
3285 -213 -248 -444 -195 34 -11 98 250 113 116 -210 48 142 -26 248 137 212 105 -35 -166 -124 -11 -84 110
3308 110 306 -92 -26 20 -27 -156 -116 -199 -59 112 39 153 -21 141 -183 -195 8 -125 99 277 327 77 -84
3331 -84 -130 -316 -235 -231 -251 55 -40 117 173 -143 -110 -352 -165 -138 -395 108 277 122 103 39 220 -250 -67 111
3355 111 64 62 14 251 189 392 -9 -223 -15 -80 118 186 120 -131 250 154 -99 -100 -213 -375 159 174 -158 107
3379 107 -44 -208 -102 54 -238 64 -89 -30 128 64 57 -129 -285 -86 -280 -165 88 33 104 -22 -18 -150 -207
3402 -207 -266 -130 21 169 55 331 -10 -292 -138 -122 -139 -162 172 305 -60 229 127 -157 -121 -331 -73 -57
3424 -57 92 118 128 93 31 -138 116 -5 -189 -351 98 -3 -100 112 78 -48 -60 16 36 49 -87 85 58 172
3448 172 1 -48 -128 -80 -150 -70 47 107 177 346 -123 -115 -139 -153 -57 85 -96 147 304 64 42 -202 34 -152
3472 -152 -336 -118 151 227 103 44 -170 -82 -70 -415 -303 -92 176 171 148 62 86 -89 -227 -219 330 174 9 131
3496 131 71 14 7 -102 -125 -174 22 13 -36 56 190 -9 185 -158 -176 177 -77 -174 106 -65 303 20 -216 -110
3520 -110 -93 92 -121 -162 230 168 35 134 27 326 49 43 19 -22 152 199 -85 -68 96 86 9 -19 -99 86 47
3545 47 -169 -55 171 -20 -260 -150 -125 168 -52 153 -41 68 -28 -204 -168 -146 -11 139 127 63 88 -49 -146
3568 -146 -344 -46 -171 92 -212 135 286 -87 -63 -259 -207 118 14 127 109 272 140 103 -40 -139 48 131
3590 131 248 -64 341 239 1 -263 -48 5 32 -328 -73 34 215 122 -249 -49 -80 -78 -173 -271 141 401 110
3613 110 209 -82 37 -8 -362 -248 49 198 210 58 104 52 -13 -169 -385 -307 -25 -13 -100 286 309 352 84 -314
3637 -314 -403 9 -71 -119 104 461 410 112 37 -301 -120 145 -303 -135 -73 397 425 40 -368 -300 -121 -236 -463
3660 -463 -77 319 223 208 56 96 -41 -56 99 -111 291 185 -25 -93 -46 157 -166 -249 173 -51 178 -134
3682 -134 -364 -95 49 139 -147 -197 217 132 -92 -56 -86 438 58 -75 -42 -7 167 -76 16 -80 -155 0 -385
3705 -385 -360 -144 -2 -116 -192 -15 135 164 -68 -266 -144 145 -30 9 92 562 358 -183 -62 -106 -42 -172
3727 -172 -400 -180 233 183 -60 -64 -89 20 -249 -300 -280 161 311 65 -5 49 47 24 -277 -117 -81 246 257 -140
3751 -140 116 442 32 -166 -344 54 223 -20 -335 -79 232 -126 -361 -298 91 431 110 55 -155 -71 341
3772 341 -156 -261 13 164 83 10 100 246 -4 -38 -273 -4 223 172 -292 143 271 358 -232 -71 -33 -96 131
3795 131 -342 -329 295 365 111 78 -284 -133 -242 -88 -394 -48 322 82 1 248 396 -67 -530 -492 -176 404
3817 404 66 98 77 231 138 -121 -326 -278 88 116 -132 -77 363 299 18 -343 2 278 -135 11 -75 246 248
3840 248 -123 -494 -15 173 -18 -131 184 130 290 -83 -489 -283 207 -35 -109 -139 333 275 26 -291 -309 121
3862 121 26 -101 -173 95 439 64 -256 -304 -243 -41 95 -401 -46 172 -159 -78 -10 92 145 -163 -317 -113
3884 -113 230 179 -91 205 295 236 -104 -310 -393 9 1 -104 -13 286 274 10 -236 -133 74 -131 12 -247 -49
3907 -49 358 114 -171 -83 20 134 -41 -70 -7 521 182 -85 67 83 221 -141 -181 54 203 218 -170 -392
3929 -392 205 388 -108 -175 166 99 8 -254 -250 -41 257 -354 -187 -63 183 180 -55 -92 -61 168 65 -281 -350
3952 -350 353 81 -170 -114 317 346 206 -328 -251 171 322 -43 -225 -134 -67 -146 -258 -67 -110 297 317 -256 137
3975 137 217 39 -232 -166 14 160 242 -224 -92 131 194 -162 -145 -126 120 -136 -97 -102 330 286 -35 -313 116
3998 116 109 -214 -390 11 266 317 243 -36 44 -104 -188 -457 -240 91 310 148 40 273 145 36 -327 -428
4020 -428 15 239 -128 94 207 288 -129 -183 -361 -32 198 -203 -56 48 309 299 -112 -85 41 85 47 -360
4042 -360 -44 392 175 -95 -115 -128 -157 111 -273 30 92 106 -127 -170 29 224 -48 -425 -110 185 323 33
4064 33 -89 124 25 82 -177 -30 -26 368 354 -28 -33 237 108 -298 -252 95 307 201 -261 70 512 118 -83
4087 -83 -322 -151 33 -11 86 83 336 263 58 -75 -176 41 3 -155 -40 12 189 149 -292 -144 121 4 -135
4110 -135 -60 209 113 -88 -254 10 280 263 123 -207 188 191 -11 -258 -62 133 -6 -51 -21 114 125 -91 -240
4133 -240 -323 67 -100 -114 68 111 151 -45 -57 -353 193 30 -73 -81 26 326 70 -150 -82 68 32 -218 -487
4156 -487 -16 -96 185 58 144 292 257 -68 -417 -462 -144 19 -126 62 363 302 183 -93 -267 -275 -79 -210
4178 -210 -156 274 355 -11 -7 -80 -90 -288 -341 24 4 375 371 177 -88 54 -20 -380 -253 86 122 193 -264 91
4202 91 70 0 -98 11 -277 49 -71 -300 65 -10 -23 -78 -143 -31 139 263 28 -67 99 147 -111 -127 -104 46
4226 46 56 -203 -22 40 247 -53 -270 -279 -186 128 -221 58 117 75 -70 -145 -314 -100 -30 -91 41 51 89 332
4250 332 -4 38 130 -69 -111 -192 -89 252 328 85 86 -32 90 67 -161 -98 -58 202 -130 -19 177 120 -86 -442
4274 -442 38 -81 150 -114 41 90 33 -30 -219 -103 -63 -16 151 -79 -58 42 0 10 -227 31 -34 130 137 -17
4298 -17 -88 -82 -296 -94 -101 79 -94 6 21 209 100 109 -97 -344 15 -46 -149 101 -77 16 157 170 68 74 -160
4323 -160 -329 -86 -1 108 3 38 155 14 237 -253 -229 -101 177 154 90 205 34 -143 -50 -5 -239 -54
4345 -54 28 117 94 280 -101 -41 -72 -69 -158 -104 47 -65 242 -45 -104 -43 -140 -125 26 33 -29 164 150 95 -192 -28
4371 -28 94 30 88 212 100 226 113 -127 -123 -201 80 -3 -6 271 126 143 12 -132 -115 -44 -62 26 123 178 78
4396 78 30 -98 0 -311 -87 -233 131 303 141 39 57 300 -204 -289 84 -179 11 119 -32 247 263 -24
4418 -24 71 -154 -251 -147 104 -61 -34 237 -19 26 34 -115 -253 -13 -15 -19 -19 58 98 -170 -137 -147 -332 -159 -102 100
4444 100 204 207 -52 0 -124 -332 -114 -45 17 -82 130 -95 75 65 -14 -175 -335 119 259 -84 129 -11 32
4467 32 89 -232 -229 -17 103 26 92 68 -187 -110 58 39 -108 -117 89 -122 -105 -92 -130 -38 -108 163 90 72 -84 -207
4493 -207 64 31 42 92 -71 77 -236 168 -107 -164 -178 -113 62 50 45 63 -15 112 117 -181 206 -41 132 -9
4517 -9 -4 25 32 -76 20 34 -15 -242 -49 -117 -201 -115 25 29 -90 219 44 105 78 -64 -150 -291 -47 123 146 330
4543 330 -121 -126 -104 -168 -111 4 -146 127 237 382 56 15 75 -61 -238 -116 43 -9 22 135 180 82 160 57
4567 57 76 80 -29 225 271 123 -85 -163 -63 -262 -71 7 172 60 73 -41 -105 174 -2 -90 -125 -184 51 170
4591 170 274 -43 157 -111 54 -125 181 5 53 85 206 -111 -214 -270 -84 -177 -268 -328 -114 -109 135 45 43 -143
4615 -143 -83 -364 -169 -51 148 202 195 295 77 -23 -176 -283 -318 -113 -70 -63 122 211 138 -35 -124 -52 -246 -113
4639 -113 -43 124 -88 105 -44 139 93 -18 42 -41 42 18 -182 -23 -118 -37 -211 90 47 -112 -348 -119 -173
4662 -173 -200 -85 13 331 -4 41 232 5 -134 77 -158 -31 235 17 3 3 305 -3 218 20 -24 -67 -209
4685 -209 -36 6 -31 54 211 154 115 -82 13 9 -163 -11 261 210 128 138 -114 -160 -40 -38 -59 -183 103 131 168 245
4711 245 115 119 -177 42 69 168 38 89 185 81 -36 -68 -148 49 -130 -106 -54 118 -81 19 31 -197 -81 -175
4735 -175 37 131 110 80 -243 -1 -92 -102 -86 -98 -40 119 81 90 -26 -151 -25 0 46 85 71 272 70 173 22
4760 22 -61 -96 -58 42 -37 -82 52 42 14 28 140 -95 -239 -121 -18 -25 18 13 1 6 -90 -70 -64 -185 37 131 124 193
4788 193 234 -232 63 -179 -125 -168 217 -30 22 131 8 54 -52 -31 -159 -58 33 64 -7 167 -12 -150 -30
4811 -30 -3 -16 -107 -19 44 181 -29 -47 -142 -46 -321 -236 70 151 54 -58 339 -115 -62 -238 -58 73 14 28 218
4836 218 72 138 30 -23 -27 -3 -49 32 -16 31 168 38 -27 -57 -12 -12 -93 219 -3 -224 103 25 -22 -111 11 129
4862 129 24 56 -22 -15 333 197 239 83 -191 -18 -214 70 -129 190 210 10 -77 -46 -87 -79 303 279 43 283
4886 283 44 -2 200 25 52 -101 39 122 140 -77 -237 25 -61 -310 -44 -49 120 97 -67 -4 -85 111 -110
4909 -110 -106 -2 153 46 87 -158 -2 -195 196 158 -204 -66 236 210 36 60 -91 89 -150 -38 24 -22 75
4932 75 -93 43 44 38 -66 -47 -72 -192 -123 70 -73 78 110 -87 -198 -113 -211 -30 -11 65 -127 -60 126 -83 -99
4957 -99 75 -59 211 18 384 44 95 32 -237 -34 169 105 9 54 203 232 0 -8 -41 -216 -185 -123 64 -140
4981 -140 -69 290 -49 -53 -18 -215 -188 -150 98 62 36 218 102 122 13 -199 -40 -225 -175 114 103 22 59 173
5005 173 125 41 -289 13 -81 -116 199 91 181 -58 44 -101 50 -45 -88 -85 9 88 56 12 60 -268 51 -175 -47
5030 -47 63 -85 -47 -188 11 -57 76 20 -98 35 26 282 148 6 126 -168 43 -86 20 49 83 15 52
5053 52 -21 175 162 9 -34 -7 283 55 50 142 35 31 69 -99 164 170 68 45 115 128 -35 27 -114 283 -335 -15
5079 -15 64 -52 -35 30 -176 -106 21 114 181 -52 171 183 53 118 -137 -48 211 -43 244 -187 116 203 -64 -109
5103 -109 167 -39 -200 -142 -42 -42 -361 18 -26 -114 -184 -151 -25 -68 -28 122 -106 -26 46 -206 20 -318 -254 -31
5127 -31 93 243 42 182 41 27 -44 -108 -70 63 -14 155 131 -127 124 -165 -161 -176 -49 -142 71 137 164 -6
5151 -6 32 -122 -232 40 41 94 153 134 110 -51 -244 -218 -190 26 -16 79 62 197 -159 -53 89 -113 -98 -3 -22 55
5177 55 -115 -67 -91 214 -84 -74 191 -282 -17 313 -67 147 66 -179 -186 -156 197 85 -85 195 40 -106 79
5200 79 32 119 -29 -60 -120 -89 -151 -44 -216 -161 -44 87 99 35 276 140 20 -21 58 -65 60 -93 -106 50
5224 50 -88 48 150 29 96 -43 23 -140 -128 79 -60 24 79 60 -101 -76 -32 -224 -199 -98 37 58 64 11 -107
5249 -107 -211 -179 -168 115 -49 148 -77 31 288 19 35 -82 -152 118 50 173 143 195 123 146 43 2 -51 -91
5273 -91 -126 80 30 124 5 -185 -71 -40 -191 -79 -6 49 181 -36 69 -252 64 -138 2 -16 -61 127 58
5296 58 13 45 -91 79 -110 62 -11 122 193 198 285 112 93 -19 -33 68 -102 178 50 -10 -167 97 51 -88
5320 -88 -166 -95 -61 -139 280 149 -143 -211 -129 2 -105 60 -45 45 -13 65 111 -60 -47 -89 -68 -8 58 92 274 172
5346 172 55 -191 69 -40 26 199 -128 156 94 181 -146 -127 -11 -278 -29 36 75 -40 61 -20 182 -71
5368 -71 81 -37 7 32 98 -184 -71 27 -183 -190 -237 -39 -119 -85 188 266 -118 181 -48 42 -111 -76 -123 -219 -77
5393 -77 -21 39 46 116 57 147 -210 -83 -102 17 -45 32 97 227 -147 29 -116 -42 167 -51 280 23 0 56 -1
5418 -1 -38 -179 193 105 -75 -7 110 118 51 -395 35 69 -1 24 158 114 21 -175 -178 106 28 59 128 83 -46 171
5444 171 99 33 -225 -179 -142 -129 -190 -125 33 207 183 -34 -173 -239 23 90 -38 258 64 -243 -55 94 94 -179
5468 -179 49 2 -52 -15 -26 -21 83 -61 -113 -93 -153 -116 -74 213 2 45 252 -21 -196 -11 -19 -16 -275 130 -28
5493 -28 182 -124 -225 -144 -264 -53 121 218 -50 -65 80 -69 -96 -22 -121 -68 224 11 -45 68 -5 -23 5 47
5517 47 -100 236 155 90 278 77 -255 -70 -226 -78 -32 113 282 -88 46 -37 -82 -138 -314 -215 -80 -100 80
5540 80 222 71 -209 28 -56 73 -45 82 0 172 -31 -65 85 -56 -51 -86 -71 35 84 306 243 -6 84 -94
5564 -94 -156 -64 -32 87 66 85 -59 87 140 -23 125 -87 -84 -100 -64 74 150 137 62 -166 84 -117 -21 206 167
5589 167 28 132 -20 -95 73 10 -124 89 34 159 -179 -9 -14 -113 -80 -41 57 -6 90 74 -29 -123 -150 -217 189
5614 189 136 -156 159 118 -42 93 -39 45 49 -44 214 -147 124 -25 -13 -89 -5 153 -137 -323 -61 -167 -180
5637 -180 43 161 181 158 60 -252 -150 -316 107 80 117 -225 -6 -192 17 45 -29 77 -111 78 10 112 -147
5660 -147 61 -299 87 62 41 -114 -180 105 -101 -21 89 -270 216 51 -21 158 -81 168 114 4 -103 -245
5682 -245 20 74 -72 26 301 -84 -79 46 -25 14 -62 147 -4 98 117 111 185 -2 -93 -112 -233 -42 47 97 106 130
5708 130 -10 107 -13 -128 -8 -76 106 159 187 134 64 17 -293 -125 34 -97 -104 81 65 -82 28 155 -73
5731 -73 12 58 -76 -13 58 -54 119 -154 -160 -28 -20 -55 -31 149 24 217 30 -18 153 52 -16 -103 235 30 -201
5756 -201 88 -75 172 -20 -134 -328 -8 -51 34 201 217 121 -59 -43 37 86 25 -141 -99 177 -107 -59 -64 144
5780 144 -43 20 -5 112 -33 -71 151 124 -304 40 -68 22 -18 -57 14 117 1 122 -2 83 -107 72 45
5803 45 182 127 -145 -33 116 31 -131 -108 26 -150 -24 -163 114 160 27 -2 -39 -165 7 -109 -122 -118 -116 107
5827 107 -189 -80 -74 -102 150 171 -178 15 26 53 -184 0 -51 -3 74 -86 5 -97 -112 -52 -236 -56 83 -45
5851 -45 19 32 45 66 38 -107 46 -31 26 65 -66 266 -103 -165 -68 -16 76 -8 -132 29 86 83 224 35 -164 -95
5877 -95 -193 -87 -247 -111 172 109 -172 45 100 -22 -142 -102 -147 207 -6 -14 19 -103 142 -282 -296 187 106 86
5901 86 -53 219 228 190 -136 108 117 19 103 -4 -51 91 153 102 -226 27 120 -179 -160 130 27 83 181 -89 141
5926 141 87 -220 -179 81 6 -35 -83 53 -73 92 233 -13 77 72 59 269 -61 -6 51 140 -38 -300 -99 -55
5950 -55 167 226 91 92 103 -127 88 20 291 -15 0 87 32 -28 -188 -29 -217 157 -4 -2 -112 118 57 -108
5974 -108 -22 -159 89 37 -61 6 181 69 208 -45 -201 73 -100 -191 -81 156 158 -96 -16 -21 90 134 12 -219
5998 -219 -105 25 186 32 -106 -202 40 -262 -119 17 194 164 161 -87 -234 -28 41 -162 164 287 22 -81
6020 -81 -39 170 112 57 -171 -27 -36 -73 122 109 -58 -4 -201 20 -204 -163 111 62 64 62 -145 -65 -58 -59 -67 -142 82 -9
6048 -9 -34 28 196 -54 -83 -213 -56 129 86 20 -118 -166 -98 -284 60 -43 -112 -228 -61 34 87 -133 -142 -55 -84
6073 -84 -263 -59 12 -207 144 -31 73 191 118 40 -23 -396 -135 -63 77 -43 203 198 32 -30 -87 -25 -223 155
6097 155 -95 77 104 27 53 190 199 128 -193 -36 52 -13 99 -6 -8 -162 -14 22 54 35 175 85 51 -101 117
6122 117 46 191 -117 99 -6 117 194 -28 19 -119 142 118 -2 115 216 -54 -46 168 104 11 45 -23 88
6145 88 -106 -63 -49 178 -148 -99 -254 3 -6 -136 182 -261 171 137 81 -13 -102 119 -21 -35 -56 -13 200 100
6169 100 -121 -174 -100 23 -54 96 18 -117 177 199 55 81 54 -37 -56 -67 63 -42 -21 82 -49 66 205 38
6193 38 158 136 -47 -50 -28 -110 -12 -8 35 -67 113 13 67 44 -122 27 80 -66 209 -51 123 140 203 -12 -53
6218 -53 -236 20 8 -55 106 163 93 21 -86 -20 31 -91 -44 -64 117 5 73 173 -77 59 -243 -33 15 166
6242 166 -90 148 276 236 30 -245 13 -112 34 -86 -1 103 100 59 51 153 -2 -46 -99 -252 36 -202 209
6265 209 -85 -117 -28 -176 -104 -94 148 98 38 161 168 -25 -33 41 27 38 -33 181 39 144 1 89 25 -268 -205 -58
6291 -58 102 -12 258 230 8 -102 -76 -66 -109 91 211 -97 114 74 62 -11 -16 -87 31 -16 108 55 18 50 -69
6316 -69 -177 163 152 21 76 -49 -54 8 14 -57 -46 -211 73 103 -198 -106 73 -20 -68 136 -24 -95 53 48 176 4
6342 4 -73 159 -67 -56 14 7 -48 -47 5 58 8 28 -131 231 -26 -56 -153 0 87 17 107 74 -109 -220 -167 -57 -138
6369 -138 177 175 -95 -204 110 36 -133 -17 -126 -108 175 -102 -60 76 213 -139 -26 -251 157 -79 28 28
6391 28 141 159 256 -9 -115 100 -152 7 83 138 -66 -1 -99 -233 -97 100 -298 22 197 41 -107 -32 -14
6414 -14 116 30 -46 94 171 -73 66 -40 -197 -60 43 -132 -93 35 -97 64 -116 -114 -104 -10 -146 -70 142
6437 142 178 -176 145 -101 -172 -71 58 86 -79 93 -52 59 -20 56 -177 -39 -230 -22 -181 -157 29 -23
6459 -23 125 -185 -40 84 66 -60 -132 -72 81 -63 169 90 58 -19 0 -125 -10 -187 -96 106 -54 253 -80
6482 -80 -1 -229 -255 -134 88 -40 178 91 232 26 101 102 -49 -46 -66 285 98 -77 -143 -112 -174 63 130 -29 19
6507 19 -145 -33 149 8 -136 -181 -189 -13 132 90 304 332 143 -119 -162 -142 -221 31 -13 4 130 -25 148 72
6531 72 40 24 -115 -74 -97 78 -54 -204 -58 -44 -206 -146 -47 -26 23 -12 80 -79 30 163 -75 -139 -26 141
6555 141 -313 -128 -25 103 52 -127 5 21 7 -109 -50 157 -106 159 164 -57 -24 -114 -174 -20 -69 154 -205
6578 -205 113 -132 -26 -54 11 -86 141 74 256 97 -5 -193 -104 -106 31 -15 -45 -45 84 159 150 -23 41 -57 -80 -66
6604 -66 -34 30 -64 102 56 -11 148 82 -50 214 74 121 -73 28 -137 -71 201 32 -111 -91 -22 211 124 169
6628 169 -12 56 78 -122 -149 147 -16 103 64 110 93 -39 -145 -44 -54 107 128 -51 -84 178 112 -112 -149 -91
6652 -91 68 51 106 87 18 250 190 -181 -194 -188 -54 75 109 187 -18 -54 -27 -113 -69 -211 -53 -84 210 197 80 3
6678 3 -7 -14 -58 72 30 70 4 -97 22 -72 0 40 69 -263 61 -2 -45 75 -116 106 42 38 -165 -51 88 -25
6704 -25 16 38 -66 141 -65 89 -70 127 21 -107 -80 162 -101 -1 -158 38 122 -80 51 -86 -27 128
6726 128 15 40 -112 20 -126 -387 49 140 -154 -93 40 76 -180 -155 101 159 -134 -43 -184 108 172 10 -86
6749 -86 -122 -112 -24 187 12 156 -42 -276 -178 -53 -55 187 150 -3 158 5 -256 -275 -25 -244 26 -46 126
6772 126 9 25 -11 -73 -1 156 -82 -43 -19 180 -40 74 -135 143 -114 -15 112 -33 201 60 77 -175 -48
6795 -48 -74 -107 -141 45 -136 63 27 146 83 -230 -95 -96 89 151 -180 -123 190 115 -147 -78 67 69 -131 15 -192
6820 -192 125 93 161 14 -223 5 53 -134 -146 2 99 66 -99 7 6 64 -302 -219 -37 138 20 -146 -40
6843 -40 -69 6 -221 -206 -35 100 121 119 59 89 -106 -41 -58 -135 -95 -5 75 153 163 4 -36 80 -79 183 152 30
6869 30 -120 -22 -301 -83 -237 27 -40 100 7 12 -4 169 -303 9 184 -319 -158 71 26 153 -146 69 -113
6892 -113 15 14 99 -33 12 8 -75 62 40 93 -49 -83 28 -35 -84 -218 -43 -41 -150 146 -115 -45 107 -47 31
6917 31 85 -2 177 -189 -39 -7 -133 51 -2 -53 -24 -117 426 16 -94 -229 -71 166 6 98 8 -27 153 45
6941 45 150 -252 -121 -93 86 20 283 -2 28 -51 18 -180 -275 -111 88 -62 112 178 84 -142 33 -3 30 -97
6965 -97 -81 158 -9 -59 44 27 126 96 -69 3 8 -42 -2 -23 -266 146 127 -46 -46 0 -87 39 102 -28 122 106
6991 106 87 28 87 -36 71 103 -145 53 -49 -11 146 129 -196 -79 39 16 47 195 79 -14 -9 35 -6 -21 -14
7016 -14 195 -142 21 140 218 -187 -149 59 -49 -54 72 229 -4 -150 -80 115 35 -99 9 154 -7 130
7038 130 -93 -59 -164 -195 -177 -140 190 64 -157 157 -12 128 136 -22 -28 27 1 96 -123 92 65 -53 -79 -176 141
7063 141 -214 36 140 -51 19 115 -56 19 -35 58 -79 63 145 -136 82 -95 107 -94 86 41 105 271 64
7086 64 196 78 5 -35 65 -120 -46 286 31 -103 282 -142 -66 190 131 -47 2 199 110 -36 -122 -8 -14 -111
7110 -111 -92 65 -88 18 276 -172 88 87 -55 -81 -158 -24 38 -127 96 101 108 56 -256 -100 -187 51 40 120 -50
7135 -50 7 121 -72 29 36 -182 -83 78 54 -162 -82 29 150 -52 -8 -189 -62 50 -90 27 -165 22 120
7158 120 -104 95 41 -225 -54 -117 26 -88 -76 -228 8 -55 -160 151 98 114 -52 -152 -95 -84 -181 136 63
7181 63 86 -128 11 50 -65 -70 55 14 -75 116 180 110 71 -91 -87 -46 56 76 -49 60 -9 -150 -143 -71 9 -6 -257
7208 -257 -126 43 333 -11 -144 123 119 -27 -121 -112 32 72 20 99 29 -98 47 -47 51 -18 -41 59 63 -33 108
7233 108 -154 1 32 20 -21 42 73 71 161 120 99 -13 56 -2 -62 -164 35 195 6 51 23 147 -24 -69 7 34
7259 34 29 -44 103 77 270 91 104 61 -252 125 -103 49 -68 -117 -154 1 -40 -9 -93 238 113 -178 222 48
7283 48 47 -117 50 169 44 12 176 89 -300 -128 54 -140 -85 38 -174 73 54 -22 24 50 15 -46 -168 -6
7307 -6 -54 21 4 148 110 -288 -50 -69 152 117 327 230 215 27 32 149 45 -151 28 -158 -51 -72 56 29 87
7332 87 -59 -113 -60 76 -50 45 43 -174 17 28 -213 -3 -133 -149 -66 -221 -67 166 -4 163 -216 -59 231
7355 231 -195 44 16 -20 273 5 -84 -132 -110 -101 115 -54 -247 28 161 -4 -117 110 54 49 14 207 16 77
7379 77 23 -111 17 -193 66 123 -106 90 -200 -85 -80 -81 224 -104 -63 -123 5 -6 -150 101 53 45 -20 18 125
7404 125 83 33 36 -4 -11 6 -130 56 16 48 153 -137 -56 -4 -113 -62 117 66 -9 -67 50 -46 25 -14 160 49
7430 49 -155 166 -84 -152 -26 177 -277 120 62 35 -102 85 -228 -214 55 87 19 88 19 -91 211 -72 -97
7453 -97 -20 -107 40 74 38 21 97 -103 -91 -147 -185 26 81 85 16 -128 -137 -66 -65 -33 227 12 53 99 -158 -100 111 92
7481 92 -276 -51 44 -290 75 -24 21 -245 -188 16 39 23 164 4 123 -24 -102 -14 -133 -114 15 -143 -40
7504 -40 -74 -29 3 139 -177 -102 -7 -9 101 28 70 -166 102 110 83 -143 -79 -78 -216 -36 -62 -55 122 -61 0 -114 5
7531 5 -72 -55 -88 128 99 1 -154 -148 -23 33 17 -31 121 -14 114 -55 212 -258 141 65 -60 72 -181 -80
7555 -80 -173 -18 66 35 -34 47 -75 -234 132 -4 -112 60 24 -108 -32 76 -35 -2 -72 -34 -26 8 173 57 -39
7580 -39 -15 149 -66 -118 61 6 185 -154 -97 -114 12 -152 0 256 109 22 -48 135 -44 53 90 72 -141 -97
7604 -97 71 93 -52 -122 -179 109 -124 -143 94 -75 99 -90 149 -119 -158 -25 101 -95 95 -68 -17 -23 -20 234
7628 234 -89 13 -14 11 -246 29 79 48 -7 -57 -46 9 -129 -48 39 -10 -33 -56 149 -36 -182 202 99 55 -22
7653 -22 103 -95 98 -149 138 139 184 43 32 108 -11 -40 75 -16 -31 -214 114 -30 -67 74 92 18 -91 -58
7677 -58 -54 -135 -98 -10 101 -53 -2 149 -169 -122 94 84 -171 -221 5 -12 21 82 17 -147 -110 -126 114 195 -33 138
7703 138 -190 -106 30 -134 -116 68 70 -100 118 -46 -35 28 -25 -242 102 78 46 7 -165 -48 59 91 -110 -330
7727 -330 17 -114 15 33 -88 -124 -45 194 -240 12 -75 111 -70 -97 10 -42 -35 -57 -14 -217 70 47 205 -169
7751 -169 -59 8 -58 19 82 -306 180 -139 241 40 47 150 -66 37 13 170 -93 126 16 165 14 117
7773 117 71 14 -222 -1 63 59 137 -30 149 68 50 -52 109 167 1 93 47 119 40 -6 -219 -4 -72 0 -45 68
7799 68 96 122 -48 216 0 -30 -215 -40 -112 -66 19 44 132 -126 -32 43 32 -41 222 154 18 -169 -223 -143 -116 236
7825 236 -114 -54 68 -2 2 10 196 184 137 162 3 -70 12 -36 -35 -69 308 -55 -90 174 -71 -125 43 -51 56 -67
7851 -67 181 87 -134 -139 110 -10 256 -139 -51 11 -12 2 164 -214 107 17 -145 -78 113 268 67 -48 -287
7874 -287 -112 -48 -56 -118 -80 -60 162 149 1 -206 -126 42 -89 -63 161 -77 -198 -182 -60 20 -55 86 -97 -161
7898 -161 225 137 190 74 78 -139 133 15 -95 -104 20 -21 68 57 133 -13 -167 -42 69 44 199 -42 -19 36
7922 36 -108 -119 -113 -96 -23 -11 74 10 32 168 -188 83 53 176 -18 41 -62 75 70 -83 -57 -50 4 19 -137 159
7948 159 -17 -109 -270 -34 -146 18 25 -29 -72 246 -247 57 -95 -79 -17 -26 231 197 36 -41 -5 -87 -23 -43 -294
7973 -294 -71 22 -52 111 21 45 35 48 13 175 125 180 300 21 112 -87 -121 10 71 -67 71 132 53 -207 81
7998 81 144 -97 -47 3 134 -80 3 41 -18 -201 -58 9 -105 -147 89 -99 74 -182 3 54 63 -205 -76 133
8022 133 -26 28 62 10 -10 -45 -123 70 -91 107 89 156 -21 217 33 -26 47 14 254 -81 -118 36 137 61
8046 61 -173 101 74 -63 162 -1 -88 31 6 -4 -88 -14 246 34 115 39 -27 -5 142 -35 47 -79 32 128
8070 128 -12 -278 -192 -50 80 20 -15 99 9 28 5 90 -17 -8 140 123 37 137 37 -91 -149 -86 -8 5 63
8095 63 23 -18 -40 52 -123 41 31 -13 -140 211 194 -99 181 -117 78 161 -132 -114 140 -90 -104 -185 276 -89
8119 -89 57 -18 -63 221 -84 111 -5 -73 -170 10 -18 111 134 149 148 29 -59 -89 -74 18 -51 -12 -150 64 -155
8144 -155 -100 -80 -127 -151 -166 68 -7 -184 105 266 -294 62 11 -87 -152 -58 -145 -115 51 108 -14 114 87 -347 -333
8169 -333 -97 43 -78 19 34 120 286 -232 74 -88 -41 -117 -36 94 128 6 -151 -2 39 -87 222 -36
8191c6
$$ Imaginary data points
##PAGE= N=2
##DATA TABLE= (X++(I..I)), XYDATA
0 0 0 0 0 0 0 0 0 0 0 0 0 -8 8 -8 8 -9 16 -16 24 -25 32 -40 48 -56 64 -74 87 -99 114 -132 152 -174 197
33 197 -223 250 -282 318 -355 399 -447 496 -550 610 -676 746 -827 913 -1004 1108 -1219 1345
51 1345 -1482 1634 -1802 1991 -2202 2444 -2725 3046 -3426 3883 -4441 5141 -6055 7299 -9096
66 -9096 11939 -17123 29639 -127120 -35592 209351 -19008 -60324 29076 -7029 -29003 80719
78 80719 -3902 -90746 19804 62431 -68201 -26632 113446 76345 -74531 -98181 11774
89 11774 123060 67779 -82131 -111178 -12990 48244 53931 -2451 -67913 -1909 81020 -29443
101 -29443 -95654 46257 61645 -97320 -58555 92617 72294 21380 3784 -103077 -78640
112 -78640 135416 116094 -111664 -86753 79190 42231 -37714 -4333 -1996 -16518 12297 -12590
124 -12590 -32693 42274 45470 -71025 -91804 21434 101518 64865 -52063 -101996 10159
135 10159 99297 15762 -59532 -12794 25577 20054 13666 -17013 -13335 38601 -7066 -84628 5889
148 5889 106798 10137 -96644 -56580 12717 59441 65065 -36194 -94495 22135 86412 -21583
160 -21583 -62751 18472 34803 -4929 -2855 11153 25444 25932 -42753 -81257 18814 102260
172 102260 28254 -71899 -65120 10659 62161 20718 -59135 -37922 45479 36335 -25560 -22249
184 -22249 8308 6587 -11268 -25192 8312 77812 45913 -75898 -78284 38023 68740 -409
196 -409 -42982 -33707 14492 59395 14055 -60901 -25248 41855 5144 -40487 2566 40391 3965
209 3965 -43105 -37185 24934 75160 28566 -61764 -58739 24812 55029 -298 -50783 -21158 46926
222 46926 47512 -15931 -32414 6936 5042 -34225 -28146 20240 51545 26934 -39921 -56365 21740
235 21740 68774 -4904 -72586 -25595 44586 42057 -2267 -29285 -13535 21406 15528 -22199
247 -22199 -12956 29689 15131 -40764 -36504 30178 58916 4604 -55374 -35513 31582 45685
259 45685 -7885 -46397 -18486 33598 35663 -12887 -30385 7900 20195 -19448 -26526 22334
271 22334 42791 -171 -42486 -31337 21387 49819 3712 -53368 -24152 45430 40149 -21819
283 -21819 -38939 -2335 20138 6040 -11096 -998 20910 10570 -27326 -29355 19858 44329
295 44329 -1515 -49938 -23642 37922 40694 -14313 -39747 -6170 28789 20559 -13158 -25082
307 -25082 -49 17484 -5231 -19714 15696 38793 -3023 -44812 -20887 26631 30325 -6368
319 -6368 -33743 -11034 35839 34583 -19903 -42294 -3304 24965 5068 -11670 5724 20037
331 20037 1494 -25385 -19833 14029 28138 -3300 -34174 -11176 36563 32959 -19877 -42635
343 -42635 -6119 28076 14375 -12747 -10558 8688 11998 -4124 -12359 5013 20207 -1629 -31524
356 -31524 -14170 29562 28734 -15149 -32638 -1485 28178 16739 -16988 -28574 -5002 18727
368 18727 8588 -11523 -1085 19712 6140 -20374 -10938 18234 16476 -12876 -25295 -1808
380 -1808 29313 26072 -11757 -31535 -3621 23446 6479 -20535 -13928 7808 9443 -4469 -6393
393 -6393 7403 12682 -5427 -21460 -5613 22108 18989 -11979 -25376 812 29858 17906 -14759
406 -14759 -16378 7714 12701 -2945 -11924 -7422 937 3649 -5344 -5694 15920 18672 -16864 -32164
420 -32164 -1693 18911 5036 -10316 -8891 6610 26014 18293 -13739 -17620 5904 5919 -10225
433 -10225 -3624 12637 10096 -2379 -9377 -2538 11956 5083 -22318 -26546 175 17729 10073
446 10073 -6947 -11590 5946 18408 -737 -16617 -561 8223 -3781 -108 13430 11163 7372
459 7372 272 -17647 -9727 19876 8238 -25358 -14069 12966 8108 -2152 -4138 -12134 -5900
472 -5900 9487 -613 -10958 6619 11296 -7193 -5265 10683 12406 6179 -5365 -14098 4188
485 4188 22741 4274 -13567 -2196 3240 -1697 -168 -8948 -15944 3496 9926 -8907 -1730 15923
499 15923 -5001 -23098 -6085 5073 5793 15094 6251 -8102 10488 20526 -7334 -17352 -963
512 -963 767 2364 12370 2780 -4457 5200 -6032 -21041 -39 10496 -11435 -11980 3254 -1127
526 -1127 4181 14794 -7061 -14840 15254 15209 -11925 -4091 8174 -5282 759 16603 5951 1590
540 1590 8794 -9204 -20049 1186 4732 -10020 -4839 1513 -267 10446 4880 -18909 -10243 9448
554 9448 -3201 -5060 14208 3550 -9172 9398 9062 -6837 10634 15951 -15400 -11739 15950
567 15950 -82 -16357 2462 3095 -6490 10913 9811 -15879 -11801 1959 -9638 -7760 9454
580 9454 5426 272 6791 1681 786 9973 -2096 -13854 3362 8914 -2879 5918 7983 -10070
594 -10070 550 16996 -7083 -17533 4938 -4339 -21091 4399 17147 -4269 -472 11263
606 11263 -7348 -10250 7633 -3205 -14202 6869 15883 4967 6277 3624 -9119 -4713 1779
619 1779 -4080 1771 8380 -4079 -4936 5328 -3390 -7434 3578 -3252 -9536 9366 9209 -12597
633 -12597 -5177 7734 -4925 -635 16687 1319 -10911 5490 3364 -11215 3992 12761 -5464
646 -5464 -4426 9045 -1561 -9434 -322 -2970 -4842 8384 8412 -3110 -3078 -4863 -10180 -313 6500
661 6500 1289 6017 9700 -3441 -5375 3302 -5444 -10658 4895 8764 1519 7808 5481 -11289
675 -11289 -8810 2606 -3226 -2967 7888 1529 -5290 4107 3035 -6671 -525 3660 -4054 -3 7478
690 7478 -1661 -6405 1772 1783 251 6206 3114 -5600 -3656 -1193 -3368 1997 5027 -719 170 3712
706 3712 -2424 -4476 375 -2650 -3609 6047 6683 -1266 -1436 -1722 -6207 -1231 5672 2468 579 2754
722 2754 -1697 -3999 656 -1244 -4054 1804 4884 655 1781 2060 -5300 -5503 1801 2012 329 2729
738 2729 397 -3866 -499 2210 362 597 983 -1828 -1189 227 -2554 -2451 1821 2567 3103 4619 123
755 123 -5762 -5372 -3074 -1073 4306 6567 2686 544 -404 -4010 -4927 -1852 -1238 807 6163 5682 334
772 334 -1787 -3802 -5757 -1818 4104 3641 1858 1991 -981 -3221 -1677 -830 -1584 716 2874 2184 1049
789 1049 -1169 -3584 -3146 -121 1909 2749 2589 -690 -2494 -925 -105 504 1748 1288 -432 -10 286
806 286 -2380 -2044 -80 375 1916 3363 329 -3712 -3510 -2797 -2044 2061 4641 1955 199 737 -879
823 -879 -2606 -1336 62 293 3017 4479 2008 -224 -1949 -3097 -2422 228 1238 844 0 -763 -805
840 -805 -515 -1436 -2298 -1052 -445 198 1878 1639 120 401 1844 492 -174 1188 -495 -1850 1061
857 1061 3562 2077 869 -39 -3468 -4843 -1894 -1498 -2271 1120 3366 1413 -133 -462 -3114 -4716
873 -4716 -1620 1551 2969 5396 4982 1336 -621 -49 -969 -1635 -869 78 1389 2155 566 -1373 -1624
890 -1624 -2408 -2962 -1612 -722 -1824 -1057 -601 -937 1664 4333 1954 -286 887 394 -1342 129 1958
907 1958 1077 3280 5227 1151 -1953 -1482 -3715 -6079 -1867 1506 333 734 633 -2743 -2959 -547
923 -547 -2494 -2974 2210 4387 2339 2506 2235 -760 -204 1654 737 1934 3935 1083 -1863 -883 -1348
940 -1348 -2645 -1525 -1738 -2419 1095 1351 -3018 -3116 -491 -2119 -1947 2102 1424 342 4012 3158 -799
957 -799 2210 3838 -1437 -1849 2585 1153 -568 1947 301 -3046 -214 207 -5199 -3896 -601 -2400
973 -2400 -1789 1709 569 246 1836 -1013 -2037 2491 2582 -984 1974 4178 1268 2443 3264 -2375
989 -2375 -2449 2415 -1174 -4422 1196 1285 -4185 -1235 1318 -3559 -2471 739 -3641 -3266 3990 2806
1005 2806 -1516 2468 3341 -603 1127 1612 -1865 851 4626 282 -217 3713 -649 -4639 -1512 -2161
1021 -2161 -3777 1604 2064 -3925 -85 3688 -3602 -5062 1046 -678 -1698 5137 4100 -713 3322
1036 3322 3581 -3878 -2017 3228 -684 -1486 3333 1424 -697 2109 -1469 -6174 -876 481 -3887
1051 -3887 -676 3016 -1405 -43 3417 -2010 -2821 3428 250 -3971 3246 5010 -1333 1076 3667
1066 3667 -1769 -834 3218 -2136 -4306 2340 1210 -3443 420 1647 -2170 -470 245 -3560 -1075
1081 -1075 2200 -2146 -1345 4307 1621 -1246 2494 -395 -3554 2523 2714 -3267 1036 5724 -1431
1096 -1431 -2980 2494 -1688 -4872 1853 1572 -2950 2622 4093 -4100 -3707 1727 -1561 -2165 2809 1776
1112 1776 335 3270 716 -3385 -437 539 -2227 847 3143 145 1346 2184 -3359 -2967 2219 -1301
1128 -1301 -3933 2527 2694 -1931 1258 2306 -3600 -1580 3258 -1918 -3044 3403 1776 -2583 1712
1143 1712 2817 -1816 -305 1290 -2763 -1471 2568 -37 -1538 2061 1155 -1201 289 -797 -2751
1158 -2751 713 1506 -1804 1065 3259 -1046 -1633 1305 -1500 -1921 2337 278 -2355 2361 2893 -2669
1174 -2669 -986 2032 -1510 -1698 1851 -62 -1382 2197 1279 -1900 403 1044 -2211 -1349 848 -92
1190 -92 874 2262 -264 -770 558 -1414 -2882 28 695 -216 2299 2383 -720 -58 294 -3186 -2683 1536
1208 1536 1249 140 2876 1548 -1710 -719 -560 -3299 -831 2411 716 290 2362 365 -1922 -510
1224 -510 -610 -1627 704 1246 -346 266 1280 -791 -1109 176 -756 -455 1043 -486 -1106 680 528
1241 528 -1044 723 1518 -582 -293 369 -1048 -852 1598 900 -114 1283 722 -1633 -959 -404 -1106
1258 -1106 307 2024 601 -101 773 -1506 -2570 -521 199 -77 1379 1903 439 -99 -160 -1581 -1199
1275 -1199 222 702 1226 1863 765 -557 -210 -759 -1718 -500 426 -665 328 1182 -107 -594 262 -699
1293 -699 -1273 55 226 -464 802 1450 618 861 1243 -189 -702 -123 -347 -27 1314 833 -236 48
1311 48 -418 -1655 -1262 -337 -490 162 1077 -26 -642 -206 -799 -990 600 1274 971 1890 1316 -292 -362
1330 -362 48 -935 -606 1226 728 250 364 -598 -1786 -1255 -904 -1522 -667 119 -600 -20 1055 514 442
1349 442 1010 195 -491 -24 102 -385 945 2409 1628 1547 1147 -961 -2615 -2197 -2037 -1524 753 1540 1058
1368 1058 736 -350 -2089 -2867 -2005 -1266 116 2569 2496 1934 1864 406 -1462 -724 -65 -484 603 1829
1386 1829 593 43 515 -766 -1898 -834 -856 -1991 -907 54 -769 -478 729 132 -43 828 360 -157
1404 -157 632 756 400 1236 1568 321 518 479 -495 -644 175 -779 -868 236 -726 -1981 -849 -386 -1393
1423 -1393 -220 850 -162 -206 1198 105 -799 599 1337 470 1428 1962 656 343 751 -623 -1102
1440 -1102 -390 -567 -1235 -255 187 -475 -60 -166 -1322 -804 -355 -1286 -796 1304 858 651 2052 1358 -20
1459 -20 376 -60 -1278 -28 1786 582 418 1119 -46 -1773 -1091 -1167 -1484 126 647 -674 -101 500
1477 500 -972 -1182 134 383 405 1961 1166 -169 523 575 -1161 -376 1323 821 669 1212 -32 -989
1495 -989 -308 -1157 -2555 -656 832 -243 -77 1200 -44 -397 257 -994 -967 723 715 -360 1064 2004
1513 2004 1113 710 615 -734 -846 84 -1408 -1643 876 1504 118 456 693 -1188 -1066 -1148 -2190 -1113
1531 -1113 1600 1622 302 1795 1504 -480 -948 -1030 -1277 289 1174 227 504 1992 655 -1264 -856 -929
1549 -929 -979 278 -8 -697 1181 1921 -820 -1134 366 -354 -961 263 211 -177 1574 1246 -1537 -469
1567 -469 1378 -296 -934 403 783 178 402 -695 -1604 214 778 -1091 -333 1283 755 117 -361 -1258
1585 -1258 -495 1025 -489 -1271 1292 1864 -247 -141 222 -643 197 575 -1318 -691 2105 902 -1601
1602 -1601 -30 1098 -486 -694 -249 -1065 -16 1080 -383 -1145 1475 1553 -635 -1148 -492 -161 -100 -293
1620 -293 -800 942 2291 62 -1681 -64 -8 -639 -387 -403 -99 2164 1642 -1674 -967 975 -138 -1447
1638 -1447 -282 637 895 1608 -211 -1823 93 1261 -1613 -1795 898 1666 714 11 -884 -349 953
1655 953 -500 -2074 10 2124 607 -446 -64 112 521 32 -1826 -1112 1887 1369 -1106 -707 651
1672 651 488 -245 -934 -1244 629 1858 -851 -1704 931 1836 -181 -1148 -335 224 1019 -47 -1813 -254
1690 -254 2137 393 -1360 -329 951 871 -103 -1350 -741 1861 1264 -1727 -1224 1332 1031 -659 -794
1707 -794 -304 975 1286 -863 -2151 347 1646 -1045 -1857 311 1636 1154 95 -1299 -694 1288
1723 1288 -208 -2295 -336 2202 1996 23 -628 -250 719 -19 -2791 -2114 1342 2086 -117 -473 515
1740 515 1055 61 -1954 -2413 564 2411 13 -1078 1402 2321 619 -1503 -1824 -368 1515 320
1756 320 -1893 -152 2592 1271 -1760 -2096 50 778 -244 -1930 -1175 2029 1911 -953 -1863 527
1772 527 1549 293 -1435 -821 1559 2293 -278 -1931 479 1930 142 -2094 -1193 767 1564 -230
1788 -230 -2392 -520 2003 476 -2559 -1767 902 1623 270 -980 -35 2256 1558 -1865 -2563 682
1804 682 1960 313 -711 421 2311 1657 -1573 -3242 -888 1482 -825 -2115 -338 2219 2048 -674
1820 -674 -2497 -753 1583 278 -2140 -831 2634 2734 50 -1299 23 1631 808 -2319 -2301 1104
1836 1104 2180 -731 -2086 -187 1599 1067 -1744 -2469 241 1852 -507 -2540 -165 2514 1823 -283
1852 -283 -868 920 2310 356 -2568 -1281 2096 1901 -997 -1168 920 2032 184 -2736 -2579 438
1868 438 1281 -1496 -2219 794 2866 1215 -1301 -1533 749 1897 -869 -2765 189 3128 2082 -785
1884 -785 -322 1368 1754 -565 -3082 -1989 1242 1077 -1699 -1484 1736 2374 -258 -2551 -2090 681 901
1901 901 -1388 -1800 1748 3671 1486 -1153 -940 897 1194 -1384 -2577 363 3296 1383 -1630 -1090
1917 -1090 1122 753 -1539 -2984 -1101 2218 1484 -1727 -1672 1486 2042 -745 -1958 -113 2255 1832
1933 1832 -821 -1746 1256 2390 -83 -2551 -806 1959 1535 -1256 -2440 -55 1977 -116 -3054
1948 -3054 -1580 1723 1646 -770 -1552 388 2240 979 -2292 -1890 1723 2139 -782 -1859 855 2631
1964 2631 1176 -1458 -1813 526 1501 -1050 -2885 -300 2538 1443 -1144 -1318 394 1526 -695 -2927
1980 -2927 -1263 2468 2132 -961 -995 1278 2069 -200 -2475 -1681 1451 2092 -693 -1749 935 2519
1996 2519 100 -2360 -1813 604 1369 -810 -2312 82 2613 1060 -1851 -1421 1128 1854 -460 -1754
2012 -1754 -246 2058 1111 -1953 -1694 1346 2154 -151 -1719 -488 1444 1187 -1814 -2291 760 2458
2028 2458 436 -1763 -206 1926 1386 -1257 -2310 -176 2135 616 -1798 -522 2150 1785 -928
2043 -928 -1947 -611 1725 537 -1905 -1456 1714 2249 -449 -1534 34 1385 461 -1604 -1888 608
2059 608 2149 255 -1735 168 1914 708 -1869 -1997 239 1586 356 -1743 -439 2018 1464 -1435
2075 -1435 -2019 -41 1498 333 -1650 -694 1789 2060 -877 -1908 88 1557 154 -1582 -933 1224
2091 1224 1943 -316 -2075 -432 1928 744 -1642 -790 1287 1778 28 -1645 -952 1333 1177 -1215
2107 -1215 -1218 1256 2016 -311 -1744 -844 825 749 -751 -1462 675 2124 163 -1704 -765 993 616
2124 616 -771 -1315 380 2168 770 -1617 -998 1155 843 -949 -1691 -21 1670 986 -925 -1228 1217
2141 1217 1431 -676 -1744 -433 1283 839 -581 -1109 876 1743 -4 -1952 -614 1068 708 -761
2157 -761 -1010 750 1665 298 -1665 -1221 737 853 -1177 -1129 913 1826 816 -1158 -1267 501 809
2174 809 -995 -1563 533 1970 994 -606 -611 269 554 -886 -1937 -436 1937 1037 -667 -492 787
2191 787 671 -517 -1795 -908 1056 1112 -442 -513 1171 1342 -119 -1315 -1090 286 808 -529 -1266 659
2209 659 1546 124 -916 -421 458 223 -495 -1249 24 1592 519 -904 -281 1215 870 -357 -821
2226 -821 -372 787 741 -900 -864 804 1271 -423 -1191 -218 390 369 -584 -1173 335 1211 -88 -965 -116
2245 -116 1008 681 -294 -550 188 1079 362 -960 -463 1124 977 -225 -713 -66 217 16 -1123 -1052 605
2264 605 1066 -396 -623 226 628 -91 -941 -968 412 1335 290 -473 415 1014 424 -637 -572 31 870
2283 870 130 -681 -267 771 338 -1202 -1141 32 505 185 -450 -47 652 596 -599 -1005 287 795 405
2302 405 -87 271 691 819 -378 -1124 -394 599 -180 -508 -30 448 642 -131 -1270 -829 216 -60 -999
2321 -999 -254 811 1154 441 21 -73 420 248 -670 -949 415 1014 600 284 313 453 4 -1082 -1399 -804
2341 -804 71 -118 -364 559 905 807 -216 -808 -972 24 131 -470 382 1244 1231 183 -274 -162 -173 -375
2361 -375 -815 -509 589 923 184 -356 -4 11 -504 -871 -788 -268 445 307 -196 226 720 339 36 -133
2381 -133 -5 290 312 -200 -305 507 523 -214 -213 300 -27 -152 -450 -659 -11 343 -331 -351 275 463 -60 -99
2403 -99 -136 -178 237 197 -638 83 853 549 35 199 241 82 -176 -593 -607 -26 112 -288 79 368 459 -46
2425 -46 -164 -384 -130 -94 -96 -26 563 664 138 35 -41 -76 -222 -442 -449 -191 494 396 -141 128 217 -384 -482 -473 -303
2450 -303 304 335 -153 -463 249 310 -387 -161 249 192 154 267 -81 52 -65 -266 -436 9 401 193 60
2471 60 -21 -84 40 -193 -490 -268 323 161 169 53 212 -3 61 -504 -476 138 260 -26 132 545 195 99 -102
2494 -102 -146 -422 -118 -158 -232 416 508 140 36 -75 -65 -406 -91 -265 -244 281 298 -37 176 245 -124 -261 -233
2517 -233 -185 81 493 102 5 242 303 -65 -227 -248 -302 95 -72 191 232 174 88 -321 -329 5 -259 48 165
2540 165 246 211 17 -249 -441 148 13 -13 92 421 163 -31 -271 -359 -303 216 143 79 500 371 192 50
2562 50 -390 -530 -266 -57 -59 24 250 322 -220 -181 -279 -319 -258 162 -172 158 279 13 116 120 -71 -76 -139 -178 -130
2587 -130 227 159 -69 24 347 131 -175 -273 -223 0 48 58 330 298 74 -178 -129 -368 -195 -235 302 319 74
2610 74 201 -101 -163 -341 -155 -216 -54 239 443 291 158 -46 -75 -260 -209 13 211 416 133 -38 33 -405
2632 -405 -366 -112 -31 48 209 302 238 226 -5 75 -272 -119 -181 -111 199 340 -117 58 -123 -38 -160 -73 -54 165
2656 165 -117 -167 -122 -291 -315 -225 165 241 113 -50 150 -286 61 -74 -103 58 317 305 -22 311 0 -71 -348
2679 -348 -217 -192 -218 81 192 -201 -96 19 -303 -178 -205 -259 -184 320 -41 318 332 47 150 361 2 -203
2701 -203 -220 -83 -153 282 407 119 126 24 -630 -718 -438 -522 64 445 541 470 329 1 -564 -167 -161 -102 248 525
2725 525 610 349 273 125 -373 -321 -268 -187 72 259 127 208 -20 -380 -369 -241 -337 -354 -13 204 190 253 368 60
2749 60 127 231 -9 145 476 228 -37 -2 -11 -141 -222 -203 -336 -260 -18 -258 -136 -13 -120 -171 -86 -25 -24 187
2773 187 249 67 350 273 -191 -231 -29 2 -3 126 -1 162 106 -29 -436 -307 -225 -506 -232 176 39 62 10
2796 10 75 -99 -88 -327 -153 -21 541 184 259 441 63 13 -120 -234 -270 54 -257 19 -72 -16 -147 -90 -269
2819 -269 -210 -178 -44 4 164 289 26 -174 83 121 -42 250 401 12 102 45 -307 -212 58 -129 195 162 382
2842 382 85 10 -335 -498 -222 -14 -35 254 447 35 86 107 -54 -100 234 123 -65 -26 114 203 483 319
2864 319 -241 -89 -352 -230 -314 150 -95 227 476 247 25 -125 -16 -185 -425 143 306 294 439 331 -134
2885 -134 -330 -199 -265 -164 170 62 571 261 -45 -11 -199 -343 -325 -131 128 62 426 300 -224 -115 -152 -239
2907 -239 -41 249 -57 17 246 121 -41 139 -66 -244 -98 32 62 13 93 -192 -217 -148 -245 -284 133 310 -168
2930 -168 83 221 73 -244 -233 -19 -285 12 138 142 23 60 -293 74 -170 12 -158 -151 -30 58 370 -17
2952 -17 -39 24 -195 -77 -84 -4 -19 109 296 157 -24 202 -178 -250 -353 32 -102 59 279 181 29 11 -218
2975 -218 -204 -142 -104 -148 377 150 -182 -116 -60 -307 -214 -62 39 189 242 95 -47 -60 -37 -533 -128 129 127 19
2999 19 228 -90 59 9 -254 -319 48 76 127 219 281 -272 -277 -155 -398 -297 114 -11 230 361 80 -72 63
3022 63 -15 -163 -6 -64 58 -51 122 -27 -135 209 -105 -179 47 -13 88 201 133 -161 147 -70 -55 -85 132
3045 132 -38 11 257 97 110 137 131 -95 -417 -62 -103 -112 38 61 163 53 40 -423 -156 -91 -26 -58 -27 83 113
3070 113 -280 -211 -141 -142 -69 -16 209 197 22 -52 3 -299 -165 -93 -86 292 189 11 215 -184 -132 -280 -31 14 106
3095 106 329 101 103 16 -281 -83 -17 -87 -360 -170 174 -30 104 -64 -135 -283 -174 4 60 -1 -55 35 220
3118 220 176 52 -116 -13 -96 -78 56 100 317 125 -101 -93 -52 -188 -71 -150 211 125 16 293 -80 -138 -147 -193
3142 -193 95 53 282 230 235 155 77 73 102 -106 151 -339 30 233 -19 -5 49 -138 -261 -248 -136 104 308 202
3166 202 231 -11 149 -211 -211 -220 -94 255 160 218 177 161 -131 -254 -359 -102 195 256 63 42 -46 -190 -68 -268
3190 -268 46 -75 0 131 101 463 -66 10 27 -77 99 83 -40 -46 5 18 146 -118 -341 -238 -218 25 -48 160
3214 160 34 -77 -102 28 44 70 -75 78 135 274 45 220 254 -252 -68 -140 50 155 168 -43 49 3 -202
3237 -202 -196 -135 -362 73 -92 26 250 140 209 -150 -227 -128 -10 152 141 309 142 288 166 -239 -147 -276 -273
3260 -273 -210 -5 66 207 48 -155 -118 -377 -199 -201 8 219 303 103 177 81 -126 -229 -219 19 395 242 130
3283 130 63 165 52 -243 -127 -72 -158 -110 -30 101 153 160 -65 -196 -28 -3 19 148 -96 53 -106 94 41 -73
3307 -73 -187 62 -53 82 6 76 -38 44 -170 -177 -193 -128 -11 87 44 100 33 41 -147 -215 -77 -151 125 323 206
3332 206 245 247 -119 -49 -128 -110 -139 107 14 204 177 53 -114 -121 -12 57 51 244 488 -7 281 57 -226 -196 -33
3357 -33 -77 147 212 177 103 175 -254 -241 -46 -85 -145 73 242 10 134 210 -57 19 69 -165 75 19 86 -98 49
3382 49 -111 -159 82 53 -72 -71 199 108 122 -5 -37 -123 -89 -149 -187 -75 -28 -77 -142 -103 42 -160 -66 -49 -55 131 -62
3409 -62 -18 155 201 -92 -24 -67 -102 -45 -20 229 351 -38 242 -158 -68 -153 -224 -86 -72 32 -48 151 -52 23 -281
3434 -281 -291 -277 76 254 142 243 -24 -171 35 -176 -352 -13 174 189 231 165 -13 13 -278 -291 -150 92
3456 92 207 95 -36 161 -130 -140 -84 -96 0 68 -70 -227 101 197 -19 -51 -114 -86 124 191 -178 93 321 39
3480 39 -133 78 -12 -329 -162 -45 -183 9 218 -103 -128 -113 -182 -243 -69 -109 -25 188 125 19 -5 -114 -233
3503 -233 -153 15 -106 222 -4 103 -45 165 103 -294 -237 -94 105 -166 72 -20 178 152 16 -289 -121 82
3525 82 -154 -138 114 115 84 -4 -165 -244 32 57 -65 223 197 115 -58 -152 -116 31 347 204 131 192 77 32 -138
3550 -138 -214 40 -204 0 89 81 23 63 65 39 102 -16 -191 -23 213 197 -148 43 39 172 -30 -35 -128 58 233
3575 233 43 -104 -126 4 88 -207 -167 -64 -11 176 253 32 171 244 -166 -229 -92 11 53 57 91 3 293 -115
3599 -115 -166 -122 -33 -98 101 96 218 105 -160 -211 -379 -429 -14 -251 14 206 432 43 -49 -3 -66 57 -5 36
3623 36 349 535 196 -127 -130 -229 -198 -238 -337 193 385 198 -53 35 48 26 -377 -185 -130 212 183 110 123 189 20
3648 20 145 -84 -361 306 150 201 74 265 127 14 -190 -84 -154 -169 -291 -126 369 380 7 70 -243 15
3670 15 -65 -224 -71 192 258 32 -93 204 98 18 31 -198 -18 250 59 -390 146 -226 14 -311 -200 -168
3692 -168 194 390 -13 -12 106 156 -164 -208 85 203 382 143 -53 40 91 -356 -215 -72 377 237 -68 -197
3714 -197 -43 26 -234 -528 -370 152 188 60 4 34 170 -16 -253 -19 181 132 -179 -263 225 63 -129 -276
3736 -276 27 145 32 14 -392 -18 64 -109 31 134 142 -15 -45 -188 72 320 82 -8 179 491 151 -108
3758 -108 -114 -119 86 224 -182 -180 86 73 53 -338 -105 59 18 187 -40 23 238 -44 -285 -140 136 232 87 -65
3782 -65 274 415 -318 -463 -168 -71 -139 126 -70 272 476 208 -387 -529 -117 118 -237 -266 425 454 213 -156
3804 -156 -300 29 30 -187 -226 151 284 231 -62 -316 -5 34 -149 -324 24 7 182 -148 -49 39 53 -5 -171
3827 -171 -225 185 211 12 -43 173 356 65 -26 -16 112 229 82 -151 -1 251 232 -313 -207 27 185 -65
3849 -65 -232 115 183 254 -257 -74 50 215 -5 -22 174 317 193 -241 -352 -73 100 -59 -150 201 409 500
3871 500 -52 -304 -216 -59 -74 -464 -195 275 329 237 -214 -164 -69 -124 -368 -20 309 346 87 -157 34 187 94
3894 94 -446 -278 234 238 33 -89 30 324 36 -408 -147 -46 271 -133 -239 -8 30 234 -126 -410 -140
3915 -140 257 73 -164 67 221 284 95 -190 -61 92 -97 -370 -217 108 241 -130 -260 -72 158 293
3935 293 -15 -169 355 334 -271 -293 127 206 103 -197 -225 -98 172 -139 51 -186 178 76 -190 -171 285 350
3957 350 -70 74 -119 -26 160 -162 -391 -34 306 163 -50 -5 -5 92 -242 -514 -137 359 233 26 -119 173
3979 173 109 -139 -490 -204 233 348 -74 65 531 61 -218 -216 -221 30 108 -70 -47 276 521 -226 -382 -41
4001 -41 -37 -52 -307 -156 85 495 263 -346 -104 9 -93 -116 -163 16 382 186 -143 -5 138 125 -324 -425
4023 -425 145 133 260 37 245 373 326 -357 -386 -170 74 188 92 101 388 414 -30 -117 -83 39 54 -73 79
4046 79 384 343 101 -121 -154 162 -48 -130 -159 273 352 32 -167 -245 -176 163 -115 48 109 144 49 -34 -136 37
4070 37 64 85 31 48 505 152 -18 -17 197 -44 -170 -161 -174 289 62 -212 143 22 19 -43 -59 122 60 130 69 -139
4096 -139 200 129 -32 -199 107 108 157 57 -198 61 77 191 -144 -249 -114 2 -292 -385 -113 276 172 -7
4118 -7 -85 151 164 -217 -242 68 364 225 116 -111 -13 14 45 -176 -44 124 107 -86 -232 -32 38 -237 -73
4141 -73 113 376 420 66 -405 21 -34 37 -342 62 324 361 183 -155 26 -55 -242 -211 -215 75 213 -106 175
4164 175 35 -39 59 -307 -224 84 115 32 -87 305 329 67 -58 -375 -117 247 -186 -23 49 214 -21 37 -265
4187 -265 -219 -108 -315 -36 -154 67 117 254 103 95 282 -90 -275 -34 135 11 76 -54 -7 77 39 -221 102
4210 102 -31 160 -109 -238 -15 -86 -105 -91 -441 -54 221 133 -271 47 15 -121 -113 90 17 70 167 -27 -198
4233 -198 225 214 -138 -336 -77 228 76 79 303 113 232 -119 -243 -146 108 157 222 216 415 100 -95 18 -224
4256 -224 67 -172 -47 30 223 305 24 75 -74 156 -102 -57 87 -214 118 139 136 -29 71 -110 73 -132
4278 -132 -181 6 102 -184 -62 134 40 84 -241 16 108 56 49 189 138 -76 -106 -45 -21 -105 168 1 -24 -141 -53
4303 -53 -156 -42 -206 -82 10 81 364 208 38 8 -372 -124 -108 -92 -196 98 73 143 211 149 -182 -152 -155 -87 -162
4328 -162 -57 94 30 -62 -133 -86 -36 -78 -58 -40 -53 90 -98 -53 -215 41 -46 -89 72 59 148 -45 115 108 30 -12
4354 -12 6 39 -24 21 -82 -45 -184 300 -63 42 -31 17 320 -82 -36 131 107 -258 -144 -84 -93 -17 58 39 182
4379 182 239 50 -4 -118 -7 -80 113 74 13 52 196 3 -176 26 72 -16 -116 118 156 340 232 137 -236
4402 -236 -167 -199 -326 -29 267 155 273 -129 -50 -285 -209 -316 -134 231 -106 161 133 47 -114 10 -8 -131
4424 -131 81 182 96 184 148 -44 17 -219 -252 -218 75 -43 96 97 243 -38 -176 -99 -212 22 -173 57 -81
4447 -81 152 37 47 49 -161 -10 95 -79 138 75 217 128 238 118 209 -124 -130 -160 -16 84 57 364 -64 175
4471 175 -47 -103 -120 -84 -85 2 -23 134 27 -132 -23 30 -30 87 -60 139 -65 76 74 -47 -140 -133 31 194 247
4496 247 -91 -23 -59 -105 -43 35 -35 118 104 235 -128 -215 -14 -160 -164 -1 -67 156 266 -72 205 -54 45 -180
4520 -180 14 270 35 -79 208 116 -252 -171 -71 -229 -83 114 77 225 2 58 29 184 -7 -238 -67 -179
4542 -179 162 71 96 229 171 -17 101 -126 -32 -143 -135 190 193 110 18 42 -119 -154 -145 -117 163 -101 34 172 -16
4567 -16 55 -114 -90 -64 251 59 -18 156 -97 35 -67 -69 -39 18 39 126 151 77 36 38 -218 -272 -55 -102 64 195
4593 195 178 304 12 -53 -84 -291 -46 19 98 232 302 -2 -81 -195 -287 -121 -90 -92 114 405 55 -97 -166 173
4617 173 -127 44 30 -142 52 -55 79 77 234 14 -193 70 -155 -364 -224 21 202 74 196 -108 -142
4638 -142 -155 -191 -18 -227 99 -46 47 101 115 -17 111 -2 89 69 290 59 104 36 66 77 -104 -98 -178 -10 91
4663 91 303 -113 -48 -117 -134 4 54 81 260 -88 246 -128 -80 -44 -67 -22 -1 52 -69 138 1 -130 -139 -67 -90
4688 -90 -107 196 -17 102 79 -26 -41 -268 -94 -101 -94 63 157 222 83 14 54 65 -56 -270 -159 42 159 -54
4712 -54 51 -44 -181 -61 128 -219 -146 29 33 -52 108 104 36 -158 -105 107 -108 -114 104 -6 140 -128 -263 -161
4736 -161 -199 31 136 167 115 106 -201 128 -61 -30 80 16 -99 121 71 -3 60 -40 -116 -143 12 -58 -63 182 139
4761 139 22 -91 129 -149 -162 -107 -205 250 137 61 57 -81 -77 -121 -15 60 49 -7 -86 17 -207 -161 -17 -151 -73
4786 -73 -150 146 -26 75 88 -77 -306 173 -153 -40 118 1 195 -46 118 -123 109 -164 109 79 -49
4807 -49 -237 2 72 65 -195 14 -48 -190 116 -7 -65 -57 -14 166 45 15 4 -169 -105 -40 60 253 101 -24
4831 -24 -132 -281 -185 84 -45 275 14 -127 -8 -128 -130 -296 75 -91 -10 132 105 93 73 38 -84 -168 -148 -139
4855 -139 -69 125 121 -88 149 -167 -76 -207 5 -102 -67 -62 -116 140 31 103 119 -210 56 -101 41 -50 -215 159
4879 159 7 -41 -80 66 -106 -67 80 -46 48 40 -124 1 26 71 71 105 31 149 16 182 14 4 65 10 -166
4904 -166 152 63 -101 -26 2 115 78 -135 -74 -75 -91 -59 145 -204 214 -144 53 95 -160 46 18 -10 15 -64 28
4929 28 36 101 -95 -275 229 24 61 -32 -73 -155 -32 -147 -4 27 -25 183 -17 234 275 -152 -334 -24 -38 179
4953 179 -72 78 130 136 -95 -123 -86 -23 -47 -151 33 36 135 -74 103 79 -17 -126 -53 237 85 -26 235 -6
4977 -6 -51 -100 -181 0 -51 405 138 167 107 12 -42 1 135 -173 13 76 26 108 343 55 117 59 -124 -184 -31 33
5003 33 120 117 263 9 -23 -181 -52 -415 -133 -153 170 77 51 -56 -65 23 -75 159 142 159 39 178 203 29 -226
5028 -226 -274 173 168 113 -101 -56 -13 -29 61 -212 -81 -165 8 65 36 140 42 -55 -21 -193 65 -169 120 20 -3
5053 -3 30 -63 -12 14 156 -36 95 33 -101 170 -86 -111 -128 -93 46 68 -56 1 -78 231 154 81 48 -33 -126 -207
5079 -207 22 71 -139 138 -73 -97 115 -202 109 -59 -187 170 35 5 113 90 -94 40 52 -32 -190 -42
5101 -42 83 70 -65 -70 58 8 -67 -132 -71 -7 136 63 8 -29 191 -44 -108 -46 -220 231 157 62 122 -180 -66 -140
5127 -140 -30 68 36 0 -114 335 -52 -77 -83 -198 1 28 170 31 60 143 114 -43 -112 -109 51 -109 26 -107
5151 -107 249 99 183 -37 -8 126 -145 -143 155 -34 84 212 -43 85 -140 -11 34 -144 -111 -66 28 131 150
5174 150 126 -2 -135 -153 15 166 59 33 76 -113 -193 -201 -323 -62 3 163 144 235 91 -125 -4 -162 -126 -8
5198 -8 68 18 -112 110 -215 88 40 42 -88 16 59 52 20 195 83 -103 32 -64 -43 -39 -101 -22 48 -134 -346 137
5224 137 -62 -170 -48 -190 61 -128 166 -54 -109 -38 -25 -15 27 -157 49 103 20 0 -200 -2 89 -165 -180
5247 -180 68 140 -142 -165 105 -15 -84 108 -11 -108 6 -67 -11 9 105 3 108 -187 -197 -74 119 60 228
5270 228 172 -119 -37 -188 -267 148 165 -58 14 -82 -47 142 -63 -24 -103 237 -262 104 90 22 28 -30 -105 -101 127 -6
5296 -6 -57 101 -164 43 -25 -323 -29 151 -198 117 94 111 -145 -92 -283 -58 -60 -201 4 67 103 117 -153 61
5320 61 -82 -213 3 -127 -123 64 61 94 -202 -15 188 6 -86 -98 168 -23 92 -277 193 63 90 -81 -143
5343 -143 -104 -41 179 114 76 122 -187 -162 11 -115 -148 25 -51 126 7 200 141 -88 68 105 215 -33 220
5366 220 66 79 132 93 -130 53 18 -35 -42 -69 125 187 15 -148 -113 -152 -177 18 -197 166 114 -20 -157 -82 -76
5391 -76 -110 -12 6 60 159 -216 159 85 -235 5 -208 130 -97 -82 -43 4 -57 203 -32 -183 118 37 57 -48
5415 -48 -160 70 84 4 70 151 -34 118 -2 -49 295 66 150 91 31 30 69 -103 198 121 49 -25 -108 38 -24 134
5441 134 -199 229 228 232 -27 -147 -118 51 19 -206 49 12 66 150 115 110 59 -87 -167 -135 144 -49 -33 74 233
5466 233 169 -36 -72 54 144 174 62 130 20 229 -26 85 -12 -175 114 -304 -148 -1 -38 31 -7 -219 35
5489 35 21 -167 3 203 212 -172 -45 -231 46 -71 108 -83 50 114 225 -54 -142 -72 294 -176 6 1 -2 44
5513 44 -17 196 99 -37 16 -97 -39 214 -103 227 -146 134 -130 152 -19 -29 18 39 192 108 150 102 192 21
5537 21 -141 -114 -55 -37 193 262 38 113 93 -236 -22 -162 -162 -35 -74 285 31 160 -38 -159 34 81 -266 15
5561 15 -36 264 113 -246 226 45 19 -40 41 55 270 77 -149 -128 -71 146 141 60 194 7 -156 -163 -17 -9 131
5586 131 -148 -60 45 -41 42 36 202 -22 117 238 -123 -214 -157 -120 121 -10 -29 248 -133 -90 -42 -34 -97 49 13
5611 13 297 28 -28 -81 26 -14 -158 102 22 12 251 -40 103 -22 -32 -169 -85 -78 92 163 -122 64 -69 -101
5635 -101 -105 -282 -111 146 73 72 104 122 -76 107 -97 7 115 8 237 6 -73 38 -65 -248 13 22 -66 29
5659 29 -140 113 105 98 42 -116 -111 -36 10 238 -20 -53 71 -72 190 -17 100 -10 -57 239 73 114 -76 -163 -44
5684 -44 -129 -26 -117 51 49 164 -88 30 -38 -129 37 -74 -60 76 57 -69 75 68 163 -77 20 -117 17 293
5708 293 -102 0 315 -49 -67 76 -88 -147 -58 20 -30 60 129 34 -78 -152 -16 -37 126 52 81 167 -76 20 -346
5733 -346 120 -46 -94 117 -10 282 213 -3 -121 -4 62 180 261 207 142 165 39 75 174 30 62 -164 122
5756 122 151 44 73 7 12 -21 -75 -35 -142 -49 99 -43 115 266 59 150 -112 -154 -64 79 -15 190 29 -33 42
5781 42 -37 -55 -15 145 79 0 -188 95 7 388 51 -217 208 27 282 36 147 206 27 -25 -69 -80 132 -192
5805 -192 -16 253 92 -16 -76 -136 -61 103 -21 91 90 -5 177 60 -341 -28 -178 88 -48 3 182 -21
5827 -21 -239 -21 102 -63 52 60 125 -63 269 -4 -188 163 57 -10 -60 -200 -9 123 71 -24 25 -50 -33 26
5851 26 54 151 104 -112 32 13 139 -35 -143 82 -41 32 -72 55 173 184 23 138 44 232 -78 106 -48
5874 -48 9 2 100 27 -79 156 -90 11 -157 -38 88 68 260 -53 -114 133 -71 19 211 -95 202 172 114 161
5898 161 -54 -176 -275 58 252 33 70 149 116 -115 -56 -124 -272 -10 222 127 90 -128 87 -5 191 -178 -101
5921 -101 222 -30 74 -33 41 117 29 -73 128 66 107 -89 -8 -40 -81 22 10 -217 243 121 -100 124 20
5944 20 -194 -174 -73 -123 110 73 72 -61 -60 -119 -136 40 52 61 161 -207 -28 61 161 50 -130 -86 48 43 7 148
5970 148 -101 -77 -66 102 66 -30 -94 -166 -156 -161 -31 -5 51 186 -162 -168 -11 -235 -362 -28 195 77 106 42 -67
5995 -67 89 -74 -164 -23 71 61 271 16 -60 -99 -49 -218 5 -115 106 34 90 -40 6 -139 -6 135 -99
6018 -99 -110 -10 -40 -38 317 112 124 103 69 -126 -110 80 88 -183 27 36 -84 50 -78 -56 19 -161 -132 -21 85
6043 85 181 -73 -300 -124 -18 150 20 42 3 112 -227 -5 -59 59 81 85 -167 48 41 71 22 22 8 3 -105 69
6069 69 62 -17 79 67 -15 -256 -115 -169 -192 -95 18 -36 168 93 -23 -85 43 30 -69 -78 182 -106 158 215 20 87
6095 87 -267 -8 150 13 122 62 -137 143 -49 -83 -13 91 -11 -54 -128 189 -2 -65 3 -189 -114 -68 23 -108
6119 -108 78 174 -130 -152 -35 -145 -80 -58 -35 -86 -168 -62 -34 -299 61 -26 -29 -184 93 -44 81 -7 107 -49
6143 -49 60 1 -9 -136 -64 238 -122 79 242 -21 -112 -5 9 -7 37 214 -150 94 99 36 21 -137 -47 102
6167 102 50 43 191 120 -53 -135 -35 88 -94 -167 10 -319 -6 29 -53 -171 -91 34 -315 -24 6 -71 -123 34
6191 34 -194 146 -29 176 -10 51 -13 260 116 95 76 -83 -48 68 -24 38 29 -175 -2 150 -9 75 -14 193
6215 193 124 -61 6 -85 33 19 -191 112 58 -98 3 66 -39 -74 -35 -80 -140 -22 6 -48 73 -20 -68 8 158
6240 158 -84 108 58 25 57 148 23 208 159 23 -69 58 77 -212 -117 50 -19 57 190 55 22 57 -34 170
6264 170 -62 -94 30 293 -50 -75 -127 -171 -32 -18 42 177 -14 43 69 19 42 42 9 33 167 -42 95 32 67
6289 67 -162 -209 102 -110 -151 52 -30 75 -49 73 -185 -122 -159 129 -51 82 233 -20 159 -32 -54 -57 -42
6312 -42 -198 90 -108 49 -69 58 63 110 -87 -29 -112 -269 67 44 114 83 -146 -41 -46 -25 -78 139 117 159 -51
6337 -51 177 -18 107 -9 -29 -64 25 166 131 -18 -17 -12 -171 -69 -86 164 43 113 169 -89 -161 -79 -85 -25 -6 66
6363 66 201 -94 -16 -31 -232 -292 -97 -72 -99 71 50 122 105 84 -71 181 16 152 -48 83 -6 -49 170 -28
6387 -28 191 7 -57 64 44 81 332 43 -108 50 -114 -304 -179 -163 117 -24 23 272 93 36 -7 28 -116
6410 -116 44 24 130 -60 58 33 75 78 -103 -62 48 130 -23 98 121 -106 165 -202 35 16 -123 113 110 53
6434 53 -76 -134 63 -318 -328 -137 -18 -45 -148 132 71 -9 -158 -104 171 181 212 113 13 154 -49 -56 240 -39
6458 -39 -119 -5 111 103 -162 -55 151 161 -24 117 -113 95 -90 130 48 20 -118 -84 -1 53 53 -57 -94 -134 33
6483 33 -28 -194 143 -4 54 82 -127 0 -11 -70 -166 -78 -40 100 -127 -14 273 -171 -141 -33 39 -34 162 37
6507 37 -90 42 -35 54 112 -156 279 -105 -236 9 49 35 222 206 17 -151 41 -185 -90 59 -163 47 31
6530 31 186 243 57 181 -86 -87 -55 -106 59 134 89 136 124 129 228 198 -324 -5 26 -103 78 21 -46 46 76 -48
6556 -48 19 -28 -125 87 -209 91 -78 6 -69 -92 -15 -69 61 102 -61 -103 -124 115 49 22 12 90 12 230 151 155 -155
6583 -155 57 -107 -35 -92 -15 -10 67 137 119 -12 -56 81 -35 -1 -34 -48 234 104 -202 -147 17 -84 189 -116
6607 -116 27 107 -49 183 200 192 -98 168 -60 -11 -15 -108 -91 30 -24 -167 -54 93 -213 -22 133 -79 275
6630 275 -77 -136 -130 111 51 -148 76 68 -57 39 97 -193 -187 124 287 43 38 -51 -91 -22 29 -129 132 -194 -106 2
6656 2 -31 204 -121 -56 102 112 91 -185 133 167 238 98 -60 278 -43 -24 105 3 178 -62 39 38 86 -14
6680 -14 163 10 -117 -63 139 73 54 -2 23 79 -130 -83 -176 -160 101 134 53 238 85 59 -116 1 -88 -90 -33 6
6706 6 32 -15 -6 -154 39 -182 61 48 141 196 7 114 188 4 -166 242 182 -78 -84 197 33 -167 8 43 -108
6731 -108 23 69 -158 168 136 15 5 1 11 -10 61 133 40 119 -131 158 -34 -105 -59 -2 120 -129 -26 -14 175
6756 175 193 66 -137 -88 -14 34 -163 -213 -157 73 -67 -12 -71 42 -126 7 -102 -215 71 -6 -47 8 23 -106
6780 -106 -17 -185 -108 -179 -51 178 -47 20 -26 19 64 105 -42 -177 60 -145 -114 -63 -242 174 -123 128 -133
6803 -133 215 150 31 -66 169 -42 -1 247 58 203 1 41 -37 -40 -61 12 -159 145 48 89 138 65 118 25 -26
6828 -26 -260 -18 25 -66 119 210 -10 90 166 -114 -127 36 106 93 40 -58 -8 -73 124 -25 -140 -142 152 -56 -92
6853 -92 -9 -102 -393 -137 -132 -27 72 -140 -12 106 150 -90 -20 -132 -160 -57 9 -169 61 152 14 -16 220 31
6877 31 -194 -165 -78 -19 -12 153 -43 -149 -156 133 -89 109 -132 140 -76 -50 87 21 -84 38 -69 28 -46 -22
6901 -22 55 -128 -3 117 29 -141 -149 33 -223 -51 -74 147 76 -63 -126 68 21 -17 124 73 -6 3 -190 44 -64
6926 -64 53 82 53 -71 83 -34 23 -35 199 -125 69 -23 -70 -88 77 131 -13 144 -29 -10 -212 -211 58 116
6950 116 107 280 -70 -9 -52 44 -14 -180 114 48 217 107 5 37 45 -203 -84 40 43 164 277 134 -28 -56
6974 -56 -109 -108 -192 -6 -146 76 207 42 -57 81 25 50 -200 -60 -57 11 25 -144 -84 -17 -136 -114 86 95 84 11
7000 11 239 128 -159 54 -56 -8 3 -115 106 -9 -163 -40 18 -17 58 11 -50 -193 156 48 88 104 5 -47
7024 -47 56 110 79 -40 -41 74 -101 25 -40 -118 -98 4 77 2 123 115 -37 56 -75 -80 -55 27 -82 6 6 -25 -42
7051 -42 -36 -136 -94 -6 -41 43 179 -3 13 80 14 -110 -68 59 96 -144 -21 169 -186 -93 63 -29 1 -59 126
7076 126 26 233 -28 7 20 -73 36 185 82 -38 69 6 8 144 124 51 148 -233 -66 106 28 46 -57 -102
7100 -102 -77 90 -69 -20 -10 113 39 -82 -161 -36 -27 268 -24 -183 -65 187 83 -25 -56 -215 17 242 46
7123 46 -58 -73 -161 176 83 61 89 63 96 110 37 143 -168 90 3 11 74 -106 7 -109 23 -46 -96 106 190 198
7149 198 105 134 45 5 25 -125 -53 -90 -51 31 -55 102 -13 -36 39 -64 92 -226 -201 0 21 112 -22 -127 173
7174 173 108 -5 200 103 -28 -13 26 55 146 35 188 -343 83 -305 -137 21 -87 21 -154 98 155 -128
7196 -128 -209 -23 55 8 -62 -55 165 4 147 140 32 -68 -153 -89 114 -145 -371 -162 -154 194 82 155 -195 -229 -219
7221 -219 72 -67 44 252 41 209 142 -140 134 36 50 77 5 276 86 187 -180 21 -64 -164 -93 -183 -22
7244 -22 71 205 -43 72 -97 -81 -201 -85 -17 77 113 98 158 -114 -31 -263 121 1 7 119 -7 136 100 -72
7268 -72 -145 -147 15 7 -41 145 121 154 20 47 30 4 -290 77 -14 -203 58 226 37 244 42 10 34 -178 19
7293 19 54 -41 -50 147 48 6 -65 65 -84 99 238 39 -74 -78 -224 -28 -62 21 11 -153 14 -146 56 -179
7317 -179 -132 -53 46 4 42 81 -72 265 131 -48 -55 52 74 54 77 328 30 66 13 -213 66 -49 -41 51 12 64
7343 64 -106 29 67 60 -28 11 248 -20 131 102 199 90 -132 152 74 -70 94 -63 -157 232 149 83 -274 -27
7367 -27 33 -70 -115 78 250 -151 82 124 18 41 72 86 144 34 -6 35 243 -140 104 67 231 -41 75 -27
7391 -27 7 211 68 16 -47 -27 -151 -94 0 78 -24 12 30 61 136 -8 -82 -46 -157 -35 90 100 48 -111 -177 1
7417 1 -39 -57 -59 -49 9 170 -32 -15 -7 10 78 25 73 134 -21 64 -155 171 -214 47 81 168 -43 -73 111 -108 179
7444 179 -111 -231 66 58 -267 -50 -217 25 -163 -57 -187 -20 -189 -53 -73 105 202 136 -182 -97 -19 -42 -170
7467 -170 -80 26 -111 207 77 -19 63 7 -165 19 -173 149 163 -36 120 -65 -19 -15 -135 -137 -78 62 131 72
7491 72 142 -93 -204 12 -177 113 -69 -32 -88 -55 -261 48 144 -52 -153 -31 -21 -174 -102 -36 80 299 88
7514 88 150 158 -116 96 -46 -103 -49 86 71 59 -50 -194 -132 -66 -42 62 -140 44 69 11 50 194 196 -113 -53 44
7540 44 -27 -189 38 58 -99 80 -9 239 105 252 79 -105 5 -119 -83 100 -114 31 -173 -45 -42 -207
7562 -207 -114 -132 81 -238 -123 11 -48 -115 -21 106 -225 41 -17 -24 -316 -44 138 36 -23 -119 128 -5 29 126
7586 126 56 -36 63 15 54 28 -50 104 57 0 78 -157 46 -11 -44 -75 164 93 -3 270 -71 -135 -93 25 17 -300
7612 -300 -66 52 16 68 87 26 223 75 -195 -16 -161 124 223 181 -250 82 148 197 134 -237 -172 -88 73 -76
7636 -76 -153 0 105 102 68 -45 197 129 -52 135 122 -46 131 213 56 -145 148 121 43 6 159 107 294 -94
7660 -94 -56 -33 -134 130 -68 -26 108 52 182 -88 -191 -155 18 226 17 130 -112 134 -81 7 -31 174 -81
7683 -81 -37 36 4 2 107 -13 -27 -6 -141 29 -83 73 182 17 -6 99 -78 17 -10 59 -211 -43 -70 -51 -17
7708 -17 -126 -76 -135 -28 70 -25 -94 -3 -15 109 168 165 -62 108 43 -136 163 199 -49 -118 -153 -50 -230 -115 -32
7733 -32 -12 28 -68 47 183 -26 -79 -30 68 15 -115 168 -45 -152 -97 118 -10 -75 -12 157 11 58 202 -94
7757 -94 51 173 95 71 272 151 115 -54 -150 -107 -30 93 -47 -108 32 -7 90 8 -19 -264 176 46 -42 -37 -49
7782 -49 -328 147 -205 -92 -44 -12 181 -199 143 8 -325 -50 81 -84 -248 0 -162 77 -68 -49 229
7803 229 16 149 125 -72 122 -17 -8 248 37 193 162 -20 -167 69 122 -41 -132 -33 97 79 27 47 164
7826 164 -313 -101 -15 89 72 15 98 -137 129 -152 52 84 -219 79 -67 98 -150 187 167 218 34 33 -48
7849 -48 259 -220 -131 -186 -118 88 -181 49 -13 -35 148 54 127 50 -41 85 17 -19 231 -93 -161 -93 21 208 -167
7874 -167 31 42 -238 -198 -130 55 58 188 -21 -91 106 -115 -127 9 -116 33 164 7 -153 -20 52 113 -204
7897 -204 -201 264 241 -165 93 -20 66 76 -16 46 35 50 105 -52 -125 51 105 -89 -53 39 -122 -142 16 124 86
7922 86 82 -184 -349 -22 36 -2 8 94 -137 193 38 48 -88 -124 -70 2 -36 -221 47 46 29 -179 -48 -79 -281
7947 -281 -44 -20 -37 -133 -35 -30 -82 82 62 35 -194 111 152 30 -137 139 -117 -110 -1 176 -219 18 -64 118
7971 118 -172 -91 -9 42 213 -69 270 -92 -24 -14 71 45 -60 -121 27 115 -33 42 127 133 7 -32 -39 -98 120 212
7997 212 291 10 -4 254 44 -65 1 -95 61 98 -10 28 24 -52 26 -61 41 -147 37 -112 -12 -10 -212 154
8021 154 153 -7 147 -142 93 -150 -53 -48 -95 85 -122 2 -89 -72 -179 84 116 -156 -113 186 6 -64 73 162
8045 162 -36 -119 139 -72 37 227 32 -195 70 -2 -115 117 124 140 24 48 -45 43 65 95 -49 -20 11 76
8069 76 45 90 95 -200 -40 -44 155 -100 57 143 -94 23 160 122 119 60 237 77 167 -41 130 188 168 67 -58
8094 -58 -9 28 168 183 1 -101 103 11 -117 69 14 157 78 99 55 -165 -74 -11 4 9 239 -40 -7 8 73 -137
8120 -137 -27 -169 -95 -170 88 -10 -8 64 -28 -75 -95 90 138 42 65 156 -183 241 -199 -58 155 21 66 38 -99
8145 -99 -139 167 109 -61 25 -8 72 -43 25 -166 -117 194 27 -95 -76 -50 -99 130 228 154 33 -12 -206 167 -12
8170 -12 2 30 -1 -190 -64 53 20 191 38 262 -9 -48 187 136 -7 78 194 12 73 -31 -39
8191c9
##END NTUPLES=NMR FID
##END=
