##TITLE=1H_Bay-i-VN
 DMSO+CDCl3, 8 sc, 
 23.12.2019
##JCAMPDX= 6.0         $$ Bruker NMR JCAMP-DX V2.0
##DATA TYPE= NMR FID
##DATA CLASS= NTUPLES
##ORIGIN= UXNMR, Bruker Analytische Messtechnik GmbH
##OWNER= root
$$ XWIN-NMR		Version 3.5
$$ Mon Dec 23 13:57:59 2019 Russian Standard Time (UT+4h)  she@DPX200
##.OBSERVE FREQUENCY= 200.1315
##.OBSERVE NUCLEUS= ^1H
##.DELAY= (6, 6)
##.ACQUISITION MODE= SIMULTANEOUS
##.ACQUISITION SCHEME= undefined
##.AVERAGES= 8
##.DIGITISER RES= 18
##SPECTROMETER/DATA SYSTEM= spect
##.PULSE SEQUENCE= zg30
##.SOLVENT NAME= DMSO
##.SHIFT REFERENCE= (INTERNAL, DMSO, 0, 15.7039)
##AUDIT TRAIL= $$ (NUMBER, WHEN, WHO, WHERE, WHAT)
$$ ##TITLE= Audit trail, XWIN-NMR		Version 3.5
$$ ##JCAMPDX= 5.01
$$ ##ORIGIN= Bruker BioSpin GmbH
$$ ##OWNER= she
$$ F:/spectra/data/she/nmr/H-F/1/audita.txt
$$ ##AUDIT TRAIL=  $$ (NUMBER, WHEN, WHO, WHERE, WHAT)
(   1,<2019-12-23 13:57:01.26 +0400>,<she>,<DPX200>,
      <created by zg, POWCHK disabled, PULCHK disabled
       configuration hash MD5:
       00 E9 B6 7A A2 85 ED C7 34 08 36 98 17 FE 4E 26
       data hash MD5: 16K
       1A EE 58 2F DB 65 C0 81 F3 F1 4E 37 0F D9 53 84>)
$$ ##END=
$$ 
$$ hash MD5
$$ 0B 7E 63 94 80 E1 7A 10 1B 36 88 D3 3C 00 D5 95
##$RELAX= 
##$RELAX= 
##$RELAX= 
##$RELAX= 
##$RELAX= 
##$RELAX= 
$$ Bruker specific parameters
$$ --------------------------
##$DU= <F:/spectra>
##$EXPNO= 1
##$NAME= <H-F>
##$PROCNO= 1
##$TYPE= <nmr>
##$USER= <she>
##$AMP= (0..31)
100 100 100 100 100 100 100 100 100 100 100 100 100 100 100 100 100 100 
100 100 100 100 100 100 100 100 100 100 100 100 100 100 
##$AQSEQ= 0
##$AQ_mod= 1
##$AUNM= <au_zg>
##$AUTOPOS= <>
##$BF1= 200.13
##$BF2= 200.13
##$BF3= 200.13
##$BF4= 200.13
##$BF5= 200.13
##$BF6= 200.13
##$BF7= 200.13
##$BF8= 200.13
##$BYTORDA= 1
##$CFDGTYP= 0
##$CFRGTYP= 5
##$CHEMSTR= <none>
##$CNST= (0..31)
1 1 145 1 1 1 1 1 1 1 1 1 1 1 1 1 1 1 1 1 1 1 1 1 1 1 1 1 1 1 1 1 
##$CPDPRG= <>
##$CPDPRG1= <>
##$CPDPRG2= <>
##$CPDPRG3= <>
##$CPDPRG4= <mlev>
##$CPDPRG5= <mlev>
##$CPDPRG6= <mlev>
##$CPDPRG7= <mlev>
##$CPDPRG8= <mlev>
##$CPDPRGB= <>
##$CPDPRGT= <>
##$D= (0..31)
0 1.2 0 0 0 0 0 0 0 0.06 0 0.03 0 0 0 0 0.0002 0 0 0 0 0 0 0 0 0 0 0 0 
0 0 0 
##$DATE= 1577095020
##$DBL= (0..7)
120 120 120 120 120 120 120 120 
##$DBP= (0..7)
150 150 150 150 150 150 150 150 
##$DBP07= 0
##$DBPNAM0= <>
##$DBPNAM1= <>
##$DBPNAM2= <>
##$DBPNAM3= <>
##$DBPNAM4= <>
##$DBPNAM5= <>
##$DBPNAM6= <>
##$DBPNAM7= <>
##$DBPOAL= (0..7)
0.5 0.5 0.5 0.5 0.5 0.5 0.5 0.5 
##$DBPOFFS= (0..7)
0 0 0 0 0 0 0 0 
##$DE= 6
##$DECBNUC= <off>
##$DECIM= 24
##$DECNUC= <off>
##$DECSTAT= 4
##$DIGMOD= 1
##$DIGTYP= 9
##$DL= (0..7)
0 120 120 120 120 120 120 120 
##$DP= (0..7)
150 150 150 150 150 150 150 150 
##$DP07= 0
##$DPNAME0= <>
##$DPNAME1= <>
##$DPNAME2= <>
##$DPNAME3= <>
##$DPNAME4= <>
##$DPNAME5= <>
##$DPNAME6= <>
##$DPNAME7= <>
##$DPOAL= (0..7)
0.5 0.5 0.5 0.5 0.5 0.5 0.5 0.5 
##$DPOFFS= (0..7)
0 0 0 0 0 0 0 0 
##$DQDMODE= 0
##$DR= 18
##$DS= 0
##$DSLIST= <SSSSSSSSSSSSSSS>
$$ [...]
##$SUBNAM2= <"">
##$SUBNAM3= <"">
##$SUBNAM4= <"">
##$SUBNAM5= <"">
##$SUBNAM6= <"">
##$SUBNAM7= <"">
##$SUBNAM8= <"">
##$SUBNAM9= <"">
##$SW= 24.9337058887773
##$SWIBOX= (0..15)
0 0 2 0 0 0 0 0 0 0 0 0 0 0 0 0 
##$SW_h= 4990.01996007984
##$TD= 16384
##$TD0= 1
##$TE= 0
##$TE2= 300
##$TE3= 300
##$TEG= 300
##$TL= (0..7)
0 120 120 120 120 120 120 120 
##$TP= (0..7)
150 150 150 150 150 150 150 150 
##$TP07= 0
##$TPNAME0= <>
##$TPNAME1= <>
##$TPNAME2= <>
##$TPNAME3= <>
##$TPNAME4= <>
##$TPNAME5= <>
##$TPNAME6= <>
##$TPNAME7= <>
##$TPOAL= (0..7)
0.5 0.5 0.5 0.5 0.5 0.5 0.5 0.5 
##$TPOFFS= (0..7)
0 0 0 0 0 0 0 0 
##$TUNHIN= 0
##$TUNHOUT= 0
##$TUNXOUT= 0
##$USERA1= <user>
##$USERA2= <user>
##$USERA3= <user>
##$USERA4= <user>
##$USERA5= <user>
##$V9= 5
##$VALIST= <valist>
##$VCLIST= <CCCCCCCCCCCCCCC>
##$VD= 0
##$VDLIST= <DDDDDDDDDDDDDDD>
##$VPLIST= <PPPPPPPPPPPPPPP>
##$VTLIST= <TTTTTTTTTTTTTTT>
##$WBST= 1024
##$WBSW= 4
##$XGAIN= (0..3)
0 0 0 0 
##$XL= 0
##$YL= 0
##$YMAX_a= 350704
##$YMIN_a= -251615
##$ZGOPTNS= <>
##$ZL1= 120
##$ZL2= 120
##$ZL3= 120
##$ZL4= 120
##$ABSF1= 10
##$ABSF2= 0
##$ABSG= 5
##$ABSL= 3
##$ALPHA= 0
##$AQORDER= 0
##$ASSFAC= 0
##$ASSFACI= 0
##$ASSFACX= 0
##$ASSWID= 0
##$AUNMP= <proc_1d>
##$AZFE= 0.1
##$AZFW= 0.1
##$BCFW= 1
##$BC_mod= 2
##$BYTORDP= 1
##$COROFFS= 0
##$CY= 11.3945322036743
##$DATMOD= 1
##$DC= 2
##$DFILT= <>
##$DTYPP= 0
##$F1P= 16.9975609425685
##$F2P= -3.02152046262296
##$FCOR= 0.5
##$FTSIZE= 0
##$FT_mod= 4
##$GAMMA= 1
##$GB= 0.15
##$INTBC= 1
##$INTSCL= 1
##$ISEN= 128
##$LB= 0.24
##$LEV0= 0
##$LPBIN= 0
##$MAXI= 10000
##$MC2= 0
##$MEAN= 0
##$ME_mod= 0
##$MI= 1.114404
##$NCOEF= 0
##$NC_proc= 0
##$NLEV= 6
##$NOISF1= 3.799351
##$NOISF2= 2.8
##$NSP= 1
##$NTH_PI= 0
##$NZP= 0
##$OFFSET= 15.70392
##$PC= 1
##$PHC0= -10165.32
##$PHC1= 39.0008
##$PH_mod= 1
##$PKNL= yes
##$PPARMOD= 0
##$PSCAL= 0
##$PSIGN= 0
##$REVERSE= no
##$SF= 200.130013532006
##$SI= 16384
##$SIGF1= 3
##$SIGF2= 2
##$SINO= 400
##$SIOLD= 16384
##$SREGLST= <1H.CDCl3>
##$SSB= 0
##$STSI= 0
##$STSR= 0
##$SW_p= 3612.71676300578
##$SYMM= 0
##$S_DEV= 0
##$TDeff= 0
##$TDoff= 0
##$TI= <>
##$TILT= no
##$TM1= 0
##$TM2= 0
##$TOPLEV= 0
##$USERP1= <user>
##$USERP2= <user>
##$USERP3= <user>
##$USERP4= <user>
##$USERP5= <user>
##$WDW= 1
##$XDIM= 8192
##$YMAX_p= 0
##$YMIN_p= 0
$$ End of Bruker specific parameters
$$ ---------------------------------
##NTUPLES= NMR FID
##VAR_NAME=  TIME,          FID/REAL,        FID/IMAG
##SYMBOL=    X,             R,               I
##VAR_TYPE=  INDEPENDENT,   DEPENDENT,       DEPENDENT
##VAR_FORM=  AFFN,          ASDF,            ASDF
##VAR_DIM=   8192,          8192,            8192
##UNITS=     SECONDS,       ARBITRARY UNITS, ARBITRARY UNITS
##FACTOR=    0.0002004,     1,               1
##FIRST=     0,             0,               0
##LAST=      1.6414764,     0,               0
##MIN=       0,             -251615,         0
##MAX=       1.6414764,     350704,          0
$$ Real data points
##PAGE= N=1
##DATA TABLE= (X++(R..R)), XYDATA
0@%%%%%%%Qj6J6j6J6k4L2m0M8n6P0q4J01j17J34j57J81k07K40k74L11l55M02m52
31b39N09n71O41p20Q01q90R92j103J224j356J498j658J835k032K254k502K781
48A464l099L467l896M405n017N776o745Q023r810J2502j7073K6863q5868J41493
62G2485K12675j27023k33958j75794M3678J81626J93253J8508j56218j95183l9708
73b05659J21620J68884P1200o1198j53150j14922K8642J63127J34246k2368j48036
84a7614j18334O259J10972J13539K6754q5765j17732l9524P3257J02509L8342
95I2663m3332p5993n4253M362O6861P8002J1277p0202q1262j2720N8646P1206
107D5255K5211l8925p0801l8369L5640P2401L4376l1568n3335k4299J2646L2039
$$ y = [0, 0, 0, 0, 0, 0, 0, 0, 8, -8, 8, -8, 8, -16, 16, -24, 24, -32, 38, -46, 55, -62, 72, -85, 96, -111, 129, -145, 166, -189, 213, -239, 270, -301, 340, -380, 421, -469, 523, -580, 644, -712, 786, -872, 963, -1069, 1185, -1317, 1464, -1635, 1832, -2064, 2341, -2676, 3100, -3645, 4378, -5432, 7070, -10003, 16860, -69008, 72485, 285160, 158137, -75821, -251615, -207937, -26311, 166942, 185450, 29232, -165951, -205659, -84039, 84845, 156045, 94847, -58303, -173225, -144583, 18544, 152790, 130422, -17614, -135948, -129689, -18717, 94822, 121576, 35811, -81921, -121445, -48188, 54321, 92663, 49331, -26662, -80915, -76553, -9692, 68310, 79587, 9385, -71877, -84597, -25951, 45255, 70466, 31541, -39260, -77629, -41989, 30412, 64788, 33220, -20115, -44414, -31768, 271]
119B71L3213J0653k7167m3747j6054K6674L9040J7342j4522l5164k9905M543M0573
132E750L4004j1874m1489k4411J1339K5378J6267N18j4629k1701r028J3079K1498
145D701Q238p929j3262j2009k780J3577K3169O700j9532k3397N13J9790J6960
158A4739Q20j1753j3443m503Q908J4912M198q905q710j713J410J976O048O735
172A0719l378j3025q158O999J3534M930p372j0360n351M393J0487O119n285r648
186e396k261N987M971n11j49J395j916m604k80N830N164p30m962m694o50M952
202B146O430M45p752o735K298P165J649m277l389m4P00m71k13J549j57q89j692
219c237j662J9L393L580j018o143k274M781N516k9m456k196J777K860J094n21
$$ y = [271, 33484, 44137, 16970, -26777, -42831, -16157, 22883, 40225, 25703, -9461, -39366, -34823, 5750, 39754, 27880, -13609, -38020, -26681, -1303, 14964, 15482, 853, -20848, -29876, -16797, 4701, 12939, 5010, -8252, -20261, -23041, -9464, 13705, 20405, 873, -22524, -22011, -2221, 14739, 15559, 3806, -9637, -14140, -5232, 9680, 13878, 4973, -3737, -5450, -4040, -2064, 3984, 10719, 7341, -5684, -13842, -6843, 6691, 11621, 4249, -6111, -11462, -7069, 3418, 9537, 4252, -5396, -7657, -1670, 3301, 2790, 2641, 4036, 2120, -2484, -2764, 3066, 8230, 7500, 2538, -2156, -2806, 2146, 8576, 9021, 1269, -5466, -3168, 3997, 5646, 1369, -2020, -2064, -1364, -1835, -2048, -499, -656, -1545, -3237, -4899, -4880, -1487, 2093, 1075, -5068, -7342, -2561, 2955, 2926, -1530, -3726, -1949, 911, 2005, 1484]
235A484j016J94P71N60r71o63J755J800j551l211r41L164K774j716l753j217J587
252i50K445L19j786k332n7J771J562j340j373O95J554j83j717l0K081J899q26
269A732k011k50J750J771J52j494j771P98J970J120j813j936O89J435n6j504j051
286d69N77J090q74j305n66L96J027K9j501j382O93K012M30j656j343R53J833L07
304B51r81o04O01J467J50o50n31J003P67L89r53r84J018J276j02j437j034P68
322D14Q86J8j068q28k63J251L95j341o64k05J392j43p61r25L22J366L45j127q15
341a751Q64J531J4o37j032Q25J000O44p54q93Q35J306q2r05q69O96N35J19p80
360F66r54K81P87J13p79j062L24N87K2q58r49L81P10L76p48o27L50R19K92m19
$$ y = [1484, 468, 662, 1433, 1993, 1022, 359, 2114, 3914, 2363, -848, -1789, 1375, 4149, 2433, -1320, -2537, -950, 1495, 1814, 28, -2304, -2361, -590, 972, -368, -1741, -1046, 508, 325, -1392, -1422, 659, 2558, 1732, -279, -529, 1221, 2992, 3144, 1650, -121, 677, 2647, 3767, 1954, 18, 707, 2142, 2086, 582, -469, 108, 1198, 324, -981, -1547, -1151, -124, -95, -1596, -2978, -2285, -273, 157, -1499, -2842, -1889, -56, 251, -730, -1334, -733, 734, 884, 234, -297, 706, 1473, 1862, 909, -75, 943, 2219, 2117, 680, -354, 414, 1300, 1318, 250, -578, -841, 410, 805, -536, -1200, -1405, -13, -156, -917, -1842, -1520, -154, 191, -936, -1751, -887, 644, 658, 21, -1011, -186, 814, 1458, 704, -189, 646, 1952, 1870, 965, 96, 792, 1327, 1446, 666, -288, -7, 780, 893, 114, -948, -624, -37, -15, -873, -1822, -1441, -731, -355, -1103, -1730, -1380, -461, -169, -588]
380e88o63j06J176N84j98p50K91J168J28o65n96L66J200K47n22p04o5Q73j31m92
400E53o37o7O62p4o01o93K2O79k19n14m30j46P26M49o64j51j59Q92O76m32o40
421g68K99N34L28o2l95J00Q46N5k83o40M76M86J79j94p68L8L65K96p46k46KL20
443B22p6m18m72l08P74Q5n19l33j98K15N97j55k68j68Q97J06J21p35K87N09J42
464C05J12l89M08J44N35n53j18J63N06j91l34m12l23N32N0k60n15Q7L8n6P9o37
486h29j39M47r0N9m57L76K8J88l6j52m0M19K86J25m85L84J74K93j34j84l9O42
508H36L77o61J45k4p6K74p6m87qLM42n96n32K72m6J19l08k86q8K40J56j72k1k59
532g76L72N06m29o0K1L30M83m92n5K45L93jK14k14j58K77N1j56k38K73r5K49j45
$$ y = [-588, -1251, -1357, -181, 403, 205, -545, -254, 914, 1042, 377, -219, 147, 1347, 1594, 1072, 368, 303, 1176, 1045, 553, -84, -151, 511, 437, -164, -857, -835, -156, -375, -889, -1319, -1465, -739, -290, -954, -1105, -1264, -372, 304, -128, -768, -469, 65, 393, 331, -64, 36, 882, 937, 654, 14, 490, 976, 1155, 961, 193, 231, 596, 892, 146, -100, -98, 222, 146, -272, -744, -1052, -278, -193, -712, -1045, -1243, -1028, -431, -586, -854, -1022, -125, -19, 102, -633, -346, 163, 305, 417, 28, 436, 580, 1115, 562, 444, 607, 1113, 922, 588, 176, -147, 385, 435, 175, -340, -253, -215, -271, -192, -829, -968, -521, -611, -552, -1009, -633, -605, -417, -453, -605, -645, -226, 60, 185, -300, 84, 258, 551, 417, 233, 194, 836, 1213, 552, 697, 673, 597, 871, 795, 308, 300, 303, 745, 149, -383, -111, -157, -38, -346, -632, -720, -480, -324, -496, -517, -776, -404, 102, -327, -387, -366, -36, 447, -45, -100, 145, 538, 537, 751, 537, 379, 656, 707, 551, 313, 586, 491, 740, 595]
555E95o66J85rM37l56q29M51j5j60j01%j93Q1K12j21J84l63L44K12j80J27j16
577b81M79J97j69j34K33K0R2J03J31r9J7j49L79k84l56J10J10j85j21m9Q7J48
599B79j6o68n1K61j37K78m06l7M2N57k52j56k38L46K79j33J13j81L45M32j67O6
621E56r2j36L57r3k17p8P0L36r1k00j74j19J59j13j78j00J64j46q1r4j50j61J87
644c94k46M23j91R9Q8j5L3j73L49RK00l58M58k37J61K79J40j33j83K41Nk41p9
667B35J82l8n1L2n8p9P1k32j49K43j93O5l87J88j61J73l6K3l29j74M64k58L71
690i8J4J45P3j24K93j79k4K54J68j51j40j5R7p1J52k84J13R5J13k76R6k83R2r2
714c2O0j67j61K72l69j92J9K29j26J79k18N2J4J74q0%J34K84k17M20l85J58L22
$$ y = [595, -71, 114, 105, 542, 186, -643, -192, -207, -367, -468, -468, -661, -580, -368, -489, -305, -668, -324, -112, -292, -165, -281, 198, 395, 226, 92, 325, 345, 437, 540, 671, 572, 589, 440, 819, 535, 179, 289, 399, 214, 93, 44, 131, 279, 263, -405, -456, -195, -332, -54, -460, -497, -455, 102, -150, -306, -544, -198, 81, -52, 61, -120, 225, 657, 490, 556, 464, 328, 685, 592, 375, 297, 367, 703, 612, 412, 238, 119, 278, 165, -13, -113, 51, -95, -176, -270, -420, -581, -394, -640, -217, -408, -309, -221, -236, -203, -376, -27, -18, 182, -176, 282, 45, 206, 485, 625, 492, 309, 550, 555, 314, 235, 417, 379, 328, 360, 302, 223, 294, 62, -87, 156, -37, 28, -359, -171, -332, -159, -195, -172, -501, -675, -211, -469, -98, -84, 61, 134, 10, 303, 124, 100, 354, 522, 371, 231, 216, 313, 242, 394, 110, 223, 318, 431, 155, 251, -32, 60, -32, 28, -139, -300, -28, -397, -589, -570, -341, -467, -288, -506, -454, -440, -266, -346, -346, -212, 72, -145, 275, -110, 48, 370]
737C70L8J55q8r5K14l71J75K23j95l01K85k77L1Lm2j40O8l48K94n98M68J56j64
760a39o6k38kq6J03M4k2j1L65K33l65J80J06J20k8j98j10J65P5M10k18k7K21J3
784E25m8l8l90q8Q6K58j61j35N6j83J26l89LL7L5k96K63K36j54K13m52K23j20
807c93K64Jn5N6J51r6K39J02k22J26J45l04L50k09K52j11j49nj95J42j5m1L74
830D07n15J09k49O2k4j33K35k80K48j88K7j00J03L22K24j51k85O9j55J57M42j99
852A26J65k48Q2K35j33j45K4K4L20k21J75l45P4L33m69j12J9J23l7k33J47N4q1
875a23J44k21K33k18m77O71P1k69j31M4L35o01O43l08M00m22M12k3J40j63L45
896D82k85l22N56j79N6j00k26J0K78n52J05R6n5L76l12N3J96m95L66m53L27k93
$$ y = [370, 408, 563, 475, 380, 594, 223, 398, 621, 426, 125, 410, 133, 164, 167, 125, -15, 53, -295, -1, -599, -131, 25, -139, -205, -443, -445, -531, -428, -384, -406, -417, -52, 181, -184, -4, 102, 222, 194, -4, -114, 51, 126, 536, 318, 291, 512, 525, 477, 439, 49, -39, 47, 305, 144, 9, 65, -118, 8, -381, -378, -341, -306, -602, -339, -103, -257, -44, -496, -273, -393, -129, -128, -183, -127, 24, -72, 167, 269, 47, 173, 318, 14, 364, 155, 407, 296, 147, 142, -53, 89, 74, 33, 407, -108, 1, -248, -186, -210, -343, -108, -388, -140, -328, -301, -401, -298, 24, 248, 97, -188, -119, -274, -117, 325, 126, 291, 43, 125, 360, 227, 82, 106, 130, 450, 229, 404, 59, 133, 466, -3, -115, -96, 27, -10, -243, -96, -42, -123, 21, -200, 33, -185, -662, 9, 80, -189, -320, -276, 59, -542, 101, -207, 193, -229, 183, 160, 300, 137, 482, 197, -125, 431, 252, 308, 208, -18, -8, 270, -282, -177, -81, -136, 240, -72, -19, 177, -318, 48, -405, -78, -371]
918c71J67m1N0k54K62K0l00M70j40j6K85O7k2k77L18J08K5j78n4M7J84j91J37
941B96j93j35l9PK78Q4m01RK34l76J54J10j79J1J33j74J61q8J72k55O1K58m6j18
965c6O3mL6K56k75O7R8M4k00M29k31L3n3j18J18q7K49j07j9k50j19N0p5j71q4
990c86L23k08J29k11j0K80m8l46M32J32L0l21K91k28J9L11r4J62l18L46j07j72
1012FK28j17O1J50L2k30J94j14n3K73m11L07l03l1j59kP7K23k33k13k0L7L59n53
1036d92L95l22R2L08l36K11L21j04o3p7J69P5j29k29N61j90j78L66J9k36j89k89
1058c17O28M7j65j32J9N8l20R3kM2M1J93j14n63Q7J43L88m6j13o0L6qj87K40k27
1083b39K96J65l5K1k17J50M3R1j18k63L82n1j55P7n9N7l04J71k54j71L76k25K53
$$ y = [-371, -204, -245, -195, -449, -187, -167, -467, 3, -137, -153, 132, 199, 177, -100, 218, 326, 351, 173, 119, 166, 350, 159, 296, 103, -32, -71, -64, 214, 298, -103, -94, 140, -236, -82, 28, -151, -140, -7, -181, -20, -108, 64, -191, -130, 128, 82, -36, 27, 23, 59, 315, 40, 107, 205, 249, 49, 478, 247, 280, 227, 109, 227, 140, 389, 282, 263, 13, -106, -56, -131, -302, -386, -63, -271, -142, -353, -363, -83, -131, -477, -45, 87, 117, -204, 87, -141, -122, 189, 95, 257, -61, 285, 178, 6, 234, 117, 178, 328, 360, 130, 324, 210, 157, 430, 19, 326, 23, -8, -167, -169, -92, 131, -102, -315, -335, -298, 61, -492, -97, -419, -327, -19, -355, -144, 177, 73, 10, -67, 102, 177, 48, -181, 380, 190, 12, 378, 397, 161, -28, -317, 311, 358, 193, 61, 80, 138, -182, -89, -91, -49, -8, 185, 71, -492, -405, -262, 126, 80, -33, -93, -57, -65, -252, -12, -239, 57, 222, 187, 208, -9, 141, 184, 275, 157, -106, 276, 225, 70, 147, 88, 145, -159, 12, -242, -413, -37, -262, -9]
1106ik31K86k12j39r5J70N4J06j53pM5j7J87J52l46M28j91K95k14k56N31k86p4
1129B4L16p4R3R1j14l88M8J60j81JJ53m02N1q4q4N36r7n79N70k72OJ79l51R6J35
1154a67J81n9J18k75j4P5K06m8j42J97j51L05j62K2o8L53j35k0O4j60J1l3Q0l28
1178a50L7K24K6j17n5l26L78J73j85j38jN3j62L74k48R3j75j15M93n7M3l7j31
1201cM5Q2J24j14L6p5J8K2J83l33M5O8j29N9j3L60l97j66Q8Q8j67J26j43j91p7
1226d64L42M8j74J24P0q5k72K82j02P5L84l94J08J92j04O2j70K34l31L47q5j48
1248f1J23J36j50J09j66K53k61J55k99J64K26n69M17m8j68j53J95K30n69L26l8
1269a48JP9J47Q2k71L18k31p0K78M2J23k80k8J1r9J48K67k32P2N1j20jj3r4M5
$$ y = [-9, -240, 46, -166, -305, -400, -230, -176, -70, -223, -230, -185, -202, -15, 137, -209, 219, 28, 323, 109, -147, 384, 98, 24, 340, 266, 359, 450, 336, -52, -4, 156, -25, -24, 129, -273, -222, -306, -390, 146, 49, -530, 40, -232, -226, -47, -398, -302, -167, 14, -45, 73, -202, -216, -141, 65, 17, -125, 72, -79, 226, 64, 86, 18, 371, 236, 216, 280, 120, 131, 98, 178, -150, -113, 111, 137, 20, -35, -361, 17, 190, 5, -133, -134, -81, -243, 131, -117, -24, -199, -314, 179, 122, 165, 128, -3, 42, 124, 248, 134, 170, 95, 113, 135, 318, -15, 30, 98, -31, 28, 15, 375, -22, -188, -100, -12, -179, -53, -196, -387, -464, -122, -74, -248, -124, -54, -139, -411, -129, -231, -156, 228, -166, -58, 134, 30, 92, -78, 156, -175, 172, 87, -61, 62, 198, 48, 157, -9, 244, -17, 138, -161, 3, 229, -340, 77, 29, -139, -292, -97, 133, -436, -110, -148, -147, -68, 79, 161, -110, 208, -23, -93, 185, 227, 350, 70, 42, 53, -46, 102, 369, 137, 209, 260, 140, 139, 126, 32, 77]
1294G7L35j65l88R9J39m23L50l44K1M94j91k16J09k41L83M0j73K02l17L19k63
1315a53J55q2j91M32l3k98M41m67L76k48J60L16m88O6K80K9m45L19r8J09k63J22
1337C9j87O80q67L30p0J28j23J17j17k83K0L37K87l32J22O6jp9k26J29j29L77
1359B18J38l63M65n17L70N8m66L91j56l9K9n9j72JJ44M0q5k20K68O3l72K80k83
1382b67K37j53K57l21K6j7N8K12k97L58l3k07K30l07L38J51l50J66j37K29K94
1403D67l88m01K57M8k6J16L57o07J79K58o5pk0m69O08l44j07J99n18N21J10k96
1425a28o8N2J18L25l70J10R8j80P8j33L29K0k33Lk09L86J06n33Q41m19p7J74l11
1448b1J15j20p9J81K6k19k5J07m2j54J26L44k75Jj6m1J15j24K20k12P6l57L46
$$ y = [77, 412, 247, -141, -42, 97, -326, 24, -320, -299, 195, 4, -212, -103, -344, 39, 79, -94, 108, -209, 110, -153, 2, -80, -271, 161, 128, -170, 271, -196, 180, -68, 92, 408, -80, -14, 266, 295, -150, 169, 71, 180, -83, 39, -148, 532, -335, -5, -75, 53, -70, 47, -70, -353, -333, 4, 291, -41, 81, 147, 146, 67, -159, -30, -159, 218, 356, -7, 458, -59, 311, 369, -97, 294, 138, 99, 128, 69, -103, -102, 42, 82, -3, -223, 45, 108, -264, 16, -267, -30, -183, 74, -247, -221, -238, -180, 32, -265, 93, 60, -147, 83, -224, 114, 265, -85, 81, -56, 173, 467, 79, -322, -65, -17, -43, 73, 430, -177, 2, 260, 195, 188, 168, -301, 307, -37, -144, 55, -463, 58, 168, -128, -196, -144, -26, 299, -71, 39, 137, -43, 35, -98, 231, 251, 18, 21, -188, 198, 304, -229, 612, 193, 116, 290, -21, 94, -26, -105, 76, 102, -117, -142, -35, -77, -231, -105, 239, -36, -35, -51, -92, 23, -101, 119, -93, -17, -374, -28]
1471b8J55j04K02l39K17J41j66Q8l1K51l36M1p3N7J46k98r5M0K01J35k34L0q9
1494h9K74m34N90n04M85o85K85J86m01j36J97n9K92j87K51K2l5J47n1j52Qr5j42
1517b33L69K44k62K88k04j86k8k00K14M0J41k82k7K8j66N61m45j21L40N5k87J33
1539b8j1k85K56p7j72M57k75j90K69K46l40O2J31k53M27j67k14K73j27J4J45M3
1561A84j13k03J4Kk47K70rJ33J37j54k64Q0J63J17k38k24L34K9j07J09j61K76
1583A28j18J7Q0j32r8L66k59K2j37K57j84Q5N2j46Q2r0J70p3k31N40n27M61n43
1606b78L99p7Kk38J88j26J34j28L89j96k22J72k53K47j72r9K64R0k15N3%l7J51
1629D8k29K35J39k91K05J94l70J78O5j95L13j18j94J37J2k40O5K28l19J04j7j31
$$ y = [-28, 127, 23, 225, -114, 103, 244, 78, 166, 135, 386, 50, 91, 18, 75, 221, -77, -172, -132, 69, 204, -30, 0, -89, 185, -249, 341, -163, 322, -363, -78, 108, -293, -429, -232, -291, 1, -186, 65, 87, 52, 199, 148, -4, 4, -91, -233, 136, 380, 118, 406, 202, 16, -12, -212, 2, 42, 183, -99, -126, -98, -264, 297, -148, -269, 71, 126, -161, -28, -39, -324, -68, -145, -317, 140, -135, -325, -56, 190, -150, -88, 43, -210, 217, 50, -164, 109, -18, -4, 141, 184, 71, -132, -118, -116, -363, -93, -102, 31, 168, 14, -250, -170, -7, 110, -128, -352, -18, 11, -96, 13, -148, 128, 10, 27, 107, -25, -123, 243, -16, 6, -131, 126, -58, 27, 79, -67, 15, -75, 95, 22, -209, 331, -196, 265, -278, 121, 44, 46, -192, -4, -130, 4, -124, 265, 69, -153, 19, -234, 13, -159, -258, 6, 96, -119, -66, -66, -103, 48, -181, 54, 193, -98, 107, 301, -69, 109, 174, -21, 292, 174, -20, 117, 129, -111, -46, 182, -137, -33, -50, -181]
1651a81K67j64K70q6j91k01J56Q2K86m82K03r7J69k20j45K64J38K52m50K84k25
1672g1J72MN5m30K98m5K87l20K76j41k0l33K07L33l17J69k02l43L41k46L62l37
1694c01K04n7N0K02J86k37j00n0K36j56P1k20K80J45k99P0L8k1k79L15J6m4J89
1717B38j03M9j81r3J06l13P60o84L26l25J56r8J01j58L37l16M5K82j61O1r2J44
1739H1N1o1k52K76k56K42k45K57K65m24J53jP4j48J7k33J71J23l1k64J80O4l4
1762EJ55l59l4m3K16J22n4l06K30m7Q6K87l61K48k54j47L14k27M15k15o7J08L3
1785A05q2J26k20L25q4j3k91mK5n3M54m68J01Q3R7k28J81K30k95R5J18j55J03
1808A50l63r0M31k35Q8k85K76j2j25j39J69J67qj4p6L42M1o91O62l21j65L62k75
$$ y = [-181, 86, -78, 192, 106, -85, -286, -130, -48, 238, -244, -41, -138, 31, -189, -334, -70, 68, 320, -130, 154, -71, 101, 105, 160, -270, 28, -17, 270, -50, 226, 85, 65, -268, -61, 272, -45, 124, -78, -421, -80, -326, 36, -301, -97, -154, -104, 98, 284, 47, -53, -103, 133, -23, 48, -172, 108, 253, -46, 24, 62, 41, -238, 77, 93, 49, 238, 135, 184, 3, -90, 16, -297, 463, -221, 105, -220, -64, -162, -61, -219, 118, -198, -153, 129, -32, 29, -63, 81, 132, 71, -181, 95, -161, 81, -164, 93, 358, -66, 87, 86, 160, 12, 29, -204, -33, 90, 59, -205, -25, 39, 5, 160, -199, -233, -276, -60, 62, 8, -298, -68, -115, -29, 258, -103, 145, -109, -256, 58, -169, 246, 31, -36, 72, 105, 23, 149, -71, 254, 170, 157, -134, -138, -113, -166, 288, -180, -79, 4, 101, -127, 54, 284, -11, 84, 202, 47, 150, -213, -303, 128, -107, -19, -304, -28, -40, -165, -304, -135, 32, 24, 10, -66, 276, 317, -374, 288, -33, -198, 164, -111]
1831a11L36r3l9j37q6l9J83k18M71j89o3j21J50O9J34l74K33K5j89j16K06k97
1853b65L11j44J49k96N19n9m3j8j66K76k81m6J14N1k21K30k01L5J78j31q4l3N9
1876f6O8j85K49m05K54R6Q2j29K05l43L73k69k75M03j95p2n3K52J21J9l70N34
1898B94k43q6J43l60M29J3m33L89K8l40j7rL00j97R8L4m9K7m8k68J82J85k34K04
1922D2j47M76m28J77k67q4J06K98j14j92K26L2J91l09n1J59j34O4L8K6n11P63
1944C61o6m7k34j00K4j00m6K16K95q4Ok57M4j19l11L34K5R3M5j67k86L96j0m02
1968c90J34M29l67q1J42J21j99L44o8j72q3L10j31j12L41q3j96j67l53L68K76
1989F3k69K56j5M2m2p8K5Ok3l0O8Q2j97K9j04P5p7L62m78J3M19j4j81j38K16j6
$$ y = [-111, 225, 132, 93, -44, -130, -169, 14, -204, 267, 78, 15, -106, 44, 113, 247, -127, 106, 131, -58, -174, 32, -265, 46, -98, 51, -245, 274, 215, 172, 154, -12, 264, -17, -63, 51, 102, -119, 111, -90, -55, 123, -8, -92, -125, -66, 2, -183, 66, -339, -85, 11, 93, -36, 169, -174, 199, -70, -345, 58, -137, -209, -262, -10, 111, 130, -240, 294, 51, -35, 108, -252, 177, 190, -243, 146, 174, -166, -183, -192, 108, -89, 9, 43, -6, 21, -27, -295, -113, 72, -162, 42, -105, 371, -57, 120, -147, -231, -125, 173, 59, -133, 93, 125, 316, 7, -44, 115, -19, 45, 83, 109, -402, 361, 295, 248, 14, -86, -62, -162, -208, 8, 303, 219, 225, -32, 12, -107, -418, -84, -59, 34, 79, -88, -374, 22, 12, -390, -256, 173, -194, -275, -133, -12, -211, 133, 65, -107, -190, 120, -11, -123, 218, 135, -61, -228, -581, -213, 63, -206, 50, 35, 77, 35, -43, -18, -12, -35, -65, 3, 85, -112, -83, -187, -112, -189, 173, -305, -292, 127, 113, -68, -206, 10, -6]
2015fn9K14k85O1K8kL06k39j17O5J44J4o6p6J0P7j51Q1q6j2l3M15k89M5o6j82
2041b09k38K23L72l71L59q6m3k72M3m2L80l25J77P8j07L05k07L90o21M1K75M6
2063A68n82M57O4k08J29n9nrJ41N6m12Q6N6l2L45m15L82j81P3k12K96J70p06L74
2087b4K68k56M1J00k2l1r0l37M41l86M88r2j62J87r4n8p4K00j67R3j38J70O9l28
2111b02K03k40K68j42j17Q8K57j61J98J56p15N47n87M52N4J4k00P0J08J12j96
2132c3O0J47P8l68J27K70l18L7j01J63k0j42m1Nk5K16l03M23l61J89k52J93J37
2155H1k78K8J80j39K66l3j32O5j79K71j8k12o9L86m5j5n4k46L12J25k05m87K06
2178a92N5J44k1Lj24K57m9j62K9j69J61r6J11m08M30M5j0j7M4k30l4L78l64K28
$$ y = [-6, -65, 149, -136, -75, -47, -49, 257, 18, -99, -34, 110, 124, 58, -18, -8, 69, -82, -1, -87, -99, -132, 283, -6, 39, -27, -209, -447, -224, 148, -223, 136, 50, 7, -265, -222, -264, 116, -209, -32, 46, -61, 244, 37, 427, -194, -153, 122, 168, -414, 43, 107, -101, 28, -31, -36, -45, 96, 152, -260, -174, -118, -150, 195, -220, 162, -19, 54, -158, 138, 308, -398, -24, 244, -12, 29, 129, 107, 76, -14, -351, 90, -296, 192, 100, -62, 125, 31, -27, -101, 99, -68, 25, -113, 57, 126, -202, 1, -239, 29, -113, -230, -142, 115, -46, 152, 308, -407, 140, -447, 5, 59, 73, -127, -57, 51, 163, -33, 27, 174, 252, -116, 11, 281, -37, 0, -101, 62, 42, -100, -141, -136, -161, 55, -248, 175, -186, 3, -249, -56, 81, -197, -169, 11, -128, 138, 105, -27, 38, -141, 130, 112, -100, -169, 217, 172, 157, 103, -143, 169, 294, 89, -398, -192, -137, 7, -14, -11, -135, 122, 73, -89, -60, -229, -68, -164, -53, -461, -31, 14, 4, -13, 31, -199, -233, 145, -219, 9]
2202IK31q4j39j74R8j06P4J75q7J32l4j47K01j14l2P0l29L60n1m1p5j14M4j44
2226b77RJ92r9K78j89k6J2k17M15j33L6K01j48J22k15l19L80Q2j81L5j24K07L7
2249G8r7O4J91m40K84M36l60l92K85j60mR9M7j54Q0l04K72m5J78n2k5mj11J31
2273ck02J8J7N7J40K1P3n33L81j44J99o2o4K05m20L09l70L77M0J37j86l3J46Q2
2297A85K9q9Q3p0l69K11n2J85j23K60j72j53K40o3o9j05j55L61O1k73L03k57j86
2320b18k6L74J31m15M8K32j49k27N9R8O0j2k4L8K11m3l90K75L4j71L14r3M2J03
2344B51l02L90m33K72j90J83j25N7k10k4K2J03j18J72p4j2KJ50l60K71j61J68
2366C2j83K44k57K1R4Q8J42o6J91r8o8m90J81J16J26j76j68J70j6j58M47p9N0
$$ y = [9, 240, 156, 17, -157, -59, -165, -91, 84, -3, 129, 95, -52, 149, 35, 3, 73, -256, 104, 53, 12, -63, -177, -133, -277, -268, -76, -175, 103, -86, -112, -100, -317, 98, -35, 1, 202, 54, 176, -39, -358, 22, 104, -77, -42, -166, 41, 78, -19, 45, 236, -204, 80, 516, 156, -236, 49, -111, -115, -16, 31, -123, -43, -347, -75, -120, 58, 6, -19, -23, -134, -3, -205, -187, -170, -113, 27, 48, 121, -412, -31, -175, 24, -38, -102, 103, -317, -8, -378, -1, 39, 176, -10, -43, 103, 185, 214, 125, 208, 138, -231, -20, -72, 113, -10, 250, 78, -75, 165, 102, 33, -72, -227, 134, 195, -78, 225, -32, -218, -244, 130, 261, -154, -106, 126, -23, -250, -191, -93, -33, -45, -69, -31, 180, 137, -253, 22, 56, -115, 199, 106, 148, 251, -51, 339, -94, 178, -12, 171, 46, 103, -107, -131, -109, -6, -124, 48, -26, -38, -36, 114, -246, 25, -136, 32, -151, 93, -164, -143, -49, 39, 181, 115, 306, 208, 140, -350, -169, -53, 73, -103, -271, -101, -117, -275, 172, 93, 143]
2389A43p5j22L85l63J02q3J56q8L8n62P49n18J51R9J44j46L5J17q8L9j09K50m39
2412a85K73K8k44J85j53n1K39K7N7l66K01Q8j54j19L0POJ60j5J9r0M33l36J33
2436A73j85p4J34j41oKK08o3k03j31Q4K43j39L48k3k60j11L20j89J54l00K01J26
2459A68P5m00M00j20j59j38J48R0j24j22J1M69l91j66J63o4J73K25k54O3q8p1
2481a12J71J97o4k24k18K27j72K17j11K58j53P4j82J82j31n0K46O2j84m6l50N46
2503A83l63r1Q8K49l8p0K53m43K06M2k76J30j48L50j06R5j8j76J79K4Mj85N1N2
2527ho7P9j17J23j43m9M44K1l09o1p8k6K71R3p5k49J98j45M6N0J46J12k80j03
2551a27N3o6J19k0R8k37K36j87J42J85l93K10K3r8k14J15l1K29N5K2k45l0J37
$$ y = [143, 68, -54, 331, -32, 70, -13, 143, 55, 93, -469, 280, -238, -87, 12, 156, 10, 45, 162, 74, 113, 4, 254, -185, 88, 116, -128, 57, -96, -147, 92, 119, 176, -190, 11, 99, -55, -174, -144, -137, -131, 29, 14, 33, -57, 376, 40, 173, -12, -86, 48, -93, -99, -97, 111, 48, -155, -286, -202, 41, -98, 250, 227, -33, -144, 176, -13, 141, -159, 42, 168, 243, -157, 243, 123, -36, -174, -26, 64, -60, -182, -171, 298, -93, -259, -96, -160, 13, 238, -16, 47, -41, -112, 59, 256, 192, -32, -250, -23, -195, 22, -89, 169, 16, 90, -92, 90, -41, -91, 155, 217, 33, -13, -363, 183, -180, -271, -183, 66, 28, -42, 211, -232, -26, 16, -260, -130, -278, 72, -34, 61, 43, -133, 46, 70, 74, -111, -60, -8, -75, 4, -113, 10, -133, -182, 262, 283, -26, -87, -165, -191, 80, 173, 98, -151, 47, -98, -52, -2, 144, 256, -24, -127, -74, -140, -21, -41, 57, -180, 56, -131, 11, 196, -197, 13, 36, -62, -276, -161, -192, 37, 92, 114, -131, -161, -24]
2574b4j76M09l11L07j17l4l3m24L44j84K66m6J81o9j06K04j19k65J58K60q4j2
2596A25k54L72k72l4K43k72J9J0M1m1P3n5K38k37k3M4K71k10J44k28L4k79K45
2619d6pJ33k50m3K41J51j11r5P8J69k89P9l79N88k57N2r4J7j68O8L29k80k4J45
2643GP4J18k04j22K03j64K3l37N44j94m11K95J63r2N1j01M13l30o7J0n8K87k03
2666i5J14J62j96k33M59k31j26K31K15k39K8Mm2j36m0J19L24m98p3J80J4j49J55
2689e3j13K67k25J98q0o0M6j04M55k81j55L52j54k04L16j67j7J51j16R4l57L49
2711A42j29J94k75o9r6J54Q4M8J96n56L7M5K64j69K14r0O6K80l64o0K57m05K45
2734A3J29j11P8j20J34J03l61J8n4L15j07l71L65r8k51l5K18J61j12o5L45l02
$$ y = [-24, -200, 209, -102, 205, 88, 54, 21, -403, -59, -243, 23, -23, 158, 89, -17, 187, 68, -197, -39, 221, 137, 125, -129, 243, -29, -63, 180, -92, -73, -63, -22, -63, 10, -45, 193, -44, -67, -23, 248, 38, 182, -46, -12, -291, -46, -53, 80, -170, -213, 28, 179, 68, -27, 51, 220, -69, 10, -369, 219, -38, 14, -80, -63, -231, -163, 166, -114, -138, 7, 81, 199, -5, -127, 76, -88, -65, -402, 142, -52, -463, -168, -5, -97, -46, -147, 266, -64, -131, -121, -179, 108, -95, 19, 181, -15, -248, 211, -20, -146, 85, 300, 61, 89, 93, 51, -85, -125, -6, 318, -180, -253, -73, -59, -208, -53, -166, 101, -124, 74, -6, -66, -20, -124, 331, 50, -105, 247, 93, -111, 205, 38, 21, 172, 56, 150, -207, 142, 13, 207, -68, -137, -233, -79, 5, 53, 249, -307, -270, -225, 39, -130, 84, -6, 60, 340, -24, -84, 173, -232, 13, 142, 31, 109, -11, 123, 226, -135, -117, -171, 144, 37, -334, 31, -67, -318, -353, -135, 26, -86, -151, 194, -108]
2756a08J7m6N8k7Q3K82k77j43O5j1Q2k0K37l64L86j97k25K88j81L33j78K22m62
2779a86O5K14o0J86k35j67K43R2k53J43Q2l29RJ93J36k4p4j4J15k02j75j1J00
2802a52K49j23N9J56j59J28m74K77L6j7L19m31L83k98J27o0J15K80j53l73mp0
2824a85K51q5K26n2k97L06p2k51L19o3O2j5q5jj60j17J65l8K43l3k04Q3r9K79
2848A77k43K17j66j27J72k80l1L71j09k9M2k09L96P0k33k22O5J79P5J04k63M0
2870dm5P3K67k05j00j2p7N1J31o9j53N2J69l6j87P3n7J90Pk6o8J51J58m61M7L3
2896i8KK44k95K8n7M81l05J46k49O2L8J40k56J87p9j04K49k11J28k6K81l64j1
2919f9P6rj46N4j16m7K50qj9K30N7k53M1LK88l69o1J66O0j68J19j34J86k06L3
$$ y = [-108, -91, -137, -79, -106, -23, 259, -18, -161, -96, -107, -25, -45, 192, -172, 214, 17, -208, 80, -101, 232, 54, 276, -186, -121, 93, 33, 219, -16, -183, 60, 152, -101, 42, 124, -205, -196, -3, 133, 109, 35, 21, 136, -66, -241, -252, -152, 97, -26, 33, 189, 30, 158, -316, -39, -3, -20, 299, -132, 251, -47, 80, 20, 135, 415, 262, -111, -115, -185, 66, -19, 207, 155, -142, 164, 92, -159, 160, 97, 159, 144, 59, 58, -102, -219, -54, -92, 151, 118, -86, -3, -102, 177, -66, 151, -15, -142, 30, -250, -281, 90, -19, -48, -6, -215, 181, 251, 18, -204, -139, 40, 115, 219, -44, -4, -49, 24, 291, 86, -14, -26, -103, -52, 79, 10, -143, -91, 78, 42, -145, -72, -129, 61, 68, 42, -26, 125, 283, -178, -131, -98, -96, 148, -147, -119, -176, 305, 0, 146, -103, -41, -3, 137, -119, 68, -11, -115, 134, -77, 51, 25, 306, -58, -69, 7, -2, -148, -94, -210, -257, -7, -15, -34, 196, 253, 0, 41, 44, 332, -37, -98, 68, 128, -40, 79, -55, 131, -75, -42]
2944d2j89K09J30q3J58l58K36j52K73j96j50J05J79j70O6j03J93k32o2L02j40
2965b6Q4N7L3j17K4j62J66J10k94p4N27k17P7q1l23K12j0L4L63m36K03N2j02J30
2989B30j84J8n1j12K32j59J0j94M59k11r1L02j88o4K39k97q8K65j4j62J67l9L
3012G1k1o7M7j18j04K87j46R9j1J56j75n5k93N88j82K8K33n73J67K36k80N2k52
3035c13M48j19J21j07J36l07K97j39j35J91r1J88j86L9J85k29l0J59q7l25J47
3056a57L83k32pp8J45l02K47j6J63j63p9J31l0N7j29k1J46l43M97l13J01J5J24
3079A39m80K93L02J51m47oJ24O3P5j37%Q4nO8j97K51n5r5J15j4j92K25j02o7r2
3104AJ81k95K87l4l79L77o9K00m36L53k24J08ON5r4K21j66J33l96J52L22l14M7
$$ y = [-42, -231, -22, 108, 25, 183, -175, 61, -91, 182, -14, -164, -59, 120, -50, 16, -87, 106, -126, -188, 114, -26, 58, 115, 148, 31, 55, -107, 59, 169, -125, -199, 328, 111, 188, 107, -216, -4, -14, 20, 383, -53, 150, 202, 100, 230, 46, 64, 13, -99, 133, -26, -16, -210, 249, 38, -53, 249, 61, -3, 236, -61, -149, 116, 102, -60, 107, 68, 71, 50, -17, 30, -88, -192, 95, -51, 48, 37, 193, 18, -37, -330, 258, 76, 104, 337, -236, -69, 167, -113, -61, -313, 135, 16, 137, 30, 166, -141, 156, 17, -118, 73, -18, 170, -16, 23, 208, -21, -51, 108, 21, -304, -157, 226, -6, -13, -91, 54, -248, -1, -17, 146, -17, -96, 35, 5, 62, -67, -88, 58, -285, 212, -101, 0, 15, 139, -341, -48, 254, 405, -42, -48, 76, 139, 214, 77, 77, 161, 156, 224, 27, 278, 223, 128, 243, 229, 37, 262, 160, 93, 1, 182, -113, 174, 140, -239, 138, 69, 269, -167, 186, -38, 70, 76, 131, 37, 258, 92, 225, -171, -19, 303, -11, 36]
3127C6j05R2J64p9r8j21K02J52q7j56PN7j98j68K81j3j19J4J65j49QM09m44K21
3151G1j23J38k05K9J10j62MJ48kj2r7r3K43K3R0N6O6k81M7o3J27J08p0k33K3n5
3177a13J88k8P6j68J38j61J19J16M8j39l75L89q9k81M13k63K46j1k29J04j20N0
3199i0j24N77k35j68j52J13J05j78J84j50J62o7o7O5J24J31l67nK68j13J70k73
3221i0J55l7l37L90l1K44n07N17k23J29k86j31K33j04L75n25K65j52K55n5J76
3242B61j05L48q08K51N5p5p6N2Q5j54Lj0L02Mj85j01J96J40k79jP2J19j20j09
3266a35J37L45k37N7P3m69N38k18L7NJ30j87J4R5k49Q4J3K47l97q8J32K02lm42
3290c16M47L3M9j47J31k20Q5K05k77l65L20J76l10J55M56o14J26o9K42K5k32J23
$$ y = [36, -69, 23, 187, 108, 10, -111, 91, 243, 156, 0, 7, 64, -134, -302, -21, -34, -153, -139, 26, -123, -115, 294, -150, 71, -52, 86, -119, -90, 20, -142, -138, 10, 8, -4, -101, -194, 49, 72, 162, 218, 284, 3, 50, -13, 114, 222, 152, -81, -58, -113, 75, 47, 123, -45, 93, -68, 51, 167, 215, 76, -299, 90, 1, -280, 133, -130, 116, 105, -124, -20, -140, -90, -214, 363, 128, -40, -192, -79, 26, -152, 32, -118, 44, -23, -90, -25, 99, 230, -137, -142, 126, 13, 183, -90, 65, 28, -309, 81, 50, 294, -213, 304, 81, 210, -76, -207, 26, -78, 297, -228, 37, -115, 140, 85, 261, 156, 504, -304, -53, 2, -73, -149, -97, -12, -166, -163, -173, 129, 133, -52, -153, 43, 183, -96, -97, -25, 94, -26, -135, 2, 347, 110, 167, 240, -229, 309, 91, 128, 133, 263, 76, 90, 185, -64, 20, 33, 280, -117, -205, -73, 129, 126, -316, 131, 164, 213, 66, 197, -23, 62, 267, -10, -375, -55, 121, -189, -34, 422, -192, -66, -135, 107, 132, -100, 23]
3312B3k40m4L90j31Jj18l3K55l01K45j62n0P3P1Q0N8j33J48m6J37k12m4r5J21
3336gk23J59k23M61m75K47j50K49J08J5k40k47N14k57J25m1Kj1r4L8J03M4k79
3359a82K85j84J52j38N6K41k60P8k01K02k19J99K7L9k33J69L4k0K06m8O2m36J87
3382A6k76K13J34k06j27K6O1K11N3k01J99J5J52o0l24R4J1L4J5j90m6K33o2K87
3406B62k61L0N5r1l25L58j21J2K97j43k41q7M14m60O2L10m9p3j13K05k74P2K69
3429A08l07K44j21K05l0n1q3K09j59j40R1O1J47j29N7k7N8k41J04Q4j12lJ31l77
3453b81J04J77K6j60K18n1k01K08p3P3o0j94K17l50N48J5n97N81l2l05L13l15
3475a39j34M17k28J37r2k34K12L61kj13n1m9j26p5Q1P4j01J28k31p0M84j61m00
$$ y = [23, -217, -261, 129, -2, -1, -119, -152, 103, -198, 47, -115, -165, -92, -21, 59, 117, -16, 132, 86, 223, 11, -33, -128, -7, -230, -71, -294, 167, -308, -61, -211, 38, 146, 161, -79, -326, 188, -69, 56, 15, 17, 6, -88, -50, 53, 97, -182, 103, -81, 71, -67, -11, 230, -30, 48, -153, 49, -170, 29, 56, 95, -138, 31, 65, 45, 251, 203, 265, -171, 16, -260, -47, 87, -119, -246, -220, -159, 52, 105, -96, 103, 118, 270, 210, -114, -20, -9, 25, 40, -150, -196, 37, -25, 262, 1, 31, 86, -5, -330, 28, -93, -81, 216, 73, -168, -255, 159, -301, -239, 71, 22, -51, -164, 41, -233, -161, 108, -199, 45, -76, 129, 99, 48, -35, 174, 15, -125, -34, 27, 174, 45, 102, 75, 133, -108, -4, 80, -32, -35, 96, -281, -177, 0, 26, -134, 84, 33, -168, 40, -33, 40, -20, -214, 3, -347, 201, 216, -381, 200, 168, -137, 176, -139, -273, 144, -84, 53, -39, -273, -61, 300, 298, 185, 134, 85, -41, -116, -35, 39, -62, 66, -165, -235, 249, 88, -312]
3498c12L80k77J18L73N0j94J40N7o48M1M08J33p1k60l7QJ99k04J54K16k41J2q8
3521d3l4Kj43K06k43M93j79k06L39m48K27J91L8J92n80J82L02p3j97l51M82k22
3543f5N3J19r9R3j55P1l7j5k22J32J33J4O5k20Q8m0J28J93k16r2J7l00K89L5J78
3568A47k86n2K30L5m53J30J16K64j2J5j13M8p1j7l51L87%J18o7l8l31N21P1q7
3592B04n4j31J6k17K33oq6j36R8o1J77P2k11j06K05q1j68J09J04j43M43k52k0
3615a1j11P1n8j2Q0m7J88k64M38m24k7J49L1j73M8j12J31j18K85L06m71L77j82
3638I4p6p9J36j62J35m1J7K77j49j40J45q4n4J21j63J63j95M6J03j69r7K05P2
3661A05m2j00j40M27m57M52J86l70j80L4p9J66k5J28q6m3j49m2N28l86o6J79k77
$$ y = [-312, 68, -209, -91, 282, 332, 138, 278, 335, -313, -272, 136, 269, 198, -62, -99, -91, 108, -96, 58, 274, 33, 45, -43, -77, -75, -218, -12, -255, 238, 59, -147, 192, -256, -29, 162, 200, 392, -188, -6, 296, 223, 26, -325, 157, -65, -12, 107, 8, 101, -54, 17, -20, -35, -257, -125, 8, 22, 87, -133, -45, -85, 43, 236, 20, -72, -55, -355, -66, -31, 147, -139, -191, 39, 74, -379, -249, -133, 131, 119, 134, 21, 69, -2, -19, -370, 17, 17, 135, 68, 30, -301, 220, 291, 204, 150, 19, 35, -182, 51, 45, -41, -177, -79, -140, 37, 109, -102, -208, -3, -84, -252, -143, -39, -182, 261, 9, -11, -122, -51, -109, -121, -41, -88, 100, -164, 274, -150, -177, -28, 3, -170, -122, -234, -103, -221, 64, 370, -101, 276, 94, 18, -61, 75, -87, 48, 7, 24, 301, 152, 12, 157, 73, 19, 140, -23, 140, -55, -9, 94, -75, -172, 33, 105, 63, -37, -177, 250, -207, 245, 431, 61, -119, -85, -164, 2, -23, 105, 19, -24, -173, -215, 313, -73, -139, 40, -237]
3684b37R5J85j02L8j58L54j91n6j42l10N16J57k08K36l87l38O67k80J03j29J10
3705g7K14k39P4K0k19J31J78r2j9k2K83j57l14K90l8mJ55j2j12j54L10j78J12
3728A30j41J06j55J61n7j53K45k43j0K96k20K32k06M4r6K12n0L3o1O9M0j62pk6
3752a9J30l00K17j83N6K32l18J46K82k66K07M3l89M7j33J92L49j10r6n8J49Qj83
3775Cm4J62r3J39l22P4j92M0p2J96K04o1j16M8J03j57K43k13jL25k74k16K69k44
3799a99j01K79j13J68l51K37Rj3K27k29K02j02j00J76K1l30Q0N2k18M42j25%N4
3822F6J80k40R4j23m7RJ08J17k09J82J43o7q6o4k24q5L47J10Ok25p2Nk21L49K5
3847G8o0J0J51l6j07J15l47o0L14l7k68J44J72j11M19j65n4m75K69k0J27j36K71
$$ y = [-237, -142, 43, -59, -21, -179, 175, -16, -72, -214, -524, -8, 149, -59, 177, -210, -548, 119, -161, -58, -187, -77, 137, -102, -28, -8, -227, -96, 82, -10, -29, -51, 232, 75, -239, 51, 13, 9, 164, 152, 40, -114, 196, 18, 130, -11, 95, -60, 101, 44, -109, 136, -107, -117, 179, -41, 191, -15, 29, -67, 145, 95, 128, 67, 136, 176, 14, 7, -19, 111, -189, 28, -155, -99, 133, -185, -39, 243, -23, 184, 227, -162, -115, -248, -56, 293, 183, 87, 29, 178, 186, 3, -41, 121, 28, 167, -155, -81, -273, -233, -305, -109, 95, 34, -82, -34, 69, -88, 155, -58, -59, 266, -8, -224, 45, -199, -300, -21, -134, 34, -317, -80, -71, -84, 143, -86, 116, 14, -86, 90, 111, -219, -139, -87, -305, 137, 12, 12, 66, 246, 6, 100, -23, -70, -61, 47, 164, -45, 137, 280, 213, 127, 63, -161, -246, 101, 211, 217, -8, -80, -75, -296, 53, 78, 18, 28, 179, 143, 36, 151, -196, -256, 58, 21, -247, -103, 69, -42, 377, 212, 158, -317, -48, -68, 59, -77, 194]
3870A94l09J0M37m02J13J15l3O7J01r7k68j53k4J97r7L33j78N8L74n4n36O5P3
3893a4k3J9j68J90Q8pl80M39J5j13k04J24Jk62J76L75l46N8L3J0J1L8j97J96k32
3918a73J68k7K04K63m61k45K09J70k59J14j84J85l2L53n24K18K05m68L13j24J31
3939C6k95M23j40oj40J17p5K54j71r0p9J44K6Kj85L57k95M56k89j23K93m12J69
3962b3k9k6O4j7K36l49K89k21L14l24j14K60k69K34j84N9O5K37k99M43o02J67
3984h9m0q0J56o5RQ7J1p3r6j13K25rKk99L98J79M2l35lN3k67O00k08m56L52j43
4010a62K41j96K92k73J35j02k40N28k47J29J55k69J87j66L1k36R0L00m56J91m8
4031a16L25l60J56k9ON8J61l22K68j79J67n8j67K56J24r5k77j79p3N65p5j02J75
$$ y = [194, -115, -105, 332, -70, 43, 158, 125, 192, 293, 196, -72, -225, -249, -52, -149, 184, 6, 64, 438, 384, -152, -87, -14, -37, -18, -186, 4, 92, 85, -295, 144, 159, 46, -158, -34, -33, -295, -119, 256, -90, -32, 1, 11, 22, 60, -137, 59, -173, -5, -32, 172, 435, -26, -271, -62, 108, -151, -37, -221, -36, -68, 285, -239, -21, 184, -284, 29, -95, 36, -259, 164, 24, 18, -122, -5, -80, 174, 3, -87, -166, -22, 4, 6, -179, 178, -117, 339, 50, -73, 220, -192, -23, -52, -78, -14, -31, 205, -144, 145, -76, 238, -86, -200, 60, -209, 25, -159, -100, -35, 202, -97, 346, -256, -89, -129, -209, -53, -118, -109, -22, -11, -84, -180, -293, -68, -77, -75, -374, 24, 203, 245, -90, -93, -40, -307, 293, 85, -371, -19, -162, 79, -117, 175, -98, 37, -65, -305, 223, -24, 105, 260, -9, 178, 12, 43, -193, -103, 197, -259, -68, -116, 209, -151, 5, -24, -18, 40, 201, -121, 147, -32, 135, 77, -90, 166, 290, 195, -82, -261, -334, 231, 156, 54, 229]
4054B29k13m0J72j42O4J96j92p8J05k02L52l36L2J7k4L73k90q8j86K64J78j08
4076H3K38m87J09j9Q2j48K22q6j09L5J9J29L26l26Q3k90M0K18l26K09P9M1k99
4099a77J4K25M8m0j78mJ25l7J22r7J28j80J78K7j28m2j9J06J53j51r7M8k92L28
4123F0J01k34n8L73k69K55l60P0K90l07j2J62r0O2j58Mr4k4P1L39l40L22k24J12
4147E1k69M26l75J65J66k38j8R0p7K88L8k20J34l4J37k75J95l22N29m90R6j71
4169a74J3J05R7N1J39j44j46j38J41K2k3P5L8j97k9M6O4J89M9o3j03j2P6k18L68
4194B26l19j1n5L86j17k00k5K64ol20J65K81k58l28J56n8L08j3k12J43r0K13r8
4217C2Q5l9j3K78l36j75K13o3j5J30N4j08j77L57k01j55K95k10L61m52P2J74k4
$$ y = [229, 16, -24, 148, 6, 70, 266, 74, -4, 101, -101, 251, -85, -53, -36, -60, 313, 23, -65, -251, 13, 191, 83, 321, -166, -57, -76, 6, -142, 80, -6, -115, -80, -61, 68, 394, 68, 151, -139, -99, 119, -207, 2, 81, 122, -177, -163, 62, 110, 70, -108, -112, 13, -24, 98, 1, 129, -51, 127, 154, 26, -16, -35, 71, 224, 73, -24, 24, -268, 60, 161, -73, -131, 242, -27, 228, -132, -62, 228, -79, -91, 71, -19, 43, -115, -111, -205, -229, -158, 181, -159, 163, -61, 51, -218, 208, -167, -2, 164, -74, -92, -2, -79, 209, 247, 27, 161, 127, 264, -11, 184, -138, 391, -99, -3, -174, -161, -56, 41, 92, 231, 87, -59, -197, -56, -34, -57, 18, 56, -141, -170, -124, -60, 129, 178, 115, 12, 0, 76, -142, 226, -93, -104, -159, 227, 110, -90, -115, 149, 143, -177, -12, 269, 11, -317, -161, -219, 89, 76, -136, 7, -83, 130, 32, 117, 78, 65, 343, 7, -168, 45, -18, -33, 97, 151, 43, -134, 223, 22, -133, 162, -48, 313, -139, -67, 107, 83]
4240H3m07L68k97J91K5k94L95R6l00J04j66K2N8J73l9k34J02K2k4j50L94m6m9
4263B7l1N0j01J94J30k37j34L00l07M8k14J22l23L59q7M87n21P2J55K35k18n2
4285d6j99J26J66k35L03J52j33Ln8j3j4l03L46j67K1J10L4J89m19j13M14k79p2
4308a87L21J21j83M6m38M93K2l58M26k69j4O6j77J21K26j94k2J21q9O5r0%J25
4331A32j36N6N2J71l70K34j80j88K68L7q3o9J62P4l91K22K06l45K79Q9j76J69
4353B13k79m8L73l17j57K99j17J10P2j11J69j02j58l83L66j32R9j7K3L07m5l1
4375A34l44K23r8K25n1M3J7l14K71j10j87K15q1k4R5J44j19k24J47P8J18L4k28
4398c6k41K98PK46k59k56J02L93k71K79m30k6K24Oj83K39k05L21j09L6k8l34N5
$$ y = [83, -324, 44, -253, -62, -37, -331, 64, 160, -140, -36, -202, -180, -122, 51, 12, -222, -120, -98, -122, -272, 122, 76, 27, -4, 46, -55, 139, 269, 32, -102, 198, -109, -61, -275, -153, -476, -117, -204, 283, -238, -166, -11, 224, 6, -46, -245, -119, 47, -188, 115, 267, 134, 137, 79, 66, 52, -251, 95, -72, -51, 59, 93, 282, -137, -250, 164, -115, -187, 134, 255, 72, 118, -320, 173, 195, -163, 263, -6, -20, 46, -131, -10, 216, 22, 0, 121, 32, 97, 7, 7, 132, -4, 52, 104, 275, -95, 139, -41, -229, 39, 76, -7, -76, 86, 160, -231, -9, 197, -148, 131, 220, 44, 213, -66, -114, 259, -58, -215, 84, -33, 77, 149, 38, 207, 105, -53, -436, -70, -202, -103, -120, -97, 210, 165, 134, -210, 13, -85, 140, 89, 132, 149, -165, 106, -4, -191, 24, -57, -81, 14, 158, 39, -185, -38, 40, 158, 192, -36, -277, 21, 28, 274, 15, -241, -139, 254, -17, 262, -168, -194, 30, 36, -147, 92, -113, 208, 99, 135, 107, -227, -172]
4421a72k6K77L0J9j38o3K22m01K67l94M70j83RK5J07l26J28M9J76j38P8K04r6
4444A24j33j03O3k4J61n1l1J43j36l60M71k94N05k66k3jj09K12j96RQ2j27M5j89
4468b28J65J53j76J2J51J91j85j94J16k2j24K95k5ll29L58j69k93R0K12J02PO2
4491A66J3o9k5L2j3j36J25m24M36rk19J83J72l83L15m64L74k37J70J48k05K74
4513B24j67m5J86j91N9L0q2j38J76j34R5p0K4k01J25N7l09M83k89L23j51K5j5
4536A5p2M6N2k92K92j60K76r2l4m3k55L36j04L52k73l8l0o2l90M88k82M54J4l5
4560A63j77J0J22q3j84L41j33J15L7j93J91k68Q3j32j47L24J3R3k63J61k78J69
4582c6J30k66M22l58K53j42K34m07RJ30J4o7N3K53L7k74J54n07K72M1J65l2M0
$$ y = [-172, -198, 79, 109, 128, -10, -73, 149, -252, 15, -379, 91, -92, -83, -58, 49, -277, -149, -100, 76, -62, 16, 220, 124, -9, -112, -49, -73, 88, 37, 6, 149, 13, -347, 124, -170, 335, 69, 46, 45, -64, 148, -48, -39, 43, -84, -39, -228, -63, 90, -86, -74, 77, 268, 83, -111, 5, -17, -141, 154, 129, 126, -203, 155, -14, -307, -217, -5, 97, 104, 166, 179, 110, 85, 117, 104, -32, 93, -331, 105, 96, -123, 60, 232, -151, 164, -300, 74, -163, 7, 155, -50, 224, 57, 12, 198, 7, 66, 96, 14, -124, 52, -82, 13, -57, -33, -234, -109, -52, -361, 122, -167, 156, 5, 30, 15, -57, -11, 41, -251, 41, -119, 157, 65, 31, -12, -267, 69, -35, 317, 44, 6, -24, -86, -476, 12, -270, 184, 198, 163, -14, -4, 118, 35, -149, 192, 59, 174, 211, 18, 209, -59, 24, -108, -255, 69, 82, 175, -88, 73, -205, -36, 94, -172, 250, -108, 145, 3, 237, -170, -161, -31, -17, -84, -31, 222, 259, -15, 139, -368, -96, -55, 110, 78, 118]
4605A18l43K96m8N7O0j55Q2j63J99j05J13r1j62L9j87K61j54J9L10j53J29k1k81
4628a80J77N8J22jj95j19K00j68L71k42n50N03J34J75m85J28N7R8j17j8K20j2
4650A56j39q7O0K91r4j81K18j76K21l08k47N13Nk35Q4J56k82J65l2l5KK1j44K32
4674A64j88J48k76qm3K08K0k00J76j72K60l37J63K65M1M4l80J05m2Kj17L10j2
4697A31Oj53K00k99K12M7n56L71J33k27J37J62j57m0j5L01m33K32J31P6k0m60
4719b21K75K92k69n0J74N2j88M5m93O17n7j75k6J92j16k6j23QL67Q4l63L48k09
4742A38q3q0k5p4J92O3J29m4l62J43L11k70k11M18j93N4k84K52J64k68j66p0J58
4765a08J15j45l1J27M7J72k78J66Nj67K75j42R5l03L1M22k96K79k28q0J03J3j1
$$ y = [118, -225, 71, 23, 80, 140, -15, 67, -96, 103, -2, 111, 20, -142, -103, -290, -29, -183, -164, 146, -7, 122, 101, -180, -3, 55, 177, 176, -19, -138, 62, -106, 265, 23, -527, -24, 110, 285, -200, -72, -15, 83, -34, -52, 168, 156, 17, -70, -10, 281, 187, 6, 224, 48, 269, -39, -286, 227, 232, -3, 81, 237, -45, 120, 88, 53, 55, 76, -68, 164, -24, 124, -152, -160, -203, 5, 25, -175, 1, -171, 89, -248, -85, 180, 221, 265, -115, -10, -52, -50, -167, 143, 131, 137, -16, 184, -115, 97, 144, -412, -41, 92, -135, 2, 164, 7, -33, -48, 253, -180, 52, 183, 259, 239, -221, 54, 346, 77, 27, 201, 253, 65, 110, -383, 234, 177, 2, -24, 168, 52, 26, -97, -89, 278, 362, -1, 347, 138, 55, -25, -50, -124, 68, 131, 260, 216, -146, -3, 308, 38, -173, 245, 52, 106, -178, 74, 238, -30, -196, -266, -108, 7, -138, -169, -42, 5, 177, -101, 65, 70, -97, 178, 36, 131, -172, -141, 281, -15, 264, 36, -44, 59, 72, 61]
4788F1j83J87l5l59J19O94k77j72j35R9Q0j80J39J80l16K2K45j29l5j00J48q0
4810b7o7K16j18k47Q2M58k49j90J33j59M0J44O9J61k60k09L35j55jo3q8L68K8
4833B01k19j75M09j85L2mqN4Nj14J18j17J64Q6l60J88J51o7j43J45j41J2M4J52
4857B28o16L58J42Kj94K24J51q2j53p1j84QJ18Q0R3k17P5j23K26J65j69o0j1j61
4881a71J96k0l1Q5q4p9q8K31O6j07J11M3N5l81L07l68J76r8R3K38m75K73J86k55
4905i7nJ11J39k81M4J68k29J4J08J81j20j97L18j13j5l4L5J14m64L90k2Q8r7l73
4929c37K78K62k35R3J32J4k26p1K23j11l48N42n9k39K06m4J06J18l84j31L74k75
4951a12J05L3j04J27P1l71L73j06o2L6J41q5N4n0R2K2j19j90O7N3N7l12j08M94
$$ y = [61, -122, 65, 30, -329, -210, 484, 207, 35, -100, -1, 79, -101, 38, 218, -98, -76, 169, 40, 5, -95, 53, -27, -94, 122, 4, -243, -161, 297, 48, -142, -9, -168, -128, 16, 85, 246, -14, -223, 112, -43, -44, -107, -195, 173, 201, -18, -193, 216, 31, 63, 59, 51, 105, 110, -4, 114, -3, 161, 247, -113, 75, 226, 159, 16, 161, 20, 32, 76, 228, -388, -30, 112, 114, -80, 144, 295, 213, 60, -11, -195, -187, -69, 11, 104, -113, -38, -161, 65, 230, 61, 1, -10, -171, 25, 5, -26, 59, -25, -104, -192, 39, 105, -2, 109, 152, 207, -174, 133, -235, -59, -157, -64, 174, -301, -28, 158, -97, -102, 9, 148, -133, -89, 79, -150, -136, -28, 153, 33, -164, 154, 41, 26, -8, 27, 141, -323, 67, 45, 133, 36, -337, -59, 203, -32, 61, 193, 207, -19, -90, 133, 22, -326, 216, 157, -82, 124, 80, 186, 304, -80, -211, 163, -112, -7, 26, -78, 49, 120, -251, 122, 16, -46, -10, 131, 46, 100, 50, 142, 164, 45, -145, -78, -25, 32, -280, -388, 106]
4975A06o6r2o2K17l3Q4k71J94j10N3J35n40L83K46k18lO7q9n6J87j20J78j60o2
4999c2J81L3j35nJ82l44K40j53K21j3K7m43j16L35J83n3K94k83m2Q1l37Q6J5L9
5023c9J73k40N7p4J24j37n8J56P7j56K95l46J58K92l05J44J44k86K7N7j61j27
5045b25M95m31N4J39R7l4J8k62J58j70J0P5j73K82J81k29l99L89k2K40m45L21
5067F9J58m27R7R0M5k00K62j21K43L2l45L58m72K02J19k16O3N2K57k16k52N56
5089C54j97j89m8M5KK44m3k78Q5J46k23Q4KK60L7m02L04k55n1M09m33J53l15J96
5113a13J5P1J66r0j22j58K84Q6j68R7K06l71j39J06o1J07J0K50j37Rj8n1J0K65
5137B54l04K14rK3J48l32j62L2K43J04j34m9k01j36K03K16j87N2l5l7j91N56k93
$$ y = [106, 40, -52, -114, 103, 70, 154, -117, 77, -33, 20, 155, -385, -2, 244, 26, 23, 90, 1, -55, 132, 12, 190, 30, -32, 149, 182, 47, 42, 224, -120, 120, -33, 188, 175, 202, -241, -357, -22, 161, 108, 402, 119, 77, 158, -179, -93, -78, -39, 134, -106, -49, -123, 1, -136, -194, -38, 39, -117, 178, -168, -10, 282, -23, 121, 265, -21, 6, 63, -98, -225, 270, -161, -107, 32, 129, 95, 113, -149, 9, -161, -151, -76, -249, 33, 214, -15, -414, -25, -47, 193, -252, 69, 227, -200, -103, -13, 32, -168, 94, -27, 216, 248, -97, 261, -211, -9, 110, -106, -43, 9, 266, 50, -202, 354, 157, -32, -80, -35, -33, 211, 168, -110, -25, 121, -102, -18, -16, 244, 281, -121, 183, -72, -123, 286, -147, 6, -309, -113, -98, -27, 139, 49, -73, -231, 53, 139, -29, 68, 274, -97, -236, -130, -191, -84, -74, 176, 39, 48, 30, -21, -11, 254, -50, 164, 155, 178, 326, -6, -168, -136, 107, 211, 77, 28, -173, -309, -106, 110, -77, -25, -60, -97, -288, 268, -25]
5160b5m1J21L37m36J18r0p4J72j84J06j25J35n0J56jo3K16k02q9L50m96K94k74
5183a45J39L07k80L7k31K45J70k62L07p4j19r9R9M6j70Q3J77k47L5j68K27K0q9
5206Hk50K87Q2j5O0q2nk02R3Q2k9m23N04j31n3j02J19j60Q9J34J48k82L08m1k04
5231f5K48l82L05j18l39L14J70k46P7O1l11M44k79J26n5J4L21k99Nj79J58J70
5253A40l1q4oK38k77J49j71r3K51p1j73j5K11j58K01p8j83J40LK49k59L3K40j99
5277E7J78l91j36L69j07O0Lo2j21J59J40j55j59M77m60J99l00M35l99K07R9lJ9
5300A09j99k5L74o5k59K49j34n1Q5K84l54k9n6k49J22J15K98o0r5k2o8K0n2J74
5324A12K97l61L1J58k13P1j33L1j20J66l0M4j5L9K08j49m3J1lk26K29N2l14K86
$$ y = [-25, -66, 55, 392, -44, 74, -16, -90, 82, -102, 4, -121, 14, -36, 120, 119, 56, 272, 70, -19, 331, -165, 129, -145, -6, 301, 21, 58, -173, 72, 242, -20, 287, 213, 94, -5, 94, 140, -30, 53, 230, -17, 18, -150, 77, 97, 8, -242, 45, 127, 112, 172, 90, 85, -117, -24, 58, 29, -394, 110, -21, -74, -176, -57, -217, -128, 6, 154, -128, 180, 139, -65, 183, -199, 106, -12, -351, -37, 133, -113, -36, 25, -286, 158, -121, 5, -50, -36, 285, -14, -9, -188, -30, 140, 109, 25, 19, 257, -20, 129, -42, -135, 116, 45, -128, -143, 68, -90, 111, 33, -150, -10, -7, 242, -17, 16, 256, 57, 235, -156, -292, 77, -30, 30, 33, -29, -150, 9, 149, -6, -165, 312, -148, 51, -249, 186, -213, -6, 93, 90, 109, -90, -115, 259, 194, -65, 184, 50, -1, 84, 368, 14, -15, -71, -320, -198, -83, 215, 155, 60, 38, -30, -10, -62, 112, 409, 48, 79, 237, 24, 95, -38, -7, -127, 39, 9, 53, 38, 77, 285, 136, 93, 104, 101, -125, 104, 156, -158, 128]
5348A28q2J74j94N2j22J33M9K29m31l40L10N0J24R1j88j72J38MJO7K10m77K83
5371C7J36n3n6k8n6k17L8J2J22R9j65J32k4r5K37r4l7p1J26j38K62j24J91j88
5395D6j90L45l16J34j56Q3k11L94o3L4j88KJ39n1M8l06N16j5m31K9m5L65O0l41
5419a18j0J89J62j24J72m57N7q0J55p9J32Oq4Q6R3l55Q4L95l99R9L58l62K66l75
5443a89L24k71J73K46l07P0j48J29j29L64n57N40k21L7lk06j41K88j03O5J6J64
5465A41j43O7j81R2p8P6K10k39R1l4k14L92j56j88K13j74K19k62L93l57L53j71
5487E0L1l1k42R6K72k22Q2q2J46j36K95l15N18m04J19l61p5L64k12j56K76K00
5509B13l25K50j19K18k60o5m3L76q6j11L7j25L33k38O2j8O3r6J68q5q6M02m21
$$ y = [128, 46, 220, 26, 78, -44, 89, 138, 367, -64, -404, -94, -44, 80, 171, -17, -189, -51, -47, -46, 21, 231, -246, 37, 173, 120, 64, 36, -20, -237, -199, -187, -65, 34, -131, 1, -23, -118, 119, 25, -12, -83, 43, -95, 167, 43, 234, 46, -144, 201, -115, 19, -137, -54, -265, 129, 66, 100, -88, -86, 53, 2, 50, -256, 260, 245, -186, -157, -202, 163, 223, -118, -128, 61, 223, 99, 271, -186, -129, -209, -54, -133, -1, 5, -79, 7, 100, -255, -171, 224, -175, -76, 282, -80, 186, -189, 135, -136, 37, 283, -24, 46, -102, 27, -102, 262, -295, 245, 24, 61, 58, -148, -289, -1, -104, -39, -23, 141, -2, 65, -116, -24, -102, -26, 184, -55, 36, 2, -212, 180, 24, -164, 49, -125, 94, -168, 225, -132, 221, 50, 81, 50, -192, -96, 176, -46, 36, -46, 100, -36, 259, -56, 462, 58, 177, -184, -259, 105, -107, -263, 13, 213, -112, 138, 19, 237, -23, -88, -131, 245, 159, 48, 85, -40, 293, 55, 117, 99, 162, 66, 234, 149, 63, 465, 44]
5532D4R9k6r4J00K83m59J62p1q3m2R8m65N45j22L20k97k20L23l33K25J72j21J83
5555B21j62j23K07q2k51K21L54n56J03J60j8n3r6J56J68m21J22N9j72l3O3J31
5577bR0k38J49k28J56K5J74J6l2k26m5J19Q9N5p9k88K31n3K15p6K2j00l1J68o9
5602D2L6j70J54J68m22J40l6j14M03J64n68J07K63j12j44P1M5m0P2l33L51j74
5624i7J45m2p6K41j19j06k4j6r7k3K72j26J38l83L79j31j50N55j32l29J41L44
5646C64o40L95k98J19m3J81j02O1J80l87K00q5n6J1J23J1j42K12N9M8l40L62o4
5669A69j86k8J51L6m36J37j68M24Q4N0k10j6K2P7j24n9L07m1N0k4k78o7K62k54
5693a22K12j16p9j36Q4L77j17J5l17J68J90j08o8L11m96K98K1n49L71L0J01j20
$$ y = [44, 143, 117, 23, 123, 406, -53, 109, 38, -45, -87, 11, -454, 91, -31, 289, -8, -228, 95, -238, -13, 159, 38, 221, 59, -64, 143, 61, -190, 31, 385, -171, -68, 92, 74, 21, -75, 81, 249, -172, -50, 9, -163, -196, -133, -2, 88, -150, -1, -229, -73, -48, 126, 142, 110, -116, -161, -42, 47, 102, 23, -265, -34, -87, 128, 52, 74, -26, -57, 111, 42, 78, -92, 62, 230, -192, -52, -88, -202, 201, 365, -203, -96, 167, 55, -89, -18, 27, -13, 59, -274, 77, -97, 48, 6, -70, 171, 52, -54, -78, -94, -191, -214, 58, -68, 70, -313, 66, -65, -215, 340, 208, -121, 20, 364, -276, 119, -179, -60, -103, 78, -24, 37, 217, -170, 30, -55, -111, -100, 23, 34, -108, 104, 163, 211, -129, 233, 169, -17, -45, 106, 142, -294, -157, -325, 99, 183, 233, 23, 7, 29, 106, -18, -77, 230, 189, 239, 215, -63, -130, 132, -122, 90, -26, -105, -241, -157, 220, 103, 118, -199, -31, 159, 51, -17, 294, -202, 96, 117, -432, -61, -31, 70, -50]
5715e0K61P9j60Ll71L11JM2n40P58j46l65R0J93J33j89pl77M16k20K40m22J63
5738a57M13l46J15j29J62L9q0o3OK2L1m1K2k25J82P0R5j21P0n8K79k76J44j38
5762A6j8k41J32J67K87l66k54L90J08m7k39J9r1n2J85j18j25O21m54m5K39J22
5784B36n12K42r5K47k6J27n4k64Q7j48K40j0k40L72n9j52j83J29K77k4j83r8J37
5807D6P1J1l1j8j05J54K50l56k69L67J14j54l47N36n19K9L86k53j5K27k06m3j87
5830c12K36P1J62l24K87j94J09j66K35N6m37j89N45k68J10mO1K21l07K38j04K59
5852B85Pj05L3k37q9Q3Q0j70J22M3j46J28p3j76K49Np5j86K95J80l39L01k37M5
5876B3j62J96k06Q9K68k29l0k6J50n4j04K52j48K2k45J64K5K13q2M0j98k34J73
$$ y = [-50, 211, 290, 130, 133, -238, 73, 74, 116, -424, 334, 188, -177, -87, 106, 239, 50, 43, -334, 82, -138, 102, -320, -157, 256, -90, 25, -104, 58, 97, 17, -46, -40, -18, 13, -28, -6, -231, -49, 21, 116, -5, 65, 7, 286, 10, 154, 16, -2, -243, -111, 56, 343, -23, -277, 113, 221, 174, -65, -46, -137, -189, -4, -122, -247, 374, -80, -125, 114, 236, -276, -34, -129, 118, 92, 219, 165, -99, -12, -160, 80, 70, -170, 202, 143, -9, -192, -63, 214, 190, 7, -91, 46, 117, 128, 97, 79, -26, 128, 378, 22, -247, 120, 234, 80, -267, 269, -250, -221, 165, -88, -103, 124, -82, -125, -312, -76, -5, 157, -167, 120, -74, 35, -131, 104, 160, -277, -466, 79, -189, -79, -83, -22, 199, -108, 130, 26, 285, 292, 187, 220, -17, -106, -23, 57, -113, 9, 52, -94, 34, -39, -215, 34, 39, -36, -222, 73, 253, -86, 215, -22, 23, -139, 57, -149, -60, 208, -21, -51, -77, 73, 19, -85, 167, 19, 41, -204, -40, -15, 198, 116, 156, -42, -276, -103]
5899a03R6O9k11r5MN62j68k11K30l26J54J02j50%M0k69K33p9K55L6l00j81L06
5922fj21m2K04j9L5J4j34N3J47m48M59K1N1ql07K5J4j92K09r8K36m18N55K20j39
5947C11m42M4K13j95L7J8RL04rk13O4J18k69p8J40l7k8n6J68K24m36J05M4j62
5971a26j74%Q1K41J48l70M68l86R7J55nk24M76m17j4K89k96R0K15j32j61k00K78
5994C3R0r4l9P3l05N03k10p6J12K34m26L71m06J99J32l69L64l28M57k79r0J52
6016I8lr7K7j63p2L23m0l54N0p8K31J12j5l1n0J58k11j5K75n2k11r5M13l12J18
6041FJ75n22L53J07j14K46k58J0J03p1l21K62j17J37J8n9j94J81L11j14Jo7J8
6064I1j78L68l96J33l3l04K45K10j75J5J35j11k68N54k22j9L26m17MK45j26j51
$$ y = [-103, -7, 62, -149, -244, -240, 322, 154, -57, 173, -153, 1, 103, -47, -47, -7, -276, -43, -122, 133, 169, -131, -312, -6, -127, -169, 35, 16, 51, 65, -69, -16, 131, -317, 142, 163, 214, 206, -101, -76, -62, -254, -45, -143, 93, -325, 230, 450, 311, -131, -87, 126, -69, -32, -14, -5, 299, 290, 77, 141, 259, -10, -88, 52, 15, -13, -69, 99, 323, -113, -8, 36, -126, -300, -300, -219, 22, 170, -200, 268, -118, -21, 134, 129, -95, 381, -36, -50, 239, -57, 33, 248, 116, -45, -245, 33, 123, 29, -10, 63, -242, 261, 51, -25, 87, 321, -105, 266, -140, 59, 191, -178, 186, -142, 315, 36, -54, 98, 95, -2, 25, -138, -210, 113, 73, -281, -231, -309, -78, 34, 19, -12, -62, 96, -115, -130, 145, 93, -118, -213, 200, -112, 6, 181, -341, 12, 119, 5, 251, -7, 3, 106, 35, -286, -24, -141, -4, 14, -45, -239, -58, 253, 139, 140, 73, 91, -87, 281, -115, 18, -15, -319, -74, 136, -39, -24, 111, 0, -268, 286, 64, 45, 371, -46, -42, 203, 77, -74]
6086g4L1j30J42o3q0K50j99K70k30P7O5K25m14J76J89o3l35J57j39L4K88j91J77
6109A63j45L3l13N37k24K17j42J8j72N9M3j02M0J59l94R8J48J31m2l13L16l8j14
6132c7m2J13j3k0n6J09k14j9K56o2J06l53K72p0q4N7q5J70j64LK97j61k3O8n7
6157iK27r3r6J68o6J89m88j43J41l3J12J28k36o5M5L17l16K85k38K69o3j43K55
6180A47j0n5m6Rp5R8J28k67J79k69J32N8P5l88K79k8J67j10j71J17k3n3k80L66
6204b0J00J29j19r5K07l91J32L71k95r4l74K87j24K48L2k60J53L6K4L28k43n8
6226b6j78K86J75l90K35j81J19k69J27r4K32j35n3J72O7j32J29l09M3K18k12J98
6248B2j89K17j98K71K4k40K56K3j15l28J01J04k66K05j15K43LJ95k81m6q1j1K13
$$ y = [-74, -43, -173, -31, -94, -174, 76, -123, 147, -83, -6, 59, 284, -130, 46, 235, 172, -163, -6, -145, -111, 177, -14, 163, 18, 51, -262, 275, 51, 268, 126, 144, -28, 31, 74, -28, 12, 171, -223, -125, 23, 154, 112, -201, 115, 77, -37, -79, 34, 21, 1, -55, 54, -160, -179, 77, 15, 121, -232, 40, -30, -114, -57, -142, 28, -136, -133, 164, 3, -20, 48, -9, 218, 125, 29, 197, 131, 320, -168, -311, -170, -203, -91, 37, -199, -264, -219, 98, -218, 67, -171, 98, 35, -108, 147, 137, 82, 36, 45, -30, 68, 196, -71, 108, -161, -29, 29, 104, -284, -5, -33, 134, 24, -147, -30, -53, -106, -386, -20, 80, 209, 90, -5, 202, -189, -57, 314, 19, -75, -449, -162, -286, -38, -6, -266, -113, -77, -53, 275, 32, -26, -204, 82, 257, -133, 102, -79, 40, -229, -102, -196, 36, -99, -152, 20, 87, -45, 84, -225, -182, 36, -176, 22, -167, 50, -148, 123, 147, -93, 163, 186, 71, -257, -156, -52, -318, -113, -228, 15, 18, 213, -68, -114, -195, -206, 7]
6271GN0q7K79k74n8Np0L41l86L01k16k46Q3K17J27L3m2P1l40L49o59N58J40n8
6295A25R2k91J13l64L43J9m6K06k78J59j06j32K44K32k80j37J95K17j44l73N0
6316a56O4K0O0o9j8J05n1m7J76m10J91R7j40L41l08j72M71k25N1J05o7O4j42J2
6340d8k35M07O4l31J13J97R3l32J50L7m8l18K50q8p3J92n1m6k03K77J61j01J74
6363B41j86k4OJ69J59j99k62Q1J63k46o1R1J54r1N3L6l28L08Nm6j32K96m17J71
6387e9J70J24m7l16l3N84m34K24l17k50M32l29L38j09K45j92k8N7J3qj45K95n36
6410c21J72R5j30J10k09J53K93k68K10J1l26M82j13k9p3k76J83p0n1K11On9Q7
6433H8j47K8l0j04M1J01P2l18J06K83o6k83q0J7J20J73k6L82o82L26l4o0O9lj16
$$ y = [7, 57, -30, 249, -25, -83, -78, -148, 193, -193, 108, -108, -354, -271, -54, 73, 106, 64, 135, -205, 144, -515, 43, 183, 125, 217, -74, 39, -325, 18, 37, -9, 197, -81, 78, -28, -160, 84, 316, 36, -101, 94, 311, 167, -206, -156, -92, -72, -12, -81, -99, 6, -45, -92, 84, -326, -135, -38, -178, 163, -145, -317, 154, -71, -20, 85, 18, 82, -60, -48, -283, 124, 188, -143, -30, 167, 260, -72, 78, 115, 67, -251, -1, -89, -162, 30, -21, -67, -270, 7, 168, 67, 241, 55, 31, 37, 206, 365, 166, -96, -15, 148, -98, -159, -68, 86, -5, 48, 84, -244, 64, 69, 23, -109, 187, -230, -59, 111, 235, 188, -128, -161, 423, -11, 213, -104, -354, 78, -251, 87, -22, 223, 31, 3, 60, 73, 65, -80, 215, -321, -149, -54, -184, -74, -283, -130, 163, -105, 105, 116, -210, 272, 159, 130, 57, -219, -36, -106, -157, 54, 60, 1, 88, -59, -31, -61, -165, -124, -23, 49, -269, -163, 120, 54, -229, -309, -292, -172, 1, -25, 357, -325, 1, -33, -93, -24, -27, -143]
6458a43J7O1l0k3L44m69L18m5j91K09J27r1j94K29k42J05O9p2J8k0m8K60kk14
6482b7J61J04k40K38j89M5k13Jp7K54M1P9l94N8J17K36R8j78l8k05K29j78L5J62
6506A19m6j69NQ5l18M54l0k26j25J24q9L57k37O4N3k0j81R3j71Q8J24K13k26n9
6530a18l6L07k63Oj54J86J78l09j16K81K07j14j01K79l57J47k79J75J41l97K36
6551a01l08N20l02N19l76m5k40N32l49m4N30jj09m90j7L19J2k09K52l41N9M2J49
6574Bj48L7O7lK30j12j91L46k34r0j05K19j55M10p1l50K31k31P4M8p2K07m10M27
6598A26m29J61J92k42n7K15k77L5J04K88k58J55k81Q2K54J24k43j2J71l84J20
6619a56J83n2L6QK86l10k3M8p4m0J23K0m7o6J14J4p7k48L22p4J03P1Q1Kl7q1R3
$$ y = [-143, -126, -65, -95, -118, 226, -243, 75, 30, -161, 48, 175, 84, -110, 119, -123, -18, 51, -21, -3, -23, -71, 189, 187, -27, 134, 238, -2, 236, 47, 92, -121, -120, -197, 57, 98, 177, -217, -159, -42, 194, 292, 114, 76, -129, 100, -78, -43, 119, 73, -96, -91, -6, -324, 130, 100, -126, -251, -127, -216, 141, -96, -32, 21, 1, -180, -87, -258, -170, -46, 167, -59, -118, -154, 153, -110, -104, -258, -72, 106, -203, -319, -38, 169, 55, -46, 233, -124, 23, -256, -81, 60, -337, -101, -409, 111, -191, 328, -48, -93, -333, 199, -150, -194, 336, 335, 226, -264, -281, 38, 50, -159, 93, -248, -189, -147, 2, -146, -109, -42, -45, 185, 73, -118, 228, -6, -96, -201, 18, -137, 273, 202, -148, 83, -148, -74, -26, -98, 109, -301, 126, -303, -142, 50, -192, -249, -34, -311, -276, -172, 116, -142, 13, -268, -186, 68, 192, -51, -63, 108, -276, -156, 27, -25, 11, 19, 305, -5, -28, 20, -54, -94, 29, 49, 2, -64, 50, 64, -13, -261, 61, -13, 90, 161, 242, 244, 207, 126, 219]
6646B19j56l20K16J66k35N2p7N16n78J61K42m84K19J26J20j71R7N1j0k72R8j16
6668a36K09j35J01j68o2N70l13j21J27n4p1J09j67L62j97j97O8j7J05m3K6R7R0
6691A83j65K0o3j64k72L39O1m8J45q6J22q1k04L73j93k76M67k9k56J96l3K4L6
6714I6j42k23MJ52J65J12l48K21o3j74L29k37K79k43J40j43n6k1K7K84j1j85J60
6737A23J73l04K41l90K96k13q0K33Q1k00K56k54K51l03n3J48K00j48p9l7k54K48
6759f5L6j25N3mr3J69r1Q0J73o3q4j18K05j07N3M3j04P2j28K86m57K83j51J49
6783A2L24k62l09L37L40n65J83k60K23L22m42k5mJ21K95q3J62m75L12j44P8J92
6805C32m98J94M6j19K07k60o4J84K7l34L12j77J56Q5K2j00P3n6o2L63l25j72J5
$$ y = [219, 63, -257, -41, 125, -110, -58, -135, 381, -197, -36, 206, -278, -59, 67, 187, 16, 113, 164, 154, -118, -20, -136, 73, -62, 39, -129, -191, 379, 66, -55, 72, 18, -53, 56, -111, 251, 54, -143, -75, -92, 13, -30, -4, 93, 183, 18, 38, -25, -189, -461, -122, -61, -109, 36, -50, 72, -9, -213, 160, -33, -309, 158, 129, -127, 69, 36, 60, 96, -46, -269, -265, -113, 52, 164, -184, 37, -26, -200, 129, -108, 171, -72, 68, -75, -131, -152, -125, 159, 148, -37, 123, 296, -8, 233, -157, 139, -74, -154, 79, 160, -40, 216, -38, 213, -90, -143, 5, 205, 57, -22, -59, -313, -65, -29, -154, -101, -105, -198, -29, -120, -40, 133, 70, -14, -132, 73, -34, 19, 62, -42, 30, -98, 188, -269, 14, -137, 12, 336, 74, -235, 102, 442, -123, 60, -200, 23, 345, -97, -122, -126, -5, 290, 207, 369, -106, 206, 62, 140, 332, -166, 28, 74, -45, 162, -98, -162, 22, 49, -285, 27, -150, 6, 91, 113, 13, 86, 30, -32, 331, 6, -166, -151]
6828a51K50k33J38L46n23J79K25j87j74N0P9l2N9j40J9M6K54l73n0M86k09j67
6850a08K49j43j63J78m9k09J11K43j09Np6p9N3L00k61J29j9J48k21J03k7N8j27
6873a4J22Pj64j56N7J87k94J58q8M4M3J04j69K80j86K33k68J6M02m70J41J3j26
6896a28J05n8o1K18K6j35N2l17M54J03k57m6J35k39K6J10OJ6J7N2j44K96j41j34
6920d4L9K12Q9k18j39j70K56QK1L8Rj05m6K13J9j62l01K03K94j59N1J77m27K45
6944A03J36l55K8l9m2L61j18l74N20n55L43J9L2j32K96l56K62k5m35M07p9J06
6966A03l0j93R5j90K56j19K7J90j41j3k17M77J12m41K02j99J66j00J19j8j08k25
6988b47J17J05K06o8Q8j92n6k4P3k34J31J70k24J76l26J07mpL8K52M3j23n8J48
$$ y = [-151, 99, -134, 4, 350, -173, 6, 231, 44, -130, -80, -1, -33, 26, -114, -95, -49, 205, -168, -218, 268, 59, -108, 141, -2, -165, 13, -36, -245, -134, 109, 0, 5, -71, -150, -97, 203, -58, 71, 52, 200, -21, 82, 55, 113, -14, 108, 115, -49, -205, -148, 39, -255, -97, -185, -141, -98, 6, -163, 117, -69, 164, -104, -88, 314, -156, -15, -2, -128, -23, -81, -142, 76, 102, -33, 19, -298, 156, 259, 2, -44, 91, -148, -122, -12, -6, 10, 27, 79, -65, 231, 90, -44, -5, 207, 296, 78, -61, -231, 25, 33, 54, 92, 101, -4, -50, 163, 182, 20, -281, -78, 216, 57, 108, 285, -142, 103, 239, -116, -88, -127, -169, 192, 74, -300, 220, -335, 8, 27, 59, -73, 223, -133, 129, 104, -331, 76, -3, 103, 73, -120, -25, -215, 41, -78, -51, 139, -2, -15, -232, 245, 357, -84, 118, -81, 85, -15, 104, 86, -22, -247, -130, -25, 181, 113, 201, 9, -47, -71, 2, -232, -101, 69, -155, 21, -305, -198, -202, -209, -171, 81, 124, 1, -57, 91]
7012I1r1k25K65J00l75J65K90l0j38n4K82l34P9J75q8q5j70J57j5N4j84J64K6
7035E9k00J54Qj20J56m1j5k94L61j7j18J11j81Q1p9K32j92J08j74k2K9K73j80
7058f1R7n7J33k65K57J08r9k19N2Q7J01j68J36O0k01j40J17k9J34J20j15J64k78
7081f6p7J10j57LK59Q2r3n3k00L54n04K03K89k4l05L9J61p8N7J22j87J12J43l05
7105a15R4K84l92M34l27J67k45l2J30J8k68K64j84j06N02m27N9Q4K00k42L30j27
7127A01m10K99K23k50j5O1J74j27j27K0R0l1K06j06k08K15J47r0n15M82l37j08
7149c06O00m48J16j04L78q3LK0O8l7l1k44Q1j73k7N5K79j92K12J85n27J85Q4q2
7173A2l93J19K70R9P0l06J63L9J36K7l30J56j38j52L06k8r7k19m7N43M7n34L40
$$ y = [91, 0, -225, 40, 140, -235, -70, 220, 190, 52, -2, 280, -54, 25, 200, 112, 27, -143, 14, -1, 53, -131, 33, 59, -141, 13, 21, -99, 57, 16, 1, -293, 68, 51, -67, 44, -137, -56, -135, 97, -95, 13, -161, -183, -154, 119, -61, 36, -21, 112, -153, 104, 212, 113, -106, -54, 33, 134, -34, 102, 162, -39, -179, -62, -91, 43, 163, 48, 212, -66, -143, -33, -190, -187, 72, 154, 61, 8, -192, 162, -342, -139, 150, 126, -179, -140, 21, -57, 0, 122, -65, 47, 190, -115, -21, 263, -129, 305, -22, 145, -100, -132, -2, 16, -252, 12, -172, -278, 224, -203, -144, -60, 140, -102, 228, 101, -309, -10, 213, -37, -52, 9, 183, 56, -71, -51, 39, 8, 214, 108, -100, 115, 262, 172, -343, 139, -198, -306, 294, -154, -38, -142, 236, 153, 156, 176, 244, 207, 176, -68, 13, -160, -187, -132, 147, -45, 167, 352, -175, 10, 94, 12, -381, -262, 8, 107, 177, -129, 34, 73, 209, 236, -94, 62, -76, -228, 78, 50, -47, -266, -313, 230, 277, -257, 83]
7196H3r1j01J34L00k09r2k1Mj59L70k04p4K04j73m1J64K32k47j15K9K20k31J52
7219A34j22N2R3k43J09J27M2M4l18J55j12K10m27K68P9j42Pj18J56O2m9k8K97
7242B76k05J76m89N81j70l40J00K4j43L35l7j91L84N4l84J49j94J25n7J37k41
7263a10P6j21K99k04J41j55L5k46J39J62J3K11k07j86J39j0J14k7J11j90l0Q6
7285D0J4l90M05k90k4L90J04k92j6k48M06J38l21J97o5k48j41M00M3k48M83l08
7307B9m49L98J55l94K69j90P9J50J71j18pm1l53K81j02J11L70m46L2l7R3l09M37
7330A29K5l06L06K51n97J82r0J08Q9j74L5q6K51k92J38Q4K60k01l14K34m1l01
7352c10J47lK04k77j21J91N3J42l55N37k78J49p6R1l72K22k40L31J64j72Q3r7
$$ y = [83, -8, -109, 25, 325, 116, 24, 3, 7, -152, 218, 14, -60, 144, -29, -70, 94, 326, 79, -36, -7, 213, -18, 134, 12, 64, 157, -86, 23, 150, 192, 236, -82, 73, -39, 171, -256, 12, 91, -51, -44, -162, -6, 56, 7, -21, 276, 71, 247, -242, 339, 169, -171, -71, -47, -190, 145, 108, -83, 301, 355, -29, 120, -74, 51, -6, 131, -110, -34, -155, 144, -60, 81, -74, -39, -285, -146, 16, 29, 240, 33, -153, -14, -24, 90, 63, 174, -16, -46, 40, 54, -336, 69, -221, -245, 145, 249, -43, -59, -307, 99, 237, -84, 113, 48, -200, -341, 59, 102, -146, 337, 29, -420, -22, 133, -261, 8, -182, -103, 47, 218, 100, 93, 52, -301, -20, -122, -11, 359, -87, -55, -92, 1, -308, 129, 154, -152, 154, 405, -192, -10, -100, 8, 97, -77, -42, -128, 123, -169, -31, 53, 313, 112, -202, 32, -9, -310, -163, -166, 38, -239, -360, -169, -116, 26, -329, 208, -70, 79, 3, 94, -278, -56, -296, 35, 199, 27, 110, 13]
7374A3P2J69m54N7M8J48P3l3k13L17k82O5J81j44j0j50o4K35J38l08j76L42K12
7397B36l38j40R8r4K01l4Q4O6K70m25J53K2k02K66N1qp9j32r6J74P4j8m60M72
7421A41k19J72J82N3j59k23J79o7j65q1N1K63j24j32j56M56l25K52rj27j85K56
7443C3p7J92j30p1m6K3r2P3K76l91K12k26K46J77J2j85O8k01J58n6J98N9j07k42
7467i7J14K31l05n1J31j02l0M33p7k53rj23j0m9o3J91j60j33K66K73k59K3lL52
7491B90j76j82K10k66J94p6K59n01K04J8r1L88l52j84L48R7k30p1k68L86n6J56
7513I7k00M42m19J22k81N6J30L03q7l7k03J16j7q3l7pm3M26j63l1q0J28j48p9
7537i5J84L0J31l69Q5j01K91j37J7l50K71K00k18J99q6K9k77J26R4k16L7J52j61
$$ y = [13, 85, 254, -200, -143, -95, 53, 126, 93, -120, 197, -85, -20, 161, 17, 7, -143, -207, 28, 166, -142, -318, 24, 236, -102, -242, -144, -238, -37, -71, 13, 79, 349, -76, 77, 99, -103, 163, 214, 206, 127, -5, -101, 73, 147, 129, -331, 141, -78, 94, 276, 329, 170, -53, 126, 59, -106, -187, -136, 127, 3, -129, -285, 171, -154, 98, 89, -38, -223, 33, -44, 148, 18, -53, -99, -76, -168, -95, 181, -210, 2, -224, 22, 199, 211, 26, 94, -107, 51, -5, 193, 252, 145, -97, 17, 248, -57, -108, 23, -79, -109, 324, 247, -6, -15, -138, -148, -197, -260, -69, -229, -362, -96, 177, -82, -59, -62, 290, 114, -68, 142, -124, 70, -6, 253, -248, -44, -26, -117, 271, -81, -265, 83, 180, -50, -121, -389, -3, -59, 97, -103, 339, -80, 42, -239, -183, -53, 250, 163, 126, -77, 39, 22, -61, -98, -105, -148, 278, 115, 84, 4, 132, -16, -95, 89, 119, 250, -119, -34, -135, 156, 19, 36, -314, -43, 157, -61, 138, 52, 81, -196, -70, 24, -192, -155, -3, -164]
7560a64J40pk2p1R9j17J62nk77N60m04J79K1j62J36q5j3J56k79K00p7Q1k6k86
7584b61m0M70n0j67K92j52r9k9M3n0J3K12j91L28m77J71o4k46K94J19p8RQ6l77
7608b44K01K2L7l0J52l8l05L28J22j48j83J8J42j41KJ14J46j09l08M54p0P6l10
7631g2N15n40M5J32l2j6Ql75K89Q1q0K43k84J71k63J80j74K17j80K15j76P1l01
7654c26K92J55l71J87J79l10J92j58J67j20M7K0k14J30J72q1O9j74L31j90j50
7675a53J93K6p4p6J10J94j91J34l09J4J20P2k72L82k30J15j33L04k86J86K79o40
7697b35K3L5J18J37o3K30J06m42K82k47O03o13j39n4L52J84k68J66k83R9P6k38
7719a71N1J07Qq1N7O4j27K09l51K64o5j20O0K22k26J80J01l0j21K2k15J46J55
$$ y = [-164, -24, -31, -53, -124, -25, -142, 20, 15, -262, 298, -106, 73, 94, -68, 68, -17, -30, 126, -153, 47, -30, 51, 25, -261, -301, 169, 119, -48, 244, 92, -7, -36, 7, -43, -30, 182, -9, 319, -158, 13, -51, -297, -3, 116, 38, 47, 133, -244, -43, -21, 16, -14, 138, 100, -205, 123, 245, 97, -86, -68, 74, -67, -65, 49, 195, 86, -222, 232, 162, 238, -72, 443, -97, -52, 80, 48, 32, 40, -335, -46, 35, -45, 198, -86, 85, -178, 2, -172, 45, -135, 80, -96, -25, -326, -34, 121, -250, -63, 116, -194, -2, -160, 7, -113, -66, -46, -260, -130, 42, -39, 30, -144, 187, -3, -153, 40, 66, -8, -84, 26, 220, 29, 163, -146, -132, -12, 60, -212, 170, -60, 55, -78, 226, -60, 126, 405, -235, -212, -177, -59, 78, 15, 245, 351, -91, 191, -56, 547, -66, -205, -259, 93, 277, 9, 175, -108, -9, 67, -171, -120, -13, -5, -86, -29, 35, -92, 117, -234, 30, -35, -155, -95, 127, -99, 81, 182, 152, 31, 53, -162, -16, 139]
7742A39l86K49J70j69j76M20j81J69j58J14k79J93j4k04n0L9J36J47o8j65K1K9
7764b4l3L0q0J84j30LRK22j92Pq0K8K43j95Q3L68n62M97l54p4nQ8o5N0n8N4L47
7791C61m86J81p4Q8O0l55M30k49R3l25J16J19J19M7j40J70n47M50j02j4K21p4
7813H9K7k29J01J55l23K49J04j55M2Qj24J63k90M7J72j08j84L40m2j44R2J33k87
7836a64m1n5J83MnO8K16j85m71N30K3p4J6P5l35N5K39q4L62k44J6j56NJ47l51
7861b26K76O5r0n9k53L32k24J63J81l73J51J93j66J32j93pR4n1j8J65j8k6p4Q7
7885F1o6K02o6j42J4pk38L59k1O7N8k33j28L7j4R5J12J65l81j4J50l8k6K8r5L4
7911h7J40k34k0j04L91k00j37L7J59L24l06K0k7r4O5m7K41j27L3M0R1k24O9j81
$$ y = [139, -247, 2, 172, 3, -173, 247, 66, 235, 77, 191, -88, 105, 91, -113, -163, -124, 12, 159, 91, -74, -53, -24, -57, -27, -107, 77, -53, -50, -41, 181, -11, -4, -84, -56, 187, -8, 75, 443, -119, 378, 24, -50, -55, 33, -32, 18, -40, 14, 361, -125, 56, -18, 70, 130, -225, 205, -44, 49, -276, -160, -41, 78, 125, -15, 155, -392, 58, -44, -58, 163, 89, 116, -113, -12, 143, -180, 69, 173, 18, 60, 68, -56, 107, -183, -136, 36, -72, -256, 84, 42, -102, -10, 123, -164, -205, -260, -77, -73, -78, -10, 206, 21, -450, 80, 103, 29, 45, 120, -215, -160, 79, -5, 357, 113, 129, -27, -22, 125, -226, 50, 115, 25, -34, -287, 45, -179, -16, 165, -208, -57, 136, -30, 102, -91, -98, -4, -55, -73, 92, 74, 48, -26, 61, -5, 197, 131, -11, 3, -4, -242, 117, 96, 163, 221, -12, -140, -103, -117, -22, 90, 255, -126, -140, 10, -28, -54, -26, -121, -87, 53, -181, -201, -305, 86, -114, -251, -214, -55, 269, -37, -17, -44, -138, -73, -120, 121, -6, 27, 67, 158, -66, 3, -178]
7935a78K91k42M4N2M4N9j19J50j16JR8K0j28k28J64N1j87o7J95L2k26K63J0k3
7959d0J95k04J23k65J38k5j79P9J07k33L28m33J10L84j37Q4r2O4j11m4L4J52l4
7982AM2l4j87L32l2n8q7J52N4j08p4R8k89M04k33J31rj70j6J05k8O0k38J48K12
8007A76r7l17L44K8k2K77o68K59oM8J41L6N2j22R7k91P7k60L58j52L3m6l9j47
8031b41k0J54M0J66K5j71j35K45j11J50k63r0J74k38M97k80K90k39o8R1l45N52
8053A83j45K6k22K30j18J67j81l8N20k46j92K9J62K8j91O2j21J20P0j55M27l41
8075G4L11n04J14K06j43K14l27o5R2L06l40J55j00n0l73M86k37J66k49K03L7J28
8097A04k51k10N03l39n1L07l87K59J2j41K53J29m93L27J7N1J06m11qK98k27K08
$$ y = [-178, 113, -129, -85, -33, 11, 70, -49, 101, -15, -14, 84, 104, -24, -252, -88, -37, -224, -291, -96, -64, -290, -27, -17, -40, 155, -49, 74, -191, -53, -78, -257, -178, -71, -304, 24, -409, -299, 85, -52, 32, -60, 4, -107, -151, -117, 35, 1, 43, 9, -178, 154, 122, 64, -23, 129, 183, 75, 1, 99, -190, 214, -19, 112, 103, -67, -83, 22, -6, 54, -184, -36, 176, 79, -238, 106, 134, 112, 389, -279, -20, -26, 22, 163, 199, 251, 129, 226, -65, 12, -248, 110, -42, -9, -55, -94, -241, -261, -107, -67, 99, 124, -47, -182, 63, -48, 102, -161, -251, -77, -315, 182, -98, 192, -47, -115, -24, -369, 183, 38, 64, -158, 72, -46, 121, -60, -98, 422, 176, -16, 13, 175, 203, 12, 74, -47, 73, 143, -12, 415, 74, 385, -119, -5, 201, 58, 272, -55, -120, -28, 278, -62, 93, -7, -57, -430, 56, -181, -15, -264, -61, -24, 104, -147, -357, 146, -193, -244, 63, -324, -65, -53, -194, 59, 188, -305, 22, 39, 90, 196, -215, -223, 75, -152, 56]
8119E6M11n54K8K00j57k2J58p5L0l4r0K35n4m26L66oQ5j50k22o6L45p3K95k51
8143B9k78L82k1k00J65L38m79k2k4O5j15N01l11j03l16K15j01J96k5R5Ql25M42
8166A16j58J17k74M06m1k27P9o2J40k16J76KJ30k8p5j06K88k65J37k36j1k7Q6
8189d9k38O8
$$ y = [56, 467, -87, -59, 141, -16, -38, 120, 45, 75, 41, -49, 186, 132, -294, 72, 66, 151, 1, -221, -287, 58, -15, 280, 29, -249, 133, 112, -88, 77, 415, -64, -86, -110, -45, -160, 341, 30, -73, -389, -174, -275, -79, -104, -9, -1, -326, 116, -42, 75, -199, 207, 166, -61, 18, -44, 96, -120, 56, 58, 188, 160, 85, -21, 267, 2, 139, -97, -108, -135, -49, -287, -219]
8191b19
$$ Imaginary data points
##PAGE= N=2
##DATA TABLE= (X++(I..I)), XYDATA
0@%%%%%%Qj6J6k2L0l2M0m8N6p2Q8j04J28j52J76k08K40k74L14l60M12m70N32o02
30c20O80p64Q59r61J071j195J331j479J642j820K015k232K471k735L030l361L733
47A965m154M636n196N854o638P593q789J0334j2421J5419k0114K8587m8728J83078
61A51426J99278k90647k31005o5860J77546K02816J04249j07357k02936j38983
71b01473P0187J81355J33797l1495j36678j42938k8897J07041J67460O0228j05095
82G3492j68086n8406Q5792J39023O7304m7083j19919q6043K4829J12842Q6237
93A09982j5312q6419p1030j0531M9809P4866M2998l4900q7751n5525L2370Q1749
105C0306N1006j9000o6240n8239k5O2190O4815Q44n9030n2201Q07L8353L6763
$$ y = [0, 0, 0, 0, 0, 0, 0, 8, -8, 8, -14, 16, -16, 24, -24, 32, -40, 48, -56, 72, -80, 96, -112, 128, -146, 168, -192, 220, -250, 282, -320, 360, -404, 455, -506, 565, -630, 701, -778, 864, -956, 1059, -1173, 1298, -1437, 1593, -1768, 1965, -2189, 2447, -2749, 3105, -3533, 4060, -4729, 5605, -6816, 8603, -11511, 17076, -31652, 151426, 350704, 60057, -170948, -236808, -59262, 143554, 247803, 140446, -62490, -201473, -131286, 50069, 183866, 152371, 15693, -127245, -156142, -49101, 118359, 178587, 73492, -94594, -153000, -67208, 71815, 139119, 92036, -27883, -113926, -89097, 23745, 109982, 94670, 8251, -62779, -73310, -23501, 51365, 94363, 59463, -28288, -83813, -51443, 30306, 81312, 62312, -3928, -62167, -62192, -2, 64813, 65657, 6627, -45574, -44767, -6414, 30349]
118C0349J5090j3275l6708l1811P697M1938L3569l558l2064l1873q194K4439M1380
131C6979J6797k9965m3349q967K8857K9284N147j5267j9945j4571K792J9751J7060
144B4603k858j7779j4506m170O559J5564J4298n356k4844j6731J0441K4830J0495
157B0546j0317j6494q878M282J3886J1446j830j2602p622K716O278M097L501J831
171A0840o348j0696k442J1536J2034j427j1785r276J98Q669Q805Q64r418r274
185g720Q10Q589M277l029k906Mj030k778J122O559L278l772n910j493L260N866
201E127M380k349p456m069N873P685L58n809l344K137K007j51rL30l30j988j738
218F54m72M94K358J958l546n488r57N406M098k684n503j701L047K995Q6k083p62
$$ y = [30349, 45439, 32164, -4544, -36355, -28658, 13280, 46849, 43291, 11227, -20646, -28840, -4401, 36979, 53776, 23811, -19538, -28505, 352, 29636, 34783, 19516, -429, -15000, -12208, 7543, 24603, 21745, 3966, -10540, -14710, -8151, 7413, 21711, 16355, -8489, -25220, -14779, 10051, 20546, 10229, -6265, -15143, -10861, 3025, 14471, 12641, 39, -7583, -4867, 1411, 5508, 9009, 10840, 4492, -6204, -8646, 2890, 14924, 13497, 1712, -7564, -7366, 1303, 10108, 10972, 1554, -7720, -6910, 1679, 5956, 2927, 21, 25, -1005, -3783, -2661, 3898, 7176, 3404, -2506, -3999, -739, 5127, 9507, 7158, -298, -4367, 1506, 9191, 9549, 3740, 396, 2533, 4540, 4389, 4380, 4710, 4380, 2392, 654, 182, 676, 3034, 4992, 1446, -4042, -4999, 407, 4505, 1821, -3682, -5383, -2336, 659, 745, -1338, -2100]
235b100K60J198Q63o69q7J141J604j401k556R16L654J769k418l164k02K887K094
252C789q85k783r49L01K015L84j428k076M31J627p32j537k87K299N34j814j710
269b821O18J652J477n80j646p24J552J938O07j737j378J416J721M65j429l58J359
286B132Q04r10j015k50R44J019j086j500j010J142J350n01k152j059J219J356
302D83n13j790l02N72N30K8q93J05O40Q30j62r91j68J094J477k44j350k85J079
321A40J561j22j268l68P36P24P3r43q66Q16P67l60j052n64L07P57k66j300m33
340a661L39J063k20o57j064R28Q21L57j353n90Q75J417n0o23m48N57J200Pn70
359C28m33O39J044J58r48k73N79P16J40j404o96L67J026j76j234o05M61M69K0
$$ y = [-2100, -1840, -642, 221, -448, -535, 606, 2210, 809, -1747, -831, 2823, 4592, 2174, -990, -1192, 1695, 3789, 2904, 121, -828, -527, 1488, 1872, 444, -1632, -1201, 426, -306, -1843, -2130, 169, 703, -1111, -2821, -2203, -551, 926, 346, -1300, -2024, -472, 1466, 2073, 336, -1042, 374, 2095, 2560, 1131, 773, 2132, 2936, 2026, 1011, 761, 1705, 2724, 1638, 138, -872, 270, 1620, 1119, -1033, -2092, -873, 483, -30, -1820, -2122, -1550, -1020, -992, -1885, -1780, -1140, -310, -472, -1463, -1631, -537, 940, 696, -654, -939, 140, 1701, 1579, 311, -57, 679, 1403, 1476, 533, -333, 483, 1250, 890, -162, -726, -419, 338, 72, -1228, -1661, -1322, -259, -479, -1136, -2200, -1272, -451, -94, -1447, -2037, -1162, 255, 205, -418, -866, -309, 891, 898, 328, -105, 534, 1578, 1736, 788, 515, 1094, 1810, 1950, 546, -150, 217, 1243, 1067, -167, -772, -311, 158, 178]
378A78q26p76K21N39K30o49o72R52K50M42p25n13P85O53J51p68L04J52R70m6m26
399D26l11M63L48M39m80o46K44O48R6q62k14J49J53k0n23m94n5M81k29p38J87
420i38J00M71J1m65m37J18P39N99q13m3K34O75L56n16j73M03M73L75o34Q4n6N44
442A107J90o15k45L24J33j86k79l36j52K01K72k99n95k70N74J94n15l67K19L48
462b97L01n50l44K02O48j41K17k12LL49L08k08l16O22O0N22l71k45J66M12Qm20
484G14l94J46j5R0k72j04l97R7P9j41k85j38L96j6k36l21p8N14L69k58m39J22
506e67M63J87j04j53L95OM2K1L6N9M3N25r2l38k07M08r5p0j18j16J13R4j82n32
530a82k55L57Pj59k46j7J10L37l07l08l2R1K80K0j75J36J22K83J31q3j51K53O13
$$ y = [178, -648, -1424, -1203, -664, -434, -1083, -1755, -803, -553, -111, -836, -1349, -564, 89, 240, -528, -224, -72, 898, 852, 426, 115, 578, 926, 1365, 885, 239, 483, 1131, 1227, 365, 151, 300, 453, 433, -90, -584, -639, -158, -387, -1125, -938, -838, -367, -356, -821, -1258, -1140, -401, 198, -615, -658, -424, 251, 607, 91, -82, 321, 794, 1169, 535, 619, 563, 1107, 1297, 682, 437, 761, 894, 708, 429, 93, -59, 142, 414, 115, -480, -750, -176, 18, -497, -864, -645, -297, 4, -546, -890, -688, -40, -181, 36, -176, -173, 176, 484, 276, -40, 582, 642, 1164, 793, 548, 714, 1126, 1134, 714, 320, 466, 451, 541, 269, 165, -232, -135, -56, -197, -482, -620, -224, -240, -476, -797, -875, -361, 8, -250, -689, -567, -104, 83, -21, -174, 221, 227, 269, 290, 326, 385, 428, 953, 861, 523, 316, 724, 629, 559, 441, 325, 438, 532, 350, -182, -437, -80, -73, -232, -478, -495, -385, -48, -355, -663, -695, -604, -324, -304, -479, -343, -221, 62, 193, 110, -41, 212, 825]
553H25m13j84K56K75J5j64j72J07J79K4l17j76k82L05j35k1m26k96N08M7m65k27
575g37q9K61J08J48m10J74M00k20J30pJJ36N7M9K64M9j52M05j64p2j75M85k20
598D21m4q5j14j09K55k99l7r5j20M03k32J3l51r6J69O4m48M79l7J40k34k46L32
621b71j47J22k21O04m1j18O14k89q4p1L36P4j29k13J45K04J23l28j11j04j51R8
643D2K09l00j04j23J81k14n35L63l06M96J99m95O7J51O3J6M4j52j12K48m4J04
665b02r2L68K5J85k02N9M2r1L49o84M54J13M7J99j65n08K27J45k58l62K80m47
687e18P39l82p6L8j75j8L8k24O8R2J47q8K25n8j31J10O7m6L28Q0k70M80m54L57
711C29J04J91j87k36J49J04m12L07j23j37l09P0l7r7k79J64L21k30j83J36J25
$$ y = [825, 412, 228, 484, 759, 774, 610, 438, 545, 724, 748, 431, 255, -27, 278, 143, 122, -304, -600, -92, -45, -510, -737, -826, -565, -457, -309, -719, -545, -145, -365, -235, -242, -241, -105, -48, 1, 265, 314, 162, 567, 403, 331, 156, 641, 421, 377, 292, 178, 69, 324, 25, -12, -107, -227, 176, -56, -43, -394, -490, -321, -257, -705, -226, -263, -123, -357, -603, -271, -418, -296, -517, 87, 46, -72, 542, 253, 169, 98, 434, 508, 379, 166, 311, 515, 638, 310, 199, 95, -56, 42, 251, -49, -153, -276, -95, -309, -844, -481, -787, -291, -92, -587, -520, -369, -306, -290, -246, -398, -510, -262, -306, -202, -294, 74, 99, 284, 82, 141, 183, 92, 441, -243, 211, 324, 371, 570, 405, -103, 124, 269, 11, -351, -71, -518, 221, -161, -237, -199, -374, -392, -354, -578, -510, -418, -271, -359, -134, -192, -323, -213, -146, -192, 136, 216, -54, 426, -28, 329, 433, 624, 437, 201, 350, 454, 42, 349, 226, 89, -220, -150, -187, -284, -563, -399, -78, -308, -491, -355, -230]
732b30n5k55M5J60K40l24Q8J37j87N32l11j5P9O4n7N36m02p9M92j27N9l33J45
755B02J9K32k08l05J20J2l11K71k54K33n02J30J06R2m69L58j29n2J21j32J14J47
777b05m1J69k29M10k5p0M1P3LL6J92p5Q1j49j5J79m70L52P7k10j51Q0K44l19J46
802A24q8K0k42J99J17m18K54j93j71L32k45L6k45Q9L62J15k90P2O4L60m00K39
824I1K70k05L5n9N6j85L52j69q2K12q6k30l8J66J02j64j42j54J39o2q4K81l97
847c53o3K73r4O1O2R4j59kJ89m19L08K91j34N4L00j37j97K25n5k22J35J77ml48
871a8K9J89j08L8J37k29j30K29o6n19K89J60k47n8j44L73j65j10K12n43L75m3
893c49M03k33J50k32L86p5j21J17M04j13j51k14J32M5j43K17K96n05k54L79o4
$$ y = [-230, -285, -540, -495, -335, -95, -419, -331, -194, -381, 151, -160, -175, -96, -32, -89, 447, 45, -34, 458, 331, 390, 57, 202, 221, 453, 245, -60, 60, 72, -239, 32, -222, 11, -491, -361, -255, -163, -632, -274, -403, -455, -334, -466, -352, -205, -246, -77, -306, 104, 79, 9, 50, 123, 126, 162, 354, 279, 360, 211, 196, 375, -95, 257, 334, 124, -27, 53, 297, -22, 124, 36, 56, -186, 13, 130, -288, -34, -227, -398, -66, -311, -275, -520, -431, -69, 46, -244, -172, -108, 252, -148, 91, 361, 156, 191, 132, 188, 3, 355, 186, 104, 316, 230, 0, -38, 128, 230, 66, -76, -230, -91, -153, -237, 44, -353, -416, -143, -237, -176, -114, -20, -179, -181, 8, -411, -103, 188, 54, 108, 408, 271, 74, 299, 244, 22, 157, 334, 330, -18, 11, 200, 92, 130, 267, 38, -92, 137, 71, -448, -159, 1, -246, -304, -448, -75, -240, -350, -138, -681, -306, -349, 54, -179, -29, -261, 125, 50, -71, 46, 450, 337, 186, -28, 104, 149, 6, 223, 519, 14, -240, 139, 75]
914G5N9J21k49l3q6j4p1L04k87K17j68k71L62j40L32n87K06K05p5j06j43J49M44
937B44l69r0K43J28j31K18j81K9K51k37J09J17k12k5k97L71l88L25l44M04j35
958C0j88p6R1J35j07l18K87P3j68l11M01j01J48l3l5L82j63J77l75J88K06j93
980E0J51j65q2M59l99k4oj85L60J91m87O6K27m4k47L40k31j73M17l70K0k20L64
1003A2l43J36K23n18l6M72n0m8L43k35J6Pj13M23j65j47j13L46k10PN5q1K30j4
1027A97r2R0P1Q7M8k81j69j27N4J94q9k98J95J42j86l4J46l0j16l31M27N4l00
1050c48K54%%r9P6K59K4M2j54J89l28J61J37j76O4M3l24Q6L56k48R4m03O05k64
1074D6%j84j3K06l05J20J77k12k5K5j6p5J54m3M34k78m1Oj40M31k05j32K44k21
$$ y = [75, 134, 255, 6, -27, -113, -127, -198, 106, -181, 36, -132, -403, -41, -181, 151, -436, -230, -25, -100, -206, -349, -200, 244, -125, -215, 28, 156, 25, 243, 62, 91, 342, 105, 214, 331, 119, 94, -203, 168, -220, 105, -239, 165, 30, -158, -234, -143, -8, -115, -433, -146, -73, -241, -552, -151, -252, -104, -137, -172, 210, 47, 224, -151, 37, 243, 50, 201, 36, -46, 413, 14, -10, -16, -201, 159, 350, -137, -71, 156, 112, -135, 205, -26, -199, 218, -152, -132, -352, 12, -331, -195, 28, -490, -526, -54, -104, -152, 191, -44, -28, -21, -134, 289, 124, -23, -136, 210, 0, 7, 62, -19, 211, 197, 105, 195, 266, 353, 401, 120, -49, -176, -122, 72, -17, -315, -120, 22, -164, -198, -52, -82, -198, -529, -102, -48, -348, -94, -94, -94, -193, -117, 142, 166, 208, 54, 243, -85, 76, 213, 37, 101, 144, -180, -94, 262, 14, 108, -295, 310, 46, 46, -138, -151, 55, -250, -130, 47, -165, -190, -165, -181, -256, -102, -145, 289, 11, -30, -24, -164, 267, 62, -70, 174, -47]
1098d7j69K52o6M7K27j71J88j5q4j55p1O8o5L70m58j24K13L69k03j16k20K49q8
1121f9j51k16N14m34J53R2N0K04k86K18Mm9l8N8r6O2J99n4k15oJ68j50R2J33k45
1146f2M2K29l08M7J55l49K94K6j0j08K4l23L67l10J57j80J42K9k6J04nl1J58j04
1170d2j24K39j77k2Q4P7K75j67j12Q2J92k08J09k34K80j74k08M07k09k7o6J16
1192I1n2J61l84J78k68M01m13M13n50L47j2m5J63k22L57R2j35l54L56n9p3N06
1214D98l49j45R3J43m7q9k10Q7Pj65L03O1l62K91n2O8l95K87k22K78l27P3J88
1237A4j01P4J59k60N6k58M41k24J64m18L83J31m2N3j28K1j6j56L32J06j89Q1O2
1260B85l57J78J05l91K97j28P7j25L9L87p01L96k14K2j52J73L10j69J20m06L71
$$ y = [-47, -216, 36, -30, 17, 244, 73, 261, 246, 162, 7, -64, 4, -61, 309, -149, -273, -60, 309, 106, -10, -230, 19, -69, -220, -436, 78, -356, -203, -111, -61, 143, -143, 75, 79, 30, -8, 50, -46, 16, 215, 161, -54, -60, 108, -42, 50, 183, -62, -20, 209, -99, -52, 103, -246, 48, 74, 64, -44, -20, -343, 24, -286, -129, -309, -167, -138, -164, -60, -65, -96, 62, -42, -166, 73, -104, -126, -42, 35, 310, 143, 31, 113, 305, 97, 206, -28, 252, 78, -130, 277, 68, 41, -25, 91, 39, 200, -184, -6, -274, 127, -286, 127, -423, -76, -88, -133, 30, -192, 165, 257, 122, -232, 124, 65, -8, 498, 149, 4, 97, 240, 193, 104, -106, -19, -12, -177, 126, 187, -175, 116, 64, 132, -263, 24, -198, 80, -247, -174, 14, -87, -13, 146, -114, -58, -316, 125, -99, 65, -353, 30, 161, 119, 172, 44, 65, 49, -107, 225, 331, 142, 223, 285, -72, 106, 211, -180, 117, -11, 66, -59, -20, 367, -334, 62, -152, -130, -282, -109, 201, 32, 152, -254, 117]
1281A17k77K67k96k4N0p0NK43j13J32J0N7Q3k86K56M8k49O5n8k4k97L14J05n5
1305CJ76r2j52J05k37J53K95l35l06K16J1J70k59J89l34J24j7L75j31L24k90j48
1327a60Ok10M54J01k59J84%J32l66L57j25J4P5J03n08j31L38J70j23j96K98j95
1349d1j81P5R3p5Q5j38n6J54p0J29k83J44J23L52l03k70P3L32p2j20J58k87K96
1372A18l78K88J4nQ1Qm8k79M28M3k08O4k8R4J58m81Q3J60J24m22N0M2K4k4k50
1397c44K85l5J8K34m41K81J62k37OM97l0l66o3K41N9kk31K76N5n00K98j55r7L22
1421B33k64J1m6Q7m1K59n09L54M3m3j78J27j68J53LqO6j41K44l07j8n8L24j92
1445f9J32j26k28K38K50J23l85r5J84k23L33L24l80n9K4r0J92O5m20N87m73K2
$$ y = [117, -160, 107, -189, -213, -163, -233, -228, 15, -98, 34, 44, 101, 184, -102, 154, 202, -47, 18, -40, -64, -361, -47, 58, 3, 179, 87, -65, 40, -197, -44, 251, -84, -390, -174, -163, 7, -252, -63, -397, -273, -290, 85, -46, 278, -12, -160, -154, -364, 90, 191, -68, 116, 116, 248, -118, 239, 114, 128, 203, 306, -202, -333, 5, 175, 52, -144, 154, -41, -222, -147, -54, -129, -44, -182, -238, -84, -154, -25, -308, -164, -41, 311, 8, -262, -189, 143, 71, -49, 109, -178, 118, -260, 28, 42, 37, 118, 126, 78, -201, 227, 270, 62, 126, 98, 192, 350, -131, -48, 112, 236, -186, -136, -94, -70, -94, -344, -59, -94, -76, 158, -283, -2, 160, -77, -71, 426, 396, 30, -33, 208, 267, 265, 34, 310, 365, -135, 163, 8, -89, 233, -31, -20, -66, 21, -20, 239, -270, 84, 127, 84, -94, 33, -135, 18, 21, 13, 79, -62, 182, -125, -143, -201, 123, -69, 63, -63, -291, -53, 197, 320, -65, -160, 24, -199, 134, 458, 78, 19, 43, -47, 145, 210, -210, 377, -96, -74]
1467g4M6j50k66N4L62j36j11K59j15NK80k10R8K8j7O4j13o1P0r5lM63l99P9r2
1492c4N0K95l28j88J26J76ON2k57J28q0J23l13P1N0k66K63J46n1k4LJ4L9j79L89
1517B11l11J58k2K7l2M2j82J19K58R0k59j08P8l6L09l89J86q5j02K59j43k6m8
1540fj14L9P8j98J16k61K17JKN5Q1J6j35K70N1k04L6j75j19J50M7j36j7L33l80
1565b53K99j17K38l16K68J1l85L5J71j53K84k07M5q7Mr2M25j97l86N02l86K82
1587a5j84K89j14jj93l4J89k80K63K7R0L1J52l31M22l91K89j47R0J5q8l6l03L37
1611G7O3j28j45j80L16j78J16J53Rk77K04j3m45J47J56j36K20J56j54k28J66J87
1633H6m5l77L66on2j0j4J38k52J20k3j08K48j93K9L72j91J07j18J94l65Q3j33
$$ y = [-74, -28, -178, -444, -390, -28, -164, -275, -16, -131, -126, 154, -56, 42, 70, 53, 117, 4, -57, 13, -82, -85, 378, -21, 58, -34, 16, 311, -17, -205, -79, 97, 103, 155, -102, 26, -54, 69, -244, -173, -123, -389, -126, 20, -31, -55, -52, -38, 1, -178, 211, -100, 58, 36, 63, 31, 73, -109, 10, 268, 358, 99, -9, 69, 33, 342, -47, 139, 54, -48, 211, 68, 42, -6, -120, -81, -3, -201, -85, -346, -129, -128, -126, -71, 10, 26, -109, 161, 212, 8, 44, -131, -250, -100, -53, -189, -206, 127, -253, 46, -71, 167, -149, 119, 130, -255, -220, -49, -202, 82, -125, -80, -167, -163, -255, 170, -27, -413, 89, -297, -15, -199, 90, -24, -25, -218, -252, -63, -343, -80, -53, 37, 68, 220, -111, 311, -80, 209, 62, 152, 167, 79, 43, -260, 77, 140, 12, -133, -313, 3, -175, -59, 94, 103, -174, 30, 17, -428, -281, -125, -261, -41, 115, -39, -267, -101, 86, 41, -336, 30, 24, -28, -38, -52, 86, -166, -46, -69, -177, 71, -122, -93, 279, 88, 195, 77, 271, -94, -11, -144]
1656a44m8N9K17k30p3R2J82Qk78L63l75P9K4k56N11j39J27j66L14k12J73Q9j49
1679A68k97J79Q9J28k33j66K73j03J80J94m96J50J06j30j18J31j53J52l8r2l5
1700a11l04K92J05K56m87L18j93k41K59K44j03j7J95M3k05N1j5r9j8j51K68N5
1722A42j15k64L82j68L55j89j38j19J18j60K16k70M39j88j56j31P1K06k25P1L32
1743B09Qk71J89Q4J58o51K68M3q6Pj78O4L00j82J78m48K46K2J40Q9j58J26m4j45
1767c2J1M7P3J15k29M36l12m23M67l25L27m48K12j01Q6J38j18p5J86J24k59J84
1789H4lk00K15J9oj1J83j56K13j45n3J3J08k16P8k10J10k8J26j38P9q8j71J69
1813b8p9Q9j14j63P2J43j94K89J9k33L48m01L67j01k40J87l9K18n3m3p5R4J64
$$ y = [-144, -192, -133, 84, -146, -219, -127, 55, 63, -215, 148, -227, -148, -124, -380, 131, -8, 119, -47, 267, 55, 228, 317, 168, -129, 50, 139, 267, 34, -132, 141, 38, 218, 412, -84, 66, 172, 42, -76, 55, -98, 54, 16, -76, -111, -415, -123, -18, 238, -249, 69, -124, -365, -106, 138, 35, 18, 213, 256, 51, 102, 87, -12, -30, -181, 87, 142, 27, -237, 145, -23, 332, 143, 5, -114, 4, -156, 60, -210, 229, 41, -115, -246, -175, 31, -194, -123, 209, 217, -54, 135, 219, 377, -274, -6, 37, -49, -42, -220, -156, 144, -38, 140, -308, -62, -40, 100, 189, 31, 157, 113, -32, -21, 26, 99, 214, -15, 421, 109, -314, 153, -172, 155, -293, -81, -182, -96, 42, -76, -151, 35, 159, -100, 84, 81, -119, 96, 115, 109, 98, 281, 125, 338, 193, 140, 153, 261, 45, 123, -87, 23, -5, 121, -17, 62, -26, -197, -28, -107, -18, -132, -295, -223, -80, -274, 15, 34, -199, 149, -252, 115, 14, -226, -39, -78, 140, 87, 44, -31, 63, 227]
1836B27l41K45M2q3j21J31J64m36L08k81K08Rk6j63K91j40M45m04Q8j80K22k32
1858b7j24J37j14J03n9Q5J01r2r4M9k94N27k21K35j49k05K59k50J09J89J73j73
1880A65j21j47J96L08m85J17m7J07r3P9k70K53J24k20k83N86k16k99M02k60J37
1901C3j11J63j76R7j24PJ59j40j20L74j38n13O40K9o3o7k09O2L97nm02J11J14
1924A18K2l1l09r3L40K5J7m93L71O8n0n6j83J90J64k21K80l0l22K84r6r8K62m49
1948b90K55J37j57Q6P6k72O01l38j32J09p3J76k8k49J79J91k91J19o3J89k59j56
1970a90J50P8j55L95k83K2L9j41J81J17r1j45N6q8K06q9j59K36j88k25j36L39
1992g1p4J56P0N8l39M57l91R4oj79R4K02k03K51J21m37O7J81j20K35k08l2J5R3
$$ y = [227, -114, 131, 173, 90, -31, 100, 264, -172, 136, -145, 63, 72, 46, -117, 174, 34, 479, 75, 163, -17, 205, -27, -151, -14, -128, -25, -84, 1, 102, 10, -84, -35, -329, 198, -23, 212, 63, -142, 117, -133, -24, 165, 338, 165, 44, -103, 93, 401, -84, 33, -14, 93, 0, 79, -191, 62, 186, -34, -317, 269, 53, -246, 156, -104, 33, -78, 85, -91, 6, -118, -111, 48, -92, -212, 162, 24, -489, 151, 180, 117, 50, -159, -97, 300, 295, -107, 4, 118, 140, 109, -200, -293, 47, 72, 89, -404, -33, 35, -15, -71, -254, -64, 100, -121, 159, 129, -193, 91, -5, -103, 159, -290, -35, 102, -55, 31, 107, -165, 436, 98, -34, 75, 2, 178, 150, -99, 80, 271, -20, 99, 36, 225, -34, -190, -40, 38, -117, 278, -5, 17, 56, -85, 96, 213, 122, -23, 33, -55, 151, 62, -97, 139, -49, -274, -410, -71, -145, 11, 81, 139, -200, 257, -134, -40, -46, -225, -131, 71, -132, 119, 240, -197, -130, 51, -69, 166, -42, -74, -59, 34]
2016C4p6P9J68k82K51k26nP2J06jj16qJ70q4p2J53J54l24J02l1p0j14P4J03p2
2041a5N8k9J16m94M67k44M6O1j76J1k7J89J4r7J57l3j57L39q7O0j89j4J52Q5j25
2066F8Q0j44J17k07L45N4j3p6l29K1J33M6j99J81ok4J3p6k58J9J94p4K30J0l68
2091b63N3J97K99m43j63J78K01j65l9J59j7l3J64k59j48L2M82m9q2j2j46L3J65
2114A44r9M0j67q7L09K00m13L1q8O1j19J72J06R6j36J7k0j49J04j26L46k09mo9
2138f0m35K89K60J55j62m9J75p3J2J38k68J0n7K77j19j57N5M29k50j23l0K10K00
2161D27n24L22j86l4J63j43k63L87l20R2M1J75J40k31r3M7P7J70l93K18k33L07
2183A46j77Q8J01k99K03N5l5k1M3k25J09M6k56M47j89j31L67k86J82l23J09J7
$$ y = [34, -42, 37, 205, -77, 174, -52, -57, 15, 121, 120, 4, -4, 166, 82, 10, 163, 317, -7, 95, 64, -6, -120, -46, 57, -15, 43, 14, 130, -364, 103, -141, -95, -34, -210, -199, -226, -37, -23, -120, 37, 4, -153, 186, 99, 159, -30, -44, 108, 193, 68, 148, 4, 121, -86, 259, 313, 300, 224, -105, -84, 49, 95, -104, 77, 71, 47, 60, -16, -274, -255, -61, -135, 95, 105, -263, -210, -13, 286, -157, -320, -142, 59, -106, -145, 14, -3, -36, 128, -131, -279, -247, 235, 186, 104, 92, -54, -21, 144, 45, 85, -82, -169, 140, 340, -73, -42, -130, -69, -188, -16, 90, 186, 50, 67, 47, -102, 2, -124, 222, 13, 9, -60, -495, -206, 54, 209, 47, -2, 173, 100, 112, 250, -18, -8, -65, 212, 93, -64, -9, 420, 170, 47, 17, 227, 427, -97, 225, 39, 5, 168, 25, -238, 149, -171, -79, -38, 137, 277, 46, -47, 0, 77, 247, -146, 72, -161, 146, -31, 57, 158, -141, 62, 117, 82, 61, 104, -121, -12, 34, -222, 225, 36, -95, 272, -14, 168, -155, -46, -29]
2205b9k5l7L8J55J13k56J05k2K15j99l22L76j97Q1M5K33j55rj85M28m98M98k90
2228F3M8j29K34j55k36K43K7n8k0j49K29l8j26N1RJ72j67Q4J15m3n6j8kj34j14
2253a70N8k2n6K08j6j12Q5j81L87m8k45N2q0J45J17k68K20m54M83j4l43K16J27
2276H9j18J95m44j72L78N9J98k39k6M0l2N7j26P7k4J10J43q8J21j59r9L65k24
2299H1K7N1l20J90q0K89l73L54j80M6M8j63j00K13j9J83j11l84L21k2l18R1J37
2322c9o5J64j20n6K15k61K98j61Q8o5k58K22K28m8N8l4L53o01k9m1J87O2r8r0
2346i1K68m3l6j90J60QN6j94p3j80J3N99k37l71M09k54K66l5o7K46n76L42J74
2369A94J04l29J4J38k85J86O2K05k00J80j69k47J65%J46p9n0k5P1o4N8n3j19j77
$$ y = [-29, -54, -91, -53, 102, 215, -41, 64, 42, 257, 58, -264, 112, -85, -4, 41, 274, 119, 110, -75, 353, -145, 353, 63, 111, -18, 216, 61, -175, 68, 95, 37, 17, -132, 97, 59, -67, -16, -7, 165, -2, 82, 197, 154, 98, 80, 78, -56, -170, -112, -134, -190, 18, 2, -110, -25, -206, 181, 133, -112, -60, -140, 5, 122, -146, 74, -380, 103, 89, -254, -38, 89, -29, 166, -278, -450, -72, -13, 185, -54, -80, -40, -72, -15, -141, -64, -88, 22, 165, 77, 198, 39, -60, 305, 81, 108, 159, -161, 29, -51, 238, -135, 219, 39, 85, 133, -30, -130, 83, 64, 247, 136, -248, 73, 51, -267, -176, -39, -104, 60, -60, -116, 99, -162, 136, -25, 63, -2, -260, -38, 190, 142, 200, 166, 519, -82, -111, -152, 35, 97, -1, -91, 177, 134, 98, -92, 68, 76, 132, -62, -135, -315, -302, 297, 60, -311, 98, -156, 110, 75, 8, 254, -322, 20, 194, 298, -31, -17, 121, -164, 22, 84, 289, 89, 269, 100, -147, 18, 18, 164, 85, 35, 10, 81, 17, 75, 22, -97, -274]
2393b74L45k33M86k42L3p2P5Kr4k30O3K85m02M09k90q3K54r9R4j59J67l01J19
2416a47p8K30J1k63L06k83P8o0j6K60J83o9K2k69K64j86R0l04j4L29j28l8K07
2439A25q9j36K73n78M72J69l42P1k7K83j59J90Q9m51N8K1N2M2K56j19j87J78k91
2462a00K92k54rn6J51j19j04P1M5K86k0k24j01m4J90k68L37l0p5J14j69n3J0K8
2486a02M57j62Ml19K7K34l60M78k78J61j82K29m16J39M6j02l08L39J1M2J1k63
2508c14L95N7J0k07k26M38m66J51P8J26j33J20K62j33K9j70J47j94J52k6K3J93
2530C12l18K40j52j07L4N2L6J11k66J95k86J04j4J85r3J75k88p0K71m80N9O9K86
2553E5k55K17q4k1L0K03k82K34L3k48K23J05M6k55J26r2O2jo2r7J59kk3L1M2n2
$$ y = [-274, 71, -162, 324, 82, 115, 43, 118, 120, 26, -204, -141, 144, -258, 151, -139, -222, 32, -67, 27, -132, 35, -266, -147, -225, 5, 16, -247, 59, -224, -146, -206, -222, 38, 221, 152, 174, -95, 169, -17, 73, -231, -245, 84, -44, -82, 125, 36, -100, 173, -405, 67, 236, -106, -35, -62, 221, 62, 252, 341, -110, -52, -31, 21, 63, 319, 200, 13, 191, -100, 192, -62, -71, -127, 24, -95, -199, -128, -83, 203, 183, -41, -142, -186, 4, -264, 73, 43, -32, 82, -87, -140, -130, -102, 355, 193, 197, -122, -95, 139, -221, 257, -21, 140, -42, 187, -229, -90, -44, -146, -454, -115, -104, -62, -51, -314, 81, 138, 148, -59, -285, 153, -313, -162, -84, 42, -91, 29, 291, 158, 187, 17, 164, -30, 122, 96, 119, 312, -6, 234, 82, -25, 9, 61, 97, 208, -58, 137, -149, -45, -59, 126, 33, 208, -80, -150, 121, -359, -300, -231, 55, -200, 17, -67, -88, -58, 145, -137, 97, 130, -118, 105, 210, 256, 1, 127, 35, 97, 96, 34, -63, 96, 94, 71, 102, 144, 92]
2579I2q9J31n7L1l67M76k13j61K83j10K53k87k48J60K89o0j5J45m53J39M17k22
2601A34p9j00P1k81R2J45j85Q5K23l22J71j14L8J72M2J88m13K74m8np7L6pj0N2
2626H2j8j13L4O5J60k0r3m05M96k01k6K80l11j52K45R0o6k65J86k59l1N46j7k85
2650g8J07j34N38n57K81l57O6J34j75R1O9j81O2P3R5j31j5P1m9p3o6K30j65j15
2674b79j1O02k51j35k4J66k08o7L59j73j79K14k26J67K3n5K13J34m90K43J41m16
2696b52J25P1N8j44J43p2J78n1l0o6m6L42k68j93J84K04o2n9j75j00n7K39L0j53
2720a54R5O6J30p2l64J77J39j42J36P2j91j04J37k24P4l2M57k61J68J1j34p1K84
2743A97l42J81R5n0n6j14M21m51R5j70M86j66J4j82n9m1L26k93J74k14j07J32
$$ y = [92, 3, 134, 77, 108, -259, 217, 4, -157, 126, 16, 269, -18, -266, -106, 183, 123, 108, 253, -200, -61, 356, 134, 55, -45, 26, -255, -163, -18, -203, -118, 105, -217, -46, -160, -122, 50, 92, 280, -133, 141, 93, 88, 11, 47, 40, 30, 82, 64, -49, -15, 50, 210, 190, 97, -308, 188, -13, -39, 241, -70, -222, 23, 113, 47, -218, -32, -291, -322, 224, 207, -78, 29, -105, 433, -124, 157, -200, -134, 0, -175, -84, -15, -196, -134, -61, 34, -97, -112, -41, -90, -163, -229, 1, -164, -279, -290, 312, 61, -74, -98, 68, -140, -207, 152, -21, -200, 14, -212, -45, -22, -77, 136, 270, -220, 23, 164, -252, -127, -56, 2, -142, 1, -71, 107, 56, 26, -40, -86, 256, -12, -205, -21, 183, 121, 62, -113, -213, -270, -31, -1, -154, -59, 7, 137, 65, -299, -122, 17, -125, 11, 83, -108, -212, -75, -299, -225, -257, 200, -61, 107, 118, -16, -87, 197, -145, 36, 131, 81, 25, -89, 332, -119, -24, -194, 292, 126, 140, -42, -101, -142, 184, -109, 65, -149, -256, -124]
2765a24K79J53k15j58J11R7K1j08J00k44QJ43j09J38Q0m16K08K48n96P75k93K1
2787A19j28K97l26o8M9P1J43j68o1kQ5K24k3k87K31j15M2k65M8N3K01l9n1M1j10
2812c9J52N9k01k31K41m9RKn4o5J20p6K05m2r9R8k36j8K13q5Q5J2j02P6Q5r6J36
2839A00N6k26J46k24J90j89K88j00O1j18k7L21k81j77K01k64P1K51J1o0k97J58
2861a09L56j77L28n66J14P3J22N3p3j67N7P5o7n3o1J17j63J43k23L39q6J35k87
2884a20R8J07R5j97J26k46m8J90o1K65j17p3L1o9m5r0K90mk79N20k91k35J81J5
2908D3J09J04m21M99l31j36J83J44k28J60k10M6K13j67L7Q3n05O86l90J27Ql0
2930B4k81O0J68J53q8l3j58J9m9j2L53j17j26L09j65j40K45k91k24O06k35N7n1
$$ y = [-124, 155, 308, 93, -65, 46, 143, 164, 56, 156, -88, -80, 63, -46, 92, 172, -244, -36, 212, -384, 391, 98, 119, -9, 288, -38, -106, -57, 14, 157, -11, -72, -74, 11, 235, 212, -75, 156, 41, 83, -182, -134, -81, 120, 81, 30, 71, -39, 113, 172, -29, -260, -19, -68, -59, -57, -111, -176, -56, -132, 73, 31, -68, 30, -206, -224, -11, -96, -11, 1, -101, -25, 60, -36, 100, 156, -70, 76, -148, 42, -147, 141, 41, 102, -16, -43, 278, -3, -180, 21, -243, -172, 79, 90, 30, -267, -109, 247, 70, 398, -168, -54, 19, 141, 194, 121, -46, 11, 86, 19, -34, -95, 22, -141, 2, -221, 118, 32, 167, -120, -22, 85, 180, -17, 109, -137, -185, 5, -56, 209, 92, 19, 50, -19, -64, -154, 136, 132, -147, 373, 82, -153, 28, 43, 152, 256, -165, 334, 3, -133, 50, 194, -34, 126, -84, -38, 175, 8, 45, 128, -377, 309, -81, 46, 54, 24, -257, -197, -29, 124, 36, 3, -155, -136, -185, -197, 156, 39, -87, 222, 57, -83, 162, -129, -353, 253, 18, 75, 24]
2953B4p3J56K80l27q8J3j6k02J4L61j03K59l13J58l45K15q4N4L17l4m10p6K77
2976E7J3j3k49K01J38J60l91M07m57k33N22L2k63K18l3k94l2K79J30l70L77j05
2998I4k14O4L0l9K15o06L92N9K0J6J79k58j08K70J83m61J50K9j85M37k67j50K50
3021A00N8j2m23K33N4N9k20O8J23L3R5j5k85J04o5L37n04MN48j86J30m87N03k22
3045C0N2l1Q9n23q9N38K91p3j84J2k12L9j13J87J52k60J70m99J18N8K43k9j79
3068b13O25m86K04k75j67k7N60j21j07J6r9q2K00Q8l88K22P6L80m19L3q2Nk5p3
3092a55J01J69k61K16j28j65L47k09j0R6R8m6k94K62K30k25k02K14M44n90J75
3113F7o2k00M24k63r3R0K81m5k42l4J9K8J28L6l3j25q7L43l05K12o6Pp8p9L20
$$ y = [24, -49, 107, 387, 60, -28, -15, -31, -233, -219, 142, 39, 298, -15, 143, -202, 13, -71, -17, 300, 266, -144, -220, 57, 70, 57, -192, 9, 147, 307, -84, 323, -134, -367, 155, 187, -76, 142, 109, -185, -217, 62, 192, -178, 199, 94, -120, -56, -26, -65, 150, -456, -64, -5, 15, 31, 210, -48, -156, 114, 297, -164, -14, 15, -170, 267, 0, -150, 100, 158, 146, -277, -44, 10, 69, -151, -83, 40, 73, 168, 153, -132, -28, -93, 244, -260, -256, 292, 106, 236, -251, 252, 30, 82, 51, 140, -383, -472, 66, 357, 284, 100, 112, -100, -61, -174, 13, 165, -95, 75, -424, -306, -248, -5, -34, -213, 412, -74, 130, -145, -312, -339, 221, 100, -7, 9, -90, -172, 28, 116, -272, -50, 26, 406, -13, 20, -62, -57, -82, -155, -54, 115, -146, 70, -58, -223, 124, -85, -95, 1, 99, 53, -241, 21, 251, 26, -176, 38, 482, -108, 67, 5, -195, 229, -34, -127, -37, 244, 199, -43, -77, -58, -30, 98, 134, 101, -24, -111, 232, -73, 139, 73, 80, 2, -77, 243]
3138B43k24j73J43P1j52J49k49K93pj30J65M0k11P5JL1J16j22j71L00k90M05m32
3161a29M7J47k13K07r6l3L4K0j0M4l05J68J56l4J66l82L22K03l68l57K46J27J96
3184A56Nj26J07k18m1L25k92O9n8L01M0j74k25K70J93l54L70k97q0J24J6j68p6
3207a33K07k92J09J2j39J76K10M1j37p7n1N9j84N3K9LJ1J92N7k36lj29L55Jj9
3232A15k04O7K64j72J3j20q8L43P3m71K90M3l2j34O8n8N1k97L34l73K70M6p5P3
3256B6L2k4J04j02j13L48p46O31k49K16k5j91n4j10K65J89l69N13l41p3J01R5
3278A23k43L32j04j09O7j75J31qk31j3J02L66l18j20L06k80n2J62O6k08L72j28
3300C8k7J08m36M33m1k49L4J29M7l41R6K56k24OJ55J18j18j00K56k42Q3%pj9p1
$$ y = [243, 19, -154, -11, 60, -92, 57, -192, 101, 94, -36, 129, 169, -42, 33, 34, 65, 181, 59, -112, 188, -102, 303, -129, -82, 65, -148, 59, -37, -70, -36, -16, -26, 18, -287, -119, 37, 3, 169, -213, 109, 312, -56, -413, -167, -40, 156, 161, 35, 142, -76, -117, 208, -84, -15, -73, 228, 268, 94, -131, 139, 332, -22, 348, 51, -29, 95, 111, -57, -133, 74, -218, -109, -97, -236, -60, 150, 191, 54, -23, -74, -15, -199, -146, -117, -114, -103, 89, 146, -90, -93, -222, 133, 134, 115, -89, -22, 242, 70, 83, -37, -125, 218, 291, -180, 110, 153, 121, -13, 55, -3, 48, -249, 85, -288, -18, 28, -47, 26, 58, 34, 138, 36, -77, 271, -475, 156, -93, 123, 98, -93, -147, -257, 8, 197, -172, 341, 0, -73, 28, 123, -120, 212, 108, -1, 66, -109, 22, 14, -217, -230, -128, 238, -80, -200, 106, -174, -226, -64, 2, -206, 166, 38, 11, 119, -317, 116, 75, -174, -140, -11, 36, -305, -209, 47, -177, -171, -16, 102, -16, -116, 140, -102, -19, -19, -26, -45, -116]
3325a16q6J86j84O5n1J90j51J15K49l37l3M46k28n9J09j99JKp0J40N9Qmn3P2k04
3351a33j4M40n35J65J14K00k02J2K6j73K16k21L36k30m27N64o4j53PJ75M0l2l75
3374b64J44J17p2p9J79R5j81oK66k28K09j8Nj39L16r0k58O7p1o0J6M0k4J05J42
3399B11j65k03j36J22L67j7j97j5K57l14n4P8J04J88p1m02K16j91K89l26J81K5
3421e3l16L83K05k19k02K64j99k7K64j68j16K60J1k0r3j27R2j17J43r7J63k73
3443b42K01o2r2R1O9j4K49m04K65m05O15m11L97j99l00J96j23pM06k90j71K98
3465F7J33n29L08K98j63M2N5p0n6l15J1J38K81r2l24K99r0j28K3J85j48M1p4n6
3489a64J02L1n5j52L31N2j33K7l4L29m11qK45o9m14L76j23k4L16k71J94k45L5
$$ y = [-116, -202, -16, -200, -135, -186, 4, -147, -32, 217, -120, -153, 293, 65, 6, 115, -84, -83, -81, -151, -11, 48, 56, 52, -1, 71, -133, -147, 293, -242, -77, 37, 237, 35, 47, 73, -100, 116, -105, 231, 1, -426, 138, 74, -79, -72, 103, 143, 111, -264, -120, -3, -75, -154, 25, 120, -61, -67, 199, -29, 180, 162, 167, 28, 344, 254, -4, 63, -8, -68, -52, -12, -36, 69, 211, 46, -157, -293, -171, 196, 179, -18, -33, 224, -90, -144, -66, 38, 226, 155, -247, -31, -222, 67, -259, -78, -53, -369, 14, 219, 0, -202, 62, -137, -164, 100, -68, -184, 76, 87, 67, -26, -153, -61, -178, -35, -132, 31, -242, -41, -103, -195, -104, -35, -49, 200, -204, 61, -344, 271, -140, 257, 58, -242, -46, -169, -176, 230, -60, -231, 67, 200, -329, -21, 277, 114, 156, 211, 141, 85, -230, -219, -81, 200, 108, -216, 83, -7, -135, -112, 73, -75, -34, -108, -164, -62, -31, -86, -238, 93, 145, 12, 39, 5, 334, -77, -85, 160, 91, -323, 53, -70, -94, 222, -49, 145, -100, -65]
3512f5J8m9j7O6k07L19j49N1lj12Q8J41l73J67j76N00l93L80k67Q6L5J1J87Q3
3536C21j02j20m86L32j10K23M6K9j47R1j98k7J3K09k63J03N5q6k7J30K3j39j0
3559a40K57n7k23J94n2Q0M4j2Q5j7m05J85L12j84j02K21k01J67j21J52J94l43
3581C4n3J38l7j41J40n1rp1p5J11J0Q1j18m8K80j84Pk1J92l7j01K2P9l16j01N49
3607B80j73n8J49k80K39l04L7J45pO9j27P8r6J30p6K8k38L29p2k03J82l6q6J4
3631g6L30l45P8o8K71j41N2j5n0K73j53J1j70Q5l67L84j64K95k21j27K13r5M8
3654D8p8K41k57J2J2J15k0p4j22J55j23K53j91L9O4k54K84k86L97k17l1K26l14
3677a21Q6K96n51L56J49j55j89K60k61m8Q2j85L91N2l43J09K28j18j26N1l5OJ86
$$ y = [-65, -47, -96, -113, -47, -254, 65, -84, -33, -36, -148, -60, 81, -292, -125, -301, 199, -194, 186, -81, 5, 40, 51, 238, 321, 219, 99, -387, -55, -165, 58, 104, 133, -14, 77, -121, -148, -135, 74, -189, -86, -31, -117, -144, -14, 9, -130, -140, 117, 60, -163, 31, -21, 59, 103, 91, 176, 159, -246, -61, 251, 67, -35, 186, -15, 152, 31, 183, 377, 34, -19, 119, 82, -59, 81, 30, 21, -50, -125, -14, -4, 77, -41, -89, 191, 7, 14, -7, 185, 148, 47, 69, 148, -168, -269, 280, 107, 49, 198, -82, 157, -147, -110, 35, 28, 97, -30, 48, -48, 82, 6, 34, -204, 125, 53, -150, 32, -4, -90, -76, 254, -91, -13, -81, 190, 49, 101, 86, 36, 309, 156, 167, -3, 82, -285, 99, -65, 230, 9, -118, 95, 0, 48, -30, 211, -46, -34, -22, 93, 73, -1, -123, 32, -91, 162, -29, 10, 74, -180, 104, -182, 215, -2, -33, 193, -121, -35, 261, -290, 66, 215, 60, -129, 131, -130, -178, -96, -281, 110, 162, -181, -72, 156, 38, -88, -37, -72, -66, 120]
3700A20m83J58Q7Q9J19jl37j3K30K65j51k77N9J28rk3j66M76l99N12k52P0N2m21
3724a67l8n9K56L20l55K23l40K20L9j51J09n9k07Q9k0J82j75J66l6j58rK05O4
3747I9L0r0p7p0jJ79J45l60j60M27o3r8Q7K15l21L9j26M75n70N64m28O4%K99l51
3772i2LL8L37j76j23K26k97J3L94m84L07ql76K62K27j91n7kj84JL0L04l04J3J48
3797Ik13J39O9O9k52M05N6k60J51n53L78J59k50j9l0J35M9J03j61L61l70P0J25
3820A70l85R8j25J05K68j99lQ6N5J01r6l0m27N04j47l5K3K59J28n61J70k58N02
3843B03j25J04k91K92k84J3P4K7j30J66r2j21K80k96j66L26j79M22K3r9l1j13
3865CJ98ll82K49j38J35J87m36L14j69K05m31K75J13j23oKj68M91r3m39L44k41
$$ y = [120, -363, -205, -118, -29, 90, 89, -248, -261, -31, 234, 83, -194, -135, -7, -16, -39, -205, 271, -128, 384, 132, 202, 254, -167, -205, -264, -8, 312, -43, 180, -160, 60, 99, -52, 57, -2, -209, -120, -140, 42, -133, 33, -3, -161, -170, 35, 99, 129, 39, -38, -108, -109, 70, 215, -145, -305, 122, 59, -39, 48, 263, -58, -19, -145, 330, -240, 324, -104, -40, -40, 259, -92, -89, -51, 286, 110, -13, 213, -84, -71, 323, -161, 146, 138, -238, 24, 251, 60, 3, 1, -183, -182, -152, 152, -152, -139, 9, -204, -65, 4, 73, -179, 226, 282, 22, 173, -380, -2, 157, -93, -112, -142, -7, 42, 145, -16, 345, -25, 45, 170, -215, -117, -242, -137, 131, -68, -71, 15, 70, 171, 75, 45, -382, 122, -25, -60, -37, 222, 350, -211, -41, -299, 203, 78, 182, -109, 183, -101, -88, -14, 13, -117, 49, -43, -164, 116, -180, -346, -20, -199, 223, 246, 147, 116, 3, 201, 198, -184, 65, -73, 62, 249, -187, 127, -42, 163, -268, 7, 120, -3, -9, -7, -175, 316, 223, -216, 128, -113]
3888a13J00J00j32J30RK65k91l18K44J78k6k63o0N93k26k04n8L04j76K20j34j85
3910d3K73m52M50kk2l44K24j00J96l64J03L72k9j61k87Q1K66J79m43K49P7l29
3932a06R9j09J65M8k6k83o3L27MKPj57j11M16m56P2K94l15J04k2J11J80nm59L21
3957C8j01j22M0KL2J68k64J25K1K00k40k1j38J65J04j46L47k12Q2ok69J93J31
3980A29J49j53J21m90L21K02k76R4J75l97L9J02K20o9J13k3n08L00k6J34l06K01
4002E2l1K78n67L20P0Lj86J10o1k06L48l3k74K97j16J20k47P0j0P6m5M8R2M2j51
4027aM7j36Qm7j42M53m68M65k2l65J49L5q1J6K58k49k36K91k3J92J10k71p7J63
4051F9q1q2J72K28p7n33N57j03p7j40n3%K73j79K72k03j26L63k62K47j71R5J71
$$ y = [-113, -13, 87, -45, 85, 94, 359, 68, -250, -6, 172, 146, -117, -177, 416, 190, -14, -72, 232, 56, 276, 142, -43, 230, -222, 228, 226, 204, -140, 84, -16, 180, -184, -81, 291, 262, 101, -186, -105, 161, 340, -103, 146, 223, -106, -7, -116, 49, 97, 71, -212, -275, 52, 56, 58, 65, -92, -203, 213, -243, -171, 123, -192, -88, -110, 1, 181, 176, -283, 38, -63, -185, -145, -143, -111, 57, -207, -82, -61, 139, -101, -122, -260, -95, 9, -137, 210, -2, 80, 74, -195, -2, 129, 278, 125, 246, -244, 77, 279, 3, 97, 272, -125, -86, 16, 236, 167, 280, 257, -251, 49, 23, 157, -149, 52, 21, 299, -268, 52, 122, 125, -61, 49, -12, -218, 130, 97, -177, 120, 4, 124, -123, -53, -63, 13, -32, 16, 108, 150, -1, 46, -90, -82, -129, -271, 182, -286, 179, 157, -208, -59, -24, -105, -89, 169, -80, -316, -25, -48, 144, 254, -17, -94, 69, -12, -94, 78, 306, 229, -304, 253, 150, 73, -67, -120, -120, 153, -26, 246, 43, -83, 280, 18, 265, 94, 189, 360]
4074C60m83P3K68j72j19o5L3J90k06K83l18r0M02j62k1J94n04L03J00j05M29n23
4096a33n8K05j02K6k9L14l32KK18k15J24j15P0j68M97k93kpJ84m34K88k08J31
4119c7M7l30J8L55K12m68m2Q9J47L04m10J66m17L06qj16K71o6p3J44j82J04o4
4142e0j90K73l17L01k29K31J47k27k47M48l8j32k3%K83m48L51L60l74k50M58l81
4164e4L51o79M06j99Q8Q7j12q0J44L40j13o5m0j68L4K70l37m9j3Pk17M40j83M18
4188B76l53lJ56nl5r7J02k39L55j70K0n6N11m80O0q9o2J31P2k88K67j10k1J08
4212E0K6nrM5p6k18j4J9K12J14J32k31j35j7R8j66K61o5p6J21r1kR1Q5l9J54m69
4239b05J96j79j34O11l08j53K58Mj85q2j31K62K33j84q7J17p7K66j52j8l23J43
$$ y = [360, -123, -50, 218, 46, -73, -138, -105, 85, -121, 162, -156, -246, 156, -6, -27, 167, -337, -34, 66, -39, 390, -133, -191, 14, -88, -62, -91, 223, -109, -107, 111, -104, 20, -95, -25, -193, 304, 11, 9, 2, 186, -248, 40, -168, -37, 10, -320, -302, 53, 265, -203, -245, -156, -9, 295, -115, 51, -366, -60, -68, -184, 87, 21, -52, 92, -90, 14, -50, -240, 33, -284, 17, -212, 19, 166, -61, -308, 140, 102, -30, -53, -53, 230, -218, 133, 493, 119, -131, 327, -54, 297, -382, 24, -175, -87, 0, -112, -192, -48, 292, 179, 114, 74, -94, -60, 210, -127, -176, -189, -182, -399, 41, -142, 276, -77, -80, 76, 71, 36, -61, 41, -198, 157, -13, 7, -49, 462, -18, 42, -47, -109, 22, 94, -194, 73, -37, -58, 50, 76, 71, 62, 107, 31, -187, -201, -182, 30, 144, 276, 45, -90, -107, -9, -175, 86, 21, -55, 66, -25, -27, 64, 149, 110, 264, -205, -9, -188, -322, 289, -19, -172, 86, 90, -95, -177, -308, -46, 187, 3, -84, 33, -44, 222, 70, 52, -271, -128]
4261a28K53N2Mj48k69K35N24l92k09K26k10K7lK18l31N2J85k80K33q0J82n2j99
4284a10q7L01L5j67J03Q0k8j66K2J80j63m4N4k1K72k16k15K85k0k73P5J72r0N2
$$ y = [-128, 125, 177, 181, 33, -236, -1, 523, 131, -78, 148, -62, -35, -38, 180, -151, -99, 86, -194, 39, -41, 141, 89, -110, -197, 104, 139, -28, 75, 155, 127, -39, -17, 163, 0, -44, 10, -11, 261, 45, -170, 115, 95, -178, -103, 69, -21, 31]
$$ [...]
8191b33
##END NTUPLES=NMR FID
##END=
