##TITLE=1H_Bay-17.12
 CDCl3, 8 sc, 
 17.12.2019
##JCAMPDX= 6.0         $$ Bruker NMR JCAMP-DX V2.0
##DATA TYPE= NMR FID
##DATA CLASS= NTUPLES
##ORIGIN= UXNMR, Bruker Analytische Messtechnik GmbH
##OWNER= root
$$ XWIN-NMR		Version 3.5
$$ Tue Dec 17 14:07:21 2019 Russian Standard Time (UT+4h)  she@DPX200
##.OBSERVE FREQUENCY= 200.1315
##.OBSERVE NUCLEUS= ^1H
##.DELAY= (6, 6)
##.ACQUISITION MODE= SIMULTANEOUS
##.ACQUISITION SCHEME= undefined
##.AVERAGES= 8
##.DIGITISER RES= 18
##SPECTROMETER/DATA SYSTEM= spect
##.PULSE SEQUENCE= zg30
##.SOLVENT NAME= CDCl3
##.SHIFT REFERENCE= (INTERNAL, CDCl3, 0, 15.7039)
##AUDIT TRAIL= $$ (NUMBER, WHEN, WHO, WHERE, WHAT)
$$ ##TITLE= Audit trail, XWIN-NMR		Version 3.5
$$ ##JCAMPDX= 5.01
$$ ##ORIGIN= Bruker BioSpin GmbH
$$ ##OWNER= she
$$ F:/spectra/data/she/nmr/H-F/1/audita.txt
$$ ##AUDIT TRAIL=  $$ (NUMBER, WHEN, WHO, WHERE, WHAT)
(   1,<2019-12-17 14:04:38.40 +0400>,<she>,<DPX200>,
      <created by zg, POWCHK disabled, PULCHK disabled
       configuration hash MD5:
       00 E9 B6 7A A2 85 ED C7 34 08 36 98 17 FE 4E 26
       data hash MD5: 16K
       2E 98 81 02 47 7B 95 34 73 DE CC 6D 5F E4 B5 56>)
$$ ##END=
$$ 
$$ hash MD5
$$ AF 4C 79 DC 9E 81 74 57 F6 18 D1 F7 3B 45 20 30
##$RELAX= 
##$RELAX= 
##$RELAX= 
##$RELAX= 
##$RELAX= 
##$RELAX= 
$$ Bruker specific parameters
$$ --------------------------
##$DU= <F:/spectra>
##$EXPNO= 1
##$NAME= <H-F>
##$PROCNO= 1
##$TYPE= <nmr>
##$USER= <she>
##$AMP= (0..31)
100 100 100 100 100 100 100 100 100 100 100 100 100 100 100 100 100 100 
100 100 100 100 100 100 100 100 100 100 100 100 100 100 
##$AQSEQ= 0
##$AQ_mod= 1
##$AUNM= <au_zg>
##$AUTOPOS= <>
##$BF1= 200.13
##$BF2= 200.13
##$BF3= 200.13
##$BF4= 200.13
##$BF5= 200.13
##$BF6= 200.13
##$BF7= 200.13
##$BF8= 200.13
##$BYTORDA= 1
##$CFDGTYP= 0
##$CFRGTYP= 5
##$CHEMSTR= <none>
##$CNST= (0..31)
1 1 145 1 1 1 1 1 1 1 1 1 1 1 1 1 1 1 1 1 1 1 1 1 1 1 1 1 1 1 1 1 
##$CPDPRG= <>
##$CPDPRG1= <>
##$CPDPRG2= <>
##$CPDPRG3= <>
##$CPDPRG4= <mlev>
##$CPDPRG5= <mlev>
##$CPDPRG6= <mlev>
##$CPDPRG7= <mlev>
##$CPDPRG8= <mlev>
##$CPDPRGB= <>
##$CPDPRGT= <>
##$D= (0..31)
0 1.2 0 0 0 0 0 0 0 0.06 0 0.03 0 0 0 0 0.0002 0 0 0 0 0 0 0 0 0 0 0 0 
0 0 0 
##$DATE= 1576577077
##$DBL= (0..7)
120 120 120 120 120 120 120 120 
##$DBP= (0..7)
150 150 150 150 150 150 150 150 
##$DBP07= 0
##$DBPNAM0= <>
##$DBPNAM1= <>
##$DBPNAM2= <>
##$DBPNAM3= <>
##$DBPNAM4= <>
##$DBPNAM5= <>
##$DBPNAM6= <>
##$DBPNAM7= <>
##$DBPOAL= (0..7)
0.5 0.5 0.5 0.5 0.5 0.5 0.5 0.5 
##$DBPOFFS= (0..7)
0 0 0 0 0 0 0 0 
##$DE= 6
##$DECBNUC= <off>
##$DECIM= 24
##$DECNUC= <off>
##$DECSTAT= 4
##$DIGMOD= 1
##$DIGTYP= 9
##$DL= (0..7)
0 120 120 120 120 120 120 120 
##$DP= (0..7)
150 150 150 150 150 150 150 150 
##$DP07= 0
##$DPNAME0= <>
##$DPNAME1= <>
##$DPNAME2= <>
##$DPNAME3= <>
##$DPNAME4= <>
##$DPNAME5= <>
##$DPNAME6= <>
##$DPNAME7= <>
##$DPOAL= (0..7)
0.5 0.5 0.5 0.5 0.5 0.5 0.5 0.5 
##$DPOFFS= (0..7)
0 0 0 0 0 0 0 0 
##$DQDMODE= 0
##$DR= 18
##$DS= 0
##$DSLIST= <SSSSSSSSSSSSSSS>
$$ [...]
##$SUBNAM2= <"">
##$SUBNAM3= <"">
##$SUBNAM4= <"">
##$SUBNAM5= <"">
##$SUBNAM6= <"">
##$SUBNAM7= <"">
##$SUBNAM8= <"">
##$SUBNAM9= <"">
##$SW= 24.9337058887773
##$SWIBOX= (0..15)
0 0 2 0 0 0 0 0 0 0 0 0 0 0 0 0 
##$SW_h= 4990.01996007984
##$TD= 16384
##$TD0= 1
##$TE= 0
##$TE2= 300
##$TE3= 300
##$TEG= 300
##$TL= (0..7)
0 120 120 120 120 120 120 120 
##$TP= (0..7)
150 150 150 150 150 150 150 150 
##$TP07= 0
##$TPNAME0= <>
##$TPNAME1= <>
##$TPNAME2= <>
##$TPNAME3= <>
##$TPNAME4= <>
##$TPNAME5= <>
##$TPNAME6= <>
##$TPNAME7= <>
##$TPOAL= (0..7)
0.5 0.5 0.5 0.5 0.5 0.5 0.5 0.5 
##$TPOFFS= (0..7)
0 0 0 0 0 0 0 0 
##$TUNHIN= 0
##$TUNHOUT= 0
##$TUNXOUT= 0
##$USERA1= <user>
##$USERA2= <user>
##$USERA3= <user>
##$USERA4= <user>
##$USERA5= <user>
##$V9= 5
##$VALIST= <valist>
##$VCLIST= <CCCCCCCCCCCCCCC>
##$VD= 0
##$VDLIST= <DDDDDDDDDDDDDDD>
##$VPLIST= <PPPPPPPPPPPPPPP>
##$VTLIST= <TTTTTTTTTTTTTTT>
##$WBST= 1024
##$WBSW= 4
##$XGAIN= (0..3)
0 0 0 0 
##$XL= 0
##$YL= 0
##$YMAX_a= 334778
##$YMIN_a= -421283
##$ZGOPTNS= <>
##$ZL1= 120
##$ZL2= 120
##$ZL3= 120
##$ZL4= 120
##$ABSF1= 10
##$ABSF2= 0
##$ABSG= 5
##$ABSL= 3
##$ALPHA= 0
##$AQORDER= 0
##$ASSFAC= 0
##$ASSFACI= 0
##$ASSFACX= 0
##$ASSWID= 0
##$AUNMP= <proc_1d>
##$AZFE= 0.1
##$AZFW= 0.1
##$BCFW= 1
##$BC_mod= 2
##$BYTORDP= 1
##$COROFFS= 0
##$CY= 11.3945322036743
##$DATMOD= 1
##$DC= 2
##$DFILT= <>
##$DTYPP= 0
##$F1P= 16.9975609425685
##$F2P= -3.02152046262296
##$FCOR= 0.5
##$FTSIZE= 0
##$FT_mod= 4
##$GAMMA= 1
##$GB= 0.15
##$INTBC= 1
##$INTSCL= 1
##$ISEN= 128
##$LB= 0.24
##$LEV0= 0
##$LPBIN= 0
##$MAXI= 10000
##$MC2= 0
##$MEAN= 0
##$ME_mod= 0
##$MI= 1.114404
##$NCOEF= 0
##$NC_proc= 0
##$NLEV= 6
##$NOISF1= 3.799351
##$NOISF2= 2.8
##$NSP= 1
##$NTH_PI= 0
##$NZP= 0
##$OFFSET= 15.70392
##$PC= 1
##$PHC0= -9945.325
##$PHC1= 14.80086
##$PH_mod= 1
##$PKNL= yes
##$PPARMOD= 0
##$PSCAL= 0
##$PSIGN= 0
##$REVERSE= no
##$SF= 200.130013532006
##$SI= 16384
##$SIGF1= 3
##$SIGF2= 2
##$SINO= 400
##$SIOLD= 16384
##$SREGLST= <1H.CDCl3>
##$SSB= 0
##$STSI= 0
##$STSR= 0
##$SW_p= 3612.71676300578
##$SYMM= 0
##$S_DEV= 0
##$TDeff= 0
##$TDoff= 0
##$TI= <>
##$TILT= no
##$TM1= 0
##$TM2= 0
##$TOPLEV= 0
##$USERP1= <user>
##$USERP2= <user>
##$USERP3= <user>
##$USERP4= <user>
##$USERP5= <user>
##$WDW= 1
##$XDIM= 8192
##$YMAX_p= 0
##$YMIN_p= 0
$$ End of Bruker specific parameters
$$ ---------------------------------
##NTUPLES= NMR FID
##VAR_NAME=  TIME,          FID/REAL,        FID/IMAG
##SYMBOL=    X,             R,               I
##VAR_TYPE=  INDEPENDENT,   DEPENDENT,       DEPENDENT
##VAR_FORM=  AFFN,          ASDF,            ASDF
##VAR_DIM=   8192,          8192,            8192
##UNITS=     SECONDS,       ARBITRARY UNITS, ARBITRARY UNITS
##FACTOR=    0.0002004,     1,               1
##FIRST=     0,             0,               0
##LAST=      1.6414764,     0,               0
##MIN=       0,             -421283,         0
##MAX=       1.6414764,     334778,          0
$$ Real data points
##PAGE= N=1
##DATA TABLE= (X++(R..R)), XYDATA
0@%%%%Qj6J6j6K4l2L2m0N6p2Q8j04J26j50J76k08K45k86L30l83M43n08N80o60
28c51P50q48R54j074J209j356J515j691J885k096K324k576K858l166L501l877
44b039M297m761N281n875O554p329Q237r319J0623j2236J4296j7032K0865k6653
58a5091L6529n7807J78536j84600k51462M81175J35559l84110j51607M26926J20730
69C34778m06628j97675L46314J66935k63961j34164K49824Q3981k55671j28687
79b04954K12884J29794j36200r7146J09979M5966j31865p0683J34181J12063p8976
90B5043j09370N0978Q0075p2016r3728J08656J63032p6370j95853M0803J88192
101A09442m3037j85993Q6686K47137p6949k96118L3824K92986j3960k64696M8033
$$ y = [0, 0, 0, 0, 0, 8, -8, 8, -8, 16, -16, 16, -24, 32, -40, 48, -56, 70, -80, 96, -112, 133, -153, 177, -206, 237, -271, 309, -351, 399, -449, 505, -569, 640, -716, 799, -892, 993, -1103, 1221, -1355, 1503, -1663, 1838, -2039, 2258, -2503, 2778, -3097, 3457, -3872, 4365, -4954, 5669, -6567, 7729, -9303, 11562, -15091, 21438, -36369, 142167, -42433, -293895, 187280, 322839, -61271, -212878, 214048, 334778, -71850, -269525, 76789, 243724, -20237, -154401, 95423, 179404, -76267, -204954, 7930, 137724, 1524, -95622, 14357, 60323, -71542, -142225, -8044, 104019, 25043, -84327, -33349, 46726, -25290, -119018, -10362, 152670, 76300, -119553, -78750, 109442, 66405, -119588, -32902, 214235, 137286, -158832, -125008, 167978, 154018, -110678, -62645]
112f2645K82948o4724l22360K9465L12017q86k60793K3532K30330o6691k48852
123a48659N7300K40685l1472j87583M1782J31675r5586j33996J13852J44987r0505
134D2480j14860Q1459O4577j17836n8036J46969R0768j20754r3548Q5668O3351
145G0238q6077m8669J08825Q6475q3245j13419L0591J00968k55p6995J1527R8562
157I8526j520j34701m6285J34191Q5183j05797p8838J03368O1112j38771q3550
168a07082J50990J12406j30160j08071J10711O8801j39134o0922J64903P6856
178A39298j59448p9562J34053L9606j47657j3442J79249K2568j85889l8289J59358
189D9845J8149j50150J1699J72594o094j82941k0776J56567K5572j23972k023
$$ y = [-62645, 220303, 155579, -166781, -137316, 174701, 173815, -86978, -63446, 166884, 100193, -148659, -91359, 149326, 117854, -69729, -27947, 103728, 8142, -125854, -12002, 132985, 42480, -72380, 9079, 73656, -44180, -102216, 44753, 135521, 14767, -78781, 6887, 70238, -15839, -64508, 44317, 130792, 47547, -65872, -35281, 65687, 65432, -11563, -36, 98526, 97006, -37695, -83980, 50211, 135394, 29597, -49241, 54127, 115239, -23532, -107082, 43908, 156314, 26154, -81917, 28794, 97595, -41539, -102461, 62442, 139298, -20150, -99712, 34341, 73947, -73710, -87152, 92097, 114665, -71224, -109513, 49845, 67994, -82156, -70457, 102137, 96043, -86898, -107674, 48893, 74465, -49507, -51530]
200e1530J26738P83j34601k8358J13720N0288p0384l6350N5056K4824o2113m2265
212e4192N5394P0158j9740o6938k438M8636o715n2404J8430P8172l091q6578j6146
225c7452O9615O745o2045J8316Q1564k2917r9618Q848Q9779j2205p4957L7587
237C260Q3698n3763j04116M3504J01948l6118q3328N0581P7432o9843r2901O2590
249a7056R5445m6650p7031M6663N8405o3295o4521O1138O9560m3429n6970L1613
261f128L3136m2565l0761M6681L9120l2666l6606J5097J7408j8228j0023K6847
273A312K1011j9265k8942J613K0943M226j1480N597K2151m497l6268r018L9032
286F415K1036k9727j3179L5743Q697m9522j4806N8345K7659n0519k3903M8933
$$ y = [-51530, 75208, 75991, -58610, -86968, 26752, 77040, 6656, -29694, 25362, 50186, -11927, -54192, 1202, 71360, 51620, -15318, -17756, 30880, 24165, -28239, -9809, 68363, 65272, -21306, -37452, 32163, 38908, -23137, -4821, 76743, 53826, -45792, -36944, 52835, 40630, -34327, 3260, 86958, 33195, -70921, -27417, 74531, 38413, -44915, 5666, 83098, 13255, -79646, -17056, 78389, 31739, -45292, 1371, 59776, -3519, -68040, -6902, 62658, 19229, -37741, -6128, 27008, -15557, -46318, 363, 39483, 6817, -29789, -14692, 2716, -15512, -25535, 1312, 22323, 3058, -25884, -24271, -3328, 898, -10582, -4985, 17166, 12669, -23599, -32617, 6415, 27451, -2276, -15455, 20288, 28985, -20537, -35343, 23002, 50661, 142, -23761, 25172]
298B5172J4577n8194j3168O8004K2259o3001k2689N4601J1711n7579n345O4953
310D1301Q747o3734j3515N2150M883m9074L468N2485l966n4462l532M3603M51
323A8805l6276O277L5961q854l9514J132L2742K053k3888J529K1034m623k4898
336a8520j451K3219Q590j5716q642J1816O027j4835r077J7603J6997j3640j9848
349a7477R740J7752j1477j7919J6645K3641j6231k7613J3326K6347j3692k3970
361b0928J8424K6470k0722k9878J8893K9267j7680k5513K0947K4840k3764k6545
373b6189K2943K6382k0462k2523K1359J9903k3378j9769K3374K0238k0073j7468
385a5663J8960J4181j9473j3266J9503J4060j6641j2746J3848J0419j3106r247
$$ y = [25172, 39749, -18445, -31613, 36391, 58650, -4351, -27040, 27561, 39272, -18307, -23652, 41301, 50048, -13686, -27201, 24949, 29832, -19242, -15774, 36711, 32745, -21717, -25249, 18354, 18805, -17471, -11194, 24767, 15913, -23601, -22469, 10273, 12326, -11562, -10033, 11001, 6378, -18520, -19971, 3248, 11838, -3878, -12520, -704, 5323, -9512, -18589, -986, 16011, 2371, -17477, -7737, 10015, -1462, -19381, -2736, 20905, 4674, -22939, -9613, 16734, 3042, -20928, -2504, 23966, 3244, -26634, -7741, 21526, 3846, -21667, -720, 24120, 356, -26189, -3246, 23136, 2674, -19849, 1510, 21413, -1965, -21734, 1640, 21878, 1805, -15663, 3297, 17478, -1995, -15261, 4242, 18302, 1661, -11085, 2763, 13182, 76, -9171]
397i171J2709J0107j0688j0680P281R512n982q894N112R626m067j1297J260J1091
411E919K35j1253j175J1452J131j3382k803J3804L919j4324m197J4381L666j5697
425h324m127J6519M276j6683m060J6730L215j6893k310J7607K294j7182j575J7117
439F604P65j6303M61J6529o13j5429J479J4980j736j3539K766J2973k854j1976
453e893L061J0580l039r348L041Q053l031p367K093N532k018m869P29L131j078
468d23l469p20J824J105j814k849L11K595j216m421P21N129j101o501N96O699
484c534j213o688K622Q158k706q165L405Q836k939o626N703Q134n304o919P002
499b34P938n257m539P960M920p942l678R015M363o983j636P524k01q470J73Q030
$$ y = [-9171, 3538, 13645, 2957, -7723, -442, 9070, 3088, -5806, -694, 8932, 4865, -6432, -5172, 5919, 6154, -5099, -6274, 5178, 6309, -7073, -9876, 3928, 7847, -6477, -10674, 3707, 7373, -8324, -12451, 4068, 8344, -8339, -12399, 4331, 7546, -9347, -11657, 5950, 8244, -8938, -10513, 6604, 7369, -8934, -8473, 8056, 7443, -7986, -6507, 8473, 6737, -6802, -4036, 8937, 6083, -5893, -2832, 7748, 4709, -4639, -1598, 6455, 3424, -3943, -1850, 3682, 1664, -3205, -2476, 655, -423, -3892, -4612, -2788, -1683, -3497, -6346, -6035, -3440, -4656, -9077, -8356, -3227, -4328, -10829, -10233, -3534, -4747, -11435, -8813, -655, -3361, -11526, -8121, 715, -2224, -8850, -3147, 4987, -317, -7236, -234, 7704, 2447, -2092, 5868, 10788, 2846, -832, 8183, 12546, 5563, 3927, 11451, 11250, 2780, 2953, 10983]
515A0983n21o865O22L561m639n935L210L881m116m316J124j577o010r49M128r70
531h389m996p42K2n031l180M367L027l931k592J844j899m327K746O682K3l082
547a9458J722J255l608J153Q803M062l783P34N299k391m573Q185J1882k399p325
562d42N087O285o456l953J2691R885q963q678O511M080q057q62J2161K756j2241
577I804o107M958p25n557M023O906o341j1334o10K283m278j084P653O49j2110
592a1870p643L617J208l158L464N621n144j0058j695L053Q67M076O457l070r701
607b3976p17N029j862o0J2406P394j3398j2176R367J0601n916j463J5116M519
621D864j8218j0131J3585J0923m819l0Q886l344j4152j102J0825M293J13N131
$$ y = [10983, 10462, 3597, 4219, 7780, 3141, -2794, 416, 4297, 181, -4135, -3011, -4588, -10598, -11547, -7419, -8389, -13385, -14127, -14105, -19136, -22316, -17949, -14922, -18853, -21445, -19601, -21500, -25827, -23081, -16399, -16376, -19458, -17736, -16481, -20089, -18936, -10133, -6071, -9854, -9120, -3821, -6212, -10785, -2600, 9282, 6883, -442, 4645, 10930, 4474, 521, 13212, 23097, 14134, 5456, 11967, 16047, 7990, 7128, 19289, 22045, 9804, 3697, 8655, 7930, 2373, 6396, 13302, 6961, -4373, -4983, -2700, -6978, -8062, -409, 240, -11870, -19513, -15896, -14688, -17846, -14382, -8761, -13905, -23963, -25658, -22605, -21738, -17662, -11205, -14275, -23976, -24693, -19664, -21526, -21586, -9180, -1786, -15184, -27360, -17993, -7392, -13308, -14771, 345, 4864, -13354, -23485, -9900, 1023, -3796, -3826, 5060, 1716, -12436, -13538, -2713, 1580, 1693, 6824]
635F824j655j3949n156J1764O397n247L317R580q984j9578K430J9853M249r831
649A4J331O344r925j3435O877J5841K752n067k379n850q300K720J0285K293j610
664A891L758m053j8086o152J8071J2731j0039p665P101l666j9361j615K1970J0345
678E230j2407q893J317n915p216R336J3839j306o505q98p645j2073Q818K3659
692f59K534j6982j454J0306r536j5308J6556K9579l168k4428l175J2590k207o579
706a1931J3866J7938m796j6292o629K002N760J1834P947o561q206P64m402j1548
720a0254P589K6073M003k6095j3822J1901K429j3499N877K3635r01k7883j3001
733b3948J0405N761j414Q111O835j1819j4936n79K651R54J2945J5018j0733k4603
$$ y = [6824, 5169, -8780, -13936, -2172, 4225, -1022, 2295, 11875, 2891, -16687, -14257, 5596, 9845, 14, 1345, 7689, -2236, -15671, -8794, 7047, 9799, 4732, 2353, -3497, -11797, -9077, 1208, 3501, 1891, 5649, 1596, -16490, -22642, -4571, 8160, -1879, -9544, -2443, -6109, -25470, -27085, -5115, 5230, -7177, -16070, -14753, -20668, -27884, -18548, -4709, -6015, -12520, -13418, -21063, -33136, -24318, -659, 1875, -15107, -16561, -6255, -15791, -31099, -14543, 15036, 11868, -12560, -15735, -3145, -5352, -11931, 1935, 19873, 15077, -1215, -7844, -5842, -82, 11752, 19699, 13138, 4932, 5696, 1294, -10254, -2665, 23408, 27411, 1316, -12506, -605, 1824, -11675, -5798, 17837, 16936, -10947, -23948, -13543, -7782, -9196, -1085, 5750, -6069, -21005, -21584, -18933, -17979, -5034, 9984, -749, -25352]
747b5352j016J6027L76n759J6015J6081j7387k6996M742K2338N194l642P135L155
761A0911j4549j2348N610J1775Q931Q121l350j8921j0649J1202Q887n552N088
774E156J7406p771l2985q460K6331J3625j3341k858J2854q237k6879k776K4115
787c820J2647p016n331l406j1488n905J0724J1111J911L239J59j7228j6140J3452
801a7091K4341N67j0696N347M407j8450j3103K0467K5594k746j3905j359r11r467
815g005J647J7449J0734m158o114p848j2494M80J9964J2090j0014q146L852q175
829B262j8662O447K8736O493k1992j1440O058m596j1356J0747K1605j723j9229
842f650q699L10k872M836J6240M955j2825q791M67n557l040J7839J8804r586k0750
$$ y = [-25352, -26368, -10341, -9965, -15724, 291, 16372, -1015, -28011, -23269, -931, 4263, 621, 7756, 10911, -3638, -15986, -10376, 1399, 10330, 18451, 15101, -3820, -14469, -3267, 5620, 68, 5156, 22562, 14791, -18194, -26654, -323, 13302, -39, -2897, 9957, 1720, -25159, -27935, -3820, 8827, 1811, -3520, -6926, -18414, -24319, -13595, -2484, -573, 2666, 2825, -14403, -30543, -17091, 7250, 7817, -2879, 2468, 6875, -11575, -24678, -4211, 21383, 18637, 4732, 3373, 2462, -7005, -5358, 12091, 22825, 18667, 12553, 4705, -7789, -7309, 12655, 24745, 14731, 6585, 10437, 2262, -16400, -9953, 18783, 25276, 3284, -8156, -2098, -6694, -18050, -7303, 14302, 12579, -6650, -15349, -15039, -17911, -13075, 3165, 8120, -4705, -13496, -13029, -18586, -21626, -3787, 15017, 5431, -15319]
857a5319l04Q364m730m45J9785J2360j5963j8323K749Q282J328P097J2152k790
871A4243j5381o593L328K140P102J4612J439j7997j1325O337M030k770R509J4796
885B3470q425k3542m566J3031L865j828R331N961j5757j7287M424J1680J742K901
899E000P806o288j9059m569J2596O347j338O572M238j5324j6320P428J5875R77
913C941k478O316j994j7645p336J4405J2226k280j260K258q880j3194M046J5404
927C529M963l473k5l327j2249m054J2298J0708j424k500q28q888r228O754J3869
942F125K388m453K8l904j1979j615J5276R592n898m350J915o759j0652P173J7482
957A0369J902j0377k346J316q242m195J3581J2769o234j0100R60r19p806L493
$$ y = [-15319, -15623, -7259, -11989, -12434, 7351, 19711, 3748, -14575, -11826, -3544, -2216, 4881, 17033, 14243, -1138, -7731, -4403, -2263, 4839, 19451, 20890, 2893, -8432, -2095, 1935, -835, 8674, 23470, 15045, -8497, -13063, -32, 3833, 2005, 11336, 17297, 1540, -15747, -11323, 357, 2099, 5000, 12806, 6518, -12541, -17110, -4514, 1833, 495, 7067, 11305, -4019, -20339, -12911, 2964, 3941, 1463, 7779, 5785, -11860, -19196, -4791, 7435, 5155, 3895, 6153, -2727, -15921, -11875, 3529, 8492, 5019, 4994, 1667, -10582, -14636, -2338, 8370, 6946, 4446, 3618, -5270, -14498, -7744, 6125, 8513, 4060, 4088, 184, -11795, -13410, 1866, 11458, 5560, 1210, 3125, -3634, -14286, -7113, 10369, 12271, 1894, -452, 864, -7378, -11573, 2008, 14777, 8543, -1557, -597, -1516, -9322, -5829]
971e829J6181M329j2518o840L741j900n138Q216J3474k879j3467l978L797l85
985c196K11Q211N378o442q800k211Q85K835O961M383m983o770q61r96k643N619
1001b419J1077p37j2228m634N309k0l200P020R436n909j2670m06O607k08k49P730
1017D499K938j0156p448N130M313k150L638P835m325j2559o20R619J611l782M873
1032C416N815q005j0800L684J0029N02l130K654Q97o986m748M784N842O98k53
1047D399q72m824l885K601M145Q7O48K317l410p741l75P069K711l047M22J943
1063B188m748n694L161O572J83k168J127j397n358j54O559K259l109Q32K481m914
1079b180n550N483Q485k405n668L173L331o336m263Q133P259n113n643L477K172
$$ y = [-5829, 10352, 14681, 2163, -4677, -936, -2836, -7974, 242, 13716, 10837, -2630, -6608, -2811, -3196, -2985, 5226, 10604, 4162, -4638, -6849, -5964, -3129, 3832, 8215, 3232, -3538, -4399, -5395, -8038, -2419, 8658, 7921, -4307, -8941, -3632, -3652, -6852, 168, 9604, 3695, -8975, -9381, -2774, -2982, -3231, 4499, 7437, -2719, -10167, -5037, -724, -2874, 764, 8599, 4274, -8285, -8905, 714, 2325, -1457, 3416, 9231, 1226, -9574, -5890, 4139, 4641, 1511, 4165, 5062, -1924, -6672, -1888, 3954, 4652, 4399, 3527, -1297, -5182, -2581, 1564, 1651, 2299, 4616, 1206, -6535, -6910, 159, 2870, -177, 245, 2188, -2560, -8254, -5093, 1479, 1662, -506, 621, -776, -6134, -6288, 271, 2530, -579, 253, 2734, -2180, -7730, -2247, 6238, 3833, -1835, 1338, 4669, -1667, -5930, 2203, 9462, 4349, -1294, 2183, 4355]
1094D355n210r93P239L170n493l117K321l57k745K422M495j501m347j88J014k061
1110i96k42L957J254l902k429R94l33j216J939K380j802k695L6j30j447J562L401
1127C31j149l780O20K283k270k205M657L936m480m433L950L482m167j766O302
1142A311K849o162l008N654K714m480k86N986N00n830l82N322P06l523J523L962
1158F856j896l974J945L580j452j912K369J324l226j532K754R85k255j44J607
1173E029j246k525O23J446j376j183J190n56k775k87J924j115k415J195J436l036
1189c671k543K644J717l462j616L498P69m559o19M657M43m293N51M753q55m333
1205f919J983N171j378l703L094M390k555k841M147L777k946j885M313K320l436
$$ y = [4355, -855, -1848, 5391, 8561, 3068, -49, 2272, 1915, -830, 1592, 6087, 4586, 239, 51, 1065, -996, -1238, 2719, 3973, 71, -2358, -1364, -1697, -2913, -974, 1406, -396, -3091, -3055, -3185, -4632, -3070, 331, -818, -4598, -3978, -1695, -3965, -6170, -1513, 2423, -2057, -6490, -2540, 942, -3225, -4991, 1311, 4160, -2002, -5010, 644, 3358, -1122, -1408, 4578, 5078, -752, -1134, 4188, 4894, 1371, 2894, 6856, 4960, 986, 2931, 6511, 5059, 3147, 5516, 6840, 3614, 2082, 4836, 5821, 3566, 3422, 5029, 3783, 1258, 1881, 3327, 1951, 768, 1958, 1402, -1373, -1660, 264, -851, -3266, -2071, -635, -3671, -6214, -3570, -1853, -5315, -6931, -3433, -2664, -7223, -7842, -3185, -2742, -7035, -6484, -1731, -2586, -6919, -4936, 235, -1143, -4846, -1752, 2638, 83, -2758, 1389, 5166, 2220, 335, 4648, 6968, 3532]
1220C532p88M366J373l400j12L661k55l187Q65K746j254k462R62J141k113j367
1236C708J378j53k413l58Q94j871k239J279Q14k946j800K094m6l894l73L463o47
1253c110m265N19L718j694l904K403M211k383l644L192L531l108k045M749K949
1268A119l903j600M904J811l926N04N299L69m408P49M525o03l207K261L544k429
1284E009l270K104K334k229j329K573K09l582j003K153m79k127R99J359k996k730
1300c005J780J148k520m82K793p92m384p2L612m20k791J892K918l110l473L163
1316c743L502k117j274L811P87m615m72N303J438l485J141M179k220n017K924
1331A42N664j497l717K581K663m474l198M740L886l334k694K552j94m375J3M468
$$ y = [3532, 2744, 7110, 8483, 5083, 4971, 8632, 8377, 5190, 6055, 8801, 7547, 5085, 6047, 7188, 5075, 3708, 5086, 4933, 2520, 2162, 3056, 1185, -1054, 225, 1039, -1907, -3707, -1613, -1659, -5553, -5926, -2463, -3110, -7375, -6856, -3138, -4832, -8736, -6333, -2122, -4505, -8149, -4957, -1426, -4534, -6579, -1830, 1119, -2784, -4384, 520, 2331, -1595, -1091, 4208, 4577, 169, 918, 5443, 4840, 1633, 3894, 7438, 5009, 1739, 3843, 6177, 3948, 2619, 5192, 5401, 1819, 816, 2969, 2490, 363, 1362, 2721, -275, -3005, -1225, -77, -2597, -3079, -286, -1078, -5462, -5534, -1922, -2342, -5133, -3241, -323, -3433, -6906, -3743, -241, -2358, -3632, 179, 966, -3649, -4121, 1182, 2620, -865, 276, 4455, 2235, -2782, 142, 5806, 4309, 592, 3173, 5836, 1362, -1836, 2904, 6790, 3456, 762, 3314, 3120, -1255, -1242, 3226]
1347C226N01l303l95P63k869j857L534K532k810j803J627j315l758J623N433j63
1363I66m333R4K022k506k014M359M221k605l148J475K98k638J745N568K0m318
1379g94j25K215k471k019N500M794m395n200K528K282m006m12O817K178o773l922
1395c803L400J171k732J941M934j895o005p20K502n73J93M373J043n654l194K796
1411b223J265j839K844M825k724o968j56M521M85q78L485K024m886m491J977L085
1427C46M63J923K224l361n309O93L499k16L04M618J05q060m239N699M149l007
1443a69K7M924k150r037j348P664L191l097L11K089m531n693K830O360P14j447
1459F38J280j931o096n04O821L589k367r2J491m422n381L815P908R16l522k51
$$ y = [3226, 3727, 424, 29, 792, -2077, -3934, -400, 2132, -678, -2481, -854, -2169, -5927, -4304, 1129, 966, -3367, -3273, -1251, -3757, -5771, -1412, 2809, 204, -2944, -1469, -1171, -3809, -2064, 3504, 3524, -794, -919, 1296, -1175, -3194, 2306, 7100, 2705, -2495, 33, 2315, -1691, -2103, 4714, 6892, 119, -3803, -403, 768, -1964, -23, 4911, 3016, -2989, -3709, -1207, -1780, -1587, 2786, 3829, -1825, -5019, -2223, -958, -2797, 47, 4872, 2148, -4820, -4976, -455, 30, -848, 2637, 4661, -225, -4716, -2739, 346, 809, 2732, 4956, 1595, -3714, -3021, 478, 262, 566, 5184, 5289, -2771, -7010, -1311, 2838, -169, -142, 4782, 2632, -6405, -7753, -89, 3102, 5, 316, 2405, -2126, -7819, -4989, 1371, 2085, 638, 1918, -13, -6109, -6613, 208, 3797, 1430, 1338, 2829, -1593, -6974, -3159, 4749, 5665, 2143, 1892]
1475A892l66m445j340N798N023j174k290j280l713k410M381N726n95k546J04k297
1491D68n940N82Q622L871n252l331J552k680n007L898Q998L56o909k408R48k629
1507d861r65O862N392m012n518j58n82k219L736P891K71p316l022J963j066p63
1523d367O260O095m207p582p64K409k40J992N962J193o364m868Q78J397J435M782
1539D011L227m420o292n84J823L06L135N679r08p935l875K998J742K97M498L709
1555G411n293q065L42M490R52J260M667j27q445m823M259M249LK118L261m375
1571A884q530k43O501K775l35K223P3p139n275M173O085P41o6J444l651p340l38
1588g018O952L955j018J10n30n698m560M010O836J419j497n96l234n119L00O289
$$ y = [1892, 1526, -2919, -4259, 1539, 6562, 5388, 3098, 1818, -1895, -4305, 76, 5802, 5207, 2661, 2765, 468, -5472, -4890, 3732, 7603, 2351, -980, 572, -2108, -7115, -3217, 5781, 6137, -772, -3180, -2232, -4861, -5826, 1036, 6428, 2416, -3102, -3260, -3842, -6061, -2325, 5566, 5837, -1479, -4501, -2538, -3604, -4367, 1893, 7988, 3781, -3801, -4565, -2156, -2396, -404, 5558, 6751, 387, -4481, -3603, -2206, -771, 4011, 7238, 2818, -3474, -4058, -2235, -1929, 1206, 6885, 5977, -1958, -5833, -2835, -1093, -796, 3702, 7411, 2118, -5947, -5605, -1115, -163, 1097, 5764, 5637, -2808, -7631, -3372, 877, 880, 2998, 6259, 1884, -6646, -6889, -388, 2387, 2052, 4275, 4348, -2791, -8066, -3893, 2192, 2933, 2867, 4311, 660, -6680, -7018, -66, 3889, 2871, 2981, 2451, -3247, -7807, -3797, 3039, 4458, 2961, 2365, -869, -5988, -5688, 601]
1604F01L988o85o95j946n495k592N527O277l42k126J05k926n820Q27Q303M307
1620G308l578k837k70l285l277M257P411N24m372k276j631l235J080O966L644
1635F429l710l679n32k436k689M852P925n88o829k619J187j651o49N953N519l296
1651C187o699j798J129O87K795M466L68m345l563q80j07K814N858J901m885m472
1667c544N05N60q83L620O338q12p394l444K604J679M29L687L086l620n918r12
1683d019K382J511K773L480j727o338k259K761J270J35L854L039n139p365Q12
1698d830N365J188r88K594J019n621n321K387N282J588l67j42k398m036n02K966
1714a816K511J495J200k170n593j814M060L559m66K26J602l004n642J65O070L169
$$ y = [601, 4589, 3904, 3209, 1263, -4232, -6824, -1297, 4980, 4638, 2512, 2617, -309, -6129, -5302, 3001, 7308, 3730, 893, 623, -2662, -5939, -1682, 5729, 6253, 1881, -395, -2026, -5261, -4181, 2785, 6429, 2719, -960, -1492, -3928, -6617, -1765, 6160, 5572, -1257, -3876, -2689, -4340, -4989, 964, 6483, 3187, -3512, -5310, -4181, -3494, -699, 3767, 4135, -210, -3773, -4653, -4760, -1946, 3912, 5813, 928, -3544, -3039, -2479, -3362, 258, 6596, 5784, -1610, -5054, -2450, -771, -342, 3345, 6431, 2811, -3107, -4019, -1637, -126, 2647, 6127, 4400, -1938, -4197, -1436, -166, -31, 3823, 6862, 1723, -5642, -4830, 535, 1723, 735, 3329, 4348, -1273, -6594, -4207, 1075, 2663, 2296, 2154, -244, -4280, -4782, -1816, 695, 2190, 3390, 1220, -4373, -6187, -2127, 1432, 966, 1192, 2794, -210, -5852, -5687, 383, 3552]
1730C552j608r24k69k978k475K411M338J338p15j043k995k918J791M661J204j562
1746A808M35l04m361k664M706N501j302l518K20J91l392j031N034L874k133l406
1762c42p39n70j141K031L697K14k314j418j096j714R48M480J946l051k464N19
1778a014n38j667K119M558K48m161k126J010J29J46K480K171j601k838p75l9L00
1795a598K473K598j368l128n04Q26j018M5L770K041l625l735J160J902j098K30
1811a029L269L73m074k422J760J515j98J106J391j812k992K04J635J01O72K048
1827A547m08l525j273K378J253r11J030J992j621l438K29L063P66p61P74O89k164
1844c80j703J421K069M1J71M86j397j995O21K161J51m71R69P0k694j323K400J939
$$ y = [3552, 1944, 1020, 751, -2227, -4702, -2291, 2047, 3385, 2670, 1627, -1368, -4286, -2495, 2166, 3370, 1808, 2243, 1939, -2422, -5086, -380, 5121, 3819, 301, 521, 712, -2680, -3711, 1323, 5197, 3064, -342, -1081, -1651, -2792, -761, 2936, 3150, 836, -582, -1678, -3392, -2444, 2036, 3982, 931, -1533, -1014, -1552, -3219, -1100, 3458, 3706, -455, -2581, -1571, -1442, -1296, 1184, 3355, 1754, -1084, -1859, -1898, -1598, 875, 3473, 2105, -1023, -1527, -701, -1719, -1674, 2096, 4137, 512, -3223, -2063, -161, -1259, -1029, 2240, 2613, -1461, -3883, -2123, -608, -806, 300, 1691, -121, -3113, -2909, -1274, -1173, -501, 1547, 1139, -2386, -3659, -1281, -28, -939, 91, 2083, 462, -2976, -2747, 316, 1082, 321, 1095, 1784, -380, -2083, -662, 1407, 1448, 1619, 2105, 708, -1287, -666, 1495, 1646, 1175, 2144, 2214, -480, -1803, 597, 2536]
1862B536j235p89J231n50k863l7K915P23j678k92Q54j543j728J648K009q34j285
1879i18O60j77k096j33K626P46k075l82J198q88j888J139K552n06k111L03Q91
1896a059j235o56J906J161j302r72P38j39r81R41J632n83j325N40P84j283l32
1913b165K182J012j965q17J723K49j650M84K445j83k273K05J797n86j229J362
1929E91J633j397j459J167Q96j302k21J788O2j930l24J607l08j506P97J509j288
1946C15j658P91J136j254q60J302M36j833p15J384n1j418L86J250r66j612Q35
1963b532J230j248q76J546O11j833o16J766M06j626R8J914l06j817O55J893o12
1980a347j194J192J317j265r06J628J021j313k66J796J36j658L29J762k19j424
$$ y = [2536, 1301, 512, 1743, 1193, -1670, -1707, 1208, 1931, 253, -39, 815, -728, -2456, -808, 1201, 367, -918, -258, -435, -2531, -2664, -38, 708, -1367, -1749, -551, -1439, -3327, -2188, 364, -142, -2253, -1950, -1059, -2294, -2950, -1044, 117, -1185, -2157, -1419, -1558, -2539, -1598, 34, -549, -1874, -1334, -550, -1833, -2165, 17, 1029, -936, -1753, -30, 219, -1431, -947, 1498, 1315, -958, -753, 1044, 458, -771, 591, 2224, 827, -632, 535, 1431, 129, -92, 1696, 1758, -172, -496, 1111, 803, -703, 94, 1603, 315, -1343, -552, 584, -670, -1530, -228, 208, -1625, -2340, -956, -1007, -2425, -2039, -789, -1755, -3367, -2532, -1302, -2550, -3426, -1880, -1269, -3102, -3718, -1952, -1546, -3172, -3074, -1160, -1466, -3283, -2628, -735, -1347, -2541, -1349, -32, -1297, -2203, -575, 446, -867, -1133, 663, 799, -859, -530, 1232, 1013, -411]
1996d11Q15J404j019j292J219J229j264q04J379L82j709k18J541qj545K42J281
2013A222r40j435R44J128j172j055J270M09j765m09J770P3j752J9J522o88j682
2030b541Q14J633r23j437J047J003j531r30J928P45j686m66J516Mj758M71J997
2047a14n28j728O11J438j033j113J524J224j476r36J349M34j401J33J852j15j658
2064a537K71J255p20q23J433J007j362j016J306N65j395K44J940k16k000J99J769
2081I20n61j342J380J606j516j811J346J301j284n11J890M55k303o64J887K53
2097A046j404O06J556r88k111O58J676p23r05J387O23k090j086J626R28j217L2
2114c86J340q03k064M53J759k12q67R43M32j977r47J859R87j106LJ369r27k248
$$ y = [-411, 404, 1808, 789, -503, 716, 1945, 681, -123, 1256, 1638, -71, -289, 1252, 1244, -301, -59, 1222, 282, -1153, -209, 919, -253, -1308, -38, 371, -1394, -1803, -33, 40, -1712, -1693, -171, -859, -2541, -1727, -94, -1017, -2454, -1407, -404, -1935, -2865, -937, -192, -1878, -2344, -828, -824, -2582, -2111, -114, -642, -2370, -1759, -321, -1354, -2467, -943, 281, -1195, -2131, -782, -348, -1749, -1616, 236, 121, -1537, -1266, -11, -731, -1554, -121, 886, -476, -1492, -186, 379, -1016, -772, 1168, 952, -1048, -849, 920, 359, -983, 397, 2003, 487, -1324, 22, 1323, 39, -472, 1418, 1873, -430, -1094, 793, 1046, -358, 248, 1804, 816, -1295, -637, 1039, 316, -589, 798, 1421, -669, -1755, -129, 799, -418, -386, 954, 151, -1913, -1460, 299, 87, -780, 163, 595, -1382, -2329, -470, 517, -589, -586, 783, -144, -2392]
2132b392P51K337j45j366Q66Q62j931j365K011J844j076q72J193k51k162K06K690
2149A200N20j519rP96j469j345K046K050j001j330Q37k1k017J11K823Q20j960
2166E32o89R30r11j367J453K549o30k060J02L03j275mK451J035j830j256N71m93
2184e89r75J597K367q28k348j54O64r24M3K550J051k277j690P93K27r29J445K389
2202B412p90k841l87J190l57o9K279J201k503k215J000R71o01R28K301o38l195
2219a314q89J830M43l27J712J254k294k773P06J899J23K74J612m78k940j272J694
2236g40J321M0R60O43k219k460Q50K007K69L11J142p66l085j000K436J551m65
2253G95M23Q58k152k883Q49L095O99p38M02l80k599j262K424K304j62n19J18j830
$$ y = [-2392, -1641, 696, 551, -815, 51, 913, -1018, -2383, -372, 1472, 396, -476, 717, 466, -1696, -1490, 1200, 1720, 201, 192, 988, -481, -1826, 220, 2270, 1269, -61, 776, 755, -1262, -1151, 1672, 2492, 532, -157, 773, -138, -1505, -52, 2497, 1867, -193, -91, 212, -1063, -1067, 1384, 2419, 589, -667, -96, -589, -1564, 33, 2400, 1572, -776, -930, -266, -1190, -1147, 1403, 2454, 177, -1513, -720, -493, -1422, 23, 2412, 1622, -1219, -1606, -416, -773, -842, 1437, 2638, 135, -2080, -1080, -109, -710, 218, 2519, 1881, -1314, -2203, -373, 70, -257, 1455, 2709, 415, -2358, -1652, 247, 370, 644, 2256, 1778, -1162, -2434, -740, 581, 621, 1581, 2224, 5, -2455, -1605, 402, 671, 982, 2124, 1358, -1727, -2727, -291, 1260, 795, 1218, 2076, -76, -2959, -2110, 985, 1684, 946, 1348, 968, -1631, -2893, -469, 1835, 1673, 1154, 1272, -558]
2271e58k174J049L090Q01j035l1m38k543r98K846K764p73j479O9j032k110O76
2288a876L422J424j619j212n78j430n51K388K529o39j622n78j071j592J290L507
2304A792P21k316j353J45j216q05K493L108q09k949r56J77o04O99K745J194j953
2321A13k156m47k29L81K402K093j226k619n73K64n67J148L344P98l054k477Q05
2338b000Q96q0J525K504n71l371j486J186J131R78J761N26k292k287K94R44P53
2355D11J744J786j619l556o19J922Q04J19J774R15k879l266O66K488Q78J05Q61
2372B534r23k832j498J418J899Q10N96m56k701k142J037J975N39L20R10j396l513
2389c423q69K702K139m06l02K62j900k452N69L023J584m90o22j099j976l23K242
$$ y = [-558, -2732, -1683, 1407, 2208, 1173, 1142, 704, -1839, -2837, 9, 2773, 2000, 521, 590, -442, -2552, -1876, 1546, 2970, 1351, 139, -439, -1869, -2420, -32, 2497, 1858, 236, -342, -1413, -3005, -1715, 1792, 2513, 197, -1156, -1011, -2227, -3032, -539, 2569, 1760, -1189, -2145, -1968, -2572, -1873, 872, 2066, 113, -2043, -2490, -2719, -2338, 64, 2157, 931, -1688, -2261, -1997, -2564, -1416, 1928, 2726, -328, -2805, -2000, -1104, -1184, 341, 2845, 2274, -1097, -2583, -1397, -266, 712, 2473, 2999, 707, -1580, -1286, -342, 411, 2155, 3941, 2322, -1234, -1853, 69, 873, 992, 2766, 3681, 802, -2464, -1798, 690, 1568, 1673, 2534, 1611, -1221, -2719, -1301, 598, 1408, 2004, 1548, -1153, -3295, -2258, -283, 256, 576, 1486, 90, -3423, -4292, -1590, 549, 143, -159, 103, -1797, -4249, -3680, -657, 927, 437, -185, -1284, -3260, -3583, -1341]
2406a341J991J40j78m41k108j769J818L327O54j289j85k65j997r74K935L115l95
2423C038j876o68l91j130P07K843J490j168j448r46j052J22K482K008q16j666
2439A529n90p75j274J132L219P64k340j910L1m00m54J716K355n83k579j477k1
2456a657J25R70J902L71j725j737l57k34L28K202J709j525k569l76O84k24O31
2473a482K436Q07k483k259N07J291L37R90J449n27k469r71J043J119P80J355K41
2490B164k019j666P32J213L86R96J384r40k684o81J870J202K1P08N53j533k128
2507d22L96K011R08O1K20p30j838n59J278J188L31K80j89j864j515J016J754R3
2525B419k52L71p10k191p48J977J454n30n51q0j080j620M58K034N52p78m21n78
$$ y = [-1341, 650, 790, 612, 171, -1937, -3706, -1888, 1439, 2093, 804, 619, 354, -1643, -2617, 318, 3433, 3038, 1162, 494, 103, -1027, -320, 2523, 4013, 2845, 1397, 451, -601, -479, 2003, 4011, 3195, 1529, 939, 164, -1110, 22, 3241, 4005, 1665, -245, -214, -614, -1068, 648, 3003, 2420, -159, -1636, -1657, -1532, -562, 1340, 1711, -14, -1751, -2108, -2342, -2014, 188, 1897, 372, -2197, -2573, -1889, -2113, -1482, 954, 1761, -722, -2981, -2474, -1183, -846, 144, 1593, 1066, -1403, -2374, -1331, -212, 568, 1923, 2164, 145, -1521, -789, 424, 810, 1806, 3190, 2250, -434, -1115, 755, 1957, 1978, 2686, 3239, 1706, -422, -26, 1985, 2893, 2954, 3174, 2444, 606, 47, 1325, 2513, 2844, 3124, 2935, 1071, -444, 572, 2326, 2419, 2167, 2538, 1828, -363, -1111, 866, 2320, 1790, 1239, 1159, 79, -1541, -1083, 951, 1503, 725, 304, -274]
2543b74j435l65J646J255n51o65j1j017j258Q82K318K38j307l75J79q08o98J615
2561f31J927l85j381j91Q2l94L96J730P68r00o92q4k57J5J496J226n99j031k2
2580A073L2n34N28J742M62j468q31M28q3k93R47J204o45j443k43L05k20K30J142
2599B333J95j419q56L73N7l80P29J199r59j675j01R60k68k93J018O10j397j366
2617a240O14Q72l29J01P73k43j381l42Q62K46j00M74K99r91r45O08P94k61j9P54
2637E46j73j421j95J089L96m07K71M95p72q95M79J013j08k04M47k0r87p3J022
2656E03L95l99J30N81n87r27P13J185l12m69M71L51r01m16J097O34o49l04O07
2675A703k58r16L37R57p4p68J25L10p00n70Q26N27q17n47M88q8j055P3R58j32
$$ y = [-274, -1709, -2074, -428, 827, 276, -389, -400, -1417, -2675, -1793, 525, 763, -544, -919, -740, -1548, -2246, -631, 1296, 911, -470, -661, -579, -973, -577, 1153, 1921, 1021, 329, 245, -12, 3, 1499, 2725, 2126, 1095, 1073, 1105, 571, 1099, 2841, 3303, 1835, 1004, 1432, 1349, 1056, 2003, 3207, 2562, 1119, 876, 1181, 961, 1191, 2333, 2528, 1109, 253, 626, 683, 303, 1032, 2231, 1272, -403, -504, 456, 188, -105, 913, 1523, 126, -1240, -626, 246, -83, 18, 791, 548, -833, -1175, -313, -67, -167, 307, 606, -385, -1330, -722, 72, -189, -208, 546, 373, -1048, -1243, -154, 242, -165, 106, 601, -171, -1066, -587, 426, 318, 114, 561, 541, -446, -519, 503, 898, 499, 629, 1210, 623, -304, 409, 1594, 1282, 813, 1284, 1635, 734, 318, 1415, 2049, 1400, 1096, 1703, 1445, 529, 866, 1823, 1749, 981, 1106, 1416, 716, 146, 972, 1499, 682, 135, 623, 535, -520, -447, 511, 379]
2695C79r82j0M16n20o59N99O04n60o21M00J44o45k1R09L0q43J28N34k48n10O99
2716g77P78n79n22O16L99n66k5R64K79q55n7Q89o0o20M76Q39l79p60M93N71m92
2737F12l88R07L76q74l04P22J74p39KR23k57q50J12O72l48o34N46N63p35n71O81
2758E90K85n66k39P32M3q48nP06j26o66L53N85n05o28O19L79o08j81O10Q4p21
2779a07j08P43j51n91K80N54m58p01N35N84o16k80N90J70p95k12Q18L1o64K03
2799a75P30m49o73M12Q64n42n67N92N34p80l72R47M20q02j05P82K5p88J39R27
2819A119j17o43L02N15m64m62N78O40n98l23M71J45p21J5Q05p9o47N2M68l95m47
2840B14N22N07n40m92M76P4o37M0Q38m9p89J13N09l34n63P00O74o52n57N36K72
$$ y = [379, -603, -613, -197, -717, -1376, -777, -173, -733, -1354, -954, -810, -1455, -1476, -567, -537, -1380, -1252, -718, -966, -1476, -777, 1, -578, -1100, -484, -85, -651, -676, 288, 567, -288, -345, 544, 484, -136, 340, 1179, 800, 40, 533, 1104, 612, 224, 1131, 1507, 633, 329, 1051, 1225, 486, 488, 1411, 1154, 304, 416, 1088, 740, 106, 652, 1215, 480, -91, 590, 875, 309, 70, 802, 845, -3, -8, 698, 572, -94, 259, 844, 339, -289, 330, 709, 101, -80, 530, 614, -107, -215, 528, 377, -214, 66, 620, 162, -539, -4, 580, -36, -316, 274, 444, -351, -563, 255, 286, -378, -175, 555, 106, -567, -155, 709, 167, -400, 192, 726, -54, -426, 521, 941, 139, 34, 816, 841, 53, 192, 1119, 1002, 359, 661, 1176, 712, 250, 828, 1468, 870, 547, 1018, 1163, 442, 457, 1262, 1183, 536, 588, 1056, 661, 214, 736, 1243, 703, 211, 687, 761, 124, 164, 1002, 953, 164, 277, 786, 452, -111, 589, 1263, 611, 54, 590, 862]
2861H62o28r1R97K14r38j69O89m9n96M79Q11l60r60L36O43l84l49Q56L95r24m86
2882C48P15J97n13J47Q16k50j022L2O90j14k39M16L48p40o19L43M94k56M7N15
2902A355l47q05r3P23o6j63M58J59q73n37O60M61l07qO40l39j072j5J110J40m84
2923E97K62M58p42q54P33R66j85l63N49p3j039k08J205N82n33PL65n20q25N40
2943I22J218J1p20K35R2p43k91J034O40m30m90O9m17n42L86R14l9n47k52j60o88
2964B02j92R42N12o67n85N2m41o61M67J134l2j098k90J94o30j38J024Q13o87q63
2984i44R6kl24M25J265J23j042m05M47r4r4J163R71o33j021J13O18j55L35J221
3004B063M18j138q00N47M04M4P02P03m71j160k19N31K01K39Q25r4j277p92L42
$$ y = [862, 234, 143, 1140, 1354, 416, 247, 936, 887, 291, 770, 1581, 1221, 261, 597, 1240, 856, 507, 1363, 1758, 834, 348, 1063, 1260, 747, 894, 1710, 1460, 438, 470, 1160, 1046, 807, 1223, 1571, 831, 212, 555, 1049, 793, 840, 1355, 1008, 203, 110, 833, 767, 604, 1062, 1221, 348, -189, 471, 932, 625, 617, 1257, 918, -154, -169, 941, 1081, 597, 859, 1317, 575, -279, 454, 1420, 1235, 872, 1421, 1348, 309, 101, 1306, 1888, 1355, 1362, 1727, 1207, 382, 922, 2140, 2151, 1431, 1666, 1758, 1015, 724, 1758, 2398, 1968, 1478, 1547, 1130, 588, 974, 1888, 1849, 1302, 1050, 890, 202, 10, 952, 1464, 797, 212, 264, -177, -838, -371, 763, 731, -367, -657, -463, -1093, -1231, -207, 606, -81, -944, -848, -850, -1174, -749, 516, 639, -403, -808, -361, -455, -549, 614, 1585, 952, -69, 44, 662, 507, 842, 2063, 2481, 1343, 543, 1090, 1494, 1538, 2240, 2943, 2472, 1312, 1093, 1624, 1825, 2064, 2889, 2795, 1518, 726, 1068]
3023A068M01%M67M04q61j376j78O92K61J7L77j52j322q66M05O15O2L05K92r18
3043c07j358R6Q37M58j42N43r2j390q51Q53J124Mj26L89m83j281j61J410Q84k38
3063A69o2Qq03q47P95J286M22m02l1m92q42K3J365Q00k30l32q4p81o45Q35J382
3084A534K23o24l80k99p37Q6J255Q55l98o38m07n67l59Q57J185M2q12n23k85o79
3104f71J67J407P44q70q71j20l56l97P06J410mj285p02l7j32pJ311Q54r11j231
3124i95j75N6j4O13J180M6j328q36K49K02J76R66Q07p78j452j21M94L00M08R73
3144G71Lj232r86K58O29M31O49M26p82j187j54N39N29N15O54l19j232o68N98N49
3164iL54N38M62r26j295J10J012M61J94M80q3j239q81Q44J035J40J48K23o70j309
$$ y = [1068, 1469, 1469, 1936, 2340, 1479, 103, -75, 617, 878, 895, 1272, 1120, -202, -1068, -663, -48, 14, 319, 611, -307, -1665, -1569, -732, -274, -416, 127, 35, -1355, -2206, -1353, -229, -225, -351, 38, -445, -1726, -1887, -477, 407, 169, 107, 115, -688, -1535, -740, 546, 968, 566, 535, 43, -799, -776, 589, 1389, 1159, 827, 743, -38, -683, 152, 1534, 1757, 1133, 753, 454, -283, -197, 1058, 1913, 1515, 877, 470, -97, -456, 401, 1586, 1628, 816, 293, 8, -671, -504, 903, 1647, 777, -94, -214, -570, -967, -261, 1149, 1145, -140, -842, -879, -1011, -1018, 293, 1147, 236, -995, -1170, -1114, -1128, -515, 665, 711, -617, -1453, -1204, -1002, -826, 140, 947, 169, -1283, -1404, -910, -610, -202, 771, 774, -458, -1444, -1186, -557, -126, 523, 949, 167, -1020, -1174, -635, -106, 409, 1063, 744, -488, -1156, -558, -9, 345, 883, 1345, 419, -876, -766, 246, 707, 901, 1381, 1298, 59, -822, 22, 1057, 1197, 1345, 1568, 898, -411]
3184d11O4J120O30l0j3j80j174q61P88J173N9m04n4n97j116j94J115Q81m33m52
3204h9l11q22o27N02J101K71m60n20o32o22J58J112N77k42l68k75o62l51R80J182
3224i8O7n74k60j70m89L16J334Q35m83n86m8k58j53Q52J318k7p44l80j9k80J48
3245C01J230P15o93r57M2n2k47M42J126N8j253p74K13mm0P38N29o20j143k57J87
3266d59Q9L63O71j69r28o49R9K29K37O60L82p01r55n8M44K56K95O29j3r96n69
3287a143M17M10K57M20L54o78q89R3N67K24J63N31j78j034n37O10N25o8P8M09
3307E31o13j081J0Q95L94l09K42J7p82o41N28Q36K6j28J32l82o26J4Q29N17k06
3328B03j5J2n31l89O02Q06lk28M4j50o15N0P94L82k56j62q1m10l32M57O80j15
$$ y = [-411, -347, 773, 1403, 1373, 1360, 1180, 6, -855, -67, 1106, 1165, 761, 707, 110, -1006, -1200, -85, 796, 363, -89, -400, -1222, -1849, -1347, -246, 25, -435, -955, -1587, -2209, -2051, -939, -362, -604, -972, -1247, -1909, -2260, -1280, -98, -31, -605, -865, -1035, -1524, -1208, 126, 961, 478, -108, -156, -414, -567, 285, 1603, 1576, 832, 452, 433, 153, 301, 1531, 2246, 1553, 596, 638, 586, 339, 781, 1907, 1965, 712, -62, 151, 147, 107, 845, 1374, 754, -389, -646, -459, -370, -7, 664, 495, -433, -1082, -983, -754, -517, 143, 525, -176, -1131, -1189, -745, -489, -194, 435, 422, -574, -1143, -726, -316, -59, 361, 715, 37, -852, -759, -192, 32, 195, 726, 548, -486, -1023, -413, 112, 44, 122, 531, -82, -1163, -1153, -258, 136, -173, 69, 86, -696, -1337, -809, 27, 53, -75, 57, -325, -951, -937, -108, 409, 203, 188, 200, -331, -720, -118, 688, 685, 457, 501, 351, -264, -214, 580, 962, 706, 544, 463, 53, -279, 178, 858, 743]
3350G43m38j04k15n99mQ13K43o35k68j3k83m86L87P01k34o41n3O2m51r3P34M29
3372d05n66m83K64M5l86L60P35Po06j46K94k0j42N69M85k94m62J82K50j76J96
3393b99O26L2n99j49L38k7q1M76L41m30n36K37J37j23L8M30kp04j40L04Nk07L57
3416B4K17m47n12J77K93k33j67M19J23p40k37M06J59l32O4M60k93o55J56M58j43
3437h03j35K45J67m79m00N04K47k05r3L93q2o09R8O30kl54K42K49l12m02M65L42
3459b94k11j93L56K3m41MM74J06k54J1K52k29l42L34L12k42k24K68P5n44L3M24
3481c02L7m24n3L42l60l97K78L73k07m65K71J37m19j55L87J65m60j16M52r0m86
3502a492K35N39j85l80K28L71k83j72M24L19k92k25M33J18k30N3N39J8m09J97
$$ y = [743, 305, 201, -14, -613, -617, 196, 439, -196, -464, -477, -760, -1246, -859, -158, -392, -1033, -1086, -1024, -1475, -1568, -834, -405, -971, -1454, -1190, -1145, -1531, -1171, -436, -429, -1035, -1181, -887, -907, -1049, -480, 5, -289, -751, -569, -319, -495, -299, 327, 359, -240, -389, -51, -78, -159, 317, 658, 228, -308, -71, 66, -57, -19, 411, 409, -295, -435, -131, -126, -333, 24, 241, -206, -718, -541, -248, -481, -648, -229, -106, -846, -1083, -677, -518, -850, -786, -326, -619, -1274, -1118, -660, -803, -938, -693, -526, -1005, -1405, -901, -654, -859, -952, -559, -641, -1250, -1152, -522, -524, -878, -636, -387, -699, -1101, -636, -294, -505, -698, -342, -319, -760, -756, -282, -176, -430, -419, -167, -396, -738, -404, -92, -334, -558, -290, -215, -759, -726, -302, -265, -689, -742, -400, -760, -1157, -879, -506, -713, -1178, -907, -770, -1189, -1344, -957, -792, -1252, -1368, -916, -1006, -1492, -1257, -718, -903, -1283, -1055, -684, -967, -1139, -715, -396, -688, -913, -480, -362, -592, -539, 0, 18, -391, -194]
3522a94K73l9k61L25L26l34k03K96J54m16L0L39o9m45J6K88j71m06J93K67l46
3543c77l58K06J33l77j56L99m9m55lK74j64k72J42L18k13l78J98L85k81k42M51
3564h19K29m09j60M41J54k98J02M71q7l45K41L41j03k81L85J82k63j81L85J79
3584A64l28p0M19j9m17N3L86q8l42K08K26l06k70L23J89k98o3K33n6k98nL97q3
3607d5l60J52L43l70k80L95K59k94j65K30R1l80j41N20Q8m15K2K94j17n00K45
3628d28M13k07m03K29J56k97k13L93L17n22j15K63p0l25J75M13j46l28Q0K28j99
3649e86j43M74K34l28j01K30M5k24J45N15Km46J50J98k2j33M40K48l20l05L14
3670C87J51k01J58L96j41m26n3L42j19k47K85L16m64l95K00K27l18j06M26ko50
$$ y = [-194, 79, 40, -221, 104, 430, 96, -107, 189, 343, -73, -43, 296, 227, -218, -202, 86, -85, -491, -298, -31, -377, -735, -529, -396, -773, -929, -530, -579, -1034, -1037, -763, -927, -1199, -1057, -739, -952, -1330, -1132, -747, -1028, -1270, -819, -590, -999, -1159, -718, -564, -862, -760, -289, -376, -721, -480, -139, -242, -523, -138, 44, -219, -400, -15, 164, -164, -234, 185, 166, -251, -198, 188, 100, -242, -34, 192, -114, -384, -61, 128, -170, -233, 0, -56, -354, -359, 38, -45, -405, -253, 90, -280, -560, -165, 94, -200, -365, -135, -44, -424, -565, -45, 43, -372, -350, -56, -173, -673, -428, -15, -222, -625, -396, -240, -537, -750, -357, -40, -562, -677, -414, -484, -809, -634, -221, -367, -695, -615, -387, -586, -729, -255, -21, -349, -450, -220, -175, -399, -254, 261, 263, -183, -33, 165, 143, 10, 450, 698, 378, 73, 387, 538, 337, 495, 891, 750, 324, 271, 613, 494, 247, 532, 848, 384, -11, 189, 416, 98, -8, 418, 416, -234]
3691b34j57M12m9k09R5L06l06o13K01L77r2j24K09J14n50j53M12J65j50J01K74
3712B9k60m25J62M50J0j56K49P5m90r0K97K87j10j9K38l32l74J18N68k3k46Q6
3734D4P8n44q3M56L41k30j72J83j78l53P4N79R3k71j30L03m68j58N13M55j97l33
3756BJ08Ml83J06N74J99m11j36J37j15l11M00N70j54m66o3K8k13R1M84J77m15
3778B13l10L0m1k05L69M78j92n27j44J48j51K6N22J83m71m68K29K0r9K67M53k51
3800G9m98r4K04Pj0N03K23n57n12K96K39j15K07M26j39o81j66M39Q9JL23J57m35
3823a4n52J62L90Q0Q7L32k31n43j69M09K79j04K74J47m97m80K30M42J48m4J86
3844E32q8n95k48N77L73j02N1J06m97m73K05N35R3j67J04k04n48k93O40L08j83
$$ y = [-234, -391, 21, -28, -237, -142, 164, -142, -755, -554, -177, -269, -393, -184, -70, -620, -773, -361, -196, -346, -245, 29, -231, -656, -494, -44, -34, -190, 59, 134, -356, -446, -149, 138, 28, 9, 247, -85, -459, -341, 227, 204, -42, 44, 122, -422, -505, -49, 292, 62, -110, 73, -105, -458, -384, 195, 288, 17, -113, 190, -278, -436, 77, 532, 335, 2, 110, 114, -269, -163, 411, 610, 199, 63, 200, 85, -226, 174, 744, 590, 124, 61, 89, -124, -33, 451, 628, 213, -97, -67, -108, -313, 56, 534, 342, -185, -329, -181, -332, -306, 216, 399, -72, -540, -311, -291, -390, -123, 330, 79, -419, -513, -309, -302, -312, 191, 414, -143, -655, -359, -120, -235, -28, 398, 259, -422, -588, -149, -60, -59, 264, 421, -14, -566, -404, -14, 66, 153, 485, 254, -289, -458, -49, 230, 126, 400, 547, 50, -430, -200, 242, 390, 346, 532, 444, -151, -399, 178, 551, 449, 500, 606, 109, -364, -159, 376, 469, 302, 406, 202, -346, -639, 1, 309, 126]
3865A26k9m7l58n82J81O63J42l17m9r8m14j93M77M94j40k62m3k07l22K01P32J29
3887H4k99n2K2l16j30N85N76j09l82J1j01j89J84P33K84m17k74N4j87l0M63N11
3909A021j32n41r1Pk20J58O33K5m08m43J06q6j68M00M69k19o51k30J18pJ33L94
3931B68K50n50n32J97J27n5L41L85j45o26j25K27J33M7M80J64n51m02J27K88M9
3952I7K37L02j38o37k28L09K63Q8J55J59m92n27J77L58JJ03J76k24n79j59L96
3973a63K10qJ62Q0n06n17K63N54J08j43J90j54n12j36N37M18o8j5O8l19l93K43
3995a01N17J89j76K7j28l58j41M89M68j88j43P4l39l08J25N77J8k26j46j6l52
4016a38j41L32M00j27l74m0j94k82K43M77Q5l46k05L9l14K0M40M29k09m37R8j
$$ y = [126, 97, 50, -308, -890, -709, -46, 96, -221, -270, -368, -782, -975, -498, -4, -144, -406, -449, -656, -978, -777, -45, 84, -215, -267, -245, -561, -691, -106, 470, 361, -21, -10, -111, -300, -116, 617, 901, 484, 210, 264, 77, 47, 510, 1021, 889, 348, 257, 264, 44, 202, 835, 860, 452, 9, 115, 29, -139, 261, 730, 511, -140, -370, -252, -259, -126, 268, 518, -32, -564, -367, -240, -295, 46, 431, 286, -340, -465, -238, -105, -58, 422, 586, 35, -367, -240, 48, 97, 334, 636, 498, -139, -367, -58, 205, 293, 448, 607, 115, -412, -235, 123, 124, 227, 403, 179, -400, -559, -163, 47, 39, 201, 281, -225, -742, -479, 75, 183, 40, 230, 76, -436, -572, -35, 383, 315, 300, 368, 49, -344, -101, 416, 605, 429, 456, 328, -30, -171, 318, 786, 598, 455, 529, 190, -118, 7, 584, 602, 376, 230, 214, -138, -279, 53, 453, 326, -48, -88, -282, -564, -321, 156, 241, -105, -310, -271, -585, -565, -125, 304, 95, -342, -244, -245]
4038b45j78J79N48J53m28k40J98K2p3L06M60j39m12o4J24j6P6M98N2m22k78J58
4060B79m3p8K90L42k60m68q5J88r2PL46J18m34l69J77J20o1J17K37j21m99j32
4082d21L31j7j5K15J51m01l35J73L25j56J02K08n1n12j25M50J07j18J38J52k65
4103f4l68J82L34L5k0J45j1m52l7L87J55j64R6J23k39k91J42L55O5k22Q5J02l36
4126Bj28L20J86j12o7J16k36k24J30L14r7j20J2M9l93j42M09K00l10q2J27j50
4148a96l36O4L68L2l47jJ01j58j59K27L03j08k31J69j7k42J33M17N5l58J56J71
4170D3o1j91L04L20q2k39Q1J86j05N5K44J59k89j54K16kj31J09K02j42l05P4J52
4193D44k60j12K97K7l80j57J12N0l02J18J61j50m12N4J77j31j58K57K4k78j47
$$ y = [-245, -423, -244, 304, 457, 29, -211, -13, 9, -64, 242, 702, 563, 151, 87, 211, 195, 271, 769, 821, 399, 121, 279, 236, 158, 448, 790, 530, 62, -23, 165, 73, 80, 426, 544, 110, -259, -82, 38, -23, 94, 331, 210, -289, -421, -90, -107, -122, 93, 244, -157, -492, -319, 6, -150, -48, 160, 109, -403, -528, -78, 29, -89, 49, 201, -64, -432, -250, 84, 119, 99, 244, 233, -219, -256, 131, 286, 122, 218, 341, 102, -189, -47, 308, 373, 151, 236, 338, 2, -126, 194, 380, 268, 201, 317, 81, -143, -13, 301, 204, 84, 96, 145, -248, -390, 19, 219, -91, -173, -46, -196, -532, -468, -100, -68, -415, -416, -315, -473, -632, -405, -102, -210, -441, -272, -289, -531, -398, 19, 74, -284, -128, 43, -18, -209, 95, 415, 333, 94, 175, 361, 256, 311, 555, 714, 425, 271, 487, 485, 354, 463, 665, 523, 218, 292, 444, 184, 72, 369, 396, 16, -141, -29, 21, -281, -163, -2, -152, -564, -510, -333, -464, -622, -365, -341, -619, -766]
4214g66K18J34k20J45K01k9k87Q6L87q3q0K60K38j74k28K56K47j55k3K62R3k59
4236B23n9L30j9j86J24J47k21k13J56K31l14j59K57n1l57J4J66L6l18l2J72j60
4258b33k45J1K06j29j36J22Q7k32j22K39J33k21O3J45Kk30K27K70n9k14K64J63
4280A11k26l0K36K36j82n3K51P7k91J30K07K3l25J39J50j06k41J98J56k82q0J26
4302B24O8k99k0J55ol09PJ91q5k67J11J74j62k15K41N4j68n4K45P2k96M3J86K1
4326h9j71J06L21k16j68J99J67j57p2K33J05k00p5K21M5j58L5K14o2k94J43J91
4348C18j32j87J15J37j89j69J89L2k32j3K13j7l01J3J72kk09J14J85k59j87K59
4370a50J27j25o2K08Mj84k5K24m0j21Q9J86j32j72K03J21j46n9J72N1k24N6J49
$$ y = [-766, -548, -414, -634, -489, -288, -317, -604, -518, -131, -214, -294, -34, 204, 30, -198, 58, 305, 150, 127, 389, 482, 223, 164, 494, 475, 289, 413, 560, 339, 126, 282, 513, 199, 40, 297, 246, -111, -97, 69, 105, -213, -245, -73, -233, -478, -467, -261, -390, -526, -404, -317, -549, -671, -432, -299, -520, -457, -312, -310, -540, -313, -43, -102, -316, -52, 111, -115, -145, 91, 327, 145, 92, 343, 420, 129, 259, 466, 489, 164, 303, 453, 347, 106, 304, 460, 178, 98, 224, 292, -7, -27, 128, 122, -187, -180, 11, -74, -341, -230, -56, -218, -433, -192, -138, -306, -360, -115, -43, -339, -296, -110, -89, -260, -154, 167, -49, -217, -18, 149, -8, -80, 153, 258, 58, -17, 204, 249, 91, 126, 340, 278, -16, 127, 318, 186, -1, 114, 251, 62, -107, 82, 114, -118, -131, 82, 65, -236, -223, -51, -53, -262, -148, 37, -222, -409, -150, -23, -148, -210, -2, 2, -182, -207, 17, -23, -144, -55, 131, -1, -173, 30, 151, 5, -54, 118, 169, -55, 1, 150]
4393A50J7k22M0J81j44j96R3K72j55k48K18Q3k21j12K26R6k01J0J32m8j68P1K38
4416A12j08j99J14J35r0k00K07J76k40k8J78jj73J3K89Mk55R7P5j43l4J58J06
4439A93j23j25J55J2j42k5K51L8l02K9J76n9j79K26J79j63k55J26J52j87l4L00
4461B43Mj87j60J87K3j07P7J61j59k01J42Q7q4j05J98Q5l03r2K10rj53N2K51j56
4485Dk60jK25p2j03J68P2k67j63J71J28p7j1K41q7k83J6K83N4j48J45J12k31j18
4509b02K10J58j01m6K21j13k46O5K85K9j66P5R1j76j68J56K27k08j1K4L6k74r4
4532b28L33Mj28PQ4j59k69J74K95j42j72R0M1k25m7K34J86k08mN9n9j11J95K11
4556A61l8j88L8Q9j71NK70K14j84j31P3Qj34R1L26k8k15n5J11j53r0K52K08k21
$$ y = [150, 167, -55, -15, 166, 22, -174, -81, 191, 36, -212, 6, 89, -132, -244, -18, 78, -123, -113, 19, -29, -197, -126, 112, 4, -195, -81, 54, -36, -236, -29, 147, -93, -121, 57, 56, -117, -104, 185, 189, -66, 31, 106, -37, -71, 87, 193, 70, -55, 100, 112, -30, -55, 196, 234, -68, -39, 137, 78, -101, 125, 304, 141, -114, 12, 164, -23, -57, 243, 247, 60, -100, 87, 110, 3, 80, 241, 82, -119, 23, 110, 26, -79, 119, 204, -99, -191, 19, 10, -143, -91, 160, 4, -256, -257, -32, -104, -207, -39, 33, -234, -397, -226, -98, -175, -186, 55, -32, -315, -299, -16, 38, -110, 35, 147, -84, -202, 8, 166, 65, 19, 240, 127, -119, -54, 231, 260, 94, 169, 260, 84, -84, 72, 299, 91, 80, 104, 140, -134, -228, 105, 109, -19, -12, 72, -87, -356, -182, 113, -29, -201, -111, -70, -295, -342, -108, 78, -130, -134, -75, -134, -245, -50, 161, 123, -65, -27, 62, -109, -104, 166, 380, 196, 65, 138, 146, 12, 103, 429, 401, 186, 131, 242, 89, -1, 251, 459, 238]
4580B38k23M2Qj43N3L12o4l21p1J41j00o0K09J40k02k05J6J28j58N8K90O7l13
4603a58j29J09O0m2J87J73j50k56P9J92r9J6K12N8l20o8J36J45j31M9J87r7l17
4626a64J9K31N5p0J27O6l03j24J13K09j73J16Q3j79k53K7K05R8q1P6P5l07k06
4649c60K28K72q3p4J53j49k53n4L02R3r7K3J2j32k77K47K87o0j59N0Jk83J06J74
4673c3K06k08k0O5j39j90K01K75l7j58m6N2j56j6L02J35r0j68K4p3j45K61K28
4696B70o5j84n2J06j08r6L77J39l04j52J25k4j57J45K87j27k69k9P2j31m4L14
4718I3J01k29k67J03Np1O0K74n2k35j40J52P5j13J56K36k29k08kK06q2M9K07L1
4742A20l07j21J76Q0J2P9J36j83k06R8J08m9NJ87l6l23n1J65J17j15N7R3j38l12
$$ y = [238, 15, 57, 65, -78, -25, 287, 223, -98, -169, -28, -128, -188, 21, 161, -41, -246, -230, -102, -260, -202, 88, 155, -158, -287, -178, -118, -160, 27, 200, 50, -206, -127, 65, -34, -18, 194, 252, -68, -136, 0, 145, 14, 63, 250, 153, -164, -145, 86, 141, 71, 198, 264, -39, -163, -50, 159, -14, 102, 185, 6, -247, -220, -15, 83, 2, 78, 153, -154, -360, -132, 140, 57, -17, 136, -13, -266, -320, -18, 75, -22, 1, 13, -119, -396, -149, 138, 78, -81, -31, -30, -313, -207, -33, 173, -35, -55, 10, -129, -319, -118, 157, 120, -38, -84, -32, -188, -204, 98, 233, 143, -25, -1, -74, -219, 42, 270, 205, 21, -31, 75, -33, -129, 248, 387, 83, -69, 56, 32, -125, 20, 307, 180, -89, -118, -46, -177, -221, 93, 194, -35, -302, -199, -194, -265, -205, 69, 17, -218, -358, -206, -131, -244, -88, 148, -81, -289, -291, -85, -167, -118, 89, 120, -187, -308, -132, -52, -40, 39, 175, -8, -214, -116, -8, -57, -52, 135, 99, -224, -275, -110, 7, -108, -51, 42, -96, -408]
4766d08M4J54J6n7O1J3j83j28J55J93r8M0J08j41k62J11J69P5r8P4R6k38j32J77
4790b59K67m1q8Q2pk10oL15P4j20j5L4j62j9J01K13j39l1M1J7k85l4K93j2k13
4815b04j6R6j39j58J30K65j11j27n7P9j44jK37N2j70o6J04k2j40J68K71r9j89
4838b41k3J98j28l3K36R3j29q7R2j8p7KK13J8k67l1Q5no2J07J11k37j12K7R2j17
4864b93k7J49M5k64l0J68n9j23J60J30j68j58J09R7l5p1K22O2k36N4Q7J00r1J57
4888a5J38j17j85K1L14j28l6J83N3k18j44K08J09j35L0J40j23k24K0J59m6j69
4910a65J18K4k15j25J19R1j75l1R9p7k06l9J87K3j26O1K1j37l6J91J68j27p5J59
4934b73M8j95Q7K26O5q9l1K38j04q2Q8K82j04j00J26L4q4m4K01O5j57K6M4k9j93
$$ y = [-408, -364, -210, -194, -251, -190, -177, -360, -488, -333, -140, -238, -198, -90, -231, -493, -382, -213, -138, -236, -162, -66, -304, -436, -259, 8, -33, -121, -39, -46, -256, -262, 53, 127, 7, -8, 26, -136, -155, -54, 159, 20, -11, 30, 47, -238, -272, 21, 9, -204, -220, -124, -263, -421, -291, -26, -137, -264, -321, -242, -386, -387, -150, -98, -268, -334, -230, -252, -392, -224, 47, -52, -241, -264, -66, -194, -227, 9, 102, -27, -114, -22, -40, -117, -115, 98, 116, -151, -182, -97, -102, -164, -57, 54, -183, -295, -268, -176, -293, -320, -171, -126, -390, -420, -252, -311, -434, -274, -144, -312, -470, -361, -264, -299, -370, -148, -86, -322, -268, -181, -81, -172, -15, 123, 6, -179, -158, 156, 28, -8, 175, 228, 10, -134, 74, 183, 48, 78, 218, 95, -129, -109, 50, 4, -165, -47, -23, -238, -363, -244, -153, -328, -359, -260, -337, -543, -582, -395, -372, -498, -437, -416, -553, -589, -398, -230, -357, -432, -273, -225, -420, -333, -107, -42, -131, -162, 76, -28, -110, -22, 260, 156, 56, 182, 216, 132, 88, 289, 354, 197, 223, 267, 238, 45]
4959D5M2K33j86j10L1J38k19K4R8J1j87q1Q2qj68R1J04n2k02MK24j83m6Q8J44
4984h3j46L1J6J20j73QJ79L5j33K8P9Lq3J04Q1j00qJJ76j90JJ78nq7j81J94Rj67
5012a13Q6J25j02j13N5O1q7o0R7l3q6p0J74k6j29R9J13q0j57J12J31n4j11K06
5036C8J1j74J1J87J5m8j31K40J9j53L7J81o7j55Q6P4l9j73J30N8p6MQ7Kk07MJ48
5063A09k6q1o3J84j10j55P7J36j14q1J61k7j63%J22J7j68P7J23r3j43J71J5n8
5087i0n2LJ60j27k6J99lj55NJ60Nj41J41L5n1j23J83J3m8r2J68L6k17NJ61l7n8
5114E4m4J90n6k17J76P0o6q1O5J24k07j0L8J24j91j8J53rj58P5J04m2r5M7K3p7
5140b8j12Q7P5j36r2J89%j44M0J56p7j51Q0J88j50j08J26N9q9p8J36J8r0l0J23
$$ y = [45, 87, 320, 134, 24, 55, 193, -26, -2, 96, 107, -80, -161, -79, -87, -255, -164, -60, -112, -314, -310, -86, -269, -315, -227, -83, -229, -198, -182, -62, -235, -227, -48, -13, -146, -118, -39, -36, -119, -15, 66, -34, -42, -41, 135, -55, -54, 124, 119, 32, -149, 45, 54, -113, -27, 98, -4, -117, -62, -1, -88, -148, -51, -84, -170, -240, -66, -92, -221, -122, -9, -89, -246, -134, -3, -57, -168, 38, 49, -125, -114, 73, 88, 40, -91, 149, 168, 15, 52, 233, 166, 11, 97, 171, 132, -41, 89, 147, 71, 75, 162, 164, -43, -39, 109, 83, 2, -61, 123, 13, -142, -65, 71, -43, -124, 37, 10, -153, -153, -31, -14, -182, -105, 18, -75, -218, -47, -32, -90, -142, -139, 21, -106, -132, 67, 64, -91, -86, 74, 79, -62, 79, 114, 63, -60, 123, 136, 88, -4, 164, 200, -17, -12, 149, 112, 54, 10, 200, 144, -73, 103, 173, 107, 26, 91, 215, 8, -2, 36, 160, -31, -49, 104, 95, -63, 12, 116, 74, -21, 26, 49, -28, -140, -53, 22, -114, -206, -17, -17, -161, -121, 35, -42, -193, -113, 75, -75, -183, -57, 2, -87, -165, -29, -11, -101, -131, -8]
5165hM4j74N2J54k6j64J17M9Lj03K00k8j86K1J62J09k06L4Q2r1q4K1K52j69q3
5190b2P6P5p9l2KJ33r4m6J12l8j26kJ61n5m1l0R9k8j22J47P9j51o0J28L8p6o1
5217a3J93J3j82Q9J8jq0R5J72k14n6J16N0j87L5J41L8j72LR0m5j24O3J71p2j43
5243bpJ54j16p7R1J32j42q3J24nj55O1J66j13o1%M5nk9J29M1q6r3P7P8j13L2K01
5271B44q7j38K3J68r0lM6L2r9j3J34K0j24M8Q0K5j68j3J03K3j43M7K13j83j34
5296A1J25Q9p1n9Q1R8k35nJ58K9n4l8R7j15p8R5J12j00j1j1J72j81q6J52L7j01
5322A11RJ80j28p6J3J76n0q8O4k5n2pN5J48q7j16J33J1j72K1J62J8j20n6J92j07
5348B09r4J20J20r8l8M8oj39J02J48K4j68JQ4r4r2J37N4qj56J26k8j24n1K02L8
$$ y = [-8, 36, -138, -86, 68, 42, -122, -5, 44, 47, -56, 144, 116, -70, -49, 113, 222, 16, 50, 132, 41, -43, -22, 230, 61, -22, 54, 129, 50, 18, 20, 153, 59, 13, 125, 87, -39, -41, 120, 65, 24, -6, 93, 65, -57, 90, 169, 18, -42, 86, 124, 48, -13, 180, 193, 11, 100, 118, 117, 37, 132, 304, 90, 34, 150, 200, 13, 48, 189, 227, 55, 58, 148, 103, -21, 42, 213, 141, -2, -9, 145, 29, -48, 43, 175, 33, -50, 74, 69, -86, -25, 141, 28, -33, -33, 12, 7, -22, 107, 148, 62, -31, 46, 124, 11, 43, 244, 157, 19, 42, 210, 120, 117, 163, 195, 96, 83, 217, 237, 113, 161, 241, 266, 98, 85, 188, 211, 68, 115, 328, 145, 11, 136, 225, 154, 95, 176, 274, 39, 34, 192, 221, 167, 129, 226, 111, 33, 128, 240, 140, 129, 118, 290, 109, 23, 175, 212, 111, 120, 300, 172, 96, 109, 285, 235, 147, 211, 186, 134, 127, 182, 330, 243, 127, 260, 271, 99, 120, 282, 300, 180, 124, 316, 209, 115, 235, 355, 257, 219, 267, 261, 122, 224, 372, 396, 228, 229, 313, 219, 127, 264, 318, 310, 154, 280, 252, 128, 77, 279, 317]
5374C17j28j10J46k3j12P0J79r8j83J19M0j25PJ60qj05p8R5Kn3K7J81k8j18K8
5399B02J30o0r8J70N0j82k9L2N9J7K4P1j4j98P7O2k2j48J57N7j39j11L5J21p3
5424A90j23J86J9k62qJ03N5j19J17m4n9j05P2P8l6kJ06o3j23M2J44M3r4Q7O6p7
5450A93j32M8K44r5k8M5O5j36j8K31L1j15r0J42m8j15M2R9l2o8N7m0m3n4J02R9
5476C84j44ON7j41p0J3J25k9j67M6R4j94k2J30J33j08r1L7L6j17M1J66n8r7N9
5501H9j8Op7J39J03j04j22Q9j1j5o6K02L3j61k1Q7k1j10N1J53k5j77l8R7p0K0
5527C3J00J5j08n5J24j01m8J00j6N7k25J12M4j6n4J10O6j94K1L8J27j18P1Q6l7
5552A32j60LJ55rJ7K9J5j8j53J02J05o8k9Q2m9r7l9R6J4r6J4P7j06r5P0L5l9l2
$$ y = [317, 189, 79, 225, 202, 90, 160, 339, 241, 58, 177, 217, 92, 99, 259, 251, 146, 68, 163, 165, 112, 139, 320, 292, 174, 202, 332, 272, 174, 344, 394, 212, 183, 215, 274, 291, 315, 386, 372, 174, 251, 313, 291, 143, 300, 357, 218, 107, 142, 263, 190, 67, 253, 272, 10, 2, 105, 160, 41, 158, 114, 55, -50, 22, 100, 64, 62, 168, 105, -18, 24, 168, 211, 117, 204, 270, 193, 61, 109, 353, 258, 230, 275, 340, 204, 186, 417, 448, 333, 243, 385, 337, 222, 264, 363, 331, 263, 320, 280, 237, 183, 285, 384, 240, 246, 303, 162, 92, 105, 230, 201, 34, 80, 174, -20, -42, 88, 221, 113, 22, 59, 95, -22, 19, 185, 127, 30, 89, 71, 77, 0, 139, 242, 138, 16, 105, 94, 79, 13, 215, 248, 87, 66, 153, 132, 22, 73, 226, 201, 24, -14, 83, 13, 33, 133, 148, 40, -15, 109, 8, -40, 60, 44, 101, -124, -12, 32, 16, -38, 72, 138, -56, -35, 3, 130, 12, 83, 169, 132, -28, -25, 130, 121, 138, 167, 182, 164, 11, 113, 218, 150, 121, 203, 154, 57, 18, 114, 128, 32, 46, 123, 17, -78, -8, 27, -12, -44]
5580d4PJ3j38nQ0L8q3j1J00q6j05N4J75m6j2L3J4j31Q4R0om0K6P3r3k7O7J13K5
5609A65p6M5K1j2p1J11Qp0k1R7p5m5k7J71n6j15k4J39j46m6J50K4j10n1J10p2
5635B4o5n4J47o6o2O0l1l4k2M7N5K5j72Q4J12j67j5J78N3j43p7Q0M6j29O4J24
5661F2o5jo0K2J26j85J33K9m4j42P9M0n7l0J21L2j65M6J57j45m1J22Nj10j0O8
5687a3%p5k6K00q4j08O0J12j03J7R0J2p4j25J85M4r3LJ13k2j26j6J59Lm8NM2r8
5715C4kRP6o3%N7J3r7oJ03o6o1P2K4m9j0L7N3j98L9JJ33j21m7Q8N2j03m2Q8m4
5745c0j5RM8Qm2k1J17q4r6J59l1k4l5P2O1j07OL7jp5O5P0n8j2l7J15J4j27J09
5774I5O7j56j5M9N0o9QM7kj21O4M9m5mPN8k9j04J23rj81O3Q9j7n2N8Q6r3m4j5
$$ y = [-44, -37, -24, -162, -167, -87, -49, -132, -143, -43, -129, -234, -180, -5, -51, -63, -30, -16, -147, -63, 27, 21, -19, 7, 80, -13, -40, 27, 140, 165, 89, 134, 155, 143, 72, 183, 191, 121, 100, 197, 122, 77, 50, 221, 165, 50, 26, 165, 19, -27, 123, 147, 37, -14, 96, 24, -41, -95, 52, -14, -76, -16, -47, -81, -103, -56, -1, 24, -148, -64, 48, -119, -134, 44, 97, -46, -123, -43, 3, -126, -62, 62, -3, -4, -64, -42, 84, -101, 32, 61, 17, -125, -46, -6, -63, -93, 28, 60, -105, -59, 98, -47, -88, 34, 39, -71, -81, -13, -13, -88, -114, 86, 2, -106, -46, 66, -37, -20, 70, 82, 8, -117, 68, 112, 19, 22, 135, 113, -13, -29, 130, 133, 85, 90, 132, 34, 32, 41, 117, 54, 54, 111, 124, 27, 21, 124, 58, -3, 69, 93, 44, 34, 71, 124, -74, -35, -34, 99, -22, -69, 19, 71, -32, -74, 14, -30, -45, -36, 12, 20, -22, -43, 74, -10, -106, 53, 22, -2, -37, 35, 96, -11, -5, 32, 31, -44, 21, 91, 33, 21, -16, 99, 113, -14, 95, 162, 6, -9, 40, 90, 21, 29, 76, 74, -47, 17, 66, 21, 17, 24, 82, 53, -51, 72, 63, -118, -55, 34, 17, -35, 23, 109, 16, -28, -43]
5804d3J00j13rO2Ml5p5J19k4m1n0P7m1l4N3Oo5j4J11k6k5q1P2O1r6KJ38l6q0K2
5834f1Q6m0m3PJ03p3oL2J12p4r4Q1L9j54K4J45n3r7LJ26j02l6O2L5k4r7J55Or0
5863b8qR9k3j13L2J25p3j13M3J22j03l2O0K7q4M2Q2o4p7oQ3qj04j9J27k9j2lO5
5892Hp5QJ8K2p8n6Q5L6p7k6J22o4k8QJ70j59j7J5P8r7m5Q1J3m4mM4J9r9O7P3o6
5923f8p1O5M1J0r4j6RK9l9O2N9r3PM8J4j69J29Q5p9r3K0J13n8l3O3L7j36P6J5
5952f7M8j09j2J73r9p3NJ56j29m9P8Kj5l1Q7n1J0n7R8K1q6M9N0k9q4K5J52j32
5980f9k4J10l7p9K1M0O8j39N5R6q8J4j2J21j45q1M0Q6j07QM5k3%m6J32Or6K3N5
6009b6q6k8R0J20r0o4M5M9n5q2J21k1l7j4R9k8r3Q9K2o2m0m2J23j9q4P1N9q1K6
$$ y = [-43, 57, -56, -65, -3, 1, -34, -109, 10, -14, -55, -105, -28, -69, -103, -50, -44, -109, -123, -12, -38, -63, -144, -72, -11, -107, -105, 33, -3, -83, -61, 25, -15, -58, -51, 52, -21, -27, 5, 117, 43, -51, 30, 69, -85, -61, 84, 31, -66, -63, 63, -39, -75, -13, 22, -2, -99, 56, 62, -28, -36, 63, 40, -73, -41, 84, 11, -102, -59, 63, -40, -72, -12, 15, -69, -27, 55, -9, -86, -92, -9, -17, -121, -140, -13, -42, -54, -57, 8, -67, -59, -41, -19, -97, -153, -68, -32, -109, -135, -13, -77, -105, -97, 73, -86, -103, -88, -10, -107, -152, -71, -58, -102, -106, -62, -43, -142, -75, -2, -68, -139, -74, -33, -23, -117, -133, -124, -95, -134, -72, -13, -106, -99, -51, -37, -206, -77, 8, -71, -164, -144, -31, -89, -122, -59, -22, -158, -82, -67, -19, -128, -140, 33, -66, -139, -134, 22, -107, -156, -78, -76, -91, -122, -35, -86, -76, -133, -35, -14, -100, -51, -1, -30, -114, -89, 63, -69, -93, 17, -20, -99, -78, -38, 30, -109, -54, 42, -46, -32, -44, 77, -68, -149, -109, -23, -130, -122, -77, -100, -100, -146, -14, -8, -104, -81, -26, -112, -140, -50, 70, -20, -84, -39, 10, -45, -127, -6, -27, -64, -78, 21, -7, -100, -11, 11, -51, -91, -133, -10, -29, -113, -42, 17, -64, -38]
6038c8J5J7j03k0K8L9p9j7J77q3j0l7J13j5j13J31M0j19l7J25k4m9L6N5p5K1n8
6065h0J79r3j44J23M9j32L0Q7k0m6M9Qj9n8M4L3l7q7R8K9m4MP4l1n3n4J06l9n4
6094g8K7Q0m9j15K9O2j3m0R8%j4r2J13P6j08nJ02k7k6j0J4qj0N7Mn4m7M7O5o9
6124IL2N2L5q3l2O9m3m0M3J7M4j16Q1M0q8m2M5J1Qj06J26rq3k8J11oj23L0N5l3
6154b4q3M2P2p0j0R4k4ql2L3%q7J18M9p9r3J21lq4J1N2Rj9j16J37O6j10J3R0L
6184F8j24J8P6n5k3L9P4r7m0O6L6j37O0Q7l7p2RP0l1L7P5k8r4%P7o4K3m1J00j5
6214E7r1N1L6n5m1P3O2q5l3O7j1n7Q2om0l9J8Q1r9oKR9m8j00K9P2k9j8K8Jm6L2
6246a4kJ9k6m3J43j21l5L9J02J9j12K9J2J4o7K9N6m5J8m3M1q4M4O3k8n4j1Q6j
$$ y = [-38, -23, -6, -109, -129, -101, -62, -141, -158, 19, -64, -74, -111, 2, -13, -126, 5, 45, -74, -111, 14, -10, -59, -23, 32, -43, -22, -80, 99, 6, -138, -15, 34, -98, -68, 19, -1, -47, 2, 10, -9, -67, -23, 10, -27, -114, -16, 13, -31, -27, 47, 16, -37, -91, 15, -24, -78, -51, 29, -20, -135, -106, -44, -57, -97, 1, 1, -13, -105, 8, 84, -24, -29, 73, 46, 20, 10, 24, 16, 6, 63, 67, 13, -34, 13, 78, 9, 41, 93, 128, 45, 13, 82, 39, -1, 42, 59, 103, -13, 68, 108, 20, -22, 23, 34, 42, -64, 62, 53, -30, -58, 53, 47, -76, -46, 9, -24, -107, -65, 7, -63, -73, 21, -3, -11, -43, -10, -10, -97, 21, 70, -9, -102, 19, 16, -68, -57, -5, 4, -15, -131, 6, 72, -38, -25, 65, 68, -56, -38, 38, -17, -40, -1, 73, -24, -64, 2, 38, -99, -39, 48, 11, -61, -52, 18, -13, 24, 99, 71, -23, -23, 54, -10, 13, -28, 72, 57, -34, 17, 53, -2, -43, 30, 92, 7, -26, 41, 30, -27, 55, 49, 9, -30, -12, 69, -30, -36, -34, 65, 17, -83, -54, 18, -11, -29, -1, 0, -46, -14, -16, 3, -23, -66, 77, -44, -79, -40, 62, 81, -31, -2, 10, 24, -43, -14, 42, -3, 15, -28, 13, -71, -27, 36, 8, -46, -57, 29, 28]
6275B8j15Q4Nj4l2N9k5j19L6J49k9q1K6N8o1l8K7R3o3j5OO1p9n7J39n2n2J9J6
6304b6L9j20L9J16j01l6Q1om4N7k0M3m6p8J19j13L2J9M6K8j52P3P3p2p5J23M0
6331C9j12n2P7ql2PQ1lp0M6N2ro7J4j7L6k5M3k4Qk9J1qk1KQ3ql3RO9n6m3K8P3
6365F1q3J4N1Nq8QP4km2J9Q7r4n6O5j5J9q3Q7K8r2n8J00L5n6m8J10n4j3j2L8K1
6396B6p7k4N6Nl2O3l2k5q4J19p8N1jP1k8m5rQj4k9J02lj37N9J04j9j20M0P0O9
6426H6j48L4K7m7%Q3L9m3q7N0jm0J4N1J8q0K8J8Jj06J46l9kKk2JN5n8PN5j25L7
6458d6L4M5l1l5L2j9rMl6M3j0%M5r3J5P5j8Qn3J05m4jk5J1Ro8P4O7q2p2KJ38k1
6491D4l1lQ4j20j7O8k2n1M6P5%n0l6M1j1o9J32m7k7M8j3O2j08POO3o0O8j6l6q7
$$ y = [28, -87, -3, 2, -12, -44, 15, -10, -129, -93, 56, 27, -54, -28, 30, -31, -69, -42, 51, -12, -27, -21, 40, -39, -96, 43, -9, -61, -42, -26, 13, -107, -68, 48, -53, -89, -8, -14, -58, -1, -21, 22, -24, -102, 17, -96, -64, -45, 1, 29, -123, -50, 23, -49, -124, -1, 39, -73, -125, -48, -56, -88, -81, 0, -3, -73, -27, 25, 16, -51, -37, -54, -18, -43, 0, -24, -16, -45, -34, -42, -63, -61, 22, 14, -19, -10, 59, 3, -40, -12, 61, -22, -8, 43, 48, -40, -32, 42, 40, -2, 17, 104, 10, -46, 19, 4, 23, -60, 27, 55, -37, -95, 5, 40, -16, -64, 46, -8, -21, -33, 5, 26, -51, -75, -19, -14, -46, 17, -15, -40, -124, -5, -83, -32, -33, 38, 10, -35, -44, -36, -50, -79, 23, 20, -117, -58, 46, 27, -93, -53, 17, 86, -62, -28, -1, -48, -48, 35, 74, 31, -56, -6, -7, -47, -33, 18, 36, -44, -16, 2, 3, -103, 43, 4, 2, 4, -18, -17, 38, -20, -13, 42, -83, -46, -12, 33, 2, -33, -1, -20, -29, -25, -61, -18, -28, -28, 17, -76, -61, 14, -4, 4, -49, 56, 12, 11, -14, -3, 6, -62, 12, 79, -3, -75, -73, 65, 44, 13, 10, 94, -26, -43, 25, 3, -48, -2, 73, 73, 23, -13, 28, 17, -52, 80, 33, 6, 54, 41, 103, -5, 2, 8, 71, 11, 79, 63, 27, -60]
6522f0M9J13o8m4L1Oo5KP8n5Nj2P8r1j9J04O0j16Pj1M7o5J2P3j9n0K5N4k7q1J4
6553b5Q2j3m9J7Mrn1J9R4j45N7NK1k3k6L8N5l9k7N4p5p8Q3M1j2j8j3L3j2m2O5
6584A1J4q4J4N8%p4L1L5No5L9K1p1L0M5k9l0K8O8q3j6N8L1po4O6L9l3r0N9N0n8
6616bl2R5p3l1O4j2n5M9n0Q0k5lk5J7m0L7P3Pj33p3J49Lm0J8Qj3m1O6m5Kk1R7
6648E1l3k0k9J9R2o7l9N6L9q0LO8m6k7nR3p8k4kL5nrN4k2Pk9p5Q6r2M1P6q3rL1
6682b3L2n1l5M3O7n8lL7l1m0L3L0o7m9O5K2J1l5M7qj0n3Q5J2n1M0M9l6o7O1Qk1
6714Do5K6N7l6n1N0J0j5M4Qo1j5N2ROr3j7P8pRNN9o8J9rJ8n9k6R4k2n8N4J9l6
6748a7LJ0M0l4L6k8R5j14J3L4j8o3M2J8k5J5lO1j12K2O0m9k9L6nmm7J26J0j4j17
$$ y = [-60, -11, 102, 34, -10, 21, 27, -38, -36, 42, -13, -8, -20, 58, -33, -52, 52, 112, -4, 3, -8, 39, -26, -14, 59, 40, -10, 15, 69, 42, -39, -25, 57, 44, -5, 12, 16, 7, -44, -25, 69, -76, -19, -14, 7, -16, -42, -4, 51, 12, -15, 39, -36, -114, -31, 10, -2, -20, -33, 0, -12, -54, 11, 25, -59, -45, 13, 13, -61, -30, 5, 10, -55, -16, 5, -66, -36, 9, -20, -50, -22, 46, -37, -53, 5, 36, 29, -35, 31, 70, 37, -53, 6, 56, -2, -34, 61, -12, -43, 21, 9, -46, 3, -47, 33, 8, 5, -20, -3, -43, -6, 67, 74, -59, -132, 17, 20, -20, -2, 6, -7, -48, 18, -27, -25, -46, 51, 18, -2, -31, -12, 80, 13, -26, 30, 69, -11, -8, 60, 14, -13, -18, 75, -3, -27, -29, 6, 1, -8, 46, 24, 31, 2, -73, 13, -79, -38, 38, -45, -54, -23, 9, -42, -77, -34, 33, -25, -28, 9, -22, -62, -29, 1, -66, -115, -50, -28, -17, -52, -5, -13, -23, -76, 9, 21, -30, 10, 59, 23, -44, 17, 25, 4, -61, -35, 22, -14, -65, -15, -5, -20, 24, 32, -29, -44, 8, 17, 23, -70, -87, -9, -16, -7, -2, 57, -11, 8, -1, 17, -42, -68, 26, 4, -54, 0, 19, -17, -14, -4, 36, 2, 38, 10, 105, -9, 4, 38, 20, -43, -1, 17, -8, 7, 4, 65, -47, -25, 35, -14, -43, -7, -12, -16, -63, 63, 73, 59, -58]
6779e8J02%q9J4M4M1j11J2jO0m4j8O5O2j25qO6n9N5L2K4j1p9P3K4n1k4%N8j09
6809e5N9K4%qJ2K2p7npK6j3q6J19k7n1JO4J4l5p8O7K7l6P3n0j7NK4L5r5K9L1l
6842a1pp5J01K6m1J4Q7j26J0P2o8K1j1QP7n8k8J14r9K3n%J8q9N5J5J0k6k5M5r
6873A8j1J9Lm9l1J15o9J2K1n0K1n4J8Q8j07M7oRmq0J63n2l4j1O6L5n0QJ7Rj11
6904e0J00O1j14%M0L8rn2R7l4k9J4J4j5j9k7P1n9n7M9K0m0K5o3L9m0L9n4P5m5
6934b5N0j6o5j3O6L1o7J5L0rPm3k7J23r0nK8L5J2rJ6j03ON5O0k0j09O4Q0j15O3
6965B5Qk2J3Jj7J9K4m9K1ln1J5J25j36l5P7k1l4M7n0jL6l4R3j19P6J7k3k2k0J
6996c9L8Oq1J06Mjq9Q8rq5L2M5M9q0N0p9L4K0J3k8k9L8J3M9o2lL2Nk5J3J3p2J2
$$ y = [-58, 44, 44, -45, -31, 13, 54, -57, -45, -46, 14, -30, -48, 17, 79, -46, -54, 12, -47, 8, 40, 64, 53, -26, 47, 71, 20, -4, -4, 54, -55, 4, 28, 28, 20, 32, 54, -23, -28, -35, -9, -22, -108, 11, -16, -67, -66, -2, 12, -23, -101, -34, -7, -43, 30, -20, -37, -32, -8, 27, -68, -39, -8, -11, -18, -93, 8, 34, -7, 7, 94, -32, -22, 50, -18, 3, -8, 0, 77, 19, -9, 105, 6, 29, 24, 24, 42, -47, 8, 23, 33, 7, -18, 27, 18, 7, 26, 29, -20, -51, 64, -5, 7, 28, -22, -1, -55, -37, 51, -56, -9, -15, -6, -10, -90, 73, 21, -13, -24, 42, 77, 27, 35, 52, 61, -50, 50, 111, -3, -3, 37, 75, 66, 14, 111, 77, 48, 62, 76, 61, 42, 15, 86, 27, -30, 19, 39, -1, 24, -39, 0, -40, -1, -55, 20, -25, 25, 9, -56, -69, -3, 28, -39, -24, 6, -3, 4, -39, -66, 57, -33, -38, -10, 25, 37, 28, 44, -59, -53, 2, 62, 42, -67, -3, 77, -38, 25, 33, 11, 24, 25, 8, 27, 51, 2, 23, 20, -31, -16, 109, -27, -62, 15, -6, -40, 7, -43, -44, -8, -42, 51, -68, 8, 25, 2, -20, -40, -39, -1, 5, -76, 30, 34, 33, -56, 32, 23, -62, -30, 15, 64, -16, 34, -45, -11, 9, 22, -6, -35, 3, 16, 65, 3, 0, 32, 37, 12, 25, 38, -34, -22]
7029b2RR1n6m1N9k3rq6J40m0M5o3L7k4k9l3L7k7M0l8M5p9M9j6N3m2J%j4l3J21
7060E2o6J0o2P4m2L3m2N2L7k3k2j4po1J20o5ll3J4P8l0mP9RJ2k01J11K3q0J4M0
7091CL5k6j2j8k7O3p1J12o6m0O3m2J1K8j5O2j3p6QONJ6J3n4J5J6N8j2j01J67j08
7122@m4M2L0J2p2O4J5K7p4O1j28N7R0n4O5j22j0P5l3l6Q2K8j0n0k5P1j9n0J4M6
7152E2n3O1l3nm9L7K7j5j4K4n3j2QJ0P4o5k6J01p8l4P4l7M7p5K3j5M6oo7R8j06
7183f1O6M6r3m2L7LQO5m9O9l9k4m0N6j7m0K8J1O0p6kQ7J6p6o2L5R5n7K2J6o9j7
7215d4N2Np3N9K2r0R3l0m7K9L9o1N8m4jK7on1K3J04o8Ol4L6L0p4P3n2Rl3J6M3
7247A6p9J03k9j8jj9J5m4K9K6N5n4lJ01l4o5K5K6n5L3m5M3k6j6L1k0l9nJ06Ln6
$$ y = [-22, -13, 78, 22, -19, 40, 17, 8, -78, 62, 22, 67, 4, 41, 17, -12, -45, -8, -35, 5, -33, 12, -67, -18, -34, 19, -23, -22, -22, -36, -69, 52, -14, -4, -66, 8, -34, -1, -43, 9, 46, 23, 1, -13, -20, -81, 39, -26, -29, -62, -48, 30, 0, -4, 75, 84, 96, -105, 6, 29, -51, -37, 3, 38, 12, 0, -18, -45, 18, -53, 59, -7, -47, 16, -26, -15, 13, -2, 60, 47, -29, -21, -15, -10, 6, 19, -35, -20, -4, 54, 42, -59, 108, 0, -44, -2, 28, 40, -32, 32, 47, 74, 0, 61, -67, -10, 80, 26, 91, -31, -41, 34, 1, -35, 47, 75, 65, 15, -10, 61, 42, -8, 6, 52, -1, 60, 27, 22, -27, 10, 37, 22, 8, 32, -21, -33, -25, -15, 59, -6, -32, 69, -9, -43, 31, -6, 41, -34, -11, -26, 20, 14, -53, 45, -61, 5, 51, -42, -84, -47, -44, -36, 29, -20, 49, 10, -14, -54, 2, -15, -55, -27, -16, 44, -32, -34, 53, 69, -7, -69, -34, 61, 4, 26, 42, -27, -44, 8, 13, -60, -1, 21, -69, 24, -6, -53, -24, 15, -46, 12, -32, -33, -6, -12, -63, -40, 64, -4, 2, -32, 4, 34, -40, 33, -19, -10, -43, -27, 16, -63, 40, 11, -7, -8, -27, -12, -56, -27, -1, 54, 0, -3, 98, 64, -1, 24, 50, -5, 28, -17, 26, 0, -16, 15, -5, -44, -49, 57, 60, 4]
7278Dn6N0Q2n5m4O0j1j18J55K4j36N5l6P4o2pJ0Kk8pO6k3k7OL7n2k5N9M2j0o2
7309c3J0J12k5p4O8j10M1K6Kj6jqJ9n4JN3N7q2nK1%o5N9M8n5K7n2j3Qk0K3P2q2
7342d8rN2l5Rn8N5K6m3j3M6j7p3R4l6N2K0l8o6Q3nQ5o6l6M4L8p9LJ1N7k3k6N2
7374E6k4m4j4L4M7l6o0R4J8n8k5Qk9kl9O1k0J2L0L6l9k1K2J5j2j9j3M1r1M4M5
7405A7m5J9O2m3j3j1N4k0l6K2mO7l8Jj1kJ3n2P0k9q0O3K4l8o9J46n3Nn4j5L9N0
7437C9n7j4K6n5O3j1J4l4P4K6q1M7k0qk0L2j2k3M1l9M5l8J3pJJ1q1J01Rk8j5K7
7469B6k1L4q9P1J08j36MO2J7p6J6k6k2K0K0J6p3J1O8l3J9j00O5m8J3K9L0q1PR0
7499B1l5O4j6j6lk6J9K8o0QP6k4k8N6p2J32j08Pl5L8J0l3L1J1On3O2k1k7Kj7J9
$$ y = [4, -52, -2, 80, 25, -19, 41, 30, -88, 67, 91, -45, 10, -26, 48, -14, -21, -11, -9, -37, -44, 22, -1, -28, -22, 15, -37, -62, -3, 39, 29, -33, -23, 89, 64, -10, 58, -52, -11, 15, 17, 1, 0, -8, 11, -43, -42, 11, 68, -14, -19, 2, 2, -63, -4, 44, -11, 16, -36, -49, -41, -61, -38, 34, -48, -57, -5, -40, -31, -89, -34, -8, -51, -64, -18, -35, -108, -14, -50, 2, 22, -16, -82, 1, -4, 81, 15, -21, 23, 61, -18, -15, -4, 53, 30, 4, 56, 32, -12, -26, 8, 55, 19, -41, 53, 71, 13, -12, -4, -33, -35, -74, -13, -33, -21, 9, 45, 6, -15, 7, 22, 10, -9, -22, 19, -72, -28, 17, -28, -9, 53, 10, -3, -14, 40, 20, -16, 6, 2, 69, 31, 32, 21, 19, 32, -20, 50, 21, -59, 4, 28, -10, -79, 67, 14, 19, -35, -50, -11, 39, -18, -32, -6, -61, 2, -9, 5, -29, 45, 71, -10, 37, 17, 9, -11, 21, 9, -14, 27, -12, 33, -5, 8, 1, 2, 13, -68, 33, 42, 14, -1, 26, 5, 39, -50, 21, 129, -7, -3, 59, 76, 0, 16, -10, -32, -12, 8, 24, -49, -38, 30, -3, 16, -84, -19, -67, -54, -25, 5, -76, -69, 21, -14, 50, 34, 18, 15, -11, 8, 36, -24, -16, 60, 36, 8, 64, -8, 124, 16, 23, -12, 26, 36, 3, 34, 45, 51, -2, 60, 39, 12, 14, -3, 16]
7531A6k1m1J3J8k9O5k8k3K5P2l2Jj08M8Nm1M5pJ02r2N1J4m3n5R1k4m9K8M8K9q
7562G0p6J1l4O6J1m7K1k5N4Qq8L3K5jpk0%k7L0ql2P3o2Q4l5p5J3N4j4l8NM8o0
7595d3M6k6M2l3pj5J3rmL9rk5k2pJ04rl0j8k9K1O8r4J03o1Kql7R8l9K1j9K0L5
7628F8l4Pk7n1Q2n3lN6kk3p7M2mNM5k1n9N9Q%k9ln5P6p3Q2KK7k3q7P5n8O7j6J9
7663B2o3jL3K6n5M0K2mq3K8K9J8R2n2m3K4l4m2P7nj3L4jo5K5j0N9mq9P5o5jM2
7696A6J5p3N2K3l4j6J5L3rm8NM4q2N2l9N3m6K2K8j22R7k1lrK1L3o9J00j03N2L1
7727A8J6m3n4Q3pk9M7l5L8o9R6pj7j4J1m5O0l6J6k0m9P6J9m8J3l9J9j5j6P4m6
7758cL3k8K0l1M0o6m1P6j1M8r3J6O6Pk5Rj5K2j1j6J5k7n2mJ16j7j9j2j8Q9j04
$$ y = [16, -5, -46, -33, -15, -44, 21, -7, -30, -5, 67, 35, 36, -72, -24, -19, -60, -15, -22, 80, -12, 39, 53, 10, -45, 46, 22, -27, 1, 49, 78, 70, -6, 5, -29, 37, 48, 1, 22, -3, 51, 59, -29, 4, 29, 28, 21, 1, 1, -26, 4, -4, -36, 37, -25, 59, 24, -51, -38, 16, 2, -36, -31, 17, -43, 3, -23, 19, -14, -21, -36, -23, -32, -36, 3, -6, -31, -53, -60, 44, 35, 5, -13, -42, -21, 47, -47, 56, -5, -3, -11, -48, 50, 11, 32, 13, 33, 68, 34, 41, 14, -37, 45, -8, -11, 45, 43, 20, -57, -15, -19, -14, 31, 10, -49, 10, 18, 18, -11, -14, -69, 7, -66, 16, 18, 45, 22, -65, 10, -48, 19, 3, 22, -41, -42, -9, 17, -38, 2, 24, 20, -63, -35, -6, 12, 104, 52, 9, 33, -1, -43, 34, 29, 16, 50, 49, -16, 9, -1, 58, 54, -35, 40, -25, -26, 16, 31, -42, 10, 33, -1, -17, -2, 31, 22, -26, -21, 23, -59, -7, -46, 7, -39, -17, 11, -111, -14, -35, -38, -47, -26, 7, -62, 38, -65, -13, 18, 34, -9, -63, 20, 13, -16, 31, -4, 34, -35, 61, 54, 37, 23, 34, -11, 49, 13, 29, 9, -40, 36, 55, 7, 20, -19, 0, -15, -31, 43, -3, 30, 2, 22, -9, 31, -35, -76, 0, -11, 37, -56, -40, 26, 33, 8, 17, 2, 24, 13, -3, 12, -15, -67, -71, 45, 28, 9, -3, -21, 68, -36]
7789c6Q5k4m8M5nk8M7p2L2NM3n5l7j7J06oj9l5RL8J2l5l1K7L0n7J01n8lJj3m4
7821d2M6Nl1O7k6p5L7K3ll5N4moqj4M4p1K9OK0q2P2L0j1q8N9M1kn9K0j4j0K4M4
7855D0l2J4m3M2J4n4J2Q4k4o8J6K8k7J0M3n1M9l4k8NK5n8J09j66P4qK1M2q8O9
7885A6J2rK3k8LK9m7l1O8o4j8N8m7K0pJ2mL4O1n7m0J6%qJ7M8k6p3O0j8rJj0Q4
7919F6k2j1o0M2K8q8L4M7Qm8j1O0J7m1l4J5K6q2N7J9k3m7R1q6%mkJ7M0o4R3n1
7951a4j6lON0k4p0L3j7N0nL7m0M3M6p0o0R5K1n4N1p3P2r9N2nJ2M7k9o5J09n9l4
7983a3P6j5k4n8M9o3O6k2jK5o7O7m8n1J14o1k5k8J17j03J4O3j7n9P2O1n1K8p8
8012c2M3L4ol6o2L7oOJ0NMk1J16l8k5ok0J7K2k2m6L9J1L6m1m9P9o0J5n4Q3j5N6
$$ y = [-36, 49, 25, -23, 22, 17, -11, 36, -36, -4, 1, 44, -11, -48, -65, 41, 35, 16, -19, -10, 28, 40, 5, -26, 1, 31, -26, 75, 17, 14, 15, 2, -42, 4, 9, -22, 45, 19, -56, -19, 4, 1, -34, 20, 16, 10, 2, -12, 32, -39, -10, -4, 16, -66, 6, 36, 25, -63, -4, 37, 35, -24, -4, -18, -28, -4, 40, 8, 22, -21, 21, 35, -19, -7, 77, 53, -15, 1, 29, 2, 12, 55, 4, 53, 19, -9, -4, 21, -37, 72, -94, -20, -28, -7, 35, -53, 16, 28, 19, 42, 14, 17, 46, -1, -32, 36, -28, -46, 12, -35, -15, -22, -10, -14, 20, 81, 24, -16, 0, 0, -8, 9, 57, 31, -42, 18, 0, -9, -8, -18, 66, 44, 33, -27, 15, 43, -45, -11, 36, 44, -4, -15, 45, 62, 21, -13, 2, 28, -54, 3, 22, -1, -48, 43, -43, -43, -47, -49, -32, 8, -56, 37, -14, -30, -33, -27, 23, -1, -71, -38, -55, -5, -10, 27, -13, 30, 76, 6, -54, 41, 62, 8, 59, -14, 58, -41, 11, 6, 18, 65, 36, -29, 80, 21, -13, 63, 48, 24, -34, 15, -48, 18, -4, -5, 20, -47, 20, -28, -79, 35, -26, -51, -79, 38, -65, -51, 12, -5, -64, 8, 69, 18, 46, -32, 11, 45, 39, 3, -59, -22, -28, -22, -12, -7, -3, -24, 92, 54, 29, 23, 3, 20, 42, 20, -26, 13, 24, 60, 19, -30, 49, -11, 4, -50, 33, 18, 74]
8045G4j10P8p0Rn8P4J4Pnk8k3MJ4l3L6m4M6J0j2k2L5Pk0jN3j1j1%Qrj6LL5j9K
8080A7L8k5m4NM1L1j04O5l4L3l5j5M7k3l9M6l1k1P7l6j4J3k1Jk6N1r6P4K7oj5
8111a9j2l4O3mN6L2j11j3P7l2q3P8lN8m6Ol7MJN3L1p2m2R3q0N5j7M1o5M0L2m6
8143Dk0K4m8M0n1QN4Pq9L9J9K7L5l8j7k9N6J8j8jnj1K9pn1QJ0qQ0r9K8kL7P0r6
8178CL8j0qJ5o8P7o4J3k4O0j9Nl3
$$ y = [74, -36, 42, -28, -19, -77, -3, 11, 18, 13, -15, -38, -34, -20, -53, -17, -61, -15, -5, -17, -39, -4, 3, -17, -18, 35, 24, 13, 13, 21, 12, -4, -1, 34, 15, 17, 55, 30, -14, -9, 32, 63, -41, 24, -10, 23, -12, -27, 20, -3, -42, 4, -27, -48, 29, -7, -21, -8, -29, -28, -54, -3, -99, -25, 2, -4, -19, -31, -65, -2, -6, 50, 82, -29, -42, 35, 3, -80, -2, -5, 53, 7, 13, -24, -20, -19, 34, 65, -7, -49, 44, -36, 19, 2, 43, -22, 18, 50, 4, -16, 8, -40, 0, -51, -43, 11, 18, -71, -32, -13, 14, 49, 11, -6, -35, 21, 39, 21, 20, 15, 4, 33, 26, -25, -17, -7, -15, 65, -34, -6, -8, 29, 99, 3, 41, 31, 23, 38, -30, 47, -17, -4, -28, 32, 13, 18, -15]
8191a5
$$ Imaginary data points
##PAGE= N=2
##DATA TABLE= (X++(I..I)), XYDATA
0@%%%%qQqJ6j6J6k4L2m0M8n6P2q8J04j20J40j64J91k23K56k92L34l81M34m92N54
30B93o24P03p87Q79r83J096j218J353j502J665j842K037k257K501k769L072l415
47a798L805m251M770n386O124p027Q168r662J1707j4684J9437k8231M9688j90313
61a57653k63630N01349J62636m01812j58404M15316J18207m14137j65945L92061
71B7988J88592k91736j53923K56873J01640k47773j00440K49787J38513j66206
81C315j16123J20358O8875j12755m7608J45622R6446j05743j16019O0892R4558
92I1818n3598p7732R6361J26275r9566j88239N4119J93110l6442j83559O3305
103a4148K08108r3496k81285N2267K97230k0728k80797K3317K62781o7168l09070
$$ y = [0, 0, 0, 0, 0, -8, 0, -8, 8, -8, 8, -16, 16, -24, 24, -32, 40, -48, 56, -64, 76, -88, 103, -120, 136, -156, 178, -203, 231, -261, 293, -331, 372, -415, 464, -519, 577, -641, 712, -790, 875, -967, 1070, -1187, 1314, -1455, 1617, -1798, 2007, -2244, 2526, -2860, 3264, -3763, 4405, -5257, 6450, -8234, 11203, -17028, 32660, -157653, -421283, 80066, 242702, -159110, -317514, 97802, 216009, -198128, -364073, 27988, 216580, -75156, -229079, 27794, 129434, -118339, -218779, 31008, 169521, 3315, -112808, 7550, 76425, -36330, -83938, 61684, 158130, 52387, -63632, -2740, 91818, 38220, -39512, 56849, 183124, 83558, -104681, -50562, 142548, 106106, -77453, -14148, 193960, 100464, -180821, -128554, 168676, 147948, -132849, -109532, 153249, 86081, -222989]
114b22989M7727L21928j3167k91060K943K36420n0239k38905O7512K50680m2953
125F7897k18523K9694J55202o6757j25030J13941J44945j02219j33282Q3145R0679
136C9692r2564n0494J41424P7225j36254r5047J03694Q3415p7248m6813J02424
147D9454O6234j00611j02768N8954J13657p899q4622M897Q2713j1693j18520j9549
159f9753J40377P0262j20687q7729R7728O5860j20791o8684J48893R8985j44917
170I544j17838J14430Q7110j22252o0884J54047O6394j68564q4716J43671O1092
181H2034j36612k3057J63079J3069j88968l4307J73242L1754j50763j606J58714
192H6579j4675j82757q035J73260K7761j37734j4627J21271l423j32928j2388
$$ y = [-222989, -175262, 146666, 133499, -157561, -154618, 81802, 31563, -207342, -139830, 110850, 67897, -150626, -120932, 34270, -32487, -157517, -43576, 101369, -850, -134132, -50987, 39692, -52872, -103366, 38058, 115283, -20971, -116018, -12324, 71091, -6157, -52970, 49454, 115688, 15077, -87691, -28737, 84920, 77021, -7601, -2704, 80009, 68316, -50204, -69753, 70624, 140886, 20199, -67530, 30198, 96058, -24733, -93417, 55476, 154461, 9544, -108294, 6136, 93246, -29006, -89890, 64157, 130551, -38013, -122729, 20942, 82034, -54578, -77635, 85444, 98513, -90455, -124762, 48480, 80234, -70529, -72135, 86579, 71904, -110853, -118888, 54372, 82133, -55601, -70228, 51043, 47620, -85308, -97696]
203i7696J28997M3517r1212m6101N8395K8064n7275k9133O3511N9035l8310p2016
215e0224N513N7930K008m5182J6339O5965j2712q5166p439Q0698J6657o1136P472
228i277P0502k3414r2497J7021R8469o027q0002K4176P6427m8744r4737N0781
240a7322J06605l7566r3199M0374P6548o2784q4994O8611R6541n4814q9054M2541
252h513O4237n6237o0223O4377O7648n4092o6986L3797M3231l6448k9729M6338
264G400L4463m2239m1030K1854K7100j4272j1104K3517J4362k5487k6785J0564
276b1657K6901M252j4050O94J5104o810k9516p64M0426J7444l3442j8157L0947
289A1372J0101m2002r712N6304K2413n5108k7574M8224J9099n2366j2007O4430
$$ y = [-97696, 31301, 74818, -16394, -62495, -4100, 23964, -33311, -62444, 1067, 60102, 21792, -50224, -44711, 13219, 15227, -29955, -13616, 52349, 39637, -45529, -52968, 27730, 44387, -16749, -9277, 61225, 37811, -54686, -37665, 60804, 54777, -25225, -1049, 75378, 26634, -68103, -17322, 89283, 51717, -41482, -1108, 75440, 12656, -72338, -3727, 92814, 38000, -51054, -8513, 55724, -513, -60736, 3641, 71289, 17197, -49789, -15992, 27239, -9209, -38938, 7400, 41863, -376, -41406, -19552, 7548, -6724, -17828, 5689, 20051, -5436, -32221, -21657, 5244, 9496, -4554, -3860, 11244, 4434, -25082, -25846, 14580, 32024, -1418, -19575, 11372, 21473, -20529, -30241, 26063, 48476, -6632, -34206, 14018, 33117, -19249, -31256, 33174]
301C3174J7514o7047k4424N7796J7764n4835p116O1363N808o6105j2508N7929
313A9313J0198m9250n9N0009n236n5041k00M9803L209l8976K864L5103r030l8456
327b5749N424L7253J547k7966q37K1114l916k2951K509K5178N551j9713r536J2808
341G16O981j2687o634J6821J3059j6244j9335J1053J9079r829j7099J4338K0437
354B0656j7162k6245J4645K7579j2712k4789J5966K4808k0221k8383K0226L0372
366B4740j7813k7328J8977K4747k2702k5617K3829K7103k1652k4699K0405K0849
378B0839k2564j9599K3647K0263k2055j9393J8965J5450j9315j3636J9688J3285
390A5575j8441j3960J4765J1360j3519r702J2727R337j2183j0773Q849J0139o443
$$ y = [33174, 50688, -16359, -40783, 17013, 34777, -20058, -27174, 34189, 39997, -26108, -38616, 19313, 29511, -19739, -19798, 30211, 24975, -30066, -30266, 19537, 22746, -16230, -13366, 21737, 12707, -25749, -20325, 16928, 18475, -9491, -10328, 10786, 6870, -16081, -13572, 11606, 17157, -2556, -12092, 716, 7697, -4990, -11624, 5197, 18256, 2012, -17323, -6270, 12809, 2980, -14119, 219, 20656, 3494, -22751, -8106, 19473, 6761, -18028, -2062, 22746, 2525, -25858, -5632, 24740, 6927, -20401, -1424, 23323, 621, -24996, -1167, 25936, 4284, -20415, -10, 20839, -1725, -21324, 2323, 22586, 531, -18862, 103, 15553, -3762, -17398, 2290, 15575, -2866, -16826, -2061, 9299, -4220, -13922, -1195, 8142, -4041, -14814, -5965, 4174, -2269]
403b269r080N488R154m583j0496K783J1581j91j0759m72J1499J533j1947j552
417i311J4332L993j3504l607J4745M525j4352l245J6704M777j6011l755J7201
430A2492M270j6423k384J7752K610j7375j789J7301J210j6541l48J6352p77j6449
444i9O87J4890k126j4839J676J2545l685j3246K148J0476l875j0852K262P672
458C634m057q679J725N602k826o023O50L230j632l649k78K267Q75k037k165J053
474a2310K939m24l113J472N417k42n200J709P607L37n490L050Q515j534o987M247
490gR947j789o544N457Q409m685o574P199Q435n392n922O872M963q015m143Q691
506A6902M093q276l670O508j72q761m05P615j245q659q15L873l748n752L151M079
$$ y = [-2269, -11349, -5861, 3293, -1290, -11786, -9003, 2578, 2387, -8372, -8844, 2655, 4188, -7759, -9311, 5021, 9014, -4490, -8097, 6648, 11173, -3179, -6424, 10280, 15057, -954, -4709, 12492, 16762, 339, -2045, 15707, 18317, 942, -847, 16454, 17664, 1123, 775, 17127, 16350, -99, 588, 15478, 13352, -1487, 189, 12734, 9049, -4197, -2049, 8427, 4552, -6300, -4038, 3634, -423, -9102, -7377, -1775, -4601, -10624, -9974, -6744, -8376, -12025, -12303, -10036, -9161, -11198, -13363, -12310, -9371, -9795, -12908, -11436, -6019, -6261, -11461, -9752, -2145, -1808, -7298, -4248, 4267, 2733, -4254, -7, 9940, 8151, 1607, 7064, 15473, 10788, 4214, 11413, 19848, 14456, 8534, 15406, 20369, 12354, 8211, 16902, 20995, 12719, 9049, 15557, 15385, 6624, 6219, 13834, 12589, 3930, 3115, 6988, 3240, -2512, 639, 4718]
522D718m783n450J234L06m286r0M703m74n309p42J981k147j245N265L440m056
538f935k929K969Q16k142L507O658p62m590J182K691j617J223P493K235o044j782
554A973M560j075m039O217Q810n493j0243K953O552n540m757R810O522j2052j0642
569f444O862O110p013k211R792P72j3549n612Q298L139m654K646N858o203r979
584a2188K663P665n84n93O415M46j0582m115Q764N978j739J991M413m789q283
599d538K150P916K951J532K684m580r059O13P994O40j846O907K343j4859j1109
614a0261J0977J2004p106o391Q962O62j8794q314J6083J1291r096o721M886l815
628e633j2843J243J3560L658n433r66k688j0677j372J4443P638p576j833O286
$$ y = [4718, -65, -5515, -4281, -3975, -8261, -8351, -3648, -4122, -9431, -10173, -8192, -10339, -11584, -6319, -2879, -6935, -9864, -6895, -6079, -8221, -4714, 1944, 1182, -3408, -2226, 465, -1152, 71, 7564, 9799, 3755, 1973, 6533, 5458, 1419, 7636, 16446, 10953, 710, 3663, 10215, 4675, -82, 9728, 16250, 4198, -6444, 418, 6528, -485, -2696, 7096, 7868, -5681, -11293, -2995, 144, -4510, -1864, 3994, -2209, -12188, -9525, -1860, -2444, -3037, 3378, 3824, -6758, -10873, -2109, 3869, 2130, 4121, 8534, 3745, -4538, -2388, 5528, 8479, 10011, 12695, 8115, -944, -331, 7663, 8303, 6457, 13364, 15707, 848, -10261, 716, 12720, 5614, -777, 8185, 8847, -9947, -18261, -2178, 9113, 17, -6704, -1818, -5633, -18476, -17233, -3673, -15, -5448, -6414, -9102, -19779, -21151, -6708, 930, -6646, -8479, -2193]
642b193p044j4494P516K2294K638j4380k134P186n756q571J0889J6945j137j1084
656F75l923j199k385O238J1457Q76o381q96k919j1338J55K0077J0827j4470j2048
671e254O498Q84j2851K702K2416O444j8855j1979N168J382k769R591J1487o178
685H686j2257j968j408m494J0344J9441l377k2220m442J2115l687j1040J4816
698E09K2991j1427l0010k384J8206J516p893Q888J1136j2075k0207k493R728P839
712e676O300O35j1612j1098J640J993m507Q201J9543l031k8667j0954J9088J0256
726g889r830L834J8978m752k7480o224K1335J3095k577K776L595j1259j1285P299
740a0384J2175M677P569P098j3438k1185N357K2846L954q602Q049R146j9442k3056
$$ y = [-2193, -9237, -23731, -16215, 6079, 8717, -5663, -7797, -611, -6367, -14938, -4049, 12896, 11759, 675, -3248, -4447, -6832, -594, 10863, 11739, 5358, 4462, 1543, -9795, -9640, 10437, 21264, 6794, -5254, 1244, 2128, -10723, -8021, 14395, 20839, 1984, -9995, -4827, -3445, -6214, 3377, 14864, 8686, -3571, -5539, -6947, -11441, -1097, 18344, 14967, -7253, -11695, 420, -3267, -14307, 509, 23500, 12073, -17937, -20321, -2115, -599, -8492, 396, 11532, -543, -20750, -23243, -13515, -5676, 624, 1259, -10353, -21451, -19811, -17818, -22325, -14124, 5419, 2388, -26279, -37233, -18145, -7889, -17719, -13885, 5093, 341, -27139, -33363, -12028, 1067, -1510, 1266, 4861, -6398, -17683, -10384, 1791, 6468, 14037, 21135, 7697, -13488, -8131, 14715, 18669, 10067, 18116, 27262, 7820, -15236]
754a5236J1963K7114K054j3195j447j47j3814q854J1126J3461J734m209j0106
767D44j7513n836J5278J0956p752l196Q096j0173k8001n93L1541J2997j9728j0164
781b3644J0327m882k0140M994K8813R793j5689j0742J15k949J163J4968J1949
794D076k949m584k293j0806o262J9158K4054m232j7831P74O264j1356o186K2981
808A0808K1732j1599k2004j915N511k871L718J5561M705j3145j1737m330l453
821i019N836J8271O167j7072j3418L772j272j0376R346K5043q15k8374j2193J2427
835a1677M012o585R909J6799p948k3260n477J0076N247N102J1114n42j6723q929
849a8882O333L471J315J4029J1329j5482k2136L660J5738M54j788J3267N169k0336
$$ y = [-15236, -3273, 23841, 25895, 12700, 11253, 11106, -2708, -11562, -436, 13025, 14759, 10550, 444, -17069, -22905, -7627, 3329, -4423, -7619, 477, -9696, -37697, -38290, -6749, 6248, -13480, -23644, -13317, -18199, -38339, -33345, -4532, 5261, -10428, -21170, -21055, -24004, -22841, -7873, 4076, 1127, -3457, -5750, -16556, -22818, -3660, 20394, 16162, -1669, -895, 5369, -5987, -12173, 10808, 32540, 20941, -1063, -2978, 2533, -338, 3380, 18941, 23646, 10501, -1236, -5566, -9019, -3183, 15088, 21255, 4183, -9235, -5463, -6735, -17111, -7765, 17278, 16463, -11911, -24104, -11677, -7665, -14250, -4341, 12458, 4510, -18750, -24227, -14151, -8904, -3802, 7312, 6770, -9953, -18882, -12549, -9078, -7763, 6266, 17595, 2113, -20023, -16363, -625, -171, -1959, 11308, 16477, -3859]
863c859j7204R428J5393J841P92M781p346j6198k775J0673O713L775O198m895
877G317j8997p997J2893R743k328L593P558j1409k1243J829K0185O775n856K307
891D370J942j4604j2455J1423J7104R26l961J607o836j4789J537J8097P946o009
905F298q18P93j2949j0375J2942J8413j690r485O53j986j2959j923J8022J1681
919A6617q118q338o2n503p614Q126J6242J303j0407m683j948o682Q21J4312Q894
934A2960p215q296j689m220l556R710J3463j671j0407l094j041n958K869J5657
948G512O829j1230q683K303j648n033Q968J5508k522j5436l825M917k318j038
962e696J2590R056j0956j3161K189M516l079L878J2957p4j5979p172P473L098
$$ y = [-3859, -21063, -11635, 3758, 5599, 6391, 11172, 3826, -12372, -15147, -4474, 2239, 6014, 12212, 7317, -11680, -19677, -6784, 2959, 631, 4224, 11782, 373, -20870, -19041, 1144, 7919, 2063, 4370, 6312, -8292, -20747, -9324, 7780, 8706, 4745, 6352, -484, -15273, -13736, 4361, 12307, 6298, 5480, 6273, -6676, -17051, -4109, 14304, 12614, 3129, 3782, 1796, -11163, -13086, 4936, 16617, 8499, 161, 99, -5404, -13018, -4892, 11350, 12653, 2246, -2437, -4385, -11067, -10246, 4066, 12960, 5745, -2551, -4240, -8460, -12016, -2306, 11157, 9486, -921, -4015, -5056, -11014, -8145, 7512, 14341, 3111, -5572, -3269, -4917, -9950, -982, 14526, 12004, -3432, -7257, -2340, -4658, -5696, 6894, 15950, 4994, -8167, -5978, -1462, -4541, -663, 12294, 12220, -3759, -10931, -3458, -360]
976c60k845O427R315o915j5215j685Q974L150l45M710J721q790q406J949N896
991b419M021L927N40p283o894J539L572O34M548P194m095j2932k653R076L669
1006B444k925M303N927p488j2048K636J0755J507k415L940Q06j0196n551Q287
1020a8P050k523r2M345n150j1039K017J1963K036o258J225L581p479q848O322
1035b868J1249r70o958k6Q81n680k822O616N907k014l877k017l134j698M205M798
1051A592r23k146J92k845n256J848Q381K185n002j652J793k765l388M850P095
1066C959j033m547K2J01k948J504O988J860m595j080K418k847l484O234P736l734
1082F554p384K390M181m633l102P853O027o935p111L771L768m161j156O371J808
$$ y = [-360, -3205, 3222, 12537, 5622, -9593, -11278, -2304, 846, 501, 5211, 6932, -1858, -10264, -8315, -2419, 1602, 5529, 6069, -1214, -8108, -6569, -2997, -2363, 2185, 9379, 5284, -7648, -10301, -1225, 2444, -481, 3822, 9749, 2261, -9787, -7151, 3604, 5111, 2696, 6636, 7442, -2754, -8305, -18, 7032, 4509, 4417, 8762, 3612, -7427, -5410, 6553, 8589, 2331, 3556, 7137, -342, -9190, -2868, 8381, 7411, 453, 427, 1308, -4372, -7194, -578, 5329, 3315, -562, -2579, -5713, -7411, -3206, 1592, 669, -1477, -1285, -4130, -9386, -7538, 843, 3028, -1974, -3626, -1833, -4598, -7986, -3136, 3959, 2926, -1621, -1599, -1498, -4446, -2942, 4046, 5906, 1311, 231, 2649, -198, -3682, 2552, 10288, 6554, -830, 1560, 5741, 1108, -1994, 5859, 11886, 4951, -2160, 1611, 5379, 1218, 62, 6433, 8241]
1097H241p122l836L416J393k316J476L472k593n212O1K451r19m68L014L47m604
1113c199k357K228J125q82J309J698k217k941O86J377l52J170K595j483l812Q27
1129d228L267j130j819L923L274m724m224M380M388l528k237N516K434o278k817
1144c803O277L239m553j254N304L65n955m16O002P94m281M07L603j857m108K016
1160A780L821j678k857J704J248l116j569K919J233k797q41J661r53k415Q07J890
1176H37j107j555R18L7k116R6K355n07k131J136J848k169j937L053K423k943j468
1193c230L652J324l818l51N042Q35m298L99M854m88m210J630N129j516m161K365
1209C158M078k703l503L379L279l595k981L464J856m064j805L685P39m360j066
$$ y = [8241, 1119, -2717, 699, 2092, -224, 1252, 4724, 2131, -3081, -3020, -569, -1488, -1956, 1058, 1405, -3199, -5556, -3328, -2203, -3085, -1776, -78, -2295, -5236, -4550, -3173, -3525, -2355, 240, -1243, -5055, -4228, -961, -2091, -3910, 13, 3287, -1437, -5661, -1281, 3107, -421, -2658, 2858, 5292, -986, -3803, 2474, 5713, 1160, -94, 5210, 5575, -380, -796, 5206, 6000, 1719, 2126, 5729, 3872, -236, 1780, 5601, 3923, 1066, 2770, 4018, 902, -667, 2252, 3485, 688, -153, 1508, 555, -1860, -1053, 837, -270, -1825, -907, -870, -2986, -2890, -535, -1042, -3173, -2037, -189, -2358, -4295, -1242, 1181, -1762, -3230, 422, 1746, -2072, -2423, 2619, 3454, -844, -445, 4409, 3921, -289, 1341, 6470, 4954, 793, 3158, 7236, 4533, 1030, 4409, 7688, 4093, 1112, 4576, 6432, 2368, 563, 4248, 4987, 627, -439]
1224d39L100m61l772J96K604j558k966O80J495j812j467J582L99k119k13J559
1240c192o93j499J780J721j885j032K792J161k478K56M185M25l530J105M523n70
1256C069l329K680M507k033l457L114L959k874k533M187K637m474k273M369J622
1271I171m485q54M274m32n409k71M035j110m348R16K715l007m081J664K484k627
1287a365k300J870K72l503j044K740J79k198N34J544k019j980K602K252j721n29
1303d666K871P0l354R88M755N05k724J614L189k120k673L745M116k049k018L036
1319E285J068l959l88N386J257m350l02L485j949m611K574N332k301n171J505
1334B861K638l993l237M665L352m510l901K265P10l620J64M392M7m343j048J662
$$ y = [-439, 2661, 2200, -1572, -1376, 1228, -330, -3296, -2616, -1121, -2933, -4400, -2818, -2419, -4538, -4751, -3192, -3885, -5384, -3604, -1883, -3768, -4800, -2008, -847, -3325, -3069, 1116, 1541, -1989, -884, 3639, 3069, -260, 2420, 6927, 4894, 1437, 4551, 8510, 5636, 3103, 7290, 9927, 5453, 3180, 7549, 9171, 4686, 3832, 8106, 7674, 2265, 1994, 6029, 4919, 571, 1487, 4202, 1195, -2886, -1222, 1262, -1365, -3665, -1795, -1523, -5026, -6070, -3330, -3151, -5349, -4815, -3271, -5290, -7270, -4668, -2416, -4137, -4666, -1795, -1725, -5079, -4091, 664, 1169, -1555, 59, 3248, 1128, -1545, 2200, 6316, 4267, 2249, 5285, 6353, 2394, 2006, 7392, 8649, 4299, 3997, 7482, 5533, 922, 3496, 8828, 6527, 1356, 2861, 5499, 1506, -1731, 2934, 6286, 1776, -2125, 140, 850, -2770, -2606, 1786, 1833, -2510, -3558, -1896]
1350a896j244j049L472K330l392k371J872L22k390K028N132q47n078n9L217j006
1366i59j464M040L321l649m043J850J840j507J271M351j041n371o19L198q41j699
1382a322M309L261n458n579L122L876k857q87N410Q31p326l556N208K981k578
1397e65O85L712k506n945N15M709P87p12K569P2n591k303M535K904j718J047L084
1414E279l360o352J224O406R91k457J326P59m850l600L764M450l79o64K73l567
1430g57m224K074M868N0j490K060j000p114k316P445M851l929k256L194j795p257
1446g596Q81R232K951n221j908J798k751l606M572P011p99m074l91p60l674J374
1462b961P449K743m693k488J165k475l078M926P472j430o427j533J013k084J22
$$ y = [-1896, -3140, -4189, -717, 1613, -1779, -4150, -2278, -1956, -4346, -2318, 2814, 1967, -3111, -3170, 47, -959, -2423, 1617, 4938, 1289, -2754, -904, 936, -571, 700, 5051, 4010, -1361, -1980, 1218, 377, -1322, 2987, 6248, 790, -4789, -1667, 2209, -648, -1535, 3875, 4706, -2620, -6176, -968, 2013, -565, 120, 3832, 1326, -4619, -4104, 605, 1392, 680, 3249, 3321, -2270, -4573, -38, 2866, 1148, 2195, 5279, 1919, -4433, -3209, 3197, 4188, 1731, 3057, 3816, -1034, -4634, -870, 3580, 3201, 2537, 2810, -757, -4981, -2907, 1961, 2011, 521, 2581, 1581, -5533, -7849, -404, 4447, 518, -1738, 1456, -339, -7596, -6715, 2517, 5468, 247, -1661, 137, -2614, -6220, -1648, 5363, 4564, 490, 99, -661, -4335, -2961, 4488, 7231, 2538, 50, 1215, -1260, -4338, 588, 8060, 6630, 203, -1330, -317, -2401, -2279]
1477b279N949L519m032m667j094r52q4M825M511k607n113o72l93k703K065Q171
1493D444J817p642m548K690L79k424M232P630k186q804k163L813M64J44N723L168
1509F737o120o308J472L002j55L207N490k257q559k244M605J847k97M217L169
1524G806o094p865J374N572J224O54L047j181p330l693L923L998J200K025L51
1539E011n658n733J798M816J460J201K543l026p861j825N896L819m71J395J052
1554D417n927o587K966P214J405j213J519j805p382k583P031N671j371j225Q06
1569B936m366o337K531Q469K465l244q99r61n430k525O518O826j302l441o38k797
1585b195m454K302Q255K901m120k744p55l436j665N974O728j046m830j978j601
$$ y = [-2279, 3670, 7189, 3157, -1510, -2604, -3556, -3640, 1185, 5696, 3089, -2024, -2696, -3089, -5792, -3727, 4444, 6261, -1381, -5929, -3239, -2860, -5284, -1052, 6578, 4392, -4412, -6575, -2762, -2298, -2154, 3569, 6737, 617, -5691, -4219, -1217, -1372, 1835, 7325, 5068, -3491, -5735, -1130, 717, 420, 4637, 7806, 1712, -6153, -4779, 793, 2017, 2671, 5718, 4537, -2793, -6486, -2563, 1435, 2635, 4660, 5011, -647, -6380, -4582, 234, 1694, 2895, 5438, 2412, -5449, -7274, -1378, 2441, 1970, 3365, 4417, -1510, -8097, -5131, 2083, 3488, 2275, 3794, 1989, -5393, -7976, -945, 4726, 3355, 2130, 2936, -1430, -7767, -5236, 3233, 5698, 2454, 1555, 594, -4836, -7361, -843, 5983, 4681, 1240, 602, -2195, -6649, -4347, 3908, 6809, 2689, -55, -810, -4246, -5911, 63, 6791, 5745, 915, -1063, -2664]
1600b664k306K650O827K319l744l357j664k603K16O545N210k916n151r31q43k857
1616e269K804Q066J974o616m752Q78k55q59M748O008k218o932k435J033k7K398
1632a454N973J345o201m657J023Q13k33M705N689l118q388j814M026J239J44M478
1648C570K965n380p034L10M459K401J662J987j830n409k443J842K529K937L349
1663E915p90o427l977K599L107K82K204L348k954p839j819N325L449l27J060Q21
1679C977m651n235J412M768K108O08N73l087n713n39M997K679o56J229Q05n466
1695b191n581L262P170R84k910L06J26m736l096M714O177J19k949j568j683k264
1711d120J572M354K211o39j216k623l733M20N596L482k126j887K73k216l685K136
$$ y = [-2664, -4970, -2320, 4507, 6826, 3082, -275, -1939, -4542, -4326, 2219, 7429, 4513, -638, -1569, -2412, -5269, -2465, 5601, 7575, 959, -3793, -2915, -3170, -4029, 719, 6727, 4509, -2423, -4858, -3825, -3852, -1454, 4519, 5864, -337, -4994, -3971, -3158, -3391, 1314, 7003, 3885, -4503, -6317, -2291, -1052, -908, 3570, 6535, 1155, -5879, -5569, -1110, 1291, 2953, 4940, 3110, -2299, -4742, -2900, -371, 2566, 5915, 5125, -1302, -5279, -2680, 427, 709, 2913, 6261, 3307, -4532, -6351, -1026, 2423, 2096, 3156, 3977, -674, -5909, -4497, 271, 2379, 2987, 3560, 473, -5240, -5779, -782, 1897, 1241, 2470, 3275, -2191, -7772, -4510, 2660, 3644, 734, 1040, 1166, -3570, -6666, -1952, 4225, 4344, 1395, -173, -1856, -4120, -2548, 1806, 4017, 3378, 2162, -461, -4194, -3774, 1822, 5304, 3178, 1291, 1564, -652, -4337, -2201]
1727b201O594J931l978k731q6j340q00L357L942o43k991j994j711j033K997M389
1743C702j13l495j216p6k532q71N072M622l181n303J34J522j673j4M896K431l951
1760d6m329L86J429M29J911K735r64l484j277N40L27J811L705N14m128k644J667
1777a418J306m64J961L434j117m793j528K711J611K05J473R16k386l050K24J750
1793H35J139J620R79k297l408J18K089R6L1K324O43m258l283K318K966p88o65
1810D59J947m10m093j692K990K284p54j80M79j985k526J071K591L57l55P92q57
1827A18l143m85L274J729j409k06J242j576k922J225L631O76j819j86M15j533
1843i69j060K153K248n45q98j2r82j232J294K382M4j257K16O4j913n45K849J922
$$ y = [-2201, 4393, 6324, 2346, -385, -471, -1811, -2611, 746, 4688, 4045, 1054, -940, -2651, -3684, -687, 3702, 3589, 94, -1122, -1198, -3730, -4601, 471, 5093, 1912, -3391, -3257, -1735, -3408, -3422, 1474, 3905, -46, -4375, -3989, -2560, -2131, -220, 2515, 1551, -1933, -3210, -2670, -2343, -532, 3173, 3687, -441, -3085, -1418, -112, -576, 1385, 4819, 3702, -1091, -2619, 92, 1703, 1908, 3381, 4297, 1911, -1139, -915, 835, 1974, 3594, 4573, 2276, -1132, -1014, 1075, 1171, 1202, 3526, 4169, -89, -3372, -1054, 1912, 1124, 459, 2406, 1996, -2097, -3789, -799, 1485, 731, 551, 1030, -955, -3481, -2410, 181, 538, 183, 975, 118, -3025, -3510, -236, 1493, 84, -122, 1120, -456, -3378, -2153, 1478, 2154, 335, 149, 564, -969, -2029, 124, 2372, 1827, 929, 917, -65, -1297, -3, 2379, 2423, 1166, 1382, 1446, -467, -1012, 1837, 3759]
1861C759j778j418J068n2j998M96L096N86k432o95J047o91j141J712K038j289
1877B308j873M92L87j427J36K534L21k537q42J399l31j505J149K152j052k496
1893a185J74J336p27p32J541Q62j703j356R17L42p59P33J329q40j679N40J041
1910a66r34k59J844P50k236q77J818O69j382K33K164l23k348K18K039j57j287
1927b34J133J393j448j344J237J358j106l98J491J68j868j95J871lj446N73J340
1944B522j011j611R97J443r84r59J193N19j618o14J525M07j413J95J253p89j460
1961d05Q88J284r20j044J277O60j725p06J798N74j843j70J749k87j952L99J905
1978A482o09j655Q40J213j377j119J376R35j564o61J480J06j850J51J692k34j669
$$ y = [3759, 1981, 563, 1631, 1579, -419, 77, 3173, 3759, 1327, 632, 1679, 988, -153, 1559, 3597, 2308, 435, 927, 1314, -113, 23, 2557, 2878, 341, -501, 898, 567, -938, 211, 2363, 1311, -1185, -1011, 325, -402, -1134, 407, 1269, -434, -1790, -873, -531, -1290, -557, 772, -68, -1747, -1207, -166, -1100, -1359, 485, 1235, -1001, -1878, -60, 609, -773, -540, 1624, 1301, -1047, -829, 1210, 1053, -234, 899, 2292, 844, -500, 737, 2095, 989, 591, 2082, 2250, 382, 187, 2058, 2055, 609, 1182, 2522, 1511, -100, 897, 2340, 1356, 397, 1590, 2109, 491, -123, 1402, 1809, 396, 591, 1844, 1055, -405, 483, 1767, 847, -197, 1080, 1740, 15, -691, 1107, 1681, -162, -332, 1417, 1130, -822, -423, 1482, 873, -782, 58, 1271, -106, -1225, 151, 1086, -478, -1139, 341, 447, -1403, -1252, 440, 206, -1463]
1995a463M77J377r38j360J124J320j309r58J405N50j493k45J793J22j512K80J423
2012E93m78j189J031J400r98j046J348P96j417l14J862L90j671m0J711l53j574
2029E1P97J842r26j634R87J191j307j017J724P03j841q10J639J44j810K64J719
2046A716o31k041M76J434r78j233J166J026j733j170J344N90j403j90J644k73
2062b56j830J37J490m11j118J121J007j492r60J342Q45j205m2J742j83j974K47
2079a540K074j92j423J096J518j533j635J561J713j130p75J663M48k118n56K173
2095A344O53j476J77J459r71j850R43J916o26j222J073N16j954o94J919R79j336
2112H50n05J069n90j810O35J996j99j392L66M97j599p80K000J077j588n69J032
$$ y = [-1463, -986, 391, -547, -1907, -783, 537, -772, -1730, -325, 225, -1268, -1513, 280, 402, -1110, -830, 593, 115, -1074, -43, 1357, 359, -687, 661, 1457, 40, -274, 1588, 1978, 307, 267, 1978, 1625, 51, 848, 2690, 1764, 130, 1117, 2308, 1001, -16, 1708, 2411, 570, -240, 1399, 1543, -267, -3, 1716, 1085, -956, -480, 954, -24, -1257, -91, 935, -798, -1968, -624, -34, -1437, -1627, 17, -256, -2086, -1949, -459, -870, -1988, -867, 140, -1352, -2312, -970, -125, -1330, -1372, 370, 187, -1787, -1540, 534, 342, -1081, 15, 1533, 0, -1635, -74, 1639, 509, -266, 1397, 1845, -273, -829, 1344, 1997, 521, 698, 2157, 1186, -664, 279, 2195, 1569, 347, 1420, 1936, -18, -712, 1207, 2186, 850, 345, 1414, 824, -986, -351, 1645, 1446, 54, 420, 917, -682, -1462, 538, 1615, 27, -542, 490]
2129D90p12j846J001K521m54j979L65R20j517r92K204J723j585j521R56J51j580
2146a855N15K565K33k212m65J142q28p67J999J862j563j866P20O90j323M08K640
2163A895M80k599j017J404k8q91J477K110j220k423J32J199m64J34K036N03k399
2180C29j384J139M76m23J182J691j312k587J31J518k10J09J764L91k688j727J567
2197c4J167m50O81J594j311l045J05K141L35k93J354M25k763j882J769J876m37
2214A232J25J345j098l096j04K766R31q14O18N69k345k198J629K654k6o44N73
2231B117q14k546m34K688J619o47l22j31j876j612J676K564N1r61J50r38k476
2248a892Q7L085J591j350p87K11j646j845J839L351J04k019n81j13j633k68K929
$$ y = [490, -222, -2068, -1067, 1454, 1000, -979, -614, 306, -1211, -2203, 1, 1724, 139, -1382, -426, -275, -1855, -1340, 1225, 1458, -754, -1219, -77, -905, -1672, 327, 2189, 626, -1240, -520, 170, -1153, -745, 1895, 2375, -224, -1241, 163, 135, -756, 721, 2831, 1611, -812, -680, 519, 55, 189, 2225, 2728, 329, -1055, 84, 560, 137, 1319, 3010, 1698, -889, -758, 760, 550, 659, 2423, 2814, 126, -1601, -34, 1133, 683, 1364, 2958, 1647, -1398, -1293, 848, 1183, 890, 2244, 2669, -94, -1976, -207, 1669, 1232, 1357, 2702, 1604, -1492, -1596, 1170, 2101, 1287, 1905, 2474, 129, -2069, -440, 2214, 2188, 1544, 2117, 1303, -1243, -1677, 1011, 2630, 1983, 1661, 1530, -346, -1958, -282, 2282, 2333, 1372, 1522, 584, -1892, -1805, 1280, 2871, 1521, 734, 945, -701, -2546, -707, 2644, 2748, 729, 148, 35, -1598, -1866, 1063]
2265A063K148j329j678l02p77j043J794L105j4k184p91J3j296J38L187K150j912
2282B272k392OJ69q72J331L129L77k758j687L06KL61K415J679j684k521l68K49
2300A4k02J634K737l35l326j457R35K25o8K119K078k028l520l91J525M85N80J850
2318B855J05k917k169O24J143Q88J572P83k290k725QJ469M94Q28K019m37l708
2335a458j988J884K090P7N45J209j544l403m24K598J778K83L95n17k537j598J509
2352a101K109P11O26L14k125k954N61L121J267n09L52%k639k255K007L494N16
2369C495j159l69r48k146k22K636K146k59q14j120k084r12K123K517Mj009k47
2386A632j420k415L36L545J870j619j567l16j124j372J518L075O21k020j562q61
$$ y = [1063, 3211, 1882, 204, -98, -875, -1918, -124, 2981, 2967, 783, -8, 5, -1291, -1153, 2034, 4184, 2272, -120, -114, 55, -817, 514, 3643, 4020, 1262, -425, -119, -117, 244, 2659, 4338, 2654, 133, -235, 14, -188, 1446, 4183, 3848, 522, -935, 0, 225, 157, 2276, 4354, 2326, -1194, -1585, -60, 425, 1005, 2855, 2960, 43, -2126, -1502, -359, 529, 2101, 2884, 594, -2131, -2123, -654, -160, 668, 2687, 2250, -1458, -3446, -1562, 528, 605, 1150, 2359, 815, -2588, -3012, -414, 1364, 1647, 2042, 1525, -1012, -2610, -1101, 1008, 1719, 2345, 2659, 534, -2420, -1859, 1262, 2529, 2020, 2372, 2372, -267, -2522, -515, 2979, 3495, 2336, 1967, 1019, -1127, -1349, 1287, 3433, 3174, 2360, 1240, -844, -1756, 367, 2884, 2888, 1879, 1632, 212, -2203, -1867, 1678, 3548, 1929, 362, 46, -1078, -2450, -932, 2143, 2764, 744, -818, -1679]
2402a679q31N99K561J427j218j431r00j160n54K316K932m47k661q95K38r31O1
2419b573K869K311j819k902m96P66N0J029K315M47k269j846l3N19J025K204J118
2436B715j823k187j11N25N3J539K472k01l074j681J166J094K79J410J395j306
2452B265k818o72J365J171Q98J109m69k289j323O59R13Q03J387M71k224k568K51
2469a071J829M16J56J201l41k903j982J586J985J21k03L53j333k365k74J828J271
2486B74J19j7p45k103j156J501J776J03j22K57j269k233J98K634J301p52l45J9
2504e60j340j222J260K513O64r85m17n56j049K84K008J290l43m36m85j186m58
2521a018J756K023j81r59j79m73j288K58K324J379j212j272o9m26p08J071J955
$$ y = [-1679, -2510, -1911, 650, 2077, 859, -572, -1472, -2632, -3186, -870, 2062, 1615, -1046, -1941, -1703, -2634, -2573, 296, 2607, 788, -2114, -2610, -1844, -1794, -765, 1550, 1997, -272, -2118, -2151, -1632, -607, 1597, 2715, 892, -1295, -1406, -881, -828, 711, 3183, 2982, -92, -1773, -607, 487, 766, 2176, 3571, 2265, -553, -1225, 140, 1311, 2209, 3318, 2849, 560, -763, -104, 809, 1612, 2999, 3470, 1246, -1322, -1071, 758, 1174, 1330, 2531, 2190, -713, -2695, -1109, 876, 997, 794, 1147, -186, -2551, -2825, -997, 274, 393, 376, -369, -2472, -3628, -2127, -351, -248, -370, -113, -1382, -3615, -3417, -783, 518, -234, -579, -560, -1900, -3122, -1862, 651, 1315, 330, -87, -643, -1692, -1408, 600, 1890, 1547, 1111, 626, -560, -1018, 738, 2761, 2580, 1621, 1442, 969, -319, -61, 2263, 3642, 2430, 1158, 1089, 663, -45, 1026, 2981]
2538B981L7j566p76k04o34K53J754Q51j355j203r4l06p06J099J916m05k086p57
2556a201N57k61k92J471J192j149j970j83O80m6M09J240k0j540r22L10L07L31
2574a087J048O25j200j352K39O29l1N47J280r1j728o83R13O30M6P36Q22q06j363
2593h26J73J119K77K84Q27%j339m91J034O78j43M72Q77r00j602M03J501J52n08
2612A988N93L61j369j137J037J176m25m10L30m38j199k35J137L13n56j20L8j120
2630c6p88Q08Q27n47n26L10m13j194l6J200K97q70r1L40o53p46O84J084l01n94
$$ y = [2981, 3018, 1452, 676, 472, -162, 91, 1845, 2696, 1341, 138, 44, -262, -968, 131, 2047, 1642, -444, -1201, -644, -905, -1197, 274, 1466, 317, -1653, -1836, -1156, -1202, -793, 447, 427, -1113, -2035, -1725, -1418, -1087, -39, 586, -614, -1966, -1727, -1098, -1129, -582, 698, 607, -1121, -1804, -891, -261, -215, 521, 1343, 537, -826, -653, 466, 743, 1027, 1854, 1854, 515, 24, 1058, 1736, 1593, 2065, 2942, 2042, 440, 843, 2344, 2496, 1988, 2581, 2942, 1573, 436, 1473, 2649, 2224, 1814, 2144, 1706, 507, 272, 1409, 1722, 1166, 1046, 1084, -36, -824, -16, 811, 264, -262, 48, -365, -1559, -1595, -395, -98, -968, -1059, -719, -1372, -2118, -1434, -350, -651, -1245]
$$ [...]
8191d9
##END NTUPLES=NMR FID
##END=
