##TITLE=1H_Bay-17-2024
 D2O
 8 sc, 
 12.3.2024
##JCAMPDX= 6.0         $$ Bruker NMR JCAMP-DX V2.0
##DATA TYPE= NMR FID
##DATA CLASS= NTUPLES
##ORIGIN= UXNMR, Bruker Analytische Messtechnik GmbH
##OWNER= root
$$ XWIN-NMR		Version 3.5
$$ Tue Mar 12 16:06:03 2024 Russian Standard Time (UT+4h)  she@DPX200
##.OBSERVE FREQUENCY= 200.1313
##.OBSERVE NUCLEUS= ^1H
##.DELAY= (6, 6)
##.ACQUISITION MODE= SIMULTANEOUS
##.ACQUISITION SCHEME= undefined
##.AVERAGES= 8
##.DIGITISER RES= 18
##SPECTROMETER/DATA SYSTEM= spect
##.PULSE SEQUENCE= zg30
##.SOLVENT NAME= D2O
##.SHIFT REFERENCE= (INTERNAL, D2O, 0, 15.7039)
##AUDIT TRAIL= $$ (NUMBER, WHEN, WHO, WHERE, WHAT)
$$ ##TITLE= Audit trail, XWIN-NMR		Version 3.5
$$ ##JCAMPDX= 5.01
$$ ##ORIGIN= Bruker BioSpin GmbH
$$ ##OWNER= she
$$ F:/spectra/data/she/nmr/H-F/1/audita.txt
$$ ##AUDIT TRAIL=  $$ (NUMBER, WHEN, WHO, WHERE, WHAT)
(   1,<2024-03-12 16:04:52.87 +0400>,<she>,<DPX200>,
      <created by zg, POWCHK disabled, PULCHK disabled
       configuration hash MD5:
       00 E9 B6 7A A2 85 ED C7 34 08 36 98 17 FE 4E 26
       data hash MD5: 16K
       3B 98 0D 79 0B 31 BB BD 80 82 87 BA D1 17 99 FC>)
$$ ##END=
$$ 
$$ hash MD5
$$ 9B 8E E3 94 C1 E9 91 E2 61 68 3A 03 1F 54 2F 93
##$RELAX= 
##$RELAX= 
##$RELAX= 
##$RELAX= 
##$RELAX= 
##$RELAX= 
$$ Bruker specific parameters
$$ --------------------------
##$DU= <F:/spectra>
##$EXPNO= 1
##$NAME= <H-F>
##$PROCNO= 1
##$TYPE= <nmr>
##$USER= <she>
##$AMP= (0..31)
100 100 100 100 100 100 100 100 100 100 100 100 100 100 100 100 100 100 
100 100 100 100 100 100 100 100 100 100 100 100 100 100 
##$AQSEQ= 0
##$AQ_mod= 1
##$AUNM= <au_zg>
##$AUTOPOS= <>
##$BF1= 200.13
##$BF2= 200.13
##$BF3= 200.13
##$BF4= 200.13
##$BF5= 200.13
##$BF6= 200.13
##$BF7= 200.13
##$BF8= 200.13
##$BYTORDA= 1
##$CFDGTYP= 0
##$CFRGTYP= 5
##$CHEMSTR= <none>
##$CNST= (0..31)
1 1 145 1 1 1 1 1 1 1 1 1 1 1 1 1 1 1 1 1 1 1 1 1 1 1 1 1 1 1 1 1 
##$CPDPRG= <>
##$CPDPRG1= <>
##$CPDPRG2= <>
##$CPDPRG3= <>
##$CPDPRG4= <mlev>
##$CPDPRG5= <mlev>
##$CPDPRG6= <mlev>
##$CPDPRG7= <mlev>
##$CPDPRG8= <mlev>
##$CPDPRGB= <>
##$CPDPRGT= <>
##$D= (0..31)
0 1.2 0 0 0 0 0 0 0 0.06 0 0.03 0 0 0 0 0.0002 0 0 0 0 0 0 0 0 0 0 0 0 
0 0 0 
##$DATE= 1710245092
##$DBL= (0..7)
120 120 120 120 120 120 120 120 
##$DBP= (0..7)
150 150 150 150 150 150 150 150 
##$DBP07= 0
##$DBPNAM0= <>
##$DBPNAM1= <>
##$DBPNAM2= <>
##$DBPNAM3= <>
##$DBPNAM4= <>
##$DBPNAM5= <>
##$DBPNAM6= <>
##$DBPNAM7= <>
##$DBPOAL= (0..7)
0.5 0.5 0.5 0.5 0.5 0.5 0.5 0.5 
##$DBPOFFS= (0..7)
0 0 0 0 0 0 0 0 
##$DE= 6
##$DECBNUC= <off>
##$DECIM= 32
##$DECNUC= <off>
##$DECSTAT= 4
##$DIGMOD= 1
##$DIGTYP= 9
##$DL= (0..7)
0 120 120 120 120 120 120 120 
##$DP= (0..7)
150 150 150 150 150 150 150 150 
##$DP07= 0
##$DPNAME0= <>
##$DPNAME1= <>
##$DPNAME2= <>
##$DPNAME3= <>
##$DPNAME4= <>
##$DPNAME5= <>
##$DPNAME6= <>
##$DPNAME7= <>
##$DPOAL= (0..7)
0.5 0.5 0.5 0.5 0.5 0.5 0.5 0.5 
##$DPOFFS= (0..7)
0 0 0 0 0 0 0 0 
##$DQDMODE= 0
##$DR= 18
##$DS= 0
##$DSLIST= <SSSSSSSSSSSSSSS>
$$ [...]
##$SUBNAM2= <"">
##$SUBNAM3= <"">
##$SUBNAM4= <"">
##$SUBNAM5= <"">
##$SUBNAM6= <"">
##$SUBNAM7= <"">
##$SUBNAM8= <"">
##$SUBNAM9= <"">
##$SW= 18.0517328524113
##$SWIBOX= (0..15)
0 0 2 0 0 0 0 0 0 0 0 0 0 0 0 0 
##$SW_h= 3612.71676300578
##$TD= 16384
##$TD0= 1
##$TE= 0
##$TE2= 300
##$TE3= 300
##$TEG= 300
##$TL= (0..7)
0 120 120 120 120 120 120 120 
##$TP= (0..7)
150 150 150 150 150 150 150 150 
##$TP07= 0
##$TPNAME0= <>
##$TPNAME1= <>
##$TPNAME2= <>
##$TPNAME3= <>
##$TPNAME4= <>
##$TPNAME5= <>
##$TPNAME6= <>
##$TPNAME7= <>
##$TPOAL= (0..7)
0.5 0.5 0.5 0.5 0.5 0.5 0.5 0.5 
##$TPOFFS= (0..7)
0 0 0 0 0 0 0 0 
##$TUNHIN= 0
##$TUNHOUT= 0
##$TUNXOUT= 0
##$USERA1= <user>
##$USERA2= <user>
##$USERA3= <user>
##$USERA4= <user>
##$USERA5= <user>
##$V9= 5
##$VALIST= <valist>
##$VCLIST= <CCCCCCCCCCCCCCC>
##$VD= 0
##$VDLIST= <DDDDDDDDDDDDDDD>
##$VPLIST= <PPPPPPPPPPPPPPP>
##$VTLIST= <TTTTTTTTTTTTTTT>
##$WBST= 1024
##$WBSW= 4
##$XGAIN= (0..3)
0 0 0 0 
##$XL= 0
##$YL= 0
##$YMAX_a= 665042
##$YMIN_a= -595029
##$ZGOPTNS= <>
##$ZL1= 120
##$ZL2= 120
##$ZL3= 120
##$ZL4= 120
##$ABSF1= 10
##$ABSF2= 0
##$ABSG= 5
##$ABSL= 3
##$ALPHA= 0
##$AQORDER= 0
##$ASSFAC= 0
##$ASSFACI= 0
##$ASSFACX= 0
##$ASSWID= 0
##$AUNMP= <proc_1d>
##$AZFE= 0.1
##$AZFW= 0.1
##$BCFW= 1
##$BC_mod= 2
##$BYTORDP= 1
##$COROFFS= 0
##$CY= 11.3945322036743
##$DATMOD= 1
##$DC= 2
##$DFILT= <>
##$DTYPP= 0
##$F1P= 15.7292609196834
##$F2P= 12.9074282941183
##$FCOR= 0.5
##$FTSIZE= 0
##$FT_mod= 4
##$GAMMA= 1
##$GB= 0.15
##$INTBC= 1
##$INTSCL= 1
##$ISEN= 128
##$LB= 0.24
##$LEV0= 0
##$LPBIN= 0
##$MAXI= 10000
##$MC2= 0
##$MEAN= 0
##$ME_mod= 0
##$MI= 1.114404
##$NCOEF= 0
##$NC_proc= 0
##$NLEV= 6
##$NOISF1= 3.799351
##$NOISF2= 2.8
##$NSP= 1
##$NTH_PI= 0
##$NZP= 0
##$OFFSET= 15.70392
##$PC= 1
##$PHC0= -25463.56
##$PHC1= 10.58731
##$PH_mod= 1
##$PKNL= yes
##$PPARMOD= 0
##$PSCAL= 0
##$PSIGN= 0
##$REVERSE= no
##$SF= 200.130013532006
##$SI= 16384
##$SIGF1= 3
##$SIGF2= 2
##$SINO= 400
##$SIOLD= 16384
##$SREGLST= <1H.CDCl3>
##$SSB= 0
##$STSI= 0
##$STSR= 0
##$SW_p= 3612.71676300578
##$SYMM= 0
##$S_DEV= 0
##$TDeff= 0
##$TDoff= 0
##$TI= <>
##$TILT= no
##$TM1= 0
##$TM2= 0
##$TOPLEV= 0
##$USERP1= <user>
##$USERP2= <user>
##$USERP3= <user>
##$USERP4= <user>
##$USERP5= <user>
##$WDW= 1
##$XDIM= 8192
##$YMAX_p= 0
##$YMIN_p= 0
$$ End of Bruker specific parameters
$$ ---------------------------------
##NTUPLES= NMR FID
##VAR_NAME=  TIME,          FID/REAL,        FID/IMAG
##SYMBOL=    X,             R,               I
##VAR_TYPE=  INDEPENDENT,   DEPENDENT,       DEPENDENT
##VAR_FORM=  AFFN,          ASDF,            ASDF
##VAR_DIM=   8192,          8192,            8192
##UNITS=     SECONDS,       ARBITRARY UNITS, ARBITRARY UNITS
##FACTOR=    0.0002768,     1,               1
##FIRST=     0,             0,               0
##LAST=      2.2672688,     0,               0
##MIN=       0,             -595029,         0
##MAX=       2.2672688,     665042,          0
$$ Real data points
##PAGE= N=1
##DATA TABLE= (X++(R..R)), XYDATA
$$ [...]
1842E08n349l581q49K686N112N437L954J496k213m797n551m219k013J718M450
1857c211N209M830K417j314l881n183n000k913P15L475M964N263L403j43l053
1872E578m758n504l592m13K345M607N548L804R81j713m368n516m070j642J174
1887g539M147N499M274K105o52l795n372m429k516J22L397N168M533L172L10l135
1903E289m771m732l584p69K629M526M861L927J228k275m029m863m356j606J732
1918f793L630M974M518J891j054l248m864m764k196L94K963M837M761K558K08
1933G815k604m759m805k981o51K153M510M757L358J198j649m432m564l583j794
1948h031J476L770M665L909K186r99l522m335m406k612N91L133M221M543K931
$$ plain form
1842 508 -4841 -8422 -9271 -6585 -1473 3964 7918 9414 7201 2404 -3147 -7366 -9379 -7661 -3211
1857 -3211 1998 6828 9245 7931 4050 -1133 -6133 -9046 -8331 -4856 108 5371 8774 8631 5578
1872 5578 820 -4684 -8276 -8689 -6344 -1737 3811 7615 8596 6883 2515 -3001 -7071 -8713 -7539
1887 -7539 -3392 2107 6381 8486 7834 4039 -1333 -5762 -8278 -8156 -4759 409 4942 8114 8424 5289
1903 5289 518 -4214 -7798 -8567 -5938 -1412 3449 7376 8604 6329 2300 -2563 -6919 -8525 -6793
1918 -6793 -3163 1811 6329 8220 7166 3918 -946 -5710 -7906 -7512 -4549 288 5049 7607 7815
1933 7815 5211 452 -4353 -7334 -7985 -5832 -1322 3435 6793 7991 6342 1910 -2654 -6237 -8031
1948 -8031 -6555 -2785 1880 5789 7975 6976 3454 -881 -5287 -7899 -7308 -4175 46 4589 7520
1963G520j95k447m140m737l181m41K128L912M783L526Q43j531l792m788l575j290
1979g405J023L430M708L889J692n73l235m716l841k107L2K918M388M032K680L42
1995G257k464m396m083k989o03K128L877M248L279J119j896l481m147l723j402
2010g276J343L257M280L812J797j085k809m279l909j943L41K463M194M125K353
2025F664K4k297l834m147k772m04J764L873M159K817J064j521l569m097l297j245
2041f818J004L350M077L411J849j004k885l858l747k105N15K612L752L824K415
2056F392p4k161l596l923k766l83J935L400L947K966P73j472l290l958l186r97
2072f393R81L007M033L241J567o83k771l903l474j722K58K312L795L587K211m3
$$ plain form
1963 7520 7325 4878 738 -3999 -7180 -7621 -5493 -1581 3202 6728 7571 6040 2248 -2540 -6115 -7405
1979 -7405 -6382 -2952 1756 5645 7337 6764 3529 -1187 -5028 -7135 -7103 -4185 203 4235 6915 7257
1995 7257 4793 397 -3686 -6675 -7278 -5150 -1273 2975 6254 7373 5477 1996 -2151 -5874 -7276
2010 -7276 -5933 -2676 1604 5416 7213 6128 3319 -960 -4869 -6812 -6471 -4008 186 4311 6664
2025 6664 6688 4391 557 -3590 -6362 -6766 -5002 -1129 3030 5847 6911 5390 1821 -2276 -5573 -6818
2041 -6818 -5814 -2464 1613 5024 6873 5869 2984 -874 -4621 -6726 -6211 -3599 153 3977 6392
2056 6392 6318 4157 561 -3362 -6128 -6511 -4576 -1176 2771 5737 6510 5038 1748 -2210 -5396 -6393
2072 -6393 -5412 -2405 1628 4869 6436 5753 2982 -921 -4395 -6117 -5859 -3547 248 3835 6046 6003
2088F003k005l661l566k554l93J888L369L593K738Q37j445l230l683l027j104
2103f240J133K905L741L186J435p91k616l744l175j846M65K248L621L449K104
2118E875j53j973l455l666k151l95J830L230L631K409P31j345l178l577k773j024
2134e984J152K740L665L009J301p91k534l536k969j772M02K218L390L299J998
2149E588j34j994l172l459k128k39J578L170L449K277Q77j490k898l549k640r62
2165e726J027K793L383K858J275o46k532l396k940j550K59K185L279L112J842
2180E223m7j878l130l204k111k43J659K984L242K258O68j405k732l298k538q79
2196e431J024K592L331K645J183p08k350l254k863j489M52K138L169L003J632
$$ plain form
2088 6003 3998 337 -3229 -5783 -6176 -4288 -919 2674 5412 6249 4804 1574 -2109 -5136 -6240
2103 -6240 -5107 -2202 1539 4725 6160 5369 2753 -991 -4166 -6012 -5547 -3299 322 3771 5875
2118 5875 5722 3749 294 -3372 -5523 -5918 -4088 -858 2773 5182 5913 4568 1390 -2187 -4960 -5984
2134 -5984 -4832 -2092 1573 4582 5883 5092 2558 -978 -3947 -5719 -5317 -3099 291 3590 5588
2149 5588 5454 3460 288 -3171 -5299 -5538 -3960 -790 2659 4936 5813 4323 1425 -2124 -4764 -5726
2165 -5726 -4699 -1906 1477 4335 5610 4964 2432 -964 -3904 -5454 -5195 -3010 269 3381 5223
2180 5223 5176 3298 168 -3036 -5147 -5390 -3731 -747 2495 4753 5421 4016 1284 -2014 -4552 -5431
2196 -5431 -4407 -1815 1516 4161 5344 4636 2286 -968 -3831 -5320 -4868 -2730 439 3442 5074
2211E074l2j805l116l063j995k04J704K848L152K216N32j420k745l223k383p73
2227e233J094K494L172K657J008o37k398l192k732j282L85K142L064K783J601
2242D926o0j896k884k922j908k59J603K853K958K159M00j322k691k986k212p09
2258d950R70K515L110K403R24o71k237l138k612j256M60K022K953K813J620k71
2274D655j637l037k801j775k30J579K711K951K061M85j489k545k916k181q27J020
2290c976K620K844K401J005q84k187k951k499j231N02K042K737K854J549l23j659
2306B844k919k818j666r3J511K753K831J933L12j266k442l022k145m80Q97K385
2322a385K952K238R09p97k059l033k291j217M32K102K782K594J388k76j667k775
$$ plain form
2211 5074 5042 3237 121 -2942 -4937 -5141 -3437 -589 2563 4779 5311 3891 1146 -2077 -4460 -5233
2227 -5233 -4139 -1645 1527 4184 5192 4555 2157 -1035 -3767 -5049 -4664 -2522 542 3325 4926
2242 4926 4866 2970 86 -2836 -4744 -5003 -3400 -547 2411 4570 4970 3648 957 -2029 -4241 -4950
2258 -4950 -3980 -1465 1645 4048 4972 4301 2064 -1074 -3686 -4942 -4482 -2460 493 3306 4926 4655
2274 4655 3018 -19 -2820 -4595 -4825 -3246 -535 2416 4477 4962 3473 928 -1988 -4169 -4996 -3976
2290 -3976 -1356 1488 3889 4894 4010 1823 -1128 -3627 -4858 -4356 -2314 423 3277 4826 4503 2844
2306 2844 -75 -2893 -4559 -4652 -3141 -388 2443 4376 4688 3422 980 -2042 -4187 -4667 -3770 -1385
2322 -1385 1567 3805 4714 3917 1858 -1175 -3466 -4683 -4251 -2149 633 3227 4615 4339 2672 -103
2338a03k627j709k47J715K713K704J852K67j409k309k713k133o17J026K331K782
2354A523K181R65q76k081k694k552j095N34J936K827K470J297k45j647k684k575
2370b716j497j31J454K496K672J893K66j128k555k750j752p52R56K226K724K213
2386C619Q58p43k113k543k291j181M32K022K536K463J337k41j704k585k425j657
2402d216K2J430K355K678J666L35j267k211k720j873m84Q60K113K845J902P68
2418D203n55j976k735k197r26L23J900K643K268J095o5j617k612k131j569k37
2434d188J487K476K385J647L58j169k338k310j960n55R12K056K422K139O87o00
2450C449j954k286k248j017N48J494K421K300J168r2j406k418k368j373j7J202
$$ plain form
2338 -103 -2730 -4439 -4686 -2971 -258 2446 4298 4565 3156 847 -1866 -3999 -4616 -3590 -1259 1523
2354 1523 3704 4669 3793 1712 -982 -3534 -4629 -4095 -2159 668 3138 4435 4190 2543 -141 -2716
2370 -2716 -4213 -4344 -2890 -394 2278 4171 4437 3309 754 -1996 -3748 -4500 -3544 -1318 1406 3619
2386 3619 4477 3734 1621 -922 -3213 -4394 -3962 -1940 596 3059 4396 4155 2451 -134 -2559 -4216
2402 -4216 -4194 -2764 -409 2269 3935 4270 3003 792 -1928 -3801 -4285 -3425 -1312 1533 3435 4203
2418 4203 3648 1672 -1063 -3260 -4186 -3863 -1963 680 2948 4043 3978 2361 -251 -2382 -3951 -4188
2434 -4188 -2701 -225 2160 3807 4165 2996 658 -1652 -3612 -4167 -3255 -1199 1223 3362 4049 3449
2450 3449 1495 -791 -3039 -4056 -3508 -2014 407 2707 3875 3783 2377 -41 -2409 -3782 -3799 -2597
2466b597K239K412J492M36j094k140k381j696o23P93K051K485J766Q29o00j913
2482A459k289k008j074K54J883K319K011J105r8j514k168k105j497N6J245K023
2498c98K236J660K95j201j839k339j687m23P76J781K362J821O44n56j586k438
2514h92j984p84K48J676K188J966J181j32j387k151k101j190j17J105K132J991
2530A749J408M40j037j965k040j668m54P54J823J994J808P35o13j572k085j985
2546b708q36L87J503K089J968R94k24j122k141k016j110LJ073J967J933J260L93
2563C413q95j821k190j359n18O90J612K245J429O41m51j541k113j629q45K17J644
2580a471J804J809J081j16j273j894j812j329K5J077J787J923J338K46q67j684
$$ plain form
2466 -2597 -358 2054 3546 3982 2888 748 -1633 -3329 -3952 -3159 -1108 1377 3143 3972 3372 1459
2482 1459 -830 -2838 -3912 -3658 -1775 544 2555 3660 3562 2048 -120 -2225 -3722 -3666 -2421 -398
2498 -398 1838 3498 3793 2592 753 -1586 -3273 -3696 -2920 -1139 1223 3044 3688 3132 1546 -892
2514 -892 -2876 -3660 -3412 -1736 452 2418 3599 3467 2080 -71 -2172 -3362 -3479 -2374 -242 1749
2530 1749 3157 3597 2560 595 -1445 -3113 -3567 -2813 -990 1004 2812 3547 2934 1362 -723 -2708
2546 -2708 -3544 -3157 -1654 435 2403 3397 3173 2051 -90 -2106 -3216 -3213 -2140 -173 1760 3020 3413
2563 3413 2518 697 -1493 -2852 -3370 -2680 -1068 1177 2606 3247 2796 1255 -858 -2487 -3332 -3115 -1471
2580 -1471 333 2142 3223 3107 1834 -60 -1872 -3201 -3176 -2099 -312 1611 2949 3195 2328 644
2596F44k063j208o51P67J578J875J697N90n03j523j879j696q92M78J173J970J740
2613B097R59j56j151j804j865r87j98J045J790J781J251M41j039j532j961j394
2629b723m72P29J588J879J464N72m90j404j794j608p50K68J333J905J498R62q8
2646B869j195j737j710j108n8J065J526J872J198K50p73j527j789j364m73N86
2662b368J461J857J351P18m54j380j783j578o90K03J296J609J646Q78k3j089j668
2679a4j726r24p3Q33J522J710J355J73p57j473j602j490l30O06J307J629J474
2696B220O00m27j334j726j303q38K80J006J696J621Q01m0r19j648j525j079n5
2713b670P77J539J689J113J98o13j459j570j294m65N45J427J535J323N94n44j105
$$ plain form
2596 644 -1419 -2627 -3278 -2511 -933 942 2639 3229 2726 1203 -676 -2372 -3264 -2786 -1613 357 2097
2613 2097 3056 2900 1749 -55 -1920 -2907 -3105 -2060 -270 1511 2762 3203 2164 632 -1329 -2723
2629 -2723 -3195 -2466 -878 1001 2465 3037 2547 1143 -651 -2259 -3009 -2741 -1408 497 1995 2957 2869
2646 2869 1674 -63 -1773 -2881 -2939 -1874 -348 1524 2722 2972 2199 672 -1117 -2481 -2954 -2368
2662 -2368 -907 950 2301 3019 2565 1185 -598 -2176 -2866 -2663 -1367 242 1888 2766 2743 1654 -14
2679 -14 -1740 -2664 -2737 -1904 -382 1328 2683 2856 2099 626 -976 -2466 -2796 -2190 -883 746 2220
2696 2220 2820 2393 1059 -667 -1970 -2808 -2528 -1522 174 1795 2596 2556 1637 -11 -1536 -2615 -2670
2713 -2670 -1893 -354 1335 2448 2646 2033 574 -996 -2290 -2755 -2210 -783 752 2075 2669 2125 1020
2730A020j524j287q76K45J138J530J459Q79o0j002j425j625r17q3Q68J319J497
2747A156J172J24m44j406j579j206l93N14J239J557J269M59k62j140j526j313
2763a779n90M1R82J586J302Q83l2r76j350j413q99j54Q04J257J416J062L15p24
2781A731j161j465j144m19N57J087J372J271N94m29q90j503j302o27K16R43J354
2798A85J282P46j8p87j380j353q10j83Q12J219J393R65J54n30j155j401r46m54
2816b261M60J094J312J102N66l65r81j315j156o44J56Q23J265J359Q42j72q80
2833A205j145j281r29L8O39J050J468R55O9m62j088j436r79k46L64J062J381R23
2851A588M86k50q86j350j052o13J04Q72J240J134P60k4o60j345j151q18j23O65
$$ plain form
2730 1020 -504 -1791 -2667 -2422 -1284 246 1705 2584 2524 1522 97 -1528 -2445 -2528 -1660 -341 1156
2747 1156 2328 2452 2008 602 -977 -2183 -2576 -2062 -823 734 2003 2462 2200 1060 -466 -1779
2763 -1779 -2369 -2328 -1346 240 1542 2425 2393 1417 67 -1346 -2245 -2399 -1595 -338 1078 2140 2455 1731
2781 1731 570 -895 -2039 -2458 -1901 -814 558 1829 2423 1994 1104 -399 -1701 -2328 -2112 -1169 185
2798 185 1467 2213 2195 1408 28 -1325 -2135 -2318 -1506 -287 1106 2071 2225 1695 540 -861 -1807 -2261
2816 -2261 -1801 -707 605 1707 2273 1908 927 -388 -1544 -2188 -2032 -1209 56 1415 2257 2085 1205
2833 1205 60 -1221 -2150 -2112 -1473 -423 1045 2000 2069 1607 519 -917 -1896 -2142 -1778 -716 665 1588
2851 1588 2074 1824 938 -412 -1464 -2077 -1973 -1101 139 1273 2033 2009 1349 4 -1147 -1965 -2088 -1423
2869a423J162J153R31L87o39j106j263r70m65N77R55J282J028N48l72q97j180
2886b92j191n55K48O95J244J214O07j00m59j341j265o57p4L92J244J314O67K63
2904A954l84j171j169q18m06K81J116J144Q92N60k69r25j137j031n52J51P31J126
2922I3J029Q16j40q58q86r98q94r4O42R57J269P92J55m49r66j151r88j51L18Q33
2942f71J198R22L87j53q13j152j057l98l7P54J149R53P27l1o67j029j008p31j24
2961a781M55J090R62Q14L03m59r95r22r10m78M65R23Q95J113K88k54p15j019j018
2980a243n63K83O49R03J202M49Ln78j009j107n33j25M30R55J043P67K33n55p56
2999D48j076p37l05K06R83J054P69L75k28p39r19r30n05j05Q62R27R30O01j69
$$ plain form
2869 -1423 -261 892 1823 2210 1571 465 -798 -1768 -2233 -1656 -701 581 1609 2157 1785 888 -292
2886 -292 -1483 -2038 -1790 -1095 149 1363 1970 1870 1411 70 -1195 -1852 -1926 -1534 -290 1024 1691 1954
2904 1954 1570 399 -770 -1588 -1994 -1713 -597 547 1439 1999 1730 805 -332 -1363 -1915 -1764 -1033 93
2922 93 1122 1938 1798 940 54 -944 -1838 -1932 -1290 -333 936 1728 1883 1434 468 -683 -1671 -1822 -1504 -671
2942 -671 527 1449 1836 1683 870 -282 -1339 -1737 -1774 -1020 129 1082 1809 1778 1111 82 -926 -1657 -1781
2961 -1781 -1326 -236 726 1540 1843 1384 389 -533 -1443 -1921 -1456 -533 362 1475 1763 1509 794 -225 -1243
2980 -1243 -1806 -1523 -874 29 1231 1680 1683 1105 96 -1011 -1544 -1669 -1239 -284 759 1526 1759 1204 448
2999 448 -628 -1365 -1670 -1464 -481 573 1342 1717 1489 750 -169 -1099 -1604 -1709 -847 80 1010 1611 1442
3018A442n44p90j023o63o0N07Q29J033P31K61n76p93r05p06l82L13O95J106P55
3037A230K70j17o90r83q94l35M5O49Q69R34N21M3n47r53r36n51r4M77P72R36P61
3058A407J51m32p96p67r14j75K28Q96P45P59L72k87n21q74r20k96k1P33R78O85
3078I51N85p7n41q21r24n98M3K67R69P96N57J99l69p01q39o84j27J49P36Q55N40
3099I66N49k24o89q73n80l68j96P00Q78P16M57jm73p96p81n64lM00O24Q15N88
3120A145K43l57p30p41q08j81L09O99P72O28L38j63n02q72o53m79N6N78P97Q24
3140I03L86j01l45q35o67n16j61M94O18Q44M66J59k96n38q31o29k44J80O49Q12
3160C48O39K98r4o31o90p51m10RO47O66P00M11J89n81o79p27m92n1L13O39Q99
$$ plain form
3018 1442 898 108 -915 -1578 -1638 -1131 -302 731 1462 1723 1147 354 -551 -1257 -1639 -1326 -631 475 1230
3037 1230 1500 1383 693 -290 -1184 -1519 -1474 -825 44 978 1499 1542 995 42 -894 -1445 -1539 -1062 -290 646 1407
3058 1407 1558 1126 330 -437 -1351 -1526 -1298 -402 343 1102 1474 1187 666 -208 -1128 -1424 -1445 -712 266 951
3078 951 1536 1459 918 97 -827 -1425 -1382 -1115 -146 650 1207 1406 1037 336 -503 -1187 -1314 -1165 -429 426 966
3099 966 1515 1291 602 -271 -851 -1219 -1415 -715 163 879 1336 1335 862 66 -715 -1279 -1282 -882 -258 557 1145
3120 1145 1388 1031 301 -440 -1248 -1429 -1120 -421 351 979 1317 1154 652 -220 -873 -1352 -1296 -718 79 903
3140 903 1289 1188 843 8 -659 -1175 -1336 -842 -224 620 1086 1245 949 411 -420 -1049 -1293 -1113 -464 348
3160 348 987 1285 1191 560 -130 -881 -1291 -1282 -635 31 731 1142 1331 750 71 -656 -1148 -1199 -886 -247 652
3181F52M26M6j76o83o69n15l25J26P45O30O63K37N6p10o87n98m12L4N12Q18N77
3202G47L49Ml24n94p53m71pK21N98Q11M60N8j64o52n58o46j85J42M39P96O36J59
3224A066j47l41q16o30j65P9L96N94N51L74L8k16p46n90m87J1K17P51N03M81K69
3245A192k41o24o95m79k10J61M62N76N54M49k41m39o07n20m88J75L40P36M87L96
3265I84O7m67n65n31m80p1M54L83O98M55J01j02o00o22o21kK6N46N58N42K48o8
3287I33m76n82m82k56n6M26M09O46K76J08m26l88n69m00j98L80M16O82L16N2j34
3308F77m24m06n68j94K37K03N94N04J65j9l56l46o57k34pL51M84O25J99j25n2
3329F51n42m86l67r2K13M48N52L94J86j93m94n03m00j23K6L36N53N15J44rm75
$$ plain form
3181 652 1078 1124 948 265 -404 -919 -1244 -1118 -373 257 920 1157 1213 503 -184 -782 -1194 -1160 -648 170 747
3202 747 1096 1100 776 182 -571 -1042 -1049 -828 -230 581 1041 1099 935 283 -275 -921 -1106 -964 -525 271 907 1066
3224 1066 919 578 -238 -868 -1033 -954 -558 36 587 961 999 783 37 -553 -1040 -1029 -812 -61 442 923 1192
3245 1192 951 327 -368 -847 -1057 -896 -434 142 696 1145 904 465 -142 -662 -1150 -975 -635 101 588 984
3265 984 1051 584 19 -512 -992 -1063 -609 -226 472 927 1028 926 326 -296 -917 -919 -893 -347 211 753 1001 933
3287 933 457 -125 -607 -863 -919 -493 -84 562 838 946 520 132 -437 -837 -1035 -655 -239 443 759 811 677
3308 677 253 -153 -721 -915 -678 -475 119 623 788 769 413 67 -590 -824 -831 -480 4 629 828 703 651
3329 651 109 -377 -744 -836 -623 -175 377 771 957 764 270 -233 -633 -756 -730 -394 159 674 818 809 334
3350C34l32n76l18J45L13M39M97M50j94k57l60n91l15m0L80J94O26L07L9n6l52
3371C33o57l28l8O0K98M72M69J26m2m15l77l71l19O4K55O33K31K20K11l70l91
3392F4m24l53j02L13M75L07L89N7k52k70m45l73r8J88K39L93L62K92j68k43m00
3413d9l66k80R3K43M76L24K89j50j90l20l57l92J12R8M09M10L58Oj64m06m27k62
3435e45k12J73L92L51K59L56q4l28n62k33k66K2L61L88K98L59j72j32m74m01j67
3456f17qK09L80K02L50J30k31k43m60k93O1j08M00L87L11J78r9j31o27k85j36
3477f30N4L30K88L58J74N5k72l45l61k23mK16K34M18K77J8j56k87m06k07j91J91
3499d69K57L15L37K01j35j61m51l60j08l1L16L59M14J58j46j83k54l00l13J7J38
$$ plain form
3350 334 2 -574 -892 -747 -434 5 502 952 758 501 141 -450 -765 -805 -425 -231 395 702 741 685 333
3371 333 -324 -652 -690 -630 -332 140 609 735 693 278 -99 -470 -789 -725 -470 163 394 614 825 455 64
3392 64 -360 -713 -815 -502 -27 280 669 726 474 204 -241 -614 -712 -524 -285 108 470 762 594 351 -49
3413 -49 -415 -695 -602 -359 117 441 730 580 390 70 -287 -679 -567 -469 -60 350 708 714 550 144 -283 -545
3435 -545 -757 -584 -192 159 418 774 690 362 -200 -433 -699 -677 -316 72 370 729 557 425 -49 -450 -617
3456 -617 -625 -416 -36 166 516 646 415 172 -288 -581 -520 -628 -228 159 470 648 549 418 -209 -494 -630
3477 -630 -576 -246 42 400 574 629 357 12 -349 -572 -576 -360 -126 292 569 587 431 144 -262 -469 -660 -469
3499 -469 -212 103 440 641 506 345 -106 -466 -574 -605 -289 70 484 642 496 313 59 -241 -554 -537 -399
3520c99L33M13K36j0j30l21l05l38l2J45J75L97L56K4j26j82k39l31k57J54J43
3541b94K79L45J48Oj95j49n62j6m1M6L88L42K36R7k88k83k69m13J1J99J70M19
3563A76K50J21r2k52l19l47j57O2M86R7L58J74l9k34l00l05j61j5N0L54L83K01
3585D91J85k98k85k51j55k23J12L10L11L05L5j04r6m17k68j98J07K38K47K28K32
3606E06L6k33l72l09j70R2J27L06L62J66K8j49l19l06k71j13J21L93K69K14J45
3627E23r4j66l38k73k31K6L10K26L78Q6J42k63l08l10j61K3O9L46L06J16%M2l82
3650F7k92j60j00O8K71L04L18M5m6j68l46k72k25M9J54M37K13L5J44j86l01l67
3672c58j01MJ60K41K10J71J33q6k92j06l95o9J10J65L20K92K5k4k16k90j37k10
$$ plain form
3520 -399 -66 347 583 573 443 122 -183 -521 -553 -408 -233 164 520 544 418 236 -3 -334 -591 -437 -294
3541 -294 -15 330 478 484 289 140 -422 -438 -479 -433 -45 297 533 630 342 59 -210 -623 -612 -413 -243 176
3563 176 426 547 455 203 -116 -463 -620 -558 -72 25 383 557 518 284 -16 -321 -482 -497 -447 -93 290 491
3585 491 676 378 93 -158 -313 -536 -424 -114 197 502 537 433 337 -80 -348 -546 -439 -201 46 274 506
3606 506 542 309 -63 -372 -542 -450 -323 -17 345 511 539 390 71 -235 -506 -619 -498 -105 164 378 523
3627 523 429 263 -75 -348 -579 -553 -243 -17 361 447 589 326 18 -292 -453 -430 -361 -15 291 407 407 449 67
3650 67 -225 -385 -485 -417 -146 158 476 521 475 307 -39 -311 -536 -487 -333 104 317 352 496 310 9 -358
3672 -358 -459 -455 -295 -54 156 327 460 374 82 -24 -419 -488 -378 -213 107 399 424 400 184 -106 -243 -453
3694d53N1J45L05L51P4p2k9m28j70j53n2J25K06L00J92J21q8l44l46j51OPK09
3717a94L31K05O8M5k15l18k74r2Q0J06K59L06J60j9j28l53j55k64PJ57K81K05
3739A98K31J3j82j26l64l1k30J14K82J05L09P7P2l00k51k18l4j8Q3K38L20Q4J4
3762C86n7l13k89n8j13J77K86K01R3K3J6k61j97k24j06J64K46J26K78pL1k26j96
3785b0j39k42M0O2K54L11J35j01l5j78k72j42L7K1J61K83J62N3r0k29j86j34m3
3808b92l6J85K11J35K31l4k50k91j41q5n9J65L24J13J46Mr1o2m23r9n7K06K14
3831A4J89P2K9L9k05j68k34r2Q0N5J93K16J73o2q0j89j83k90J07K22Q4K81m0J71
3855C82j37k16j99q6j52J91J06K83J33m0M0r8k44j81q3o1L21J19k5K81q4j36j08
$$ plain form
3694 -453 -402 -257 48 399 473 401 372 -56 -226 -379 -431 -306 -100 200 392 513 425 81 -265 -416 -410 -403 -194
3717 -194 137 342 410 455 240 -78 -352 -444 -364 -258 1 307 467 448 320 -33 -188 -452 -445 -288 -7 198
3739 198 429 442 260 134 -230 -261 -491 -377 -95 10 319 396 468 168 -83 -301 -335 -353 -270 -32 288 372 386
3762 386 329 16 -273 -331 -444 -267 19 220 313 336 352 91 -106 -330 -436 -272 -26 100 378 371 402 176 -20
3785 -20 -159 -401 -361 -299 -45 266 401 300 265 87 -185 -327 -290 -269 -108 175 337 390 300 71 -115 -249 -292
3808 -292 -328 -143 68 203 434 400 150 -141 -282 -367 -426 -261 63 176 322 326 235 173 -250 -349 -406 -200 14
3831 14 203 275 304 343 138 -30 -264 -356 -276 -221 -28 188 361 299 219 30 -153 -443 -336 -114 -30 251 211 382
3855 382 245 29 -170 -256 -408 -217 -111 172 305 265 305 207 -37 -218 -301 -362 -41 78 53 334 250 114 6
3878Fk30n4j11K38R7J10K65o0R2k05k65r7j43P9K28K11K27l9j3k23j19k20j2j9
3902b57J57R2J65J82L6k81j29Rk24k0J01J92N1K33J14j50k39j47j50q2J36K9L41
3925A59L2J27q6j50j68j09q5kJ60J73K33J07k29Lj15k51p9l0J9K74J45J55J7L
3949C03l36rj26j69O0K61o6L31J5k2j65j51r5j68N9J70J31O3J49J07j71k49k1
3972i9j19K2j7R2L13L4R1j19p1k11j45K8Q5j5K22P3j8J05j85p5j70j01R7J34K3
3997b6K06N4Q8l01k3k74J13m5j8K74P4O9K1o3o1j57j17q8J00J6K84K8J37m5J4
4022B60j79k17k4j2J39J8K01L8P5j93j49j52j05O3K5J91P2N3J52j52K1j76j44
4045a95m4K8J96M7J38J09k2k44r0k6j08oN1J74Q2J26N6j08k06r1p4J4j04L10J28
$$ plain form
3878 6 -224 -278 -389 -151 -54 56 321 261 353 148 -117 -214 -357 -278 -50 161 388 349 336 113 -6 -226 -238 -257
3902 -257 -100 -8 157 339 375 94 -35 -26 -250 -270 -169 23 74 307 421 271 32 -115 -265 -347 -211 -182 159
3925 159 191 318 232 82 -86 -195 -280 -282 -122 51 284 391 162 165 50 -201 -280 -310 -291 -17 128 283 300 303
3949 303 -33 -42 -168 -337 -277 -16 -82 249 264 242 77 -74 -169 -337 -278 -108 23 86 235 342 171 -78 -99
3972 -99 -218 -196 -213 -121 192 226 317 198 127 -84 -229 -201 -116 -131 91 164 146 251 66 -9 -179 -280 -183 -49 -26
3997 -26 180 234 322 21 -2 -276 -163 -208 -226 48 122 191 212 149 88 -69 -186 -274 -174 -158 126 154 291 246 260
4022 260 81 -136 -160 -172 -33 -15 186 224 299 106 -43 -195 -300 -237 -212 -21 51 104 256 104 125 -51 -195
4045 -195 -239 -211 -15 32 170 279 257 13 -77 -103 -211 -217 -166 8 90 216 272 164 -42 -133 -207 -193 -297 13 141
4070A41l1K3k9K5j48j29n8LJ06P9J62Q0k5p9j31j71n6R6L5O1P2J57J4k4j37j89
4096a53p2r4J03J07J94M2L1J7j41p7k18P2P2j3J59Q8K03q9j30j51r6j30J16l9
4120a99P1K13J40p5l5q1j35k43J12RK36M2J06J22k32m1j9j77Lj9P2J81R6P1O1
4145B79j94j92l9o5n1J14J47K2J76P2j11p4j05k41M5N7J45O2J21m4J49k11m1j79
4169a58K0M8P4M6J67lJ05k34j43j32O5j53K15R2J14J37j56J55k79K3j70J2M8K12
4193A05O0n8J69m3j45j41n7k2pP0O4Q7J04kj32q4j55L9M9k3Q3J70K8K3r2J55l34
4220h9j52Q9J06L7J13K1N7J2m3j83p6m4nN0K20j03R5N2r6o1r4m0j06J47lJ91J24
4247B19p8k1j19j31n7%NO7R1J35N6lp3j10l1j55J63M1%J62N0L4l0k58k4p8O4N3
$$ plain form
4070 141 110 133 104 129 -19 -148 -206 -203 -97 -18 144 224 199 120 -11 -182 -238 -142 -107 -46 26 183 197 173 36 -153
4096 -153 -225 -319 -216 -109 85 127 158 175 34 -43 -261 -189 -117 -130 29 117 320 231 101 -50 -146 -276 -160 -199
4120 -199 -128 85 225 150 115 34 -101 -344 -232 -223 13 55 161 283 51 10 -9 -186 -183 -202 -130 51 147 218 279
4145 279 85 -107 -146 -211 -262 -148 -1 21 197 269 158 84 -21 -262 -217 -160 -15 47 168 124 273 62 21 -158
4169 -158 -138 -90 -16 30 197 194 299 65 -78 -210 -145 -298 -83 9 123 260 104 259 -20 3 -167 -155 -107 105
4193 105 165 107 276 233 88 -53 -110 -132 -139 -69 -5 82 186 184 52 -32 -187 -148 -99 -122 -39 131 159 182 90 245 -89
4220 -89 -241 -152 -46 -9 104 125 182 194 151 -32 -108 -152 -157 -107 113 10 105 157 61 0 -94 -134 -240 -93 -96 95 219
4247 219 141 120 1 -130 -187 -187 -182 -115 -24 111 167 164 91 -19 -50 -205 -42 -1 -1 161 211 245 215 -43 -67 -145 -81 -28
4275b8nJ19J20j48J84k36j05l3J7J2M6K04J2L3R3k27j37J4j82J32o5P0J79O6P1
4300B06j01l4j61j32O0K6P7K12Kqk4l6o8k21Q2l6L1J78J52j27j1J31k90j06K4
4325a74O7J22r4K55J9j02kl0j54K2n0J1J35R3K9Kj6k4j61m7j07j5J98nK53j41
4351H4J16j58O7j73q7K1K3J58Q9JJ2o6p2o9q9j5L9J2J36J88j10J73k08j21K1r7
4377a25M9J5P9O2O8N6j31o3r1n7M1O4j0J29j2L2j8L3p1k13k6J62RJ33J28o0n2
4404A31j20j5o8j3j05K49rN3J13n4o6r6p4Nj14L0J34K3J37OK0j80m3p9q5Q0P7
4431f3J63K9l4J35j16m8j15o6j02J48P6J16N5K1n1n2k11l0j16J52R4j7J81k2m1
4456H6k4j86l0j0M2K2O7J64p7M7l5o5k02Q3l9O5N8R2J78q8j50p4M5j9j3QN0QM1
$$ plain form
4275 -28 -33 86 206 58 242 6 -99 -132 -115 -103 -57 147 159 192 285 58 -79 -65 -247 -115 -180 -110 69 135 206
4300 206 105 71 -90 -222 -162 -136 -59 153 155 147 123 87 19 -202 -120 -156 -125 53 205 78 67 198 -92 -198 -174
4325 -174 -107 15 -79 176 195 93 91 61 -93 -71 -121 -110 25 118 147 149 133 109 -52 -99 -206 -221 -23 -28 225 84
4351 84 200 42 109 -64 -151 -130 -107 51 140 141 153 87 15 -54 -143 -158 -119 -107 29 217 107 280 72 -49 -28 -125
4377 -125 -76 -61 18 80 148 204 73 10 -81 -138 -97 -33 -43 86 74 106 88 121 50 -163 -189 -27 -18 115 243 183 131
4404 131 11 -4 -72 -85 -190 59 50 103 216 162 96 0 -74 -69 -183 -153 -19 4 141 147 167 -13 -56 -135 -220 -140 -63
4431 -63 100 129 95 230 114 66 -49 -115 -217 -69 7 123 178 199 148 96 -115 -145 -261 -109 -15 -32 149 127 86
4456 86 62 -124 -154 -164 -122 -100 -33 131 54 101 66 1 -201 -118 -157 -92 -34 58 236 148 -2 -76 -31 -50 -63 -55 -5 3 44
4485D4K20j51p1k1r6j14K2J88J8P6K3n0l2m0j54n7R8P5N1N7j4Q4r4m9j5l5o2R8
4513aOl9J06J16j22o0r0K9r4J11N1j06K96m9n3Rk05R3j11O1K2J6R6j5l7J25j32
4540B3j56P1m6K9L9J5J83j4Lj34m9q6o3Q0J1J55K7n7N5n3k4j41n6J01k3J43O8
4567A01L3j2q5o8Qj99N0L1P6j8J30J02j22l4J3j17P3j36Q4R3P9qMPr7J4o4m9J15
4596DR3q3qJ16o3qo0m7j5n4K5J55o3N5Mj26J35j35N4N8p8J00K9l2j0pq0R2k24
4625a73J21q3K02r1P9J08k12mK3L8j61J46k1J02j8R6q6l3k8n4J0k1m2J13J4p4
4651d9K26j91m0P0q3k7P9M3K4J31j67No4j2R4j34L3rJ12q4J27M1m2l8r1O9j06
4678h3p9J46PR4n8M2o2K3p5j0P0o9J64J0n4k4j02K8m0M0j2J33JL8K3j45J9j6j9
$$ plain form
4485 44 264 113 42 21 -75 -189 -167 21 39 115 138 88 56 16 -138 -195 -97 -22 29 86 72 156 62 13 -2 -37 -99 -1
4513 -1 5 -34 72 188 66 6 -84 -55 -149 -38 13 -93 203 154 101 110 -95 -2 -113 -52 -30 -14 82 67 30 155 23
4540 23 -133 -62 -108 -79 -40 -25 158 144 147 13 -36 -122 -185 -105 -94 61 88 31 86 33 9 -132 -188 -87 -110 33 101
4567 101 134 122 37 -31 -23 -222 -172 -141 -65 -83 47 149 27 -7 6 -111 -38 -174 -90 3 82 74 78 85 -12 2 -62 -111 4
4596 4 97 14 6 122 59 51 -9 -56 -71 -125 -100 55 -8 47 51 -75 60 -75 -21 37 -41 59 88 56 46 39 -41 51 -173
4625 -173 -52 -135 67 -24 55 163 -49 -53 -30 8 -153 -7 -28 74 56 152 66 33 5 -49 -39 -60 -102 11 25 -49
4651 -49 177 -14 -54 16 -67 -94 -15 28 52 183 16 21 -43 -55 39 -95 -62 -71 41 -43 84 125 83 45 -46 23 -83
4678 -83 -162 -16 -9 85 27 69 7 30 -45 -55 15 -54 110 120 66 42 -60 -32 -72 -32 -44 89 90 128 151 6 25 9 -10
4707a0o9O9m0O6O0L6k9k6l1m9j24O4J29jo2N5N7nl7o3j9jJ6p8J57P1p2l6m9m1
4737f2j5k9qJ05K6O2R0j0q6j87J63j47j1R0k6j4J10%j7MK0j20N9q3O0J24k1Ll2
4766D8m4J0Kj82J46J3Q7L3l5j15J69o4r0n6m0J41o5R6l8K0O4n3j47L2m2R8R7n1
4794C4j5J24rn9j39M9K5l4kJ21m4n5J62k2j76p3M6J4L3j1J12K7n3P5j3j24k02
4821b09L9J40P9n2NP1j20L3N3r3o8J01m4L1K5M5n7l0j8lmrJ00o7J21l0O0k6l9
4850C4j1k4j77K15j2P1L2j4l8l1m5j04J8J37p8P0O1j0j31N3j3p5k6n3J05J8R8
4877G0K0mo2j55Q2m0J26j32J11k9P6rK0o0j43J1M3K1P0O1n6J31k8n9j23q2J25
4904a5j42R4J14j2J04m7j8r4p6L1m0mL8R5N5l3J23j21j48m2R4j52K43j3jM2N1
$$ plain form
4707 -10 -79 -10 -50 16 76 112 83 57 26 -23 -147 -83 46 45 -17 38 95 90 53 -10 -29 -30 -14 -92 65 136 64 28 -21 -62
4737 -62 -77 -106 -114 -9 17 79 169 159 73 -114 49 -98 -109 -19 -45 -59 51 51 34 38 58 -62 -3 -86 -26 98 77 80 48
4766 48 4 14 16 -166 -20 -7 80 113 78 -37 132 68 -22 -78 -118 23 -42 54 16 36 100 47 -100 -68 -110 -12 85 34
4794 34 19 143 134 75 -64 -15 10 -24 -26 95 51 -4 158 136 -40 -113 -67 -53 -20 -31 81 108 55 130 117 -7 -209
4821 -209 -170 -30 49 -3 2 73 -47 -14 39 -54 -122 -21 -65 -34 -9 36 -21 -51 -69 -72 -76 -85 15 -52 69 39 99 73 34
4850 34 23 -1 -178 37 25 96 128 114 76 45 0 -104 -86 51 -27 43 104 94 -37 16 3 -72 -98 -151 -46 -28 70
4877 70 90 86 24 -131 -49 -89 37 -95 16 -13 63 54 74 14 -129 -118 -75 -54 16 77 21 152 124 65 -58 -140 -15
4904 -15 -157 -63 51 39 143 96 78 -16 -92 -61 -101 -105 -67 28 83 50 173 52 -96 -138 -44 -196 47 34 33 75 126
4931A26o9k02R1j3J4K9J37o5J1J01j43l4n5J0L2j9Q6k3k3J29m6p3m3r4j5J55j47
4958a43K14Pk0P4j54L0K2k08J05j7J96j11J38j16K2j11LJ1j16J90n9J19K0Mp8
4983B2m6jn9M7N3L7l6M1J07k9r0o3m5r7L6J19r3K02N2o1j53KJM1o8m5J54J02n1
5012G9L9K8o2j06j09Q1l2O9n3J19M7L3q5r6j3J7j08J00JJ80M2j46J13p5j36m9
5038a22O4n1L6J55r3R1m9m1J4j02L3Rk4K51k5j06J03r2j62K5j3J07M6l6K9J02
5064A49lJ4q2k02R5J1q6J33m3L8J03o6j07k1l2k5J5J70O5o2Jj01O3j55J12r3N3
5091e6J5j2J18O9%p0j13L0o4Q7k5K4J20Jk2m3J9o0o1q0mK27n0N2m8J4j16Kk9J12
5121C7j54R8k6J90M2r3j02J2j38L5o6J7J89rJ9R7n6j45m4j0J2J13Nl2R1M2ql5
$$ plain form
4931 126 57 -145 -54 -67 -53 -24 113 48 59 160 17 -17 -72 -62 -30 -49 37 14 -9 120 74 1 -42 -136 -151 4 -143
4958 -143 71 78 58 132 -22 8 30 -178 -73 -90 106 -5 133 17 39 -72 -69 -58 -174 16 -43 76 96 100 22
4983 22 -24 -25 -84 -37 16 53 17 58 165 136 46 -17 -62 -159 -123 -4 -97 105 157 96 -57 -55 -54 -13 -81 -126 28 130 79
5012 79 118 146 84 -22 -131 -50 -82 -13 -66 53 100 133 48 -48 -61 -44 -152 -52 -51 129 171 25 138 63 -73 -122
5038 -122 -58 -109 -73 82 -11 80 31 -10 4 -98 -65 -56 -80 171 146 40 143 51 -111 -86 -99 8 54 18 47 149
5064 149 146 160 78 -124 -29 -18 -104 29 -14 24 127 61 -46 -67 -99 -124 -109 61 126 64 65 -36 27 -128 -16 -109 -56
5091 -56 -41 -53 65 134 134 64 -49 -19 -83 4 -21 3 123 124 102 59 78 18 -43 -123 -127 100 50 102 54 68 -48 -46 -75 37
5121 37 -117 -19 -45 145 187 94 -8 4 -134 -99 -165 -148 41 32 51 148 92 -53 -97 -107 -95 18 23 -9 82 124 116 81
5149H1r2j02l1M7P7L5N1J0n4O8j68J67j79n1L6J30q8J57O9j32k2L6j71P7p9J32
5175DJ21n5K2J18k10K2j59M7J13l5kJ6O3j22J04o4q8K2o2j8K00n3J23n5m5Qm7
5202c2l9k9N4J13j42J87O0j41l2p4m2n8O2N4K8R6L2r1j36J60r1r9P0M6r9J64M7
5229F8M0j94KJ40j30oM2m9J09M2P4n2l9p5p3j6K8Q3O1O0m1j3K7j04j49N3k5O2
5257g5N9K3J28r3N7p8m1k6J5j01R4P4K0k1k1L8m4j30l3lLJ76l3P5j0mk4q7n6J5
5287a03MK35j25P7J2p5Q7k17k1o1P5J14O4M8n5k3n9q0nm9J57j08R7J06p5K3p8
5314c5j2JL8p6Q1n8K01j38Q9n5m3m6j3nm5J19k4J42j78K48k29j4M4j56L7%P1N8
5342BJ13qj10J3Mj23K8o8J47lK0P8J3j52M7j49J47j04Q3Q1J02j77Kn5J03Lj49
$$ plain form
5149 81 -11 -113 -144 -97 -20 15 66 76 22 90 -78 89 -90 -141 -105 25 -63 94 163 31 9 45 -126 -49 -128 4
5175 4 125 70 92 210 0 22 -137 -90 23 -12 -14 2 65 -57 47 -17 -105 -83 -145 -163 37 -16 107 52 7 15 -32
5202 -32 -71 -100 -46 67 -75 112 172 31 -1 -75 -117 -175 -113 -59 -31 65 97 6 -130 30 -61 -160 -90 -44 -143 21 68
5229 68 108 -86 -84 56 -74 -80 -38 -87 22 64 138 86 47 -28 -101 -117 -89 -6 55 115 74 61 88 -16 -165 -112 -137 -75
5257 -75 -16 7 135 42 99 21 -20 -46 -31 -132 -38 36 56 35 14 52 8 -122 -155 -158 -155 21 -12 63 53 49 25 -62 -118 -103
5287 -103 -99 136 11 88 100 25 112 -105 -126 -187 -112 2 66 114 59 36 -23 -103 -108 -157 0 -108 -11 95 20 43 -35
5314 -35 -47 -46 -8 -84 -3 -61 140 2 91 36 -7 -53 -66 -71 -116 3 -21 121 -57 191 -38 -52 -8 -164 -127 -127 -56 2
5342 2 115 107 -3 10 14 -109 -81 -149 -2 -5 15 93 106 -46 1 -148 -1 -105 -22 59 161 -16 -14 -69 34 37 -112
5369a12L9P2ML2N9j4j50n4J03j20k6P0P1J9N7J42j75q1oJ5K1Nk1O6J6PJ23j41
5397B1l3q5j5o1J87m6J12p4M2j9q6Rm0j22K16K5J56j63L5kj3j22nK8o7M5K7J34
5425H4l4m9n1P6m3p8L4mJ34M2q8N8j27L0J3j2k1O2k3o9P0J12j54R2n0q3MQ7r0
5454g8J50J2o5K43k41J9k6m5n1J32j17Q0N2p8L2j25J70j40J8L9J33m4j5p6R2L9
5480A10k97R8k7N1P1J5M9Q4j01K5q5l8J3L5o4J43k8m3P3j02j9R9l1k6n4K0O5j45
5508a09J44L2j2j79N8qO7O0k2j7R2l3j19j5l3l2N1J90L3m8P5j9j03r7J5L4k3J1
5536gpR5l8%P5j72NL6m7nO5o6P1R7J4o2j92O9q6R3R4K9mL9j36J8J3j10N0k2P6
5567a5N9m8m2J08j2o3r7M1j09R1K1J26o5P0J2r5j26M7o4R6k9K5J63j2k6k4j6j75
$$ plain form
5369 -112 -73 -1 3 35 94 80 -70 -124 -21 -141 -167 -97 -26 -7 50 192 17 -64 -70 -55 -34 -29 -50 16 32 39 162 21
5397 21 -12 -97 -112 -173 14 -32 80 6 48 29 -57 -48 -88 -210 6 31 187 24 59 57 44 -78 -83 -55 -122 -77 -50 84
5425 84 50 1 -50 26 -17 -95 -61 -65 69 111 23 81 -46 -16 -3 -15 -36 26 3 -66 4 116 -38 54 4 -79 -75 12 -78
5454 -78 72 84 19 262 21 40 14 -31 -82 50 -67 13 65 -13 19 -106 64 -76 -58 -19 114 70 55 -21 71 110
5480 110 -187 -89 -116 -65 6 21 70 154 53 78 -7 -45 -32 3 -61 82 54 11 84 -18 -37 62 31 5 -49 -29 36 -109
5508 -109 35 67 55 -124 -66 -74 -7 53 31 14 106 73 -46 -61 -94 -126 -75 115 148 100 175 156 53 -44 -29 5 -18 -7
5536 -7 -14 81 43 43 118 -54 -49 -13 -60 -65 0 -66 5 102 116 54 -138 -69 -155 -62 32 61 57 96 -40 -22 -9 -119 -69 -91 -15
5567 -15 44 -4 -46 62 50 -13 -110 -69 -178 -87 -66 60 -5 65 77 -18 -144 -97 -161 -65 -94 -69 94 82 56 32 16 -159
5595a59Q5R7N1r2J72m7%q9k3mj16Q3r4J02J73j08L2J6Rq0j03n5Q3N9L5O3J8K1
5623A29r0l3Q0j65R4l6J7J06j07K8J7m6l5O8o4j11O4J16N6j37k3K2L5N1j15l3
5649a12P0N9mR7r8k5L5r5jO5l6K9L5K3K5j8j00N4o8MP2r3P8O1J1N6j53Jn9L2j0
5680f5J05q1P0O1lj03J23p2r8l1J25p5M1L7P5o0j59JQ0m6J08N8j94J08M3Qj21
5707f5J66j90j0K8K3R9K2j0k8K0K3q3m7j4k0P0qJ13p4L0j8l2k1op1J15j8L0l5
5736a1P7r4Q7n4r8J42n8LJ0R4K0j7p5Jp8l3k7J25L8k1M2j05J69k58Q9J7P0j34
5764g9m3K22k0l8j8O6o1j41J7J21Pj7mJ85j25l5p3P2p6J70m5j00O3O4j52J16r0
5791a4k6l3K7N0q2P7M1j31J49k5pr2l4j6K29j62Q3r5j1M0k4P1r3k0J13J51j63
$$ plain form
5595 -159 -74 23 74 -18 154 107 107 18 -5 -9 -125 -42 -136 -34 139 31 63 79 88 8 -95 -150 -67 -8 27 90 108 129
5623 129 39 6 86 -79 15 -21 -4 102 -5 23 40 -6 -41 27 -37 -148 -84 32 88 -49 -72 -50 -15 36 -79 -112
5649 -112 -42 17 13 110 12 -13 22 -73 -74 -9 -45 -16 19 42 67 49 -51 3 -65 -61 11 -82 -4 57 68 124 -29 -28 -87 -55 -65
5680 -65 40 -41 29 90 87 -16 107 35 -63 -94 31 -44 -3 34 109 49 -110 -109 -29 -75 33 91 -103 5 48 56 -65
5707 -65 101 -89 -99 -71 -48 51 73 63 35 55 78 -5 -52 -66 -86 -16 -24 89 15 45 27 -5 -26 -32 -103 12 -6 24 -11
5736 -11 66 -28 59 5 -93 49 -9 -6 4 98 118 101 26 27 -51 -84 -111 14 52 31 73 -32 137 -121 -32 -15 55 -79
5764 -79 -122 100 80 42 24 90 29 -112 -95 26 33 16 12 197 72 37 -36 36 -40 130 85 -15 48 112 -40 76 -14
5791 -14 -40 -73 -46 4 -78 -1 40 -91 58 33 26 -66 -100 -116 113 -49 34 -61 -72 -32 -56 15 -78 -98 15 166 3
5818CJ10n3K0j63O0%pp3J05N1l8k7J6l6NO7j45J63l4L0o3lL0O1n0l6j32Q6L9l0
5848d4J8J9Q9j2j02N8n3r0N9O7J8j8N1j2j04LR8j23M3J4l0P2K6J12j73M6q1N3
5876Dr5K5M2N6j8L6p1O5q0m6R7n4k8O2r5J23l3m1ML8m8J9%O8J05q1r0K8J04j19
5906b3Mj7K1qR3j04n1N9J13q2l1k0L8MM6O1q5j9m1N4r0O3j0J14r5OkMoqJ0m3k8
5939g3J15m4N4qK8N4j15O7j85L3J38p6nR3r2M2qn6L9o4n1K4Q1N9L4q6K6l6l6O0
5969A2n2mqJ04l1n7N7K5j01J5Q2p9L7K3rk8k4J06o8j1n5Q2q2R9r7P2n8P2k7M8
5999D3j32J2O0JN8L9j0J7j1l5j35K5Q2M3p5m7N7j7K6O6n3l8m9R4m5K7L8l6N7n7
6029Em1l3L6qM3l9J77j32kP6j18k9K9K8j6J03P3j81J06j41J39q7rj6l3P2l8J6
$$ plain form
5818 3 113 60 80 -83 -23 -23 -30 -103 2 53 15 -12 4 -32 -27 40 -105 58 24 54 -9 -12 18 79 29 -7 -139 -53 -14 -44
5848 -44 -26 -7 82 70 -32 26 -27 -117 -58 9 27 9 60 48 -56 -53 45 -78 -35 -21 -51 21 47 159 -14 32 -49 4
5876 4 -91 -66 -24 32 14 50 -21 44 -36 -82 15 -39 -67 -5 -100 23 -10 -51 -47 -9 -57 -38 -38 30 135 54 -36 -8 96 -23
5906 -23 -19 -36 -15 -23 70 -34 -85 -26 87 5 -26 -46 -8 -4 42 103 18 -1 -42 12 -78 -15 -25 89 -6 0 -2 2 -4 -12 -2 -45 -73
5939 -73 42 -2 52 44 72 126 11 78 -107 -74 64 -12 -17 76 -16 26 18 -38 1 -63 -114 -90 -9 50 84 -2 24 -12 -48 12
5969 12 -40 -44 -52 52 21 -36 21 46 -55 -40 42 -37 0 23 14 -14 -38 68 0 -11 -66 16 -66 33 -64 8 -50 22 -5 43
5999 43 -89 -77 -17 -16 42 81 71 88 77 42 -93 -68 14 57 -18 -65 -8 -25 1 67 14 -24 -73 21 -24 3 41 5 62 5
6029 5 -36 -69 -33 -41 2 -37 140 8 6 82 -36 -65 -36 -8 -24 79 152 -29 77 -64 75 -12 -21 -37 -70 2 -36 -20
6057b0N3J2o4J6L8l7L3j4n0R2jl3n1j4N0L3m3J3K9Ol8%KJ23j24p1M1P6o7m0N9
6088IL1p8n2qp6L00j24L3n7n5J13oj13J0l8L6O0NN4m8p2j4J29j30K5n9J67o3j8
6117c9J0K7J32j68J4M9j81J41K7l4L3J10r9l9m8M4l4m0M3N6R4m4J4j07m8J64o6
6144A1q5R8O3q1j30J75J3l3n5O8o0l0J71j02o0J01q5P7j6p1p2J16O8j7o7L8m4
6171iR0K5k65J52k4K6JK2Mm0J15o0k9j42R2Lj0J65p0o3P1r0N9qj46J16J6pk7J0
6201b3JJ11r0j23R2J07r5J9n0j1J73j24J07j22r3J50Mr5N2M1n4K4l2J03r3P4j10
6228e7P3j4j44K45k0o9j2l8Q6j11J39j01KM7j4rQ6m1m3P5o4K3j10K07j27m3P0
6255C6m2j9K9K2q4K2n9J00M7r4R1j22Q4o6K6MrJ6O4n5k5P5j0K8K2j24R9j45J8
$$ plain form
6057 -20 33 45 -19 -3 35 -2 31 17 -33 59 58 25 -26 -40 10 43 0 13 42 48 10 10 12 135 11 -60 -19 57 -10 -50 9
6088 9 40 -38 -90 -98 -174 126 2 35 -22 -77 36 30 -83 -73 -111 -75 -15 -10 44 -4 -76 -90 39 -91 -66 -125 42 -21 -39
6117 -39 -29 -2 130 -38 -24 25 -156 -15 12 -22 11 121 22 -17 -65 -21 -55 -95 -52 4 98 54 68 -39 -87 77 11
6144 11 -74 24 87 6 -124 51 64 31 -24 44 -16 -46 125 23 -37 64 -21 56 40 -31 -103 13 81 64 -3 35 -9
6171 -9 81 106 -159 -7 -31 -5 -4 18 22 -18 97 37 8 -134 -42 -39 -49 116 46 -17 54 -36 23 15 -131 -15 1 -6 -33 -23
6201 -23 -22 89 -1 -124 -32 75 -20 -1 -51 -62 111 -13 94 -28 -121 29 33 -62 -10 31 -23 1 -31 72 -21 53 -57
6228 -57 16 2 -142 103 83 14 2 -36 50 -61 78 -23 -21 26 12 3 89 48 5 80 16 39 -71 136 9 -34 36
6255 36 -6 -25 4 26 -58 -36 -95 5 52 -42 49 -73 11 -55 -29 -25 -34 -18 46 -9 -34 41 31 59 81 -43 56 -89 -71
6284g1J45o5lO3o1r1O2L2q6k9J49m0J04o5m5J5Ll7kR3j30j00J78l2P2j04k5n4
6312a24J46l1%pJ00j90N3P3J5K0r1M8M2L9m5Or1N6p4J6n9J24j9P5rj39M4M6m1
6341a7l9J9J6N3q7J5M2k9L5r4k1Q2J57q9r9MJ38j40J16r0J5lM4qo5o9P5L3q8Q0
6371a4J4K6r4J30k6r8M2O1M1o7M2mj10P6n9K5O0J1p5L8J5Qm1K1r1J37J1q6l5k0
6401f2J1Q4p3l0J53j60J39j10K1K4Mo5L0o4L5N1mL3p4O3Qn7M7o5j5K4J54j37P8
6430D3p5P8j04J6o7P5K9K25k55J2oo7N4N6r6N1L8orKQ8q2p7R1j29M7J57r0O6j26
6460f1J94j92J47j6j93P5P6r0O3J42j26K8j00O1K2j01N8K4mk6K8J03j33m1J02
6485D0r0O3LL2J4Mm7J8m0Q6o1q4k9K3NJ18J5OP1j55n1k0M8m1R9r0J37q7LJ5p7
$$ plain form
6284 -71 74 9 6 69 8 -83 -21 11 -75 -104 45 5 109 44 -1 14 17 -20 -22 71 -59 -159 19 -13 59 -45 -70 -124
6312 -124 22 -9 -9 -16 84 -106 -53 20 35 55 -36 12 54 93 48 54 -37 19 -55 -39 -98 26 7 82 73 -66 -22 24 -17
6341 -17 -56 -37 -21 32 -55 -40 2 -27 8 -86 -107 -25 132 43 -56 -52 86 -54 62 -28 -13 -16 28 20 -45 -114 -39 -6 -94 -14
6371 -14 0 26 -68 62 36 -62 -20 41 82 15 57 53 -57 19 -40 -15 45 56 -19 19 34 42 1 22 -69 68 79 -7 -42 -62
6401 -62 -51 33 -40 -70 83 -77 62 -48 -27 -3 1 -64 -34 -98 -63 -12 -16 17 -57 6 14 -43 4 -61 -76 -52 102 -35 43
6430 43 -32 46 -58 -42 -109 -34 -5 220 -35 -23 -29 -96 -42 14 -82 -31 7 1 -8 -6 82 0 -77 14 -115 -68 89 -1 65 -61
6460 -61 133 -59 88 72 -121 -46 30 -60 3 145 19 47 -53 8 30 -71 -13 11 7 -19 9 112 -21 -62 40
6485 40 -50 13 16 48 62 66 19 37 -3 83 22 -62 -91 -68 -63 55 70 76 147 -8 -59 -79 -31 -72 27 -63 74 -13 -10 5 -72
6516g2QKj0J9M6J08j79P5Q1r8p2M5PP7m7QK8k0k1O6m7K4p0R0n1L7l6J02L4p8k9
6547B7J3j14M0O3k9j5P7o3m2R2r7M4o7k5L7J10m6j8QnN7j9o6N1l2jN7O3n7Ro0
6578hPl8K4M8j8k5K7n3M9r2R7m2O4Kj8nO7j2r8J51j29j3r8O6j6R0Q3l6l4n5rN
6610a9k3J34j67J79p6q4L9nj01J19j33K17j28J15q9N4L8n1j4n5J08kj48J54m3
6635A9k0o1P4l9j6K7M6q6L5Q0j23M2jL6k5o1N5r7J07Q6j40J8k6N7L6K8o2j21M1
6664i1N3J49p2k8J02r5K4q6l8nJ26q8Q7j59J21J9j38Q9m2J9ll2J59n5n8M8K2p3
6692d5l4J66k0j14m4O5P8k5O8k11J3J12o1J8M5l4l5L4J10j08n8J81j55N7N6R1
6718A50j76M7j31P3n4N9n8J00n1k4N8N5j92J16M4o8M4j0j24N3J21O2O8j06l5r2
$$ plain form
6516 -72 -64 -62 -72 -53 -7 101 -78 -3 78 -20 -92 -47 -40 37 -10 -2 26 6 -15 51 4 28 -42 48 -3 34 -2 100 134 56 27
6547 27 40 -74 -34 29 0 -15 62 -1 -43 49 -48 -4 -71 -96 -59 51 5 -13 -5 -10 47 28 -38 13 -19 -20 37 100 43 52 -8
6578 -8 -1 -39 -15 33 15 -10 17 -36 13 -79 18 -24 40 42 24 19 86 74 -24 127 -2 -15 -113 -47 -63 27 110 74 40 -15 -24 -19
6610 -19 -42 92 -75 104 28 -56 -17 -22 -123 -4 -137 80 -48 67 -22 32 70 19 5 -50 58 56 -92 62 19
6635 19 -1 -62 12 -27 -43 -16 30 -56 -21 59 -64 -22 -23 13 -12 -73 -18 -115 -8 78 -62 -44 -70 -13 23 51 -11 -132 -91
6664 -91 -38 111 39 11 113 18 42 -44 -82 -87 39 -49 38 -121 0 19 -119 -30 -72 -53 -56 -88 71 16 -42 6 28 -45
6692 -45 -79 87 67 -47 -91 -26 52 27 95 -116 -103 9 -52 -34 11 -23 -58 -24 86 -22 -80 101 -54 3 59 150
6718 150 -26 21 -110 -37 -91 -32 -90 10 -41 -65 -7 48 -144 -28 16 -52 -8 -18 -142 -89 32 94 162 56 21 -71
6744g1Q0PkP5m4p1pJ03j61M8m3Q0M8n1J05j09L1NN2p5k7M3L8J0l2m1J06n1jr7
6774e2Q8l7n4J36p1m7J01q0J54k55P4J23m2m2JP8p7p9O1n8R8o6O7k2p4R7l5NL6
6803B8p6M9o4n1J32j47J29q3M0R9k01J42qk9j0O2o0k3J05J5p6J39l5j27J3O3%
6830B6k8m8N4%o7J16l3j6j07J52l5n2R2m6L9L2j20k2Q7m6N9R7j23J7p6k5J27j00
6858d6k6N1j0K2q4K31k04Q8o5K0m1l8M0J00jl9jM3o5j1P4n7J1JJ25j16o8J11o2
6887a7qJ9j6p5K1n4J88k0m8K4P8j5j43j1K7K1j7O4rj7j5o1k1PO0K2k7rrm8J19
6918A0J8j18J51J2p8j2L0l0R8j30J8O4n6p2N9M4j31J31J00j1q7n2pP1q1M8O2j05
6946e4N0J5Rj12P8P2j22Q1P6o9j6J8N0L3p9m6p9L0O6NJ7Mk1j2J0pj2JJ02j02k3
$$ plain form
6744 -71 9 16 14 89 45 -26 -33 70 -91 -43 -86 -6 42 -9 96 -13 18 23 75 0 -27 16 54 64 32 -9 97 46 45 -52
6774 -52 36 -1 -55 81 10 -37 64 -16 138 -117 -43 80 38 -4 -3 75 -2 -81 -20 -78 20 -46 21 -1 -75 22 -13 -8 28
6803 28 -48 1 -63 -114 18 -129 0 -83 -43 56 -145 -3 -11 -40 -50 12 -48 -71 34 49 -27 112 77 -50 -37 26 26
6830 26 -2 -50 4 4 -63 53 20 4 -103 49 14 -38 54 8 47 79 -41 -63 24 -22 37 134 11 28 -48 -73 54 -46
6858 -46 -72 -21 -31 -9 -93 138 -66 22 -43 -23 -64 -102 -62 38 37 -2 -3 40 -25 -36 38 -19 -8 -7 118 2 -66 45 -17
6887 -17 -25 -6 -22 -97 -76 -130 58 38 -10 14 92 77 -66 -77 -50 -29 -46 18 9 -8 -23 -84 -105 -98 -38 -16 -43 -52 -61 -109 10
6918 10 28 -90 61 73 -5 -17 13 -17 81 -49 -31 33 -23 -95 -36 8 -123 8 108 97 10 -42 -49 22 -59 -11 51 -54
6946 -54 -4 11 20 -92 -14 58 -64 17 93 24 8 26 76 109 30 -16 -95 -65 1 6 23 27 6 -6 4 -3 -15 -14 88 -14 -37
6977c7J6M1O7j63P2o7p2J48p1J54k2k8k2m9K0n1JN3K5O1r4R7j58O9o5O8N6j27
7005g8l5K12j37O5N4q7J06p8n8N5O0j58J13%k6L9J1k8j23J11k0o8R7o2J24l3n1
7032EP1p7o5K8O0LL3l6J2j0Mj04J20k5R1j12N5m8l1N5J0lJ0nq2P2j38L8R2K5N4
7063A02o2n0Q1k4j3j17J20O5j03N5o2L1k9j38J02P9Nm7N0Pj13Q2o5Om6P5J1R0
7091I2O8k10J58j21r4K6L2j8k0K5N4o7K7J54m0q0K0n5k2NP1k1mK8n0P3j2j51J23
7120iL6l9J9P0L1j68L3qP5O2q8M4n2P4p0R6j41L1q9k8J19pn4P2OJ3P7j38l3K0
7150d6R3q1mJ8M7j5l9N3j20J02Lp9J05PM3j75O6N7p7L1j02J14l5J55q2Kq4P6K8
7179F1o4L3p4LK1p5Q4P3q4O2p2J8N1n3R3j17M5p5Q8j0j76J59q1J66j13P5J52j40
$$ plain form
6977 -37 -21 20 87 -76 -4 -71 -143 5 -66 88 66 38 16 -33 -13 -64 -63 -10 15 76 -18 79 -79 -10 -75 -7 49 -78
7005 -78 -113 99 -38 27 81 -6 100 22 -36 19 79 -79 34 34 8 47 58 30 -93 18 -2 -70 27 -35 89 56 5
7032 5 76 -1 -66 -38 22 25 58 22 34 24 28 -76 44 19 110 -2 53 5 -26 29 39 36 46 41 -41 31 -107 -69 23 48 102
7063 102 40 -10 71 47 34 -83 37 102 -1 54 -8 23 -6 -144 -42 37 42 -5 45 52 -61 21 -44 -38 -84 -9 2 92
7091 92 160 -50 108 -13 -107 -81 -49 -67 -87 -62 -8 -75 -48 106 66 -14 6 -49 -71 -66 5 -16 -20 8 -42 31 19 -132 -9
7120 -9 27 -12 7 77 108 -60 -27 -35 40 102 14 58 6 80 10 106 -35 -4 -93 -121 -2 -9 -63 9 15 28 105 -33 -66 -46
7150 -46 47 -34 -38 -20 27 12 -27 26 -94 8 11 -68 37 44 87 -88 -22 35 -42 -11 -113 1 -34 121 39 41 -43 33 61
7179 61 -3 30 -44 -41 -20 -95 -11 62 -22 40 -32 -14 37 -16 77 -40 5 -70 18 8 -168 -9 -90 76 -37 38 190 50
7207E0m6q7P3j8P5q1m6J20m5K4j0K7m4n2J75j28O4o5O5L2q9o4Q7p8N0K6m3N6o2
7236c4NN3m7O4J6j76J16j02J15K0J50n1k0N3j93m3K3J65j80R3j7NP7j19J04p8
7262ak3J12j06m1J33r8K8L2m0L5j08QL0O0o9J25q8nO8j06k7%R0j9J0j4N8N3o2
7291C5n5O4l4J1m1j9P2l2kr0J18j1m5r6P5J9j8J73k00Q7ko8Q2m8QPj43J04J23
7320G4j04J4m0o5J22pJ26k00R2Q7r7pP9o7rJ5Nk8k7P0M6r0J13j37P5p0L2O6m0
7349B8N7o3j02P0PjO6o5%j8J5Q4rj52J15j21O2J2P9j46P3J03j13L5p0K3k4P8p2
7378d9Lk6R0o1J28r8L1K5p0j0kJ5K4J17r9K7q6m3Q7q0J03K0j48J64l4O1j19k9
7406e9O4p1O9j6P1k3m8P7j13L6m1M4pK3j12J76n5O1r5o2L6RK6kj1L6Mj61J06P9
$$ plain form
7207 50 4 -83 -10 -28 47 -34 -80 40 -5 19 9 36 -8 -60 115 -13 51 -14 51 83 -6 -70 17 -61 -11 15 -28 28 -34
7236 -34 -29 24 -23 41 57 -119 -3 -105 10 30 180 129 109 162 -31 -74 -51 114 -66 27 10 15 92 -27 77 -1
7262 -1 -24 88 -18 -59 74 -24 4 36 -4 31 -77 -69 -39 21 -48 77 -11 -16 52 -54 -81 -81 9 -10 0 -14 44 97 35
7291 35 -20 44 10 21 -20 -39 33 1 -1 -91 27 16 -29 -125 -50 -31 -49 124 -76 11 9 -59 23 -25 -17 -10 -153 -49 74
7320 74 -30 -16 -56 -121 1 -6 120 -80 12 99 2 -5 74 7 -2 13 18 -10 -37 33 79 -11 102 -35 40 -30 2 68 28
7349 28 85 22 -80 -10 -3 -4 62 -3 -3 -21 -6 78 69 -83 32 -89 -27 -15 64 -82 -9 94 -19 16 -54 -31 -55 23 -49
7378 -49 -46 -72 18 -43 85 -13 18 43 -27 -37 -39 -24 0 117 18 45 -41 -84 3 -77 26 46 -102 62 28 89 -30 -59
7406 -59 5 -66 3 -13 58 35 -13 64 -49 -13 -54 -10 -17 6 -106 70 15 76 -19 -81 -45 -36 -10 -12 -23 13 17 -144 -38 41
7436D1r1N8k5L1NK3N6q9nM4l6J3N4o4k1J08m6N3j15k2L5jk8L5n1J6J1m7J91p5
7466E8l1j5q7Q9k7L8KK2m6K4kO1j54J7n9J03j0r9N6O3O4k8q9MqP5mO1k01O5O7
7497In7K8M7J2l1n3p9J84m3l4P6j05Q1q3P6n5j12P6Q2m7O6J3m7J3r1P5J10j53
7525d2q8kJ72j05L7k1R3KJ9rp0Q9r6j9k8N9l3L2P3l3r5N4R6k8r6j4P1J5rK0j32
7556h8M1N0J42j57K5p1R2k3N6q7J22o8o7J4q1J03L5L2j2j01q5J78n7j24Q9L6K8
7583B2j3M6j1j43N5J28J6r8l1l7n0J46r4R0l1N9n2n0PO8q2J0L7p8O3J08nj31p
7612e8N4m4K6Q3j40P8M2m7P5N4j35j3J1L8L0L3L8Ln9j29R2o0L0P2q5Lm0O7r9J27
7642D7N9q7j12pP5L1q6R3Oj8Q9j42J24j9m8j5j2q8K5L1ONJ2j0O6j8k2p8M6J79
$$ plain form
7436 41 -50 8 -17 14 19 42 98 9 4 48 12 25 79 15 -6 102 56 109 -6 -28 7 6 -22 13 -38 -22 -11 -58 133 58
7466 58 27 12 -75 14 -13 25 27 49 3 27 25 86 -68 -51 -110 -7 -17 -116 -60 3 67 39 -50 -46 -54 21 17 78 -123 -58 9
7497 9 -48 -20 27 39 8 -45 -124 60 17 -17 59 -46 35 -48 28 -27 -139 -63 19 -28 38 51 4 17 -74 1 111 -42
7525 -42 -130 -132 40 -65 -28 -49 44 46 65 56 -14 75 -21 -40 -68 -9 -42 -10 63 30 -65 -11 85 57 -39 -53 18 33 24 44 -88
7556 -88 -47 3 145 -12 13 -58 34 11 67 -20 102 34 -33 -19 -100 3 38 70 58 -43 -128 50 -7 -131 -42 -6 22
7583 22 9 55 44 -99 -44 84 100 2 -29 -66 -116 30 -64 26 -5 54 2 -48 -41 27 -55 -45 -8 -86 -23 85 80 -51 -58
7612 -58 -4 -48 -22 61 -79 -1 41 -6 69 123 -12 -25 -14 24 54 87 125 128 69 -60 32 -28 2 74 -11 -8 -48 19 -80 47
7642 47 106 19 -93 -100 -25 6 -80 13 19 1 90 -52 72 53 5 -10 -22 -110 -85 -54 -48 -43 -31 -41 25 7 -15 -93 -47 132
7672A32j91O1O3j13J02o2m4m2Q0J01p1KKO8j38l0K7LM2m8Q1J2j0j17J31o8K1K1
7700A5M6p6M1l7L5k2N4M0K9r8mMK5M3o8m3L8k2l9P2p8Q8j2k0J6q2M3%M8n2n5J44
7732G3l1pm3l7Q1m3L7k5k4O3j1M3j06L2j26L3M2N1nJ9j00J41p8l6J01n0j9J78
7760A53k15n2P1M7JJK4p6Q8o6J29j59J08n1M2p5p7J20m3O2j01O3%M1l0j0m6L8
7788a3k0j7M6j08K09o0kn0J40k28R1J1j2p1M8M4M3r2R1o4J4j0o0N3m3O3n4J45
7816I4n9q6mQ2r3L8J9opJ07j33J0n2Q3j0P9Lp0Q4l3L0j6j21K1L4q6k3l0J76n0
7846a9K3Q6j04Pl8P1P6r2n2m9J64r4j9l2JO2R6j26O8l5N5r6R0r3K7N2M5p6r7J21
7876B2j9J37j08p2M5O0o1k4K7M8p0MJ9j19K13j15L2mr0J23Rk0r2L2L6J8n4k3m3
$$ plain form
7672 132 -59 2 65 -48 54 -8 -52 -94 -14 87 16 18 20 88 -50 -80 -53 -50 -8 -56 25 37 27 -90 41 -27 -6 15
7700 15 61 -15 26 -11 24 2 56 96 125 27 23 27 52 95 27 -16 22 0 -39 33 -45 43 31 11 27 -55 -12 -12 36 -16 -71 73
7732 73 42 35 -8 -45 36 -7 30 5 -19 44 33 76 -30 2 -124 -91 -49 2 -3 16 -84 57 -21 -57 44 -6 -25 153
7760 153 -62 -114 -43 4 5 6 30 -46 42 -24 105 -54 54 3 45 -30 -107 13 -30 32 -69 -6 -6 35 5 -5 -51 -13
7788 -13 -33 -50 -4 -112 97 37 35 -15 125 -103 -12 -1 -13 -84 -36 8 51 -41 50 -14 0 -10 -70 -17 -60 3 -51 94
7816 94 35 -51 -55 27 -66 -28 -9 -15 -22 85 -48 -38 -90 -7 -17 62 65 -5 79 46 76 60 -61 -40 -6 -92 -115 -145 31 -19
7846 -19 4 90 -14 -7 -45 26 102 10 -42 -91 73 -21 -40 -72 -71 -9 87 -39 29 -6 49 -47 43 -50 -23 29 74 -2 -99 22
7876 22 3 140 32 -40 5 65 4 -20 7 55 -15 -11 8 -111 102 -13 19 15 -75 48 57 37 -55 -23 13 31 -23 -46 -89
7905h9J07j01J14n6P8j09Q4p8o2n5J14J0N6j9q6L5MRN0Pq7k9J80j19L1O3p9N9
7933C2l3m7k2J84j36K4R1j59J15J0p1q4L5R1n4M0K8j2N4q5J9o2k6O0l0M9L9p9
7961b9R9j15J08K4r4j09J37J01j86N8j4L0K2J8j53P9m1J26oj05K9M3P4j29L9l3
7987b7j31J02J10j30M7j9N8j6K5k4QNP3r9r%J06j11J42r6l7R1j43J23n1m9M8K4
8015B0j8J2P6n0m5K1j4r1J04m4J23m3rj2n9Q7q7M9k7N1o2L9l5n2Q8np7Q6Rj3q4
8046f2l9J35%J2n2N0K0j5q7J41j61J48j6j37K9Lm4P0k0J79j60RPQ3m7o4P3m0J8
8075C3L7j4r9j5P3Q6j01K1j47J53O8p0j2R0j03K0L8O4j29m1J23j1j6j55K2KK1
8102f2P7m7J08pr3J6K2n6M3Om5N7K2l4K8J3o6o1L5p8N9K0N7l7L7R5m5o3Q9o4K4
$$ plain form
7905 -89 18 -83 31 -25 53 -56 28 -50 -112 -167 -53 -43 13 -6 -92 -57 -53 -44 6 13 -74 -103 77 -42 -11 52 -27 32
7933 32 -1 -48 -70 114 -22 2 93 -66 49 59 -12 -96 -61 30 -24 16 44 32 86 1 20 -42 -68 -8 -38 11 50 -29
7961 -29 70 -45 63 87 -7 -116 21 122 -64 -6 -20 10 32 50 -103 -24 -65 61 55 -50 -21 22 96 -33 6 -27
7987 -27 -158 -56 54 -76 -29 -48 10 -6 19 -5 3 8 81 -18 -27 -27 79 -32 110 14 -23 68 -75 48 -3 -52 -4 20
8015 20 2 14 90 40 -5 16 2 -89 15 -29 94 51 42 30 -29 58 -29 20 -7 44 -18 21 -14 -66 22 17 -60 26 35 22 -62
8046 -62 -101 34 34 46 -6 44 64 49 -38 103 -58 90 74 -63 -34 -31 -75 -5 -25 154 -6 3 10 93 46 -18 55 15 33
8075 33 70 56 -43 -58 15 101 0 21 -126 27 95 25 13 103 0 20 58 122 -7 -48 75 64 48 -107 -85 -83 -62
8102 -62 15 -32 76 69 -24 -8 14 -42 1 7 -38 19 41 7 35 48 -18 -79 -44 -122 -63 -43 14 -23 14 109 64 1 90 26 50
8133E0R5j05K1j17O6nK0J4j17J10n6n5J22N1j5j58lM3R9j73J15p0R8PM5j25L2
8160a1J59j63N7l6K6r2Q6j7J0k3Qj3Mk5J08m3k2J1n5j0J03p0J1j3k2K9M0j3j3
8189A1j4n0
$$ plain form
8133 50 145 40 61 -56 10 5 25 39 -78 32 -24 -79 43 94 79 -79 -82 -39 60 -113 2 -68 30 37 82 -43 -11
8160 -11 148 -15 42 6 32 -60 26 9 19 -4 4 -9 -5 -30 78 35 13 24 -31 -41 62 -8 3 -10 -32 -3 37 24 11
8189 11 -3 -53
8191e3
$$ Imaginary data points
##PAGE= N=2
##DATA TABLE= (X++(I..I)), XYDATA
0@%%%%%%%%qJ6j6J6j6K4l8M6n6P2q8J04j20J44j74K06k40K80l29L78m35N01n73
31c06O57p45Q44r57J078j214J359j520J698j891K105k334K585k860L162l492L848
48B017m243M677n151N676o254O899p622Q434r357J0408j1626J3057j4764J6846
62H997j9443K2800k7326L3795m3879O1931j04310L92160L40317m07747j44663
73A12632l35146k73462l4520J85216K18197M03827K22093n6446q6755j39597m35490
84b19451l07916K0821J05743J69722L59096K57023R7786J6417k25560m01256j84150
95c11725o4358q9409J54721L89527K44318J10706M3481j76227k86852k07242k27550
106d20610j14397K18578K90406J54172K05404J52718j41420k59796k22497k36563
$$ plain form
0 0 0 0 0 0 0 0 0 0 -8 8 -8 8 -8 16 -22 24 -32 40 -48 56 -64 80 -94 112 -128 152 -177 201 -234 267 -306
31 -306 351 -394 450 -507 571 -643 716 -804 894 -997 1108 -1226 1359 -1501 1661 -1831 2017
48 2017 -2226 2451 -2700 2976 -3278 3621 -4001 4433 -4924 5484 -6142 6915 -7849 8997
62 8997 -10446 12354 -14972 18823 -25056 36875 -67435 324725 665042 257295 112632
73 112632 -222514 -495976 -530496 -345280 -127083 276744 498837 442391 355636 216039 -219451
84 -219451 -527367 -506546 -400803 -231081 128015 385038 482824 499241 273681 -127575 -311725
95 -311725 -376083 -465492 -310771 78756 323074 433780 477261 301034 14182 -193060 -420610
106 -420610 -535007 -316429 -26023 128149 333553 486271 344851 85055 -137442 -374005
116c74005q9360J29253J49100K04961L15740J18716j48335j49275j77906k80879
126c01990j44484N5750J27457K43532K75621Q7583j5309m1352k32587l09247j07834
137c62860J8400N5693K06219K58494J42302O7892n5715k45630k29176j11555j08035
148c63971L35K21203K37804J37246J00643k0248j78280j89183j77708j56299L0021
159c58437J87660J61346J65044J78594J3360j47863j66340j85895j55666j500
169c09697R6694J35759K19328J82915J208q6963j16288k03036j85113m2288N0738
180b56743J28799K09455J57015M7745n540j10673k21683j67993n8476l903R6634
191a85363J94408J65553R6520K4989j05465j82609j44476j09131n2649R0212J78217
$$ plain form
116 -374005 -463365 -334112 -185012 19949 335689 454405 306070 156795 -21111 -301990
126 -301990 -446474 -390724 -263267 -19735 255886 343469 328160 286808 54221 -255026 -362860
137 -362860 -344460 -288767 -82548 175946 318248 386140 330425 84795 -144381 -255936 -363971
148 -363971 -363636 -142433 95371 232617 333260 313012 134732 -54451 -232159 -388458 -358437
159 -358437 -170777 -9431 155613 334207 347567 199704 33364 -152531 -308197 -309697
169 -309697 -213003 -77244 142084 324999 326207 239244 122956 -80080 -265193 -307481 -256743
180 -256743 -127944 81511 238526 286271 280731 170058 -51625 -219618 -278094 -281997 -185363
191 -185363 9045 174598 271118 296107 190642 8033 -136443 -245574 -298223 -208011 -29794
202b9794J53256J21268N6708p0880j46091j53157j46140o4938O7132J27058J41552
213E5974J52689P9353m8646j17864j49264j57265q2856K3414R0383J48578J65914
224A60410Q7491j0830p4011j38877j63300r7755r337O5280J39187J58990J02926
235B20174L2059m6551j33837j58252j09750m6944L2051J19232J49295J18514O1851
246B37842k3599j10486j40985j23260p6807J0093R9646J36678J29648Q7981M284
257B31035q2064j27583j34069r6966j5252O6882J17180J33526J03536K6607n4894
268A67938j11363j35597j10443m0452L8482J01992J34641J16187N3791k1839q9382
279A03955j28200j17198o2310J0814Q1341J24925J20360P2981K328p1123j20160
$$ plain form
202 -29794 123462 244730 301438 230558 84467 -68690 -214830 -279768 -212636 -85578 55974
213 55974 208663 288016 239370 121506 -27758 -185023 -267879 -244465 -154082 -5504 160410
224 160410 247901 237071 163060 24183 -139117 -236872 -246209 -180929 -41742 117248 220174
235 220174 252233 205682 71845 -86407 -196157 -243101 -211050 -91818 57477 175991 237842
246 237842 214243 103757 -37228 -160488 -237295 -227202 -127556 9122 138770 226751 231035
257 231035 148971 21388 -112681 -209647 -224899 -158017 -40837 92689 196225 222832 167938
268 167938 56575 -79022 -189465 -229917 -191435 -89443 45198 161385 215176 193337 103955
279 103955 -24245 -141443 -203753 -192939 -111598 13327 133687 206668 208996 137873 17713
290A7713j23795q4675j7227N6993J10151J21443R0290K7711m6294j02259j20489
301g0438r5826l7146L6089R5711J20675J03620M9525k2155q4793j16438j07307
312a28483n9185R874P3760J10812J08335O5548m40o5334j07333j11660p4326j1401
324a89833N4788J02262J13173Q2411K4194m1498r3706j10650q5744l2880L1588
335a45895Q7373J09159R0099M1818k2528q1101j07964r6490n4539R443P1293J01587
347B255R7355O2829P80o1703r5900r8429o8684q000N3858R1592J03060P8728J8542
360A76283m2579q2828j02284q4455k8213L0744P5339J01407Q5913L3630j9743
371A43214o8883j03562r1058m1841Q409O0110R9728R2585N1935L798n4492r6230
$$ plain form
290 17713 -106082 -190757 -207984 -150991 -40840 80603 170893 198604 152310 50051 -70438
301 -70438 -166264 -203410 -167321 -71610 49065 152685 202210 180055 95262 -21176 -128483
312 -128483 -187668 -177794 -104034 6778 115113 180661 180221 114887 7554 -104106 -178432 -189833
324 -189833 -135045 -32783 80390 162801 186995 145497 51791 -58859 -144603 -177483 -145895
335 -145895 -58522 50637 140736 182554 160026 78925 -29039 -125529 -180068 -170625 -99332 2255
347 2255 99610 162439 163219 101516 5616 -92813 -161497 -169497 -115639 -24047 79013 157741 176283
360 176283 133704 50876 -51408 -135863 -164076 -133332 -57993 43414 129327 162957 143214
371 143214 74331 -29231 -120289 -162130 -153721 -93611 6117 98702 150637 154435 99943 3713
383C713q9056n7841j6327M7041R4261R0343O4246K4477l9088q5324q8771p5100
395a27426l3800L6125P7677Q2875Q1238M4737k7335p1751q3437q5221m7219J7312
407a36225N6674Q2718R4668N0015j4726m6615p7063r8240n8675K266L9602P8649
419b6952R5559N6348J2262k3412p9997j00079n5705j6686J4840P2843R6888O4911
431A10820L2108j2439p3647q6020o1988m8837n12P3169Q5604O2309N1789N957
443A38313n9876p7373p4912o4482k315N6012O1190P3506P8500J2537n0940o0831
455B9329p4988p4110j7090K9751N3322R0294P9407J1664j9726l6786q6862q6220
467a02015k2909J3528M2261Q5262P4107L2270J1755l9297r6446p1855k9089k1283
$$ plain form
383 3713 -85343 -143184 -159511 -112470 -18209 72134 136380 160857 121769 36445 -52326 -127426
395 -127426 -161226 -125101 -47424 35451 116689 161426 134091 62340 -21097 -106318 -153537 -136225
407 -136225 -79551 3167 97835 147850 133124 86509 9446 -88794 -147469 -145203 -105601 -26952
419 -26952 68607 124955 137217 113805 33808 -66271 -121976 -138662 -123822 -50979 45909 110820
431 110820 142928 130489 56842 -29178 -91166 -140003 -140515 -67346 18258 80567 132356 138313
443 138313 78437 1064 -73848 -138330 -140645 -84633 -23443 50063 128563 141100 90160 29329
455 29329 -45659 -119769 -136859 -107108 -53786 36508 115915 127579 107853 71067 -15795 -102015
467 -102015 -124924 -111396 -69135 16127 90234 122504 134259 94962 -1484 -73339 -102428 -123711
479a23711K6055Q6258P5062M4278K3058l5191p5774o0140n8264m3763L5064Q0119
491b6949N7560N6981M7519k0218o2274o3158p2428m0798K7410M4651N1136Q5606
503H5038N4243k4582m5273n2303p9656n2288L400K6390O3193Q8772L9582m628
515A01888q040n4501r5368n0221l230J1552N5962P9870M7757K9106O92o8476q0629
528c3638l7173l2580j5140N6876P9366N0186L9604M628n2807n8166n3151o2676
540a14671r836N8998N4617M6994O2906K0008m1535n2564o2880o3345q934K8909
552h1333L2354O7571P7250J1862k9690l1555o2591p1239k3527Q551L3548P5455
564F656O3960J6650P259j8670p6665p0125k1880p170K1642O6819O0585L7887K5227
$$ plain form
479 -123711 -97656 -11398 63664 107942 131000 95809 20035 -40105 -98369 -142132 -107068 -26949
491 -26949 30611 87592 135111 114893 52619 -10539 -82967 -123765 -96355 -51704 -568 85038
503 85038 139281 114699 69426 17123 -62533 -114821 -111421 -85031 -21838 66934 106516 101888
515 101888 93848 39347 -56021 -106242 -109472 -97920 -41958 37912 85669 114775 115467 46991 -33638
528 -33638 -70811 -103391 -118531 -61655 17711 67897 107501 112129 59322 1156 -51995 -114671
540 -114671 -124507 -65509 -10892 36102 99008 119016 77481 24917 -37963 -101308 -110242 -81333
552 -81333 -48979 18592 95842 107704 78014 46459 -16132 -87371 -110898 -102347 -68799 6656
564 6656 70616 87266 94525 75855 -810 -70935 -92815 -99985 -78343 -11524 49061 86948 112175
577A12175k7725p1646n0431l6243l7178J6158O6392N5362M4017L2454j8040m9754
589C5541m7750o0171m2125K2973M8058M0974N9337M8374r545l8818m7725o3647
601e4524l9279O578K1466M4897P4184M3402n708j8010m0759o8668m6426r654J1607
614h0894M7880O7001L8405J7208K036m5370o9797m1742k0598k927M0266O0100
626A1568M5750L4566N220m3465n3698m1267m1937j3854L7838N2628M5685M3414
638H2448J2744k8747m2498n0870n2107j3250K6769L5658M8763N4852J9771j8337
650G5196l4702n2237n2726k0404P256K7182N5203N5406K1574k662k2369n2051
662D666n4825k8354n454K1992N1460N0248L1150J4531j7314n0526n0318l3859
$$ plain form
577 112175 84450 12804 -37627 -73870 -111048 -94890 -28498 26864 70881 103335 85295 35541
589 35541 -12209 -72380 -114505 -91532 -43474 -2500 56837 105211 95666 56848 9123 -54524
601 -54524 -93803 -87225 -65759 -20862 53322 96724 91016 73006 32247 -36421 -82847 -92501 -80894
614 -80894 -33014 33987 72392 89600 91636 46266 -23531 -65273 -85871 -88798 -48532 11568
626 11568 57318 91884 97104 53639 -59 -41326 -83263 -97117 -59279 -6651 39034 82448
638 82448 95192 66445 23947 -26923 -79030 -92280 -65511 -29853 18910 73762 93533 75196
650 75196 40494 -11743 -64469 -84873 -77617 -50435 4768 60174 81748 79086 56717 4666
662 4666 -50159 -78513 -83967 -61975 -10515 39733 70883 85414 68100 17574 -32744 -66603
674f6603j8394J3346M4729M8399L9917K3524j2356m0547m4482m2938k8967P887
686g6485L6644M3766M5117L0770l090k9619m2341m8811l3134J04K3850L9416M9650
699C5837L6123M999j9116l8534m9331l6654j0549J2883L6788N0049L7957J4914
711G5366p750l3527m8208l9717j9878L893L1082M5851M0494K4750P80k8073m4164
724H99m1297k8337n269K3963M1179M2170L2007Q570j9838l7862m2456l4818j2217
737g3306J5779L4898M2468L7125J5862j0874l1657m2299l8956j9292O331K7790
749c6131M1102L9990K2510j850k4469l9964m0849k5577k612K0831L8444M0966
761C2391K8490P136j6970l6030m1011l0810j1103J3261L3413M0359L3086J4701
$$ plain form
674 -66603 -84997 -71651 -26922 21477 61394 84918 72562 32015 -12467 -55405 -84372 -76485
686 -76485 -39841 3925 49042 79812 76722 47103 4762 -44049 -77183 -77079 -53229 -13813 35837
699 35837 71960 76959 57843 19309 -30022 -66676 -77225 -64342 -27554 22495 60452 75366
711 75366 67616 34089 -14119 -53836 -73714 -69821 -38739 7112 47606 72356 73136 45063 899
724 899 -40398 -68735 -74004 -50041 -8862 33308 65315 73885 54047 16185 -26271 -61089 -73306
737 -73306 -57527 -22629 19839 56964 72826 61952 30295 -12004 -50960 -70252 -63921 -36131
749 -36131 4971 44961 67471 65621 41152 1188 -39661 -65238 -67850 -47019 -8575 32391
761 32391 60881 68017 51047 15017 -25994 -56804 -67907 -54646 -21233 19126 52212 66913
773F6913r633l0738l9925l4971j8357N643K7491L8453L6448K1478j688k4116l6884
786A14l7169k4458j820K0536L5373L8181K6919N783j6892l3152l8350k9296r253
799f3484J2850L0869L8291L0819J2879r089k8458l7775l2422j5971N228K5569
811c0694L7116L3517J9357j359k2959l5281l4233k2239k342J9908L3897L4608
823B9296K4966N942j6851l1461l4867k7656r015J3645K8951L4508K9875J2243
835E9576j0227k6305l4262l1431j4807O467K2973L4119L3030J7054k993j9742
847C3452l2962l3994j9527j037J6860L2179L3922K1274N242j3626l1226l3787
859b3230k3118q779J0516K9268L3162K5368J2432q396k7284l1369k6990j6396
$$ plain form
773 66913 57280 26542 -13383 -48354 -66711 -61068 -33577 4876 41324 62802 61114 36998 114
786 114 -37055 -61513 -63333 -42797 -7424 30757 57676 63459 46567 13415 -24935 -54231 -63484
799 -63484 -50634 -19765 18526 49345 62224 53135 24677 -13098 -45520 -61491 -56263 -30694
811 -30694 6422 39939 59296 57937 34978 -303 -34536 -56775 -59117 -39209 -5312 29296
823 29296 54262 60204 43353 11892 -22975 -50631 -59646 -46001 -17050 17458 47333 59576
835 59576 49349 23044 -11218 -42649 -57456 -50989 -28016 6103 39133 56187 53194 33452
847 33452 490 -33504 -53031 -54068 -37208 -5029 28893 50167 55409 41783 10557 -23230
859 -23230 -46348 -55127 -44611 -15343 17819 43187 55619 47223 19939 -11430 -38420 -54816
871e4816N377K5251L0346K8366J8999k847k1767k8815l0713k1385J200J8288K6359
884f157L1866K4046J674j5113k5373l2427k4523m842J0303K4031L4126K5229O586
897D9426o157k1670l3932k6438j0218L188K1008L2565K5555J4142J533k0211l2350
910c559k5169j6368m682J7496L0261K6338K0224O174j6663k6487k5092k4423r532
923e1482J5430K4762K4873K5621J1441j1380k1216k6845k8526j0947R016J6575
935b2678K6162L1001J3282o296j4676k6296k9893j4555N47J1753K8161L0453J3597
948D0562K862p596k7172l0937j6409n835P147K5798K7653J8234J1958n731k6830
961A3704k5903j8102j4884K725K3795K5421K1552J6685l428k0501k1236k4514
$$ plain form
871 -54816 -49439 -24188 6158 34524 53523 50676 28909 94 -30619 -52004 -50804 -32516 -6157
884 -6157 25709 49755 51429 36316 10943 -21484 -46007 -50849 -40546 -16515 17611 42840 49426
897 49426 43269 21599 -12333 -38771 -48989 -45801 -24793 7772 33327 47469 49002 28791 -3559
910 -3559 -28728 -45096 -49778 -32282 -2021 24317 44541 50715 34052 7565 -17527 -41950 -51482
923 -51482 -36052 -11290 13583 39204 50645 39265 18049 -8796 -37322 -48269 -39253 -22678
935 -22678 3484 34485 47767 41471 26795 499 -29394 -43949 -43402 -31649 -3488 26965 40562
948 40562 43424 35828 8656 -22281 -38690 -44525 -37378 -11580 16073 34307 46265 40534 13704
961 13704 -12199 -30301 -45185 -42460 -18665 6756 28308 44993 41565 21064 -172 -24686
973b4686k1234K545J9124J9523K4550K1927M95j4304j9715k7871k1222k79Q918
986c2229J6671L0108K3539K250o979j5847k8567k2512o760J985J7187K9934K0084
999B8864Q119K681j4887k9946k1623j0994l876J4488K6145K0566J6349P160j5641
1012B7405k4678j8487j8107r941J2735K3029K0420K0762R298j1149j7570k0425
1024f708k5027j0572J0496J5393J9283K5421J2250o164j3243k1799k5579j0792
1036c7041K563Q617K2451K7677J1887o85o936k1167k5847j3814m424O165K2798
1049g756K3773J3154Q541l265k2140k4036j4982j0110K522J9561K1345J7761J4168
1062C8536k579j8870j8744j8021j6613L08J6498J8587J9783J6974K10j2475j6448
$$ plain form
973 -24686 -45920 -43375 -24251 -4728 19822 41749 42244 27940 8225 -19646 -40868 -41147 -32229
986 -32229 -15558 14550 38089 40339 33360 17513 -11054 -33566 -40326 -38341 -21154 8780 28864
999 28864 36983 39664 24777 -5169 -26792 -37786 -41662 -27174 -1029 19537 35886 43046 27405
1012 27405 2727 -15760 -33867 -43808 -31073 -8044 12376 33138 42436 31287 13717 -6708
1024 -6708 -31735 -42307 -31811 -16418 2865 28286 40536 34372 21129 -670 -26249 -37041
1036 -37041 -34478 -25861 -3410 24267 36154 35469 28533 7366 -18481 -32295 -36719 -30554 -7756
1049 -7756 16017 29171 37712 34447 12307 -11729 -26711 -36821 -34299 -14738 6607 24368 38536
1062 38536 35957 17087 -1657 -19678 -36291 -35983 -19485 -898 18885 35859 36069 23594 7146
1075G146k2665j8854o00J0132J4570K2371J9629L506p292j4766k3427j8403m865
1088c3518K798J3613K4564J8884O381n71j2271k3063j9159r650j828J2505K2116
1101H01J7502J2056M794j1377k1568j7981j3663o049R730J8918J8139J6590P248
1114C5140r023j6458j7479j8220r160P092J5012J7864J9050R732m559j2296j8228
1127a533k0721j0205K697J0164J7725K1083J1710l26q676j7715k0662j2018k726
1140c1203O476J7687K0592J2988M709m633j6627j9979j4323p085L496J5652J8827
1153F577J5175R598j980j4454j8028j6070j1086M51J2508J7139J7240J2539P18
1166C0327j0743j5877j7757j4135k349Q900J4828J8161J4815M015o426j4008j8615
$$ plain form
1075 7146 -15519 -34373 -34973 -24841 -10271 12100 31729 35235 27943 13177 -10250 -28653 -33518
1088 -33518 -30720 -17107 7457 26341 32722 32151 19880 -3183 -22342 -31992 -33820 -21315 801
1101 801 18303 30359 35153 23776 2208 -15773 -29436 -35485 -25755 -6837 11302 27892 35140
1114 35140 26117 9659 -7820 -26040 -35200 -28108 -13096 4768 23818 33550 28991 16695 -1533
1127 -1533 -22254 -32459 -29762 -19598 -1873 19210 30920 30594 21918 4203 -16459 -28477 -31203
1140 -31203 -24727 -7040 13552 26540 31249 26616 9989 -9990 -24313 -31398 -27902 -12250 6577
1153 6577 21752 31350 29370 14916 -3112 -19182 -30268 -29817 -17309 -170 17070 29609 30327
1166 30327 19584 3707 -14050 -28185 -30534 -21634 -6806 11355 26170 30185 23759 9751 -8864
1179h864j5370n367M335J2794J8485J5991P150k358j1707j8083j6351q913K38
1192b8020J0484J7422J6443J0367J419r144j6577j6736j1627l238P686J5531J6743
1205A0753J3160M867o163j4269j6547j4194o305M675J2872J6439J4934P595k883
1218B4934j1719j6052j5802q910J240R979J5769J6037J0150N98q616j4926j6333
1231a3651j1093k054P083J4298J6459J2203L786n488j3403j6383j3068n295L735
1244b2871J2279J6038J3672O959k346j1127j5546j4140q362Q92R995J5121J4703
1257A5267R610P83q549j4143j4930j0871k253P150J3183J5076J1693L596n663
1270A9949j2391j5241j2641m934M017J1383J5110J3376O271k403j0147j4750j3599
$$ plain form
1179 -8864 -24234 -29601 -25266 -12472 6013 22004 29154 26796 15089 -2994 -19345 -28258 -28020
1192 -28020 -17536 -114 16329 26696 28115 18971 2394 -14342 -25969 -29207 -21521 -5990 10753
1205 10753 23913 28780 22617 8348 -8199 -22393 -28698 -24023 -11151 5288 20222 27817 24934
1218 24934 13215 -2837 -18639 -27549 -26309 -16330 -561 15476 25626 26224 17608 2682 -13651
1231 -13651 -24744 -26798 -19715 -5417 11042 23245 27031 21543 8140 -8243 -21311 -26606 -22871
1244 -22871 -10592 5446 19118 26077 23731 12604 -2942 -17082 -25444 -24552 -14557 564 15267
1257 15267 24877 25660 17111 2968 -11962 -22833 -25086 -17936 -4753 10323 22016 25612 19949
1270 19949 7558 -7683 -20324 -25258 -21241 -9858 5252 18628 24899 22496 12349 -2401 -16000
1283a6000p405R14R082J4364J4017Q584O28p863j3976j4177r840k260O514J2998
1297d420J4221J0515L682n400j2205j3965j1510n003M153J1277J3773J2507O271
1310B3896k849j0055j3503j3087p296J593Q599J3071J3573Q262k68p514j2723
1323A699j3899r082j283N947J2410J3937R738K715m578j1547j4053j0428m032
1336b2456L391J0856J3786J0818N593k016j0308j3473j1220o938Q60R166J2764
1349H23J1829Q174K15q130j1828j2208r269j367P151J1189J2453J0102K538n664
1363A6008j0122j2908j0994l321M087R129J2981J1643M126k514q412j2891j1780
1376a4968n324R79P492J3076J1895O035P04o516j2587j1912p292j975N896J1954
$$ plain form
1283 -16000 -23405 -22491 -13409 955 14972 23556 24184 16321 2345 -11832 -21672 -23932 -17418 -4420
1297 -4420 9801 20316 23998 18598 6393 -7572 -19082 -24085 -19932 -8655 5118 17625 23896
1310 23896 21047 10992 -2511 -15598 -22894 -21301 -12702 369 13942 22204 21936 14422 1699
1323 1699 -12200 -21282 -22565 -16618 -4208 9729 19467 22182 17604 6057 -7996 -18424 -22456
1336 -22456 -19065 -8209 5577 16395 21988 19972 9664 -3809 -15029 -21967 -21107 -11941 823
1349 823 12652 20826 21041 12911 1083 -11125 -20394 -21761 -14610 -3421 9032 19134 21672 16008
1363 16008 5886 -7022 -18016 -21337 -17250 -8121 4860 16503 20629 18115 9703 -3188 -14968
1376 -14968 -20292 -19313 -11821 1255 13150 19185 19889 13373 786 -11126 -18418 -20393 -14497 -2543
1390b543J1493Q421L623n104j1395j1195r299m665M001J0320J1073J0330N590
1403B0650l450q840j0737j1259o609K374P934J0231J1775P275j179o322j0372
1416A471j2400p466K61M738J0097J2594P934J354l693r667j2526q138l006K366
1430a6081R609J2317Q282M136j275q956j1927q837n541M08Q374J0876R361P032
1444A7778M98p830j0113r320q088j328O830R467R876R020J717n620q267j0501
1458e881r848k456M432P393J0547J0237L100k722o878j1068j0111l636J303N706
1472i882J1338J0414M614m4n098j0935j0140n659j633M836J0723R567O197L060
1486A7358m179j0093r780p096l823L479R293R161Q365N012l113q234q680r017
$$ plain form
1390 -2543 8950 17371 20994 15890 4495 -6700 -15999 -20664 -16663 -6343 4730 15060 20650
1403 20650 17200 8360 -2377 -13636 -20245 -17871 -9937 294 12069 19344 18165 11843 1471
1416 1471 -10929 -18395 -18134 -13396 -3299 9295 17229 18583 14890 5223 -7303 -15441 -18447 -16081
1430 -16081 -6472 5845 14127 18263 16988 8032 -3895 -12732 -18273 -17865 -9491 1385 10746 17778
1444 17778 18276 10446 333 -8987 -17075 -18403 -11573 -2106 7770 16790 18507 12887 4620 -5881
1458 -5881 -15729 -18185 -13753 -6360 4187 14424 17524 14802 7924 -3144 -13255 -16891 -15588 -9882
1472 -9882 1456 11870 16484 16440 11342 407 -9733 -15392 -17025 -12189 -1466 8101 14298 17358
1486 17358 13179 3086 -6694 -13790 -17613 -14134 -4841 4320 12685 17697 14584 6350 -2330 -11347
1500a1347n640K286P149Q567R762O023j556n820q351j0511o578N98M492Q164J0645
1515G883O772Q18l554q069j0638o878j832K244P884J0826P211K771j145p531j0132
1530c370p606m255L18P265R540P480N434M93o561r152q033o300j068N881Q313
1545a621Q419P249J570m869p451q568q043k160M068O761Q744Q313K800k915n992
1560F305r096q640l374J689N284Q996Q911M079n01m817q987q784m500o61M039
1575a0057Q865Q678N440J652l491q370q412o169k843L054P802Q169O736L590k327
1590A2317p131q131p259m262J671O345P654P985M900r70n480p444q304n474K56
1605a3327M500P358Q527N775N53l538p051q664o197j487K768O604Q748O482K323
$$ plain form
1500 -11347 -16987 -14701 -7552 1015 10777 16800 15244 9424 1073 -9438 -16016 -15418 -10926 -2762 7883
1515 7883 14655 15473 11919 3850 -6788 -13666 -15498 -13254 -5370 5456 12667 15438 14293 6762 -3370
1530 -3370 -10976 -15231 -14913 -7648 1892 9372 14806 15299 8738 -414 -8447 -14747 -15815 -9934 -1621
1545 -1621 6798 14047 15617 10748 3297 -5271 -13314 -15474 -11406 -4645 4099 12412 15212 12297 6305
1560 6305 -2791 -11431 -14805 -13116 -7832 1164 10075 14154 13653 8836 -151 -8935 -13435 -14096 -10057
1575 -10057 -1192 7486 12926 14578 11087 2717 -5695 -11864 -14707 -11653 -3851 4318 11054 14644 12317
1590 12317 5186 -2945 -10204 -14466 -12795 -6450 1204 9189 14089 13119 7639 195 -8109 -13583 -13327
1605 -13327 -8827 -1469 7058 12833 13386 9848 2797 -5867 -12064 -13551 -10783 -4179 4569 11051 13374
1620A3374j804o498q272o867l121R08N870Q284O924M077k81n183q131p054m902
1635a2676m02M710P429P428N526J180l957p116p436o204j819L360O298P662O569
1650A0552K438k541n794p522o977l121J549N452P491P132L823p89m694p416p239
1665g656m304n0M020P212P386M869Q91l626o753p330n313j795K804O329P421N833
1681I938K432k018n970p328o156l024J305N546P116O514L730o64m711p013o730
1696g033m431O5M182O429P029M757O43l394o186p151n190j292K632N922P059N761
1712I802J961k046n353o982n963k732J344M958O930O156L142n90m493o734o393
1727f993m028J47L850O430O464M461N95l262o078o653m689j500K849N794O536
$$ plain form
1620 13374 11570 5072 -3200 -10067 -13188 -12280 -6410 1874 8798 12875 12594 7411 -720 -7774 -12676
1635 -12676 -13078 -8368 -939 6489 12015 13195 9238 2122 -5314 -11518 -13337 -9977 -3679 3983 10552
1650 10552 12990 10449 4655 -2867 -9844 -12965 -11416 -5964 1527 8659 12482 11693 6999 -417 -7656
1665 -7656 -11960 -12010 -7990 -778 6608 11477 12368 8742 1989 -5341 -10654 -12449 -9645 -3316 4105 9938
1681 9938 12370 10352 4382 -2946 -9102 -12126 -10821 -5275 1841 8355 12085 11421 6710 -303 -7033
1696 -7033 -11464 -11399 -7217 -788 6241 10998 11641 8247 2061 -5090 -10280 -11572 -8940 -3018 4041 9802
1712 9802 11763 9717 4364 -2618 -8581 -11313 -9969 -5011 1919 8075 11217 10627 6134 -600 -6993
1727 -6993 -11021 -10874 -7024 -594 5870 10331 10926 7664 1586 -5067 -9756 -11256 -8407 -2613 3923
1742C923N307J952k156n302o468n732k473J453M775O445N908L083r88m289o288
1757h50o041l598Q5L780O096O258M086N04l028n923o362m460j183K641N605O215
1773C825M816J736j956n114o307n128k539J503M597O152N410L136q02m173n982
1788h26n753l417K16L751N827N810L948L56l163n401o034m359j002K543N130O077
1804C703M631J610j911m835n982n026k117J296M329O102N179K701o92m046n878
1819i36n210l245J47L637N529N511L519N36l069n319n471m206j004K574N046N394
1835C433M593J797k201m528n577m907k001J549M036N512N179K514r68l665n437
1850f71n270k986L49L062N288N532L335K13k524n139n622l523r54K006M821N602
$$ plain form
1742 3923 9230 11182 9026 3724 -2744 -8476 -10949 -9496 -4721 1724 7632 10715 9727 5438 -850
1757 -850 -6891 -10489 -10404 -6624 -528 5730 9816 10320 7292 1369 -4993 -9453 -10636 -7995 -2390 3825
1773 3825 8641 10377 8421 3307 -3000 -8128 -10667 -9164 -4567 1585 6995 10131 9329 5156 -826
1788 -826 -6579 -9996 -9780 -6029 -202 5608 9556 9912 6749 1348 -4686 -9045 -10047 -7504 -2374 3703
1804 3703 8334 9944 8033 3198 -2784 -7810 -9927 -8631 -4302 1800 6979 9680 8988 4942 -936
1819 -936 -6146 -9391 -9244 -5607 -78 5433 8952 9488 6419 1100 -4371 -8577 -9581 -7007 -1961 3433
1835 3433 8026 9823 7622 3094 -2483 -7390 -9391 -7842 -3806 1706 6885 9399 8431 4766 -671
1850 -671 -5941 -8927 -8578 -5516 -228 5304 8639 8852 6328 1189 -4433 -7956 -8910 -6904 -2083 3519
1866C519L917J641j606m676n453m274k091J187M196N262M575K664o49l788n110
1881f86m734l291L17L294M812N056L647Q7k914m389n159l943p17K347M161N274
1897C162M156J198j713l925n284m438j539R33L789N323M317K298n54l307n242
1912h26m616k484k03L063N132M605K912O50k650m763m651l514r69K245M388M574
1928B893L962J630k014m004m563m217j958J428L657M458M560K245j012l095m500
1943e30m679k688N02K552M525M766K947K12k292m185m963l014q30J869M052M984
1959C228L219J279j223m002m729l623j892J003L553M666L689K406m99l343m387
1974f55m039k659N9K981M172M219L094L13k491l849m513l316o55J907L687M481
$$ plain form
1866 3519 7436 9077 7471 2795 -2658 -6932 -9023 -7836 -3640 1622 6197 8861 8212 4424 -686
1881 -686 -5420 -8711 -8394 -5100 -288 4768 8415 8502 5588 1199 -3960 -7903 -8620 -6273 -2112 3162
1897 3162 7318 8516 6803 2878 -2406 -6844 -8383 -7450 -3661 1662 5979 8277 7723 4416 -826
1912 -826 -5442 -7926 -8129 -5066 66 4671 7583 8233 5583 820 -3831 -7345 -8314 -6069 -1681 2893
1928 2893 6855 8485 6471 2467 -2096 -6313 -8271 -6843 -3186 1272 5832 8077 7065 3970 -530
1943 -530 -5209 -7897 -7395 -4843 -318 4448 7395 7607 5315 1130 -3833 -6847 -7677 -5808 -1756 3228
1959 3228 6447 7726 6503 2501 -2228 -5851 -7743 -6740 -3187 1479 5168 7574 7075 3732 -655
1974 -655 -4694 -7353 -7294 -4313 -141 4078 7172 7485 4994 1145 -3368 -6684 -7339 -5432 -1745 2736
1990B736L615J065j516l304m631l765j497J022L053M508L933K004o05k804m530
2005g16l922k118l6K423M234M133K553O15k301m013m202k945r12J834L877M082
2021B586L262J253j433l530m035l580j624J188L038M075L766K013o74k794l913
2036d02m035k307L81K296L878M005K517K00j930l686m198k792n35J514L581M103
2052B590L037R96j196l366m070l204j390P56L162L848L494J905n32k788l802l516
2068d076k353J63K349L821L660K538K17k106l504l764k729n26J662L305L599L105
2084E361J098j388l061l775l342j161P74K929L847L353J599o44k477l775l450
2099d112j881J53K161L715L492K306J88j939l474l719k400n54J550L247L657K797
$$ plain form
1990 2736 6351 7416 5900 2596 -2035 -5800 -7297 -6275 -3222 1286 5219 7223 6618 3814 -716
2005 -716 -4638 -6756 -6792 -4369 -135 3998 6551 7166 4865 852 -3350 -6295 -7207 -5373 -1496 2586
2021 2586 5848 7101 5668 2138 -1897 -5477 -7101 -5913 -2875 1200 4966 6979 6305 3511 -402
2036 -402 -4437 -6744 -6363 -4067 -189 3816 6333 6533 4603 917 -3281 -6073 -6608 -5094 -1513 2590
2052 2590 5627 6623 5427 2061 -2009 -5213 -6603 -5847 -2685 1163 4657 6562 6030 3242 -560 -4076
2068 -4076 -6429 -6266 -3917 -96 3564 6102 6319 4213 709 -3055 -5784 -6310 -4648 -1343 2256 5361
2084 5361 6459 5071 2010 -1765 -5107 -6268 -5494 -2565 1282 4635 6234 5590 3113 -662 -4112
2099 -4112 -5993 -5840 -3679 36 3528 5834 6022 4083 609 -3110 -5510 -6064 -4514 -1267 2390 5187
2115E187R22j306l077l456l062j289R95K798L507L215J539o54k438l478l302j897
2131e796J97K218L421L463K105J35j852l249l527k380m95J563L040L539K653P36
2147E771j128k778l705k780j219Q71K644L598K907J454l99k529l363l133j805
2162e594K22K127L419L155J994Q6j756l035l391k276o08J620K946L406K420P73
2178E508j208k643l495k576j102Q94K443L323K949J346n96k394l171l080j517
2193e319K30K042L071L185J996p0j765k839l373k061l77J383L059L217K224O40
2209E243j164k658l299k450j004Q53K500L293K651J314p00k279l072k871j618
2224e261L83J976L130L015J712l4j681k892l126k031k80J374K902L123K251O50
$$ plain form
2115 5187 6109 4803 1726 -1730 -4792 -6081 -5086 -2288 1219 4434 5973 5319 2881 -597 -3899 -5796
2131 -5796 -5599 -3381 40 3503 5608 5743 3891 642 -2885 -5265 -5760 -4197 -1157 2382 5035 5771
2147 5771 4643 1865 -1840 -4620 -5839 -4968 -2324 1274 4181 5635 5236 2707 -656 -3789 -5594
2162 -5594 -5372 -3245 174 3329 5323 5409 3653 618 -2773 -5049 -5657 -4037 -1091 2315 4735 5508
2178 5508 4300 1657 -1838 -4414 -5516 -4622 -2179 1144 4093 5439 4843 2449 -722 -3802 -5319
2193 -5319 -5089 -3047 24 3209 5205 5135 3370 531 -2842 -4903 -5280 -3897 -838 2379 4603 5243
2209 5243 4079 1421 -1878 -4328 -5332 -4479 -1979 1314 3965 5279 4579 2300 -772 -3643 -5261
2224 -5261 -4878 -2902 228 3243 4955 4921 3240 348 -2778 -4809 -5089 -3715 -813 2310 4561 5211
2240E211j349k568l055k541q08R05K407L068K655J148o74k110l037k612j633K94
2256d699J962K999K894J582J09j648k956k959j935k83J480K731K972K157N90j303
2272C693k430k929k458r01J040K320L047K449J197p17k120k959k669j410L55J975
2288b517K949K698J588j56j485k786l002j822k23J378K643L004J983N91j191k465
2304A187l068k007r17R31K255K990K347R80m40k227k870k571j319L60J899K761
2320B91K679J716j43j795k731k690j762k02J483K473K908J927N75j311k355k779
2336a716k300o61J004K142K891K429R08o27k090k877k399j302M63J651K895K533
2352B944J530r7j655k675k606j712k02J482K406K678J885N77j073k475k674k069
$$ plain form
2240 5211 3862 1294 -1761 -4302 -5110 -4205 -1798 1270 3925 5073 4399 2289 -748 -3360 -4993 -4699
2256 -4699 -2737 262 3156 4738 4847 3199 243 -2716 -4651 -4934 -3454 -723 2249 4406 4996 3693
2272 3693 1263 -1666 -4124 -5025 -3985 -1665 1382 3831 5028 4311 2191 -768 -3437 -4847 -4492 -2517
2288 -2517 432 3130 4718 4562 3077 291 -2711 -4533 -4756 -3378 -735 2269 4252 4843 3652 1187
2304 1187 -1881 -3888 -4805 -3874 -1619 1371 3718 4698 4258 2031 -839 -3410 -4729 -4369 -2470 291
2320 291 2970 4686 4543 2748 17 -2673 -4435 -4637 -3154 -681 2227 4154 4729 3418 1063 -1716
2336 -1716 -4016 -4677 -3673 -1531 1360 3789 4697 4070 1980 -897 -3296 -4598 -4135 -2484 411 2944
2352 2944 4474 4377 2722 47 -2559 -4271 -4473 -2991 -585 2093 3978 4555 3482 1007 -1667 -3736
2368c736j010J013K280K689K293R80o44k050k539k539j255M72J675K671K532J584
2384D416k12j549k417k758j775M8J177K403K871J694L36j013k153k772j943p07
2400d354P75K045K865K037R98m39k170k614k197j260L46J821K585K275J460l0
2416D143j617k413k424j745j23J262K401K596J730M18j204k133k402j945p33P90
2432c399J999K505K337P41o08j756k697k053j193M00J520K534K352J284r1j382
2448B493k389k372j523k37J160K422K345J553O21r44k234k432j831o64P17K082
2464a233K291K038R80n88j769k318k164j170L06J582K287K249J397j54j377k187
2480A70k340j529j11J165K166K277J659L21q88j995k292j770o43N79J857K420
$$ plain form
2368 -3736 -4746 -3733 -1453 1236 3529 4509 3865 1815 -724 -3263 -4518 -4046 -2371 300 2832 4416
2384 4416 4204 2655 238 -2520 -4295 -4247 -3070 -667 2204 3898 4234 3221 1068 -1704 -3647 -4354
2400 -4354 -3579 -1534 1331 3368 4366 3927 1757 -857 -3054 -4314 -3968 -2147 438 2713 4173 4143
2416 4143 2526 113 -2311 -4056 -4179 -2917 -516 2080 3810 4228 3024 891 -1511 -3456 -4189 -3399
2432 -3399 -1400 1105 3442 4183 3575 1819 -878 -2931 -4124 -3724 -2204 330 2682 3966 3875 2493
2448 2493 104 -2268 -3791 -4028 -2868 -446 1899 3452 4073 3129 895 -1537 -3368 -4032 -3315 -1233
2464 -1233 1058 3096 4076 3488 1719 -599 -2763 -3933 -3627 -2045 242 2491 3888 3734 2357 170
2480 170 -2170 -3699 -3810 -2645 -479 1798 3457 3778 2890 895 -1397 -3167 -3810 -3231 -1374 1046
2496A046J889P70l43j629k359j896j190K72J558K145K022J320m0j412k095k069
2512b011j471k13J296J869K180J589N08j026j841k167j784n39O38J578K364J867
2528B837O95m74j422k260j875j029K12J352K175J998J188k8j128k086k132j233
2544c210k32R83K059K159J406L79q60j886k023j566o87O93J705K002J577R06l54
2561C051j513k064j911r45K26J380J959J858J281j01j186j836k078j323o1R27
2577b336J784K044J476K95o13j897j863j623n43N54J645K050J523P25l76j458
2593A387j932j682r96K14J324J821J851J106k6j072j953j769j314k70J235J647
2609d29J831J497L72q11j769j798j590m49N98J496J827J657O81m14j406j863j660
$$ plain form
2496 1046 2935 3705 3362 1733 -626 -2522 -3712 -3440 -1882 263 2285 3605 3565 2153 58 -2011
2512 -2011 -3482 -3695 -2399 -530 1650 3239 3747 2721 880 -1287 -3071 -3610 -2972 -1394 970 2837
2528 2837 3532 3058 1636 -624 -2499 -3528 -3316 -1964 211 2209 3397 3369 2241 155 -1977 -3210
2544 -3210 -3442 -2459 -400 1759 3165 3544 2684 798 -1225 -2791 -3478 -2785 -1080 922 2499 3405 3051
2561 3051 1538 -526 -2437 -3382 -3156 -1776 183 2041 3322 3221 2035 199 -1879 -3202 -3263 -2336
2577 -2336 -552 1492 2968 3263 2650 753 -1110 -2733 -3276 -2722 -1077 973 2496 3221 2845 1387
2593 1387 -545 -2227 -3223 -3009 -1685 136 1987 3093 3067 1995 42 -1727 -3041 -3311 -2076 -429
2609 -429 1402 2899 3271 2460 691 -1107 -2697 -3146 -2548 -1052 775 2432 3113 2699 1293 -570 -2230
2626b230q63K99J308J644J803J052j68j009j813j683j130k10R43J754J735J173
2642B605L98o97j566j806j384o12O03J458J799J449P30k40j479j770j421r46J57
2659b722J179J571J742J088Oj055j551j777j145k39Q84J468J873J247L08m91j638
2676G48j728j431n63N91J199J950J484O41l12j315j715j484q23J42J066J702J607
2693A759P95J36r05j650j579j085k50Q25J470J618J306M35o24j451j691j394n17
2710b802N42J362J573J342P43l09j206j574j569q13K63R72J556J636Q14p3p96
2727A661j474j627j026j44O38J540J513J191L36m71j447j605j297m24L97J341
2743h98J542J143P27k28j042j540j426p74J01R76J480J408R68J7q12j455j562
$$ plain form
2626 -2230 -3093 -2794 -1486 158 1961 3013 2845 1836 23 -1660 -2790 -3000 -2057 -303 1432 2605
2642 2605 3003 2306 740 -1066 -2450 -3062 -2459 -1001 798 2247 2977 2737 1258 -512 -1933 -2879 -2722
2659 -2722 -1543 28 1770 2858 2864 1809 258 -1519 -2664 -2903 -2019 -551 1322 2569 2877 2386 748
2676 748 -980 -2411 -2974 -2383 -1184 766 2250 2891 2579 1264 -451 -1935 -2758 -2616 -1550 152 1759
2693 1759 2554 2690 1785 135 -1444 -2529 -2779 -1954 -484 1134 2440 2875 2251 800 -891 -2285 -2802
2710 -2802 -2260 -898 675 2017 2760 2451 1245 -329 -1898 -2711 -2448 -1476 80 1716 2530 2457 1661
2727 1661 187 -1440 -2466 -2610 -1972 -432 1081 2272 2608 2137 690 -915 -2212 -2636 -2239 -898
2743 -898 644 1787 2514 2286 1244 -296 -1722 -2496 -2395 -1419 61 1469 2437 2454 1642 187 -1375
2760a375r24k04O38J347J671J093K87n02j247j578j257l82L85J063J585J241N81
2777B422k31j062j518j197q12O1R72J453J297R41op41j439j397q73k04N88J447
2795b99J323J025L52n53j248j328j108n51L65J081J479J202N56k43r58j497j178
2812a580o88J95R14J201J340Q38Np53j365j238r72j34N65J263J519P16M66n14
2830A778j253j341r62l92J70J175J414J021O22k65r94j355j026p26M8R59J213
2847H6J201Q24J14r46j112j165r73k46P15J131J331R42J81m65r34j401j015l47
2865b079K67R42J405J114M47k39q66j266j113o39Q4P55J177J261O95J33o96j414
2883c2j072p92k50P38J155J037R92J59l95r72j215r68m03L43R33J142J077N14
$$ plain form
2760 -1375 -2299 -2503 -1865 -518 1153 2246 2533 2031 784 -794 -2051 -2433 -2048 -985 600 1841 2422
2777 2422 2191 1129 -389 -1586 -2398 -2337 -1365 88 1385 2326 2320 1579 140 -1257 -2130 -2334 -1746 -299
2795 -299 1024 2049 2401 1848 600 -728 -1836 -2387 -2022 -941 538 1740 2296 2053 1095 -402 -1580
2812 -1580 -2268 -2073 -1159 42 1382 2220 2225 1472 107 -1131 -2103 -2237 -1672 -409 1110 1826 2292 1778
2830 1778 525 -816 -1778 -2170 -2000 -825 589 1610 2232 1967 973 -382 -1408 -2134 -2086 -1127 86
2847 86 1287 2111 2225 1279 167 -998 -1971 -2217 -1502 -371 960 1902 2083 1618 684 -717 -1732 -2079
2865 -2079 -1812 -870 535 1649 2096 1857 991 -275 -1388 -2027 -1943 -1188 -11 1250 1945 2078 1382 -32
2883 -32 -1104 -1896 -2146 -1408 -253 784 1776 1935 1540 568 -647 -1615 -2018 -1675 -742 400 1477 1991
2901A991k14q31j230j055n55J01P26J069J249O23M8o74j068j231o89j48M16J120
2919c52J225Q31J96l52r64j297q57l16J14J028J130J080L27m4q16j174j005n58
2937a804p7Q16J106R39Q83l9o51r98j121p78j40O62Q36J040Q19L68l38r96j072
2956e45j012l98M05P97J151R59L92j68o54j137j037m81J03O33Q97J143O36R1n10
2975A265j187j114o36j01M57R53J127Q02K75m60r96j004p24n47M49P93R52J028
2993A332M04k53o82j003r67n72J16O01R71J011P33l7o28q76r66o50j30M23P90
3012c83J043P82K11l19p08j208p60k42K29P34R94Q29M28k23o20j007q92n58J43
3031a527O15Q75R69N64R4n46r33q24q02m2M18Q15Q32R27J11k60p83r59q26l26
$$ plain form
2901 1991 1777 946 -284 -1339 -1894 -1793 -1067 2 1251 1874 1922 1248 180 -1051 -1740 -1888 -1472 -352
2919 -352 873 1704 1900 1548 584 -713 -1570 -1886 -1772 -744 386 1466 1793 1749 933 -241 -1246 -1804
2937 -1804 -1881 -1065 41 980 1863 1824 1173 175 -946 -1724 -1864 -1202 -366 674 1493 1861 1523 527 -545
2956 -545 -1557 -1955 -1550 -753 398 1357 1749 1581 927 -210 -1247 -1728 -1625 -992 -95 1048 1684 1775 1265
2975 1265 78 -1036 -1672 -1773 -1316 -363 764 1566 1841 1381 385 -619 -1343 -1890 -1441 -648 304 1332
2993 1332 1736 1483 801 -202 -1169 -1741 -1625 -1024 -53 958 1691 1654 1026 150 -816 -1466 -1596 -1173 -383
3012 -383 660 1442 1653 1334 626 -582 -1342 -1584 -1355 -621 373 1202 1630 1407 787 -220 -1112 -1670 -1527
3031 -1527 -912 -37 932 1496 1590 1044 111 -713 -1515 -1557 -1139 -324 508 1435 1546 1286 503 -456 -1282 -1608
3051a608M02M81J103P53M29j28n83r33r72l82p3O53Q72Q41N24N3m21r36r39m88
3071a352j00L77P15J022N62L12k49q30r50p11k89K09O72R04P41M61j65o03q41
3090a15p72n59Q6N75P94Q11N90n3n03p07r09n74J3L53O68P92P55O1k31p45p62
3111d32p16l55L57N39Q63P63L02j17m74r40o33m67k8N87Q27O32O43J7o05o86q36
3132g59n35k0L82O80P35P08J09k10p71p03o51k43K41M56P83P32M26k42n12o82
3152g6p19m83R6L36Q09P48M90J15m32p19p35n87r2K51Q74O05N73K07j68o65q44
3173d16o08k30J89O67O63O26L23j41m21o76p51m54O2M56O28P80L76J41m43p00
3193G1n93n32q9L03N80O56O21J29j93n46p55n60k81K45L91P58P13K66p9m48p72
$$ plain form
3051 -1608 -1206 -725 378 1131 1560 1432 849 -84 -1056 -1438 -1511 -858 14 855 1379 1432 1011 75 -864 -1352
3071 -1352 -1452 -1075 -360 662 1224 1536 1287 457 -493 -1204 -1493 -1284 -612 292 1033 1494 1329 726 -115
3090 -115 -887 -1446 -1360 -785 9 820 1410 1357 854 147 -762 -1336 -1323 -970 -302 490 1245 1306 1075 330 -432
3111 -432 -1148 -1503 -1146 -607 256 1019 1321 1204 730 -210 -843 -1310 -1338 -751 76 708 1351 1368 763 77 -759
3132 -759 -1294 -1314 -932 -252 483 1191 1300 1090 319 -384 -1035 -1278 -1037 -581 202 934 1360 1118 606 -76
3152 -76 -795 -1278 -1182 -846 -37 711 1201 1316 884 165 -570 -1157 -1249 -998 -124 481 1054 1261 1093 428 -416
3173 -416 -1024 -1254 -1065 -398 265 891 1214 1073 652 -24 -775 -1229 -1167 -711 -83 697 1073 1214 771 71
3193 71 -522 -1054 -1143 -840 -260 396 1017 1146 953 407 -348 -908 -1189 -944 -553 205 918 1184 1105 657 -115
3214a15o26l64K5L29O65Q55K11J20l01n79p55l40j69K57N98O43M73K09j13o60
3234C63o39n69k29J03N10N67O96K71q4m22o20o10l90J25K81N42N95N59r5k83o21
3255E0m95l53j80J16N79N91M50K87j23n37o08m35m48J89N69O17M07L65k3m56m86
3276G6p25k87j2L90M66N90N03M2m95l25p00m13r3K02O33M85M74J61j59m81m63
3297a31n44j59o2L62P47M08L44q0k79o42n34k79RL38M72N46K52K20l07o57m35
3318d11m13j75K16N12N22N08J55j86m25m96m16l20J79L55N35N37J58o7l26m99
3338e7m45k38k4K28M51M85L84kk22l87n51l39j06J81M50N35K78J13jm14o09l89
3360f79o9J33K84N24L47J75L5l82m72l41l78M4L23M67L33M34J8k62m51l20m41
$$ plain form
3214 -115 -741 -1105 -1080 -751 -86 769 980 1100 799 220 -535 -875 -1044 -787 -189 454 927 1136 1023 363
3234 363 -276 -845 -1074 -971 -461 106 802 1073 989 567 -53 -663 -1053 -928 -647 -105 490 1049 954 671 50
3255 50 -445 -798 -978 -862 -283 308 758 1045 922 385 -223 -658 -1106 -917 -348 269 676 1041 1018 562 76
3276 76 -649 -936 -948 -558 -92 498 1001 1043 548 223 -477 -890 -983 -781 -148 337 811 972 813 332 -131
3297 -131 -675 -834 -896 -534 213 621 965 885 606 -36 -570 -849 -840 -502 -30 516 768 988 681 24 -411
3318 -411 -824 -999 -783 -271 251 759 914 728 303 -193 -609 -929 -750 -395 140 677 835 768 442 -57
3338 -57 -502 -740 -764 -536 -85 400 784 782 560 173 -378 -717 -823 -642 -192 343 621 734 733 319 -290 -679
3360 -679 -748 -615 -331 193 540 715 750 368 -104 -445 -823 -779 -456 11 344 778 796 534 83 -237 -678
3381f78j5J54K62N47L70K27l47k14m43n13k0J17J67N64L47K27j62k23m80l91k34
3402g38N0J78N61K93K41J64k39m83m33j81m1l8O25K95K81L21j77n38l03k95k64
3423g21K30K86K79M22K89k73j08l87m38k53K1L71L02M23J44J03j85m97m10j91
3443e93J3R7K99N07K49J28j9n93k75l29j83J49L27L49K86K40o5k06m76l67j86
3464f48J4K65L80K80K45K19m11j95m78j83n8J58K87L28L60K3j50k43m08l18j33
3485f66J84K07M00L70J06l9k85l65k99j63M2J17M88L07J92Q5k46m31k34k87p9
3506e96K51J36M54L23N1j51k09n03k68n8R6K99L45K83J49J1l36l30l94k16J65
3527d98J27M35L20K33n6k14l91j90m02J38L6L74L01K80Q6j46l21l59j98j09O0
$$ plain form
3381 -678 -693 -539 -277 270 640 867 520 306 -137 -650 -670 -553 -386 178 525 752 590 367 -113 -504 -738
3402 -738 -688 -510 51 344 585 749 510 27 -406 -587 -628 -666 -41 254 535 856 679 141 -162 -457 -721
3423 -721 -491 -205 74 496 785 512 404 17 -421 -674 -653 -282 20 443 587 690 505 8 -402 -593
3443 -593 -580 -483 -184 323 572 700 681 88 -187 -516 -699 -550 -223 126 412 652 587 381 -95 -462 -648
3464 -648 -634 -369 11 291 536 755 344 149 -329 -512 -570 -412 -125 203 563 586 436 193 -215 -533 -666
3485 -666 -482 -275 125 495 601 562 277 -88 -387 -550 -508 -391 97 404 596 681 435 4 -230 -517 -596
3506 -596 -345 -209 245 568 619 468 259 -244 -512 -570 -474 -175 170 453 602 613 277 -53 -447 -663 -498
3527 -498 -371 64 384 617 561 347 -44 -234 -636 -498 -462 -88 213 493 579 433 112 -247 -445 -554 -494
3548d94K75L88K74J21J3l34k62l10l26K07J77K25L06L31o3l75q0k44l48N3O9K97
3570a00L92K47R8k43k37m38k17j58K36J96L32L69K6j23j26k93l53j54l6L55K39
3591A2L17K35K1k38l68k80j24p0J61K55L95P0J69k28k03k89l48qN5K16L95J60
3613C05K34j80m5m82j18l01K28J04K57K80K61nk53k08l55j75n8J50L82J81K68
3634D70PJk57m67k03lJ8K29M29J55J67r7k84l67q2r3oqM25K44R2M5j97l08k73
3659c63j68K8J60K76K95J88J44k95j83k70k69l6J17J77M16J76J30j00k18l82j60
3680c37j67J98lL70L07L2K3j14k40k96j67m7J16K13K19K58J05j33k53l11j92n9
3702d78N1L80R9K97J49j50j64l30r9k24J5K78J70K92J1K19k34k05k89k25j7J83
$$ plain form
3548 -494 -219 169 443 564 577 243 -19 -329 -655 -448 -271 -46 260 591 528 153 73 -171 -519 -466 -397 -100
3570 -100 292 539 637 394 157 -281 -498 -656 -420 -224 108 477 503 380 254 -39 -392 -546 -582 -227 12
3591 12 329 564 585 347 -21 -301 -425 -495 -334 -79 316 386 555 327 124 -165 -513 -521 -466 -250 145 305
3613 305 539 359 314 -168 -286 -587 -359 -255 2 282 543 538 285 77 -278 -453 -511 -361 21 202 470
3634 470 477 478 221 -246 -449 -452 -434 -205 224 379 546 449 165 -202 -284 -377 -383 -391 34 278 370 415 218 -90 -363
3659 -363 -531 -503 -343 -67 228 416 560 265 82 -188 -457 -493 -376 -199 217 393 523 423 205 -177 -337
3680 -337 -504 -306 -309 61 368 400 423 309 69 -227 -394 -441 -325 -112 107 365 470 337 84 -227 -419 -478
3702 -478 -427 -47 52 349 498 348 184 -146 -245 -469 -454 -176 -6 286 297 516 282 77 -212 -437 -454 -271
3724b71J55M52J0R1J4l85j42k90j06Q7J92L21J99O4k0j28l17j32k08RK66J93K73
3747C27L8L1j17k50j84j87j04J03K64J92K36J94k52k07j72k24j01RJ92K69K98
3768C55J7q6j26k68j84o7O3J05J35L04O9J25k34j57k17j94n3M6K86K83J24P9n9
3791C46l58j55j63j2R7K7K08K87Q3O7k65k28k34j78J10J21K19K18J32J15j12k43
3813H2k18k70K0R0J25L14J01J46k31N1k22k79j61J18J93K23J79M4J2j48k79j02
3835b12j88Q8J45J48J78J28Q3r0j53j76k81k2J18R0K44J81M3p4j19j88j62j60
3857c79J34J43O9K80KO1q4p1l17k11j00K76J26J64J80J70j10k32k95kj38K4J44
3880a66K53M7J42M7j61k47j56p1n0K27R0K37R3k1j10k08j5k53P9J15J01J20J99
$$ plain form
3724 -271 -116 336 346 437 451 66 -76 -366 -472 -385 -193 128 327 391 371 243 -74 -206 -414 -405 -139 54 327
3747 327 365 396 279 29 -155 -342 -446 -343 -79 113 349 543 291 84 -88 -312 -413 -404 -212 57 355
3768 355 372 286 160 -108 -292 -359 -296 -191 -56 248 317 442 208 51 -166 -360 -413 -367 -81 202 326 405 346
3791 346 -12 -167 -330 -342 -245 -218 -10 277 360 427 162 -66 -300 -478 -368 -247 -28 190 322 437 325 82
3813 82 -136 -406 -386 -296 -171 143 244 390 159 210 -12 -291 -452 -334 -141 82 261 305 317 169 -110 -212
3835 -212 -400 -312 -167 -19 159 287 370 280 127 -49 -330 -352 -234 -144 100 281 324 250 131 -57 -219 -379
3857 -379 -245 -102 -33 247 249 310 226 155 -162 -373 -473 -197 -71 93 273 443 333 101 -194 -196 -334 -310 -166
3880 -166 87 134 276 323 162 -85 -241 -312 -362 -135 -45 192 285 264 154 -54 -69 -322 -243 -128 -27 93 292
3903B92l0k9j81j49j18q7l8K26K24P7Q1j06m8j18j08r5j28J46K57Q5J09Mq6k43
3927f3p6j40K5L8L7L21P5J25j41j15j19k49lJ14J29J52R3O2o2o7j22k87r9Q6J42
3952a44J26J51J38l1r2k12j34K6q1Q4J62Q2J33P8l0j21j15k03m3j0J90L9K81P
3976B81mk04j49K1k25K1J25Q4K53j3J19j48j35p3p5j38O5R8J95J41k5M2k29j42
4000a15q5k2kN0J89J68J76r1j65j07j88MM7PJ59J38Q8K5o8k26q5j68j8R1J04J88
4026I4J07L4q5o8j22j83j84K51K7J75K05K7o2k56m5j29j6nJ34j3K81K50j87j56
4050G4p9j85m3P7l4K44O8J01Q1j64n3j69r4j22J36O6K55l1K05j39j77j44Mj72
4074b95K6J26K41P7K3K3j30j10j38qj08K22n3K10jQ6M3j15j94j33q7J18Q5J57
$$ plain form
3903 292 262 233 52 -97 -215 -302 -340 -114 110 187 268 162 114 -4 -112 -207 -335 -189 68 153 262 266 180 -63
3927 -63 -139 -279 -254 -216 -179 142 217 342 201 86 -33 -282 -285 -171 -42 110 203 265 203 136 14 -273 -372 -286 -144
3952 -144 -18 133 271 240 148 -64 -198 -172 -253 -169 -7 75 208 286 256 135 20 -183 -226 -236 -46 -7 274 281
3976 281 277 73 -76 -55 -280 -259 -134 -50 203 190 309 161 26 -47 -122 -260 -195 -97 98 239 214 256 27 -115
4000 -115 -200 -222 -224 -174 15 183 359 268 103 -4 -192 -188 -141 -134 25 163 251 276 208 -18 -103 -271 -289 -198 -94 94
4026 94 201 235 150 82 -40 -223 -407 -156 -129 46 251 278 216 -40 -85 -214 -230 -235 -101 -114 167 417 230 74
4050 74 -5 -190 -233 -156 -190 54 122 223 304 140 87 -82 -176 -298 -162 -96 159 128 333 194 17 -127 -123 -295
4074 -295 -269 -143 98 175 198 221 91 -19 -157 -165 -273 -51 -104 106 105 191 234 119 -75 -208 -295 -177 -92 65
4098F5M7O9lj7j53j23q4M1m0K44J99P1j80Qj24j01q0q6M6L4L37Q7l1j23l0j10
4124c7j63plM1J92J43J01q2j2j94j75k4m0J97k5J95K85j87rj98p5j71Q6RJ69k1
4150eK29o0k7j18q6k3j19J1O0J92J27Q8p3o3k40o5%j57J55J68L2J00R5k2j99k3
4176b3j05j48P6J41J3J64J27n1o7j68n9q1J3L6K99M8K7L3j17j23k04l7K1J47J5
4201b3J01J50KJ2j16j69p1j37L6Q9J04J35J70r6j39j02p3o5O3K6J49J59k7N7j23
4226A12q1j37lj22J09O0K15L5M4j44Kk24mJ6j21K11J28K6P8q5nj52q5j17m3J24
4252a63J88J32R1l9j00l5j76l4m7J03P6R1M6J11k55O5k11O9j44Q1J90kJ08Q2j22
4277A05k1j50j46N3O1M0M0J00J97j32K1j31j71j18N8J21P6J5J06J25k10M8m1k44
$$ plain form
4098 65 112 181 178 161 8 -115 -199 -158 -198 46 245 316 136 144 20 -81 -161 -247 -201 -167 170 257 226 103 73 -37
4124 -37 -200 -207 -210 -169 23 166 267 185 173 -21 -196 -220 -260 -63 -88 107 392 205 196 -2 -77 -248 -162 -153 16 -5
4150 -5 224 164 137 19 -67 -90 -209 -198 -138 54 181 269 196 133 -107 -172 -172 -329 -174 -6 26 126 221 199 0 -23
4176 -23 -128 -276 -200 -59 -46 118 245 194 127 -41 -100 -181 -168 -132 167 215 242 275 158 35 -169 -206 -185 -38 -23
4201 -23 78 228 230 242 126 -43 -114 -251 -215 -126 -22 113 283 187 48 -54 -127 -192 -129 -103 46 205 178 235 112
4226 112 31 -106 -109 -231 -122 -62 153 188 232 88 90 -134 -138 -122 -243 -32 96 122 200 115 110 -42 -127 -244 -287 -163
4252 -163 25 157 248 209 109 74 -102 -136 -183 -80 -4 87 133 244 -11 54 -157 -88 -232 -151 39 37 145 227 105
4277 105 84 -66 -212 -159 -98 -58 -18 82 279 147 168 37 -134 -252 -194 -73 3 18 124 249 39 87 46 -198
4301a98O0J14nP3P8oK05k53j56j21J6Qq8L18qQ7J49k17Ok03r7n8J25R6O8J68J6
4328A77l0m7j39j56m4Q0n2K16J26%J39p6k18j17l1k5J15l8K15MJ17jj49p2r7k1
4354a24l6J09M1R2J26oj43n4j21n8J5k0J16J30K1N8%j83o5J5o7q2J95J04R9q6
4380G6M8k2j52j00N8m3m7L42Lm4J25k79o7m6P4r2J72P5n2J88j58n0L8j32m6m5
4406a76N1P0Q4J25Q2j96O0j41j58m6J88L6J22l5O5N7j12j22j5r8j46K73j7J53
4430A04kK2o4o0q2n2l9J36M4P6M3j39J74j21j23rr2K6Q5O5nRJ64O2k67qj32N6
4458a29N5ll0K40k5j50L1k0q0j12N3J35R9P8o6j6k6o6j33J48l0l6J19l6R9O5l5
4485A29j61m2lnj5J48O5Q0J4j39o5q7o7lL9O9J01K9P4r8j1j18K0p9l5K29n6J08
$$ plain form
4301 -198 -138 -24 -29 44 122 116 321 68 -88 -209 -193 -185 -273 45 37 124 273 56 62 -141 -238 -296 -171 -75 -7 161 177
4328 177 147 100 -39 -195 -239 -159 -211 5 131 131 270 194 -24 -141 -172 -197 -82 -120 95 99 216 215 66 -6 -103 -124
4354 -124 -160 -51 -10 82 208 202 59 5 -116 -174 -159 -179 -63 67 88 146 146 -37 -102 -87 -154 -236 -41 63 162 76
4380 76 124 102 -50 -150 -92 -135 -182 160 163 119 244 -35 -102 -148 -74 -166 6 81 29 217 59 9 47 -85 -131 -176
4406 -176 -125 -55 29 154 236 40 100 -41 -199 -245 -57 -21 101 66 131 188 76 -46 -61 -159 -305 -32 -49 104
4430 104 102 124 60 0 -82 -134 -173 -37 7 83 126 -13 161 40 -83 -92 -184 -158 -73 -8 -13 -4 160 222 -45 -53 -185 -129
4458 -129 -74 -77 -107 133 108 -42 -11 -31 -111 -223 -170 -35 64 142 76 60 34 -32 -165 -17 -47 -83 36 0 99 164 129
4485 129 -32 -74 -77 -82 -97 51 116 196 210 71 6 -81 -148 -151 -112 -43 58 87 161 63 52 -66 -46 -125 -160 69 13 121
4513A21k4n9L2J7j17q5R7n7O7J22p7L4j1Q8k82Q1k9o2J54m4Q3L4M1j87R8k37J12
4540i0M5Jk6Q4nM6Pq2j35l1P9n7J64Q2p2J11rnj12j89Q0Q3j3L4O5J01n7k4j10
4569c5K7Nj82J28J12O4l1Q8p6j29p3j1l3Q4P0kRJ43j18o6Q5j72J3O4R9j05J33
4596I1J7K9l9m7q8j0r5J32K0R9l2l7J2j00m6L8jr5J98j4KJ47j10n1r6N9j37J0
4624a44J75O6m3l7J5n1rMn2K3K0Q9p8J43p7mj08j7q9J54q1J62Q5l4q9K8K3j69
4652i5N4l2M3L8R9m3J04j61o3O6j04K3j15M3M1K15r6N8p1ll5j01R1j9N3N7M3q1
4680IN1o2Q3j66nO6L0O4pqr6J1K6o3r2Q4O3M0L3k7L2K5j72J07p4n3o0J69J0K4
$$ plain form
4513 121 97 38 70 87 -30 -115 -18 -75 -8 114 37 71 60 148 -134 -53 -82 -144 10 -34 49 83 124 -63 35 -202 -90
4540 -90 -45 -44 -70 14 9 55 62 -20 -155 -186 -107 -164 0 82 10 121 112 107 -5 -194 -114 -31 -44 -10 55 156 99 75 -35
4569 -35 -8 -3 -185 -57 55 119 88 176 100 -29 -102 -113 -146 -62 8 6 15 158 40 -26 59 -113 -100 -36 63 -42 91
4596 91 108 137 98 51 -37 -47 -142 -10 10 109 77 40 52 -48 -94 -56 -57 -152 46 32 34 181 71 20 -76 -17 -154 -144
4624 -144 31 97 54 17 32 -19 -28 -24 -76 -53 -33 56 -22 121 44 40 -68 -85 -174 -20 -101 61 146 112 23 51 74 -95
4652 -95 -41 -73 -30 8 107 64 168 7 -56 10 -94 -71 -186 -143 -102 113 17 75 4 1 -34 -135 -44 -63 -10 47 90 9
4680 9 60 -2 81 -85 -90 -24 6 70 63 55 -41 -30 -4 -67 -159 -75 -12 28 61 34 66 91 -81 26 -48 -101 -161 8 18 42
$$ [...]
8191H2
##END NTUPLES=NMR FID
##END=
