##TITLE=1H_Baulin-Fin
 CDCl3
 8 sc, 
 3.10.2023
##JCAMPDX= 6.0         $$ Bruker NMR JCAMP-DX V2.0
##DATA TYPE= NMR FID
##DATA CLASS= NTUPLES
##ORIGIN= UXNMR, Bruker Analytische Messtechnik GmbH
##OWNER= root
$$ XWIN-NMR		Version 3.5
$$ Tue Oct  3 13:52:20 2023 Russian Standard Time (UT+4h)  she@DPX200
##.OBSERVE FREQUENCY= 200.13135
##.OBSERVE NUCLEUS= ^1H
##.DELAY= (6, 6)
##.ACQUISITION MODE= SIMULTANEOUS
##.ACQUISITION SCHEME= undefined
##.AVERAGES= 8
##.DIGITISER RES= 18
##SPECTROMETER/DATA SYSTEM= spect
##.PULSE SEQUENCE= zg30
##.SOLVENT NAME= CDCl3
##.SHIFT REFERENCE= (INTERNAL, CDCl3, 0, 15.7039)
##AUDIT TRAIL= $$ (NUMBER, WHEN, WHO, WHERE, WHAT)
$$ ##TITLE= Audit trail, XWIN-NMR		Version 3.5
$$ ##JCAMPDX= 5.01
$$ ##ORIGIN= Bruker BioSpin GmbH
$$ ##OWNER= she
$$ F:/spectra/data/she/nmr/H-F/1/audita.txt
$$ ##AUDIT TRAIL=  $$ (NUMBER, WHEN, WHO, WHERE, WHAT)
(   1,<2023-10-03 13:51:10.54 +0400>,<she>,<DPX200>,
      <created by zg, POWCHK disabled, PULCHK disabled
       configuration hash MD5:
       00 E9 B6 7A A2 85 ED C7 34 08 36 98 17 FE 4E 26
       data hash MD5: 16K
       97 1E 59 0D 91 30 65 49 70 59 FD 3A E0 AE 37 3B>)
$$ ##END=
$$ 
$$ hash MD5
$$ 99 5E 2E 25 6D DB 8B 1A 59 64 B4 54 22 B1 AC 76
##$RELAX= 
##$RELAX= 
##$RELAX= 
##$RELAX= 
##$RELAX= 
##$RELAX= 
$$ Bruker specific parameters
$$ --------------------------
##$DU= <F:/spectra>
##$EXPNO= 1
##$NAME= <H-F>
##$PROCNO= 1
##$TYPE= <nmr>
##$USER= <she>
##$AMP= (0..31)
100 100 100 100 100 100 100 100 100 100 100 100 100 100 100 100 100 100 
100 100 100 100 100 100 100 100 100 100 100 100 100 100 
##$AQSEQ= 0
##$AQ_mod= 1
##$AUNM= <au_zg>
##$AUTOPOS= <>
##$BF1= 200.13
##$BF2= 200.13
##$BF3= 200.13
##$BF4= 200.13
##$BF5= 200.13
##$BF6= 200.13
##$BF7= 200.13
##$BF8= 200.13
##$BYTORDA= 1
##$CFDGTYP= 0
##$CFRGTYP= 5
##$CHEMSTR= <none>
##$CNST= (0..31)
1 1 145 1 1 1 1 1 1 1 1 1 1 1 1 1 1 1 1 1 1 1 1 1 1 1 1 1 1 1 1 1 
##$CPDPRG= <>
##$CPDPRG1= <>
##$CPDPRG2= <>
##$CPDPRG3= <>
##$CPDPRG4= <mlev>
##$CPDPRG5= <mlev>
##$CPDPRG6= <mlev>
##$CPDPRG7= <mlev>
##$CPDPRG8= <mlev>
##$CPDPRGB= <>
##$CPDPRGT= <>
##$D= (0..31)
0 1.2 0 0 0 0 0 0 0 0.06 0 0.03 0 0 0 0 0.0002 0 0 0 0 0 0 0 0 0 0 0 0 
0 0 0 
##$DATE= 1696326670
##$DBL= (0..7)
120 120 120 120 120 120 120 120 
##$DBP= (0..7)
150 150 150 150 150 150 150 150 
##$DBP07= 0
##$DBPNAM0= <>
##$DBPNAM1= <>
##$DBPNAM2= <>
##$DBPNAM3= <>
##$DBPNAM4= <>
##$DBPNAM5= <>
##$DBPNAM6= <>
##$DBPNAM7= <>
##$DBPOAL= (0..7)
0.5 0.5 0.5 0.5 0.5 0.5 0.5 0.5 
##$DBPOFFS= (0..7)
0 0 0 0 0 0 0 0 
##$DE= 6
##$DECBNUC= <off>
##$DECIM= 32
##$DECNUC= <off>
##$DECSTAT= 4
##$DIGMOD= 1
##$DIGTYP= 9
##$DL= (0..7)
0 120 120 120 120 120 120 120 
##$DP= (0..7)
150 150 150 150 150 150 150 150 
##$DP07= 0
##$DPNAME0= <>
##$DPNAME1= <>
##$DPNAME2= <>
##$DPNAME3= <>
##$DPNAME4= <>
##$DPNAME5= <>
##$DPNAME6= <>
##$DPNAME7= <>
##$DPOAL= (0..7)
0.5 0.5 0.5 0.5 0.5 0.5 0.5 0.5 
##$DPOFFS= (0..7)
0 0 0 0 0 0 0 0 
##$DQDMODE= 0
##$DR= 18
##$DS= 0
##$DSLIST= <SSSSSSSSSSSSSSS>
$$ [...]
##$SUBNAM2= <"">
##$SUBNAM3= <"">
##$SUBNAM4= <"">
##$SUBNAM5= <"">
##$SUBNAM6= <"">
##$SUBNAM7= <"">
##$SUBNAM8= <"">
##$SUBNAM9= <"">
##$SW= 18.05172834244
##$SWIBOX= (0..15)
0 0 2 0 0 0 0 0 0 0 0 0 0 0 0 0 
##$SW_h= 3612.71676300578
##$TD= 16384
##$TD0= 1
##$TE= 0
##$TE2= 300
##$TE3= 300
##$TEG= 300
##$TL= (0..7)
0 120 120 120 120 120 120 120 
##$TP= (0..7)
150 150 150 150 150 150 150 150 
##$TP07= 0
##$TPNAME0= <>
##$TPNAME1= <>
##$TPNAME2= <>
##$TPNAME3= <>
##$TPNAME4= <>
##$TPNAME5= <>
##$TPNAME6= <>
##$TPNAME7= <>
##$TPOAL= (0..7)
0.5 0.5 0.5 0.5 0.5 0.5 0.5 0.5 
##$TPOFFS= (0..7)
0 0 0 0 0 0 0 0 
##$TUNHIN= 0
##$TUNHOUT= 0
##$TUNXOUT= 0
##$USERA1= <user>
##$USERA2= <user>
##$USERA3= <user>
##$USERA4= <user>
##$USERA5= <user>
##$V9= 5
##$VALIST= <valist>
##$VCLIST= <CCCCCCCCCCCCCCC>
##$VD= 0
##$VDLIST= <DDDDDDDDDDDDDDD>
##$VPLIST= <PPPPPPPPPPPPPPP>
##$VTLIST= <TTTTTTTTTTTTTTT>
##$WBST= 1024
##$WBSW= 4
##$XGAIN= (0..3)
0 0 0 0 
##$XL= 0
##$YL= 0
##$YMAX_a= 115015
##$YMIN_a= -101973
##$ZGOPTNS= <>
##$ZL1= 120
##$ZL2= 120
##$ZL3= 120
##$ZL4= 120
##$ABSF1= 10
##$ABSF2= 0
##$ABSG= 5
##$ABSL= 3
##$ALPHA= 0
##$AQORDER= 0
##$ASSFAC= 0
##$ASSFACI= 0
##$ASSFACX= 0
##$ASSWID= 0
##$AUNMP= <proc_1d>
##$AZFE= 0.1
##$AZFW= 0.1
##$BCFW= 1
##$BC_mod= 2
##$BYTORDP= 1
##$COROFFS= 0
##$CY= 11.3945322036743
##$DATMOD= 1
##$DC= 2
##$DFILT= <>
##$DTYPP= 0
##$F1P= 15.7292609196834
##$F2P= 12.9074282941183
##$FCOR= 0.5
##$FTSIZE= 0
##$FT_mod= 4
##$GAMMA= 1
##$GB= 0.15
##$INTBC= 1
##$INTSCL= 1
##$ISEN= 128
##$LB= 0.24
##$LEV0= 0
##$LPBIN= 0
##$MAXI= 10000
##$MC2= 0
##$MEAN= 0
##$ME_mod= 0
##$MI= 1.114404
##$NCOEF= 0
##$NC_proc= 0
##$NLEV= 6
##$NOISF1= 3.799351
##$NOISF2= 2.8
##$NSP= 1
##$NTH_PI= 0
##$NZP= 0
##$OFFSET= 15.70392
##$PC= 1
##$PHC0= -21707.28
##$PHC1= 8.452709
##$PH_mod= 1
##$PKNL= yes
##$PPARMOD= 0
##$PSCAL= 0
##$PSIGN= 0
##$REVERSE= no
##$SF= 200.130013532006
##$SI= 16384
##$SIGF1= 3
##$SIGF2= 2
##$SINO= 400
##$SIOLD= 16384
##$SREGLST= <1H.CDCl3>
##$SSB= 0
##$STSI= 0
##$STSR= 0
##$SW_p= 3612.71676300578
##$SYMM= 0
##$S_DEV= 0
##$TDeff= 0
##$TDoff= 0
##$TI= <>
##$TILT= no
##$TM1= 0
##$TM2= 0
##$TOPLEV= 0
##$USERP1= <user>
##$USERP2= <user>
##$USERP3= <user>
##$USERP4= <user>
##$USERP5= <user>
##$WDW= 1
##$XDIM= 8192
##$YMAX_p= 0
##$YMIN_p= 0
$$ End of Bruker specific parameters
$$ ---------------------------------
##NTUPLES= NMR FID
##VAR_NAME=  TIME,          FID/REAL,        FID/IMAG
##SYMBOL=    X,             R,               I
##VAR_TYPE=  INDEPENDENT,   DEPENDENT,       DEPENDENT
##VAR_FORM=  AFFN,          ASDF,            ASDF
##VAR_DIM=   8192,          8192,            8192
##UNITS=     SECONDS,       ARBITRARY UNITS, ARBITRARY UNITS
##FACTOR=    0.0002768,     1,               1
##FIRST=     0,             0,               0
##LAST=      2.2672688,     0,               0
##MIN=       0,             -101973,         0
##MAX=       2.2672688,     115015,          0
$$ Real data points
##PAGE= N=1
##DATA TABLE= (X++(R..R)), XYDATA
0 0 0 0 0 0 0 0 0 0 0 0 0 0 0 0 0 0 0 0 0 -4 8 -8 8 -8 8 -8 15 -16 16 -19 23 -24 28 -32 36 -39 44 -51 54 -62 68
41 68 -76 83 -91 101 -113 123 -136 150 -165 181 -200 220 -244 272 -300 335 -375 424 -480 553 -642
62 -642 759 -918 1147 -1497 2093 -3292 6531 -30924 -73167 66492 64280 51675 115015 88552
76 88552 52512 44594 29200 -11751 -41389 21603 -21853 -100641 3390 13044 -45253 28539
88 28539 3593 -46644 5921 652 -16566 16527 57930 41791 -27944 12711 34913 -35142
100 -35142 17258 29267 -35256 32198 39726 -19089 21259 29548 -16954 -54768 -47773 -11861 -31644
113 -31644 2277 47296 -4751 36747 70525 -5753 31704 65730 4085 -3545 -5178 -13264 -18279
126 -18279 -31769 -22988 -57621 -54072 -5120 -49844 -25744 46388 -2046 -5001 21158 -7575 12678
139 12678 21574 10275 14478 8177 27284 4044 -17314 29895 -4615 -35615 3658 -21891 -14181
152 -14181 18235 -16982 -16415 -12695 -27246 -22289 -30767 2366 19783 -5520 28411 25162 3712
165 3712 34998 777 -20782 4226 -19415 -16017 -3769 -6992 13690 -6549 -10457 7395 -11834
178 -11834 14246 21349 -2572 31381 22098 798 20377 -890 -100 4001 -21296 -1533 -3182
191 -3182 -9445 9077 -16783 -10393 1923 -24815 -2105 3501 -5385 20519 1372 240 18005
204 18005 -4531 7600 9091 -3921 20977 8422 4992 19879 -4911 311 -5097 -26598 -1387
217 -1387 -8242 -10816 14187 -4345 3154 9655 -15081 -120 -5564 -13302 5411 -8552 3257
230 3257 13048 -8926 7446 -1811 -16794 6331 -9581 -5781 14606 -2993 8945 8404 -5537
243 -5537 10407 -4825 -3599 10949 -7854 8664 9317 -11077 9237 -5177 -14734 3262 -13330
256 -13330 -3766 4951 -9149 7461 -2370 -8448 7116 -11824 -967 10298 -7445 12751 8784
269 8784 -4558 11434 -5311 -5301 5453 -9069 7683 7608 -1196 16691 -1460 -3682 5846 -16604
283 -16604 -4776 -1173 -13416 7537 -275 -2671 10748 -7344 1145 3484 -10622 8439 772
296 772 -3592 12730 -6428 -1703 3073 -15422 452 -3202 -8168 11544 -937 5370 14093 -3757
310 -3757 9572 4820 -6263 10601 -3803 -2893 7188 -12557 -2251 -3912 -16762 1168 -8163
323 -8163 -5466 10337 -3721 7861 9784 -5075 10221 -135 -4431 10677 -4715 2841 7582
336 7582 -8524 4097 -3834 -11227 3559 -9348 -735 8721 -4747 11170 6555 -4874 9387
349 9387 -5380 -5302 4617 -10202 1297 1279 -7358 6751 -5842 -4077 7101 -9327 4312 6931
363 6931 -6294 11007 1522 -5188 6689 -7223 -1541 1476 -8070 7913 -64 -1552 12624 -4913
377 -4913 2579 9065 -9688 4450 2604 -8357 3187 -7391 -5440 -533 -11373 2808 -655
390 -655 -3405 15436 283 3175 17233 -3140 2934 5383 -8075 2610 -3558 -4425 3141 -6940
404 -6940 3803 -475 -10654 9933 -1375 -6634 11065 -3922 -1430 6838 -7536 729 -313
417 -313 -4100 2507 -7629 4474 7968 -7907 8759 2664 -9679 7324 -6334 -9084 5025
430 5025 -7120 -4030 -2947 -4062 8299 -2632 2472 11426 -4757 8107 6948 -9418 8235
443 8235 -504 -13379 -2994 -10160 -4717 -2284 -9908 2764 -3400 -2843 8899 -5226 6426 14172
457 14172 -6466 4042 5606 -1606 8819 -1943 -1883 4172 -5932 2557 -690 -3410 11105 -5722
471 -5722 -7932 5562 -4866 3089 2966 -7264 5914 -316 -2365 8286 423 10183 7495 -8573
485 -8573 5912 3689 -1393 5876 -7071 -1729 2084 -9393 3685 2359 404 10197 -7857 -2847
499 -2847 11511 248 5887 3844 -3078 5166 -4690 -2389 4601 -4842 3595 -6609 -15736 7325
513 7325 -328 -7490 3599 -7665 -4978 -776 -6334 3856 3158 3984 2236 -11546 7058 10295
527 10295 -8313 6642 1351 -10548 3759 -3793 -5800 4519 -1854 -6246 -13329 -3222 9053
540 9053 -7642 1468 7837 -12705 2184 4619 -10787 8063 7749 -7177 -4008 811 7820 -581
554 -581 -2306 6547 -11658 -4872 9151 -10882 4761 17639 -8945 -3400 7678 3017 5747 5379
568 5379 6844 -1346 -2549 10108 -7869 -4920 14882 -13742 -15721 7653 -4076 487 11309
581 11309 1507 -81 2520 6274 -896 -1998 17135 -2191 -15119 10797 -1902 -8535 11802
594 11802 -3764 -8132 7327 2686 200 4857 12856 2485 -14191 3251 -868 -14527 8659
607 8659 -1428 -15887 7208 -417 -10254 4878 5126 -1674 -6987 522 4659 -6835 6769 4422
621 4422 -17597 2530 2408 -15536 7128 10259 -2659 3890 3546 1990 -714 1711 3292 -12818
635 -12818 -2650 5610 -15066 515 9988 -11325 -1387 2325 -6784 3540 5905 3247 -445 -360
649 -360 5816 -8511 -5517 9090 -9386 -4316 8841 -6109 4157 11570 -1492 1839 2234 1095
663 1095 106 -2023 8924 50 -5454 7367 -6520 -6228 8574 -6062 -2567 6995 -2431 1609
677 1609 1419 -387 40 -7848 -1013 -2663 -7717 8579 976 -3802 10848 -787 -2015 7033 -1695
692 -1695 2482 3171 -540 3932 -2736 988 891 -9806 1113 -1085 -7833 6777 742 -1896 6685
707 6685 -3762 -2126 -429 -5462 1112 -3051 -937 4800 -4779 2318 2576 -7127 3783 -464 -3920
722 -3920 7465 493 1704 5619 -2825 2449 -1195 -3898 4342 -3143 2055 6258 -3840 4232 1153
737 1153 -7000 1935 -4400 -4632 3287 -3935 1435 1831 -4169 2957 -3929 -3134 4242 -3941 3868 6029
753 6029 -2377 6201 532 -3877 3419 -4305 -572 3452 -2485 5326 1109 -2382 4107 -5498 -2615
768 -2615 1713 -6752 2213 1550 -3968 4129 -3402 -3680 741 -6985 241 808 -2941 6159 -468 -708
784 -708 4818 -5261 374 1730 -4404 5314 1610 -128 6585 -2698 549 1423 -6187 2535 -682
799 -682 -2397 6050 -2384 167 2494 -7035 358 -2101 -5275 4289 -1747 441 4956 -3147 1906
814 1906 162 -4742 3890 -1544 1020 7243 -1129 4474 3519 -4385 3308 -1731 -2562 4889 -1878 2804
830 2804 3809 -3602 2944 -3096 -4675 2595 -5264 -16 4049 -3671 3585 205 -4925 1944 -4393
845 -4393 -1653 2664 -2714 4910 2074 -2275 5692 -2957 -2175 4235 -4113 2819 4572 -1369 4947
860 4947 -630 -1441 1506 -6887 130 176 -5440 4770 -1092 -3500 4378 -5008 -3272 828 -4337 2132
876 2132 301 20 5548 -2812 1380 2153 -6453 3746 1507 -3800 6992 1918 177 4109 -3154
891 -3154 323 -1742 -3649 2755 -3326 932 5300 -6059 1155 2187 -7180 1327 -312 -2562 3574
906 3574 -643 1028 114 -3399 2545 -5701 -4078 6310 -3806 1533 7204 -3149 3066 2892 -3650
921 -3650 1715 25 1643 872 -2682 5932 -875 -5206 4134 -6193 -4955 4719 -4907 -282 4557
936 4557 -2082 -788 -3092 -943 464 -5189 3591 1302 -3208 8779 970 -3358 8038 -1237 -3136
951 -3136 3014 -239 3324 1226 476 1654 -5720 569 247 -8174 5454 2980 -5648 5159 1089
966 1089 -1745 3423 -2573 -1341 -1566 -1053 3609 -3172 2722 6063 -7384 94 2615 -5351 5040
981 5040 2642 -2259 4345 508 778 78 -1377 4591 -3774 -3061 6060 -2501 2517 4929 -7064 -523
997 -523 -768 -6697 -600 -1560 -5 -71 -5773 1415 -958 -2697 4844 -3405 -992 7070 -1749 2980
1013 2980 5299 -926 1717 -3994 -3586 2167 -2401 2259 651 -5043 2891 -2536 -4422 3731 -2168
1028 -2168 -559 988 -4315 3980 1952 -1604 2368 -4748 -1767 1580 -4199 3704 3307 -1432 2439
1043 2439 -3829 -296 4763 -2776 2776 1570 -2603 5570 582 105 5992 -1925 -1069 -502 -2192 5260
1059 5260 180 -375 2785 -6017 -673 748 -6475 2941 879 -4865 1634 -770 1533 3106 -1341
1074 -1341 2554 -1613 -480 6583 -1353 3197 7284 -5327 -491 1757 -4060 2090 -161 -2233 -362
1089 -362 -2470 1809 -2113 -2797 4913 -5027 -4068 5600 -3253 1180 5390 -3986 -858 57 -2391 -117
1105 -117 -1618 3410 -571 -5170 4821 -1258 -3391 6768 -3074 -2731 5676 -1132 908 3890 1395
1120 1395 890 -3475 1171 547 -4651 4668 -364 -6928 4190 -1960 -6111 3362 -1948 -2603 505
1135 505 -730 1913 -649 2907 3329 -4807 3644 3386 -5334 5831 3629 -3632 4209 307 -2270
1150 -2270 1211 -999 239 -3098 -988 2886 -5510 749 3863 -6674 1091 2097 -5290 2937 1833
1165 1833 -1676 1323 -894 1129 -1772 -2089 3551 -3849 -1105 5030 -4350 1112 4643 -3987 1766
1180 1766 2063 -1686 1819 53 1942 595 -2184 3419 -2353 -2974 4606 -3911 -1622 4008 -4077
1195 -4077 10 1311 -2990 399 -1871 -543 723 -2700 3414 397 -2371 6087 -441 -820 5910
1210 5910 -1050 1188 3720 -1384 2216 -283 -911 1331 -3589 877 556 -4240 2938 -827 -3328
1225 -3328 4164 -2192 -945 2703 -2516 1053 23 -1680 2266 -2678 51 2002 -3842 2443 1102
1240 1102 -2988 3853 -1021 -1204 3439 -1987 984 1139 -2441 2137 -1688 -1108 2468 -3614 481 995
1256 995 -4258 1801 -985 -2996 2136 -2700 -772 1144 -3205 1700 -758 -2042 2971 -2437 213
1271 213 2803 -2921 2211 1288 -2121 3318 -990 -102 3085 -1969 1982 1216 -1941 3510 -1001 -1159
1287 -1159 2450 -3357 105 726 -3497 1746 -1346 -1840 2402 -2388 814 2118 -2412 3192 972
1302 972 -889 3983 -1030 1121 3011 -2186 2323 417 -1785 3220 -1509 159 3223 -2490 1494
1317 1494 700 -2634 2058 -1782 -1396 1551 -3180 522 -7 -3480 2488 -1435 -1709 3195 -2149 911
1333 911 2374 -2203 2425 -169 -1503 2042 -2711 353 1353 -3327 2236 -81 -2596 3004 -1559
1348 -1559 -504 2572 -1847 1716 472 -1748 2286 -2719 -1294 843 -4605 433 267 -3956 2174
1363 2174 -710 -1934 2223 -1888 1048 1056 -1146 3661 -272 112 4029 -2184 725 2887 -3132 1426
1379 1426 913 -1636 1711 -1689 -195 497 -3297 1433 -1651 -2661 3475 -2095 -937 3668 -2153
1394 -2153 621 1492 -1465 1959 -33 746 2058 -1982 2595 549 -3761 3103 -920 -2151 3486
1409 3486 -1305 -295 2163 -1227 984 -888 61 2018 -3264 1895 2369 -3552 2293 -16 -4343
1424 -4343 1847 -1445 -2363 1046 -908 947 -1197 -735 3098 -2389 539 3482 -3223 2264 3640
1439 3640 -2623 2549 1587 -1571 229 -1381 1138 -285 -1344 3080 -2677 -1637 3347 -4476 -1403
1454 -1403 2818 -3659 -184 1084 -821 1216 -236 1402 19 -1770 4088 -325 -1341 5998 -1209
1469 -1209 -1995 3130 -2590 -1313 1042 -1846 -443 -1020 1349 938 -2458 3669 431 -4103 3619 -115
1485 -115 -2513 3861 -1279 -2697 355 -2051 -1121 -2000 523 1759 -2994 2323 2788 -2826 4266 1247
1501 1247 -3961 2773 466 -1394 2096 792 1033 -1508 -1188 1405 -2992 812 2697 -4347 976
1516 976 1859 -4275 952 178 -2929 -255 -1432 522 758 717 3807 -1441 -95 3805 -2837 768
1532 768 3723 -2295 1073 683 -2156 1145 -734 54 -462 -2381 2082 -524 -863 4157 -1445 -1612
1548 -1612 1652 -3827 -194 1772 -1470 1107 -749 -503 796 -2044 1189 264 -2781 1927 -1125
1563 -1125 -790 3772 -1156 -116 1417 -1925 1658 1174 628 3379 -523 697 779 -2963 997 -1453
1579 -1453 -3491 707 -2984 -1360 1496 -2365 905 443 -2221 1893 81 1181 3241 -321 1892
1594 1892 497 -1800 2156 -1601 -993 2192 -2343 483 2097 -1678 1645 -94 -1551 790 -1501
1609 -1501 488 941 -1483 2225 -1064 -2074 2039 -2268 -697 2336 -2130 795 1118 -1424 734
1624 734 -1054 -427 181 -2198 1902 481 -989 4214 -298 -773 3065 -1465 -186 1813 -1070 948
1640 948 -499 -567 92 -3241 -42 -1057 -4133 1945 -673 -2307 2996 -828 -975 1865 -1095 423
1656 423 145 277 2266 -918 1569 1798 -2952 1982 524 -3030 2460 54 -925 2173 -604 141
1672 141 -215 -818 890 -2059 -283 2032 -2632 1561 1731 -3255 1141 -80 -2443 1575 -16 520
1688 520 925 -319 1747 -727 -234 2604 -1866 983 3102 -1452 2389 2168 -1276 1138 -558 -1068
1704 -1068 262 -1477 1029 -881 -2005 1569 -2703 -1603 1729 -2984 -151 1652 -1578 1900 1070
1719 1070 -60 1455 -1164 762 318 -1724 2365 -499 -1439 2309 -2244 -770 1260 -2106 633
1734 633 628 -569 1691 -674 448 909 -2536 476 -1265 -2905 1405 -1654 -1871 1103 -2523 -543
1750 -543 292 -1273 1631 -3 625 2280 -746 1748 1481 -2079 1849 -220 -1364 2347 -585 520
1766 520 1477 -1511 760 -627 -1439 1394 -1979 -143 1188 -2577 766 103 -2101 1633 -821 -268
1782 -268 2273 -252 2134 1253 -354 2284 -989 -637 1668 -2145 735 1372 -1676 1611 237 -636
1798 -636 1849 -879 1025 1157 -1089 2072 -544 -1524 1249 -2622 -1586 359 -2386 481 -2 -1033
1814 -1033 1745 -1070 91 1243 -2163 1174 443 -1650 2252 -191 -585 2079 -1052 638 886 -645
1830 -645 1903 -673 -508 1207 -2896 -650 -328 -3669 227 -826 -1711 1631 -602 557 1118 -701
1846 -701 1820 -371 -924 2010 -1662 -370 1211 -2402 279 277 -1314 1551 278 919 2416 -202
1862 -202 2095 834 -1464 1782 -1425 -1611 1449 -2247 -688 467 -1657 775 -330 -516 1374 -1435
1878 -1435 1081 966 -1952 1899 -110 -1888 1743 -845 -152 2014 -19 1844 1105 474 2060 -1282
1894 -1282 254 1085 -3122 366 33 -2666 955 -805 -1416 859 -731 876 440 -510 2361 -1201
1910 -1201 -667 1758 -2721 -321 671 -2557 727 484 -627 1545 -144 1335 1005 -939 2424 48
1926 48 -1171 2675 -1447 -984 1707 -2046 -175 280 -1255 604 -1127 276 787 -2306 864 -482
1942 -482 -2812 1599 -838 -1475 2043 -546 417 1214 -57 1728 192 883 2052 -1749 1478 1351
1958 1351 -2522 1301 75 -2558 920 -740 -743 492 -459 810 -967 -526 1991 -2066 -62 2068
1974 2068 -2650 256 1256 -2112 857 184 -765 204 -790 1285 -255 -716 2834 -1075 -701 2997
1990 2997 -1823 153 2318 -1314 359 536 -604 286 -1097 552 -702 -2656 1330 -1124 -2065 2412
2006 2412 -1471 -1550 2249 -912 183 1236 172 949 -622 1092 1137 -1582 2295 631 -2463 2363
2022 2363 -282 -1659 2071 -612 -919 186 -811 292 -974 211 1231 -2398 1035 1140 -2596 1755
2038 1755 717 -2177 1237 -496 -1240 549 -714 211 -792 -228 1789 -1503 681 2473 -1851 1523
2054 1523 1779 -1650 1597 646 -738 633 -970 108 -808 -1441 1157 -1998 -1196 1396 -2687 -42
2070 -42 1660 -2037 758 584 -754 1381 49 1122 985 -740 2187 -82 -876 2522 -1176 -445
2086 -445 1591 -2001 2 338 -1692 454 -501 -82 884 -911 1544 286 -1096 2067 -707 -990
2102 -990 1395 -1725 -195 392 -1838 478 -586 -820 938 -1195 729 1049 -969 2043 296 -484
2118 -484 2510 -503 159 1670 -1243 615 331 -1307 808 -1417 -771 -116 -2346 363 -364 -1626
2134 -1626 1450 -947 -961 1796 -1135 734 1237 -575 1315 131 127 1729 -792 883 432 -1927 1401
2151 1401 -404 -1252 1745 -1288 -461 637 -1155 897 157 -683 1174 -844 334 1276 -1357 1335
2167 1335 -51 -1900 1379 -937 -956 1583 -1100 -47 267 -873 1270 -65 694 1777 -853 1439
2183 1439 1514 -1177 1951 36 -1444 994 -1230 -375 571 -1305 525 -856 -1295 794 -1626 129
2199 129 1297 -2091 848 197 -1518 1501 -296 -431 881 -859 845 596 -238 1862 -1015 -338
2215 -338 742 -2187 497 870 -1825 833 -272 -1091 1197 -680 342 262 -1277 1000 -666 -619 1573
2232 1573 -1743 -575 538 -2111 391 517 -949 1460 -268 297 1257 -403 1598 309 -854 1827
2248 1827 -829 -247 1745 -1281 401 451 -1545 671 -415 -337 947 -1420 513 37 -1609 1154
2264 1154 -609 -1069 1559 -1003 200 1603 -747 1144 472 -518 1304 -695 485 879 -1272 1125
2280 1125 3 -1466 1348 -427 -558 1348 -936 537 442 -841 1072 -998 -489 785 -2035 323
2296 323 329 -1968 1028 -518 -1210 848 -1100 -112 869 -679 1232 148 -153 1823 -1066 569 1196
2313 1196 -1552 915 410 -1265 787 -976 -572 290 -1671 355 -572 -1097 1350 -872 -403 1564
2329 1564 -1367 231 802 -1136 945 129 -96 1193 -733 648 323 -1360 1361 -307 -861 1620
2345 1620 -745 24 1101 -1019 463 -8 -667 1105 -840 607 733 -1395 904 -252 -1754 747
2361 747 -1160 -1039 803 -1146 351 203 -532 1232 -503 488 1820 -973 1365 1189 -1094 1457
2377 1457 -155 -1143 891 -993 9 304 -983 1027 -618 -728 1163 -1424 -282 992 -1714 491
2393 491 285 -991 779 -513 44 356 -849 1069 380 -855 1853 -684 -666 1271 -1495 -174 284
2410 284 -764 848 240 420 1148 -929 978 453 -1445 1089 -373 -1256 905 -1160 -734 191 -1587
2427 -1587 -46 -350 -472 1388 -721 984 1426 -1110 1205 241 -1030 1213 52 -147 990 -557
2443 -557 947 87 -724 1252 -1015 -403 1137 -1362 154 439 -1749 261 -470 -767 659 -620 566
2460 566 494 -755 1464 -241 -769 1508 -944 -375 1059 -940 643 289 -432 735 -859 272 742
2477 742 -1052 1243 226 -1210 1162 -666 -967 807 -1163 -210 89 -645 765 -560 -44 971
2493 971 -1540 388 597 -1461 1231 162 -800 966 -243 345 673 -380 1473 -66 51 1570
2509 1570 -1078 205 1005 -1775 -60 206 -1326 484 -331 -329 158 -968 598 -494 -816 1456 -844
2526 -844 -289 1633 -937 239 1024 -690 559 100 107 635 -430 882 310 -1191 1349 -473 -1255
2543 -1255 1376 -734 -572 971 -506 602 205 -466 279 -1011 458 435 -1497 903 95 -1379 1239
2560 1239 -408 -766 1029 -623 523 695 -86 1068 -554 197 1158 -1093 814 826 -1142 1187 121
2577 121 -964 675 -741 -454 -163 -955 355 -695 -424 809 -1360 -162 772 -1530 868 700 -890
2594 -890 1213 185 -35 744 -280 687 -200 -615 1121 -837 -303 1260 -1152 177 486 -1325 367
2611 367 -150 -346 439 -772 252 62 -1000 885 -463 -724 1013 -1141 -36 1186 -852 367
2627 367 142 -715 561 -104 452 754 -734 1066 185 -679 1493 -453 -426 952 -878 234 641 -553
2645 -553 530 -448 -541 327 -1288 372 172 -871 897 -637 -1021 1121 -262 117 933 -598 768
2662 768 349 -108 1171 -295 143 492 -990 795 401 -448 1174 -739 -550 673 -883 367 298
2679 298 -660 448 -737 -509 713 -848 387 -11 -1378 1046 -6 -109 1387 -526 219 494 -805
2696 -805 643 102 -359 837 -900 171 541 -819 1020 198 -756 937 -639 -86 659 -794 -43
2713 -43 -435 -1120 272 -1053 -326 613 -848 393 473 -441 1306 -46 -238 956 -599 212 523 -575
2731 -575 529 -215 -303 802 -590 759 713 -689 475 -127 -689 701 -783 -312 128 -956 379
2748 379 110 -206 904 -500 -37 875 -987 520 309 -827 849 -121 -382 758 -511 412 449 -328
2766 -328 1122 -171 -24 1058 -961 -102 330 -1263 60 -25 -853 298 -537 19 401 -742 795
2783 795 89 -457 929 -873 47 809 -881 460 364 -455 913 19 183 790 -543 769 242 -613
2801 -613 1028 -442 -460 742 -1094 -385 507 -866 340 -155 -432 465 -782 499 565 -1092 723
2818 723 -102 -999 1074 -364 -1 544 -546 556 373 -170 1003 -393 89 809 -1008 530 215
2835 215 -780 726 -176 -508 700 -478 258 315 -565 423 -662 -256 790 -954 38 527 -1082 592
2853 592 43 -623 922 -142 207 434 -331 911 -20 -277 1018 -543 -216 699 -889 221 244 -482
2871 -482 376 -375 -224 366 -894 390 -8 -950 778 -330 -538 1116 -505 223 755 -539 482
2888 482 -194 27 510 -724 675 585 -914 900 91 -713 816 -336 -23 549 -646 273 13 -361
2906 -361 400 -758 -144 526 -1154 269 188 -888 514 -208 -275 545 -373 522 161 -213 901 -259
2924 -259 -25 956 -654 314 701 -756 560 122 -498 397 -384 -33 173 -942 616 -357 -670 846
2942 846 -627 16 828 -582 179 154 -508 619 -372 58 482 -564 859 383 -610 1016 69 -381
2960 -381 951 -507 78 416 -469 544 -311 -211 622 -877 117 345 -1289 427 -109 -806 624 -221
2978 -221 -183 426 -448 570 131 -384 904 -370 159 864 -329 649 489 -525 560 1 -45 707 -709
2997 -709 279 90 -748 685 -383 -416 727 -676 -290 321 -650 269 36 -370 480 -658 398 438 -925
3016 -925 783 175 -481 624 -352 -193 533 -552 410 276 -296 725 -388 181 763 -884 414 -31
3034 -31 -1156 494 -239 -560 326 -670 103 42 -729 748 -292 -289 854 -825 -33 767 -687 540 456
3053 456 -426 967 -280 311 575 -486 798 -89 -679 708 -722 -446 464 -788 -124 4 -714 466
3071 466 -380 -20 458 -835 577 190 -737 1028 -26 -444 910 -573 -20 574 -374 543 60 -107
3089 -107 768 -635 463 235 -915 462 -214 -805 900 -471 -387 286 -651 69 62 -410 576 -631 24
3108 24 585 -869 418 509 -794 648 -17 -323 865 -132 767 264 -512 462 -358 -196 852 -919
3126 -919 -11 392 -813 224 190 -610 396 -584 -213 103 -637 674 -154 -686 491 -638 -191 935
3144 935 -400 505 467 -333 706 148 205 318 -616 195 -37 -661 881 -289 -243 662 -979 56 500
3163 500 -424 242 -6 -367 362 -829 -127 409 -669 471 -148 -659 746 -21 20 854 -864 429
3181 429 474 -201 1036 -243 211 424 -721 347 387 -454 761 -389 -444 394 -472 33 -14 -715 194
3200 194 -470 -330 617 -534 1 559 -795 445 123 -27 822 -286 232 628 -538 777 131 -359
3218 -359 571 -582 -101 535 -490 294 174 -869 568 -352 -249 696 -686 94 56 -765 485 -316
3236 -316 -240 471 -753 -9 386 -529 807 -160 -349 769 -453 234 819 -544 779 69 -363 827
3254 827 -152 48 347 -555 238 -350 -737 553 -372 -387 393 -814 21 169 -411 690 -196 -165 811 -372
3274 -372 442 344 -522 921 -107 -80 864 -341 42 308 -634 451 -368 -541 661 -591 44 436 -660
3293 -660 277 63 -634 722 -538 -289 490 -614 136 -36 -555 438 -395 -48 473 -737 477 402 -421
3312 -421 683 1 -132 539 -250 314 319 -298 435 42 -742 528 -641 59 270 -892 235 -119 -465
3331 -465 368 -288 -147 187 -381 649 71 -565 706 -295 1 629 -576 279 478 -294 552 -26 -212
3350 -212 550 -592 224 54 -777 426 -371 -396 648 -585 -245 284 -666 212 -68 -167 598 -523 211
3369 211 237 -675 556 228 -476 787 -232 53 463 -437 402 323 -276 827 -245 61 522 -722 520
3388 520 73 -711 340 -218 -328 523 -254 103 78 -532 505 -325 -469 651 -619 64 600 -415 386
3407 386 106 -209 671 47 54 168 -445 652 43 -356 719 -474 -165 299 -463 196 131 -397 395 -393
3427 -393 -93 474 -859 357 190 -679 756 -147 -449 777 -246 18 589 -311 668 148 -156 702
3445 702 -368 1 301 -634 526 -58 -507 613 26 -171 231 -460 -8 -268 -429 472 -636 -172 749
3464 749 -635 168 179 -551 593 -78 -145 651 -162 478 297 -430 708 -94 -289 778 -297 94 359
3483 359 -501 230 -57 -289 473 -246 35 232 -539 490 -220 -721 536 -424 -85 518 -320 166 215 -381
3503 -381 310 -224 -41 753 -568 178 376 -167 599 49 -199 668 -488 97 256 -852 381 14 -540
3522 -540 476 -623 7 387 -675 115 5 -306 479 -369 17 568 -425 350 152 -293 763 -230 -50
3541 -50 671 -429 310 287 -416 262 -232 -301 322 -666 167 -43 -626 240 -252 -367 434 -478 -115 155 -544
3562 -544 438 63 -307 708 -622 176 427 -207 451 241 -399 414 -342 55 564 -414 265 91 -348
3581 -348 372 -314 -98 386 -697 -30 86 -595 404 21 -476 167 -748 80 74 -449 495 -237 -340 661
3601 661 -362 10 659 -362 214 -136 -409 281 -228 5 236 -598 340 114 -321 471 -294 -199 342 -617
3621 -617 -88 -69 -446 481 -439 -48 444 -307 377 136 -282 471 49 -185 747 -3 50 56 -519 279 -95
3642 -95 61 563 -557 -15 260 -484 360 -13 -452 248 -394 -310 249 -387 127 -79 -375 406 -307 43
3662 43 534 -366 -24 264 -403 425 151 -102 518 -469 241 320 -280 626 -14 -220 457 -417 47 430 -294
3683 -294 65 -212 -501 96 -424 97 112 -402 193 -24 -261 653 4 -78 641 -517 81 251 -99 459
3703 459 -207 -138 312 -545 219 265 -360 316 -77 -385 385 -268 -180 127 -627 157 -127 -190 646 -241 141
3724 141 264 -684 560 122 -475 443 -251 -115 328 -170 361 24 -338 582 -162 -73 601 -559 258 111
3744 111 -505 320 -184 -311 355 -412 15 -35 -437 383 35 -255 598 -185 107 396 -280 306 94 -38
3764 -38 529 -206 -93 648 -445 196 149 -389 573 -71 -242 204 -445 -145 28 -388 245 -380 -348 462 -296
3785 -296 180 258 -538 348 -96 -210 422 -32 118 393 -261 368 -129 -76 538 -323 -30 399 -400 142 80
3806 80 -259 274 -408 -110 108 -510 96 -192 -444 292 -299 -472 233 -456 -5 95 -369 388 41 -94
3826 -94 603 -5 185 333 -347 501 189 -76 400 -154 -153 456 -531 231 -98 -296 375 -381 -19 96 -834
3847 -834 196 12 -152 297 -206 -211 248 -394 256 95 -320 324 -282 205 578 -448 107 341 -415 198
3867 198 26 -375 447 -446 71 84 -495 398 -180 -214 294 -462 -147 87 -527 182 8 -301 144 -301 2
3888 2 355 -287 228 72 -235 567 42 -258 475 -290 236 240 -252 117 -117 -128 520 -496 25 -37 -418 353
3910 353 -97 -520 372 -449 -254 139 -368 312 -203 -93 386 -277 38 64 -375 270 183 -290 320 -39 57
3931 57 166 -367 117 65 -415 363 -112 -62 291 -480 118 -50 -470 130 -144 -261 296 -304 68 209 -351
3952 -351 502 132 -245 584 -145 99 334 -224 170 122 -240 417 -238 170 75 -126 417 185 -206 404 -409
3973 -409 -534 215 -465 252 -82 -343 196 -189 -130 470 -370 153 250 -403 335 -43 -201 313 -80 124 272
3994 272 -157 335 109 -174 555 -145 143 442 -456 74 -245 -440 166 -200 -290 211 -315 163 132 -338 424
4015 424 -191 -3 283 -328 57 136 -190 361 -26 -110 223 -322 160 271 -366 323 -98 -139 421 -302 -194
4036 -194 154 -327 32 -140 -383 288 -206 90 306 -415 13 38 -262 252 -294 -40 265 -419 121 327
4056 327 -48 579 30 176 372 -46 202 -27 -355 115 -324 -217 231 -362 83 130 -559 212 -69 -298
4076 -298 385 -257 -41 332 -260 441 107 -199 387 65 31 27 -249 433 -242 -272 296 -158 -154 471 -277 87
4098 87 289 -567 293 -159 -305 521 -213 -105 166 -541 95 -26 -242 208 -380 -133 110 -251 242 8
4118 8 -149 414 -209 193 591 -312 317 210 -539 369 -296 -71 155 -338 88 -45 -297 271 -193 -334 376
4139 376 -370 117 194 -358 139 -340 -264 347 -52 4 340 -255 79 87 -270 420 -241 122 191 -269 195 389
4161 389 -306 335 -120 41 190 -392 283 109 -492 97 -43 -361 282 -49 48 53 -311 315 -147 -67 514
4182 514 -374 248 221 -312 431 185 -1 305 -101 28 50 -356 93 55 -298 14 -353 -223 204 -491 301
4203 301 -101 -380 202 -96 -118 354 -299 -187 -103 -301 372 -200 88 354 -497 229 325 -298 407 108 -238
4224 -238 246 -244 -13 58 -383 18 -281 -464 158 -181 46 228 -469 165 90 -336 281 -253 -112 171 -403
4245 -403 43 250 -238 417 -107 152 447 -269 278 142 -148 466 -143 -69 297 -598 42 90 -408 334 15
4266 15 -198 416 -269 -54 333 -431 266 -122 -378 343 -152 -9 323 -286 16 114 -438 222 -245 -124 288
4287 288 -362 273 77 -380 453 -142 -115 387 -423 -9 12 -447 32 -28 -240 253 -243 -26 209 -412 156
4308 156 105 -463 485 -164 178 391 -256 249 -36 -76 329 -166 -44 271 -409 125 102 -289 148 -150 -153 249
4330 249 -425 -48 182 -288 228 -53 -164 396 -383 -27 235 -481 386 147 -100 237 -186 11 256 -270
4350 -270 235 85 -277 398 -307 -214 419 -441 157 119 -216 291 -135 -223 28 -430 -19 -12 -409 391 -150 -8
4372 -8 442 -220 -67 46 -197 229 -88 -51 296 -317 116 286 -306 328 -47 -360 231 -240 -142 36 -539
4393 -539 -78 -48 -300 407 -193 -252 312 -156 123 16 -298 337 2 -248 100 -158 172 289 -202 353 -141
4414 -141 -68 524 -72 182 185 -364 -105 128 -113 235 -350 -108 84 -443 305 -166 -266 335 19 5 268
4435 268 -321 -9 100 -230 227 -348 180 313 -422 317 347 -75 424 -147 -219 121 -106 66 57 -326 195
4456 195 -186 -263 334 -350 28 169 -365 293 -51 -297 250 -191 -98 107 -348 138 -12 -170 392 -246 96
4477 96 416 -170 191 154 10 280 -100 -34 109 -308 -80 -31 -403 274 -169 -168 334 -419 157 53 -274 137
4499 137 -270 -256 128 -108 203 232 -308 294 54 26 399 -126 224 331 -181 54 193 -390 191 -180 -66
4520 -66 348 -406 -230 9 -197 138 143 -32 248 -195 -37 31 -330 270 -116 -206 447 -209 37 124 -186 265
4542 265 56 -226 219 -132 10 114 -193 321 66 -214 361 -122 -241 351 -281 87 116 -344 384 -171
4562 -171 -113 419 -462 -13 39 -347 435 -31 27 551 -225 123 464 -167 267 50 -138 295 -164 48 254
4583 254 -352 63 66 -334 263 -78 -122 98 -163 -78 164 -39 228 -334 -35 325 -286 199 32 -158 249
4604 249 -184 -112 409 -252 24 38 -212 269 30 -59 455 -139 -106 174 -250 252 186 -37 55 -419 -226 38
4626 38 -257 -25 -18 -425 111 -209 -196 256 -150 -8 206 -220 363 67 97 317 -241 264 48 -353 467 -7
4648 -7 -172 277 -246 -28 222 -230 -1 25 -227 122 -201 94 280 -312 327 39 -208 142 -90 -127 477
4669 477 -215 200 75 -222 283 -116 -266 110 -337 -31 272 -302 213 20 -185 42 -212 -198 88 -233
4689 -233 286 -102 -155 291 -349 -134 174 -289 265 59 -134 478 -211 -14 90 -222 269 122 -162 230
4709 230 -133 17 288 -497 65 60 -191 118 65 -5 189 -339 3 -177 -420 309 28 -136 323 -271 132
4730 132 212 -247 324 3 -143 108 -238 -80 180 -254 136 64 -186 37 -437 -8 80 -414 95 30 -368
4751 -368 85 -194 37 -177 -356 -57 125 -329 114 -72 -125 364 -165 35 27 -75 295 37 -116 233 -102
4772 -102 146 324 4 208 31 -73 149 -346 -108 91 -290 237 9 -378 184 -84 -63 211 -122 32
4792 32 -119 -84 153 -30 -172 407 -43 -78 414 -175 248 -22 -95 243 -60 -35 -110 -334 87 -272 -139 188
4814 188 -283 -71 273 -492 52 -227 -357 393 -151 3 134 -314 175 97 0 302 48 -64 224 -23 234
4835 234 104 -161 149 46 86 176 -300 169 94 -312 54 -181 -292 97 -234 117 39 -111 -126 31 -168 94
4857 94 -192 166 174 93 297 97 -181 50 -166 -94 327 -196 -76 -9 -359 128 -280 -25 308 -281 257 66
4879 66 -406 80 -80 -242 32 -370 113 192 -243 405 -136 -14 280 -335 -20 390 -79 428 -4 -76 223
4900 223 2 151 272 -202 162 63 -138 228 -246 21 150 -127 88 -88 -228 -63 -217 -180 134 -331 61
4921 61 -27 -214 214 -42 -152 286 -176 105 272 -122 288 136 61 455 -123 35 85 -279 189 79 -149
4942 -149 144 -204 6 228 -91 56 -157 -299 250 -147 -103 195 -285 -87 57 -131 159 -83 -16 -41 -59
4963 -59 89 149 -186 290 85 -366 144 -467 -56 159 -335 115 -4 22 185 -88 -152 371 -271 76 -123
4984 -123 -33 200 -134 91 251 -45 106 118 -265 280 -3 -8 194 45 233 267 -273 240 -118 192 169 -317
5006 -317 7 -3 -318 178 -65 -155 151 -241 -104 174 -237 134 21 -129 248 -35 5 420 30 31 315 -146
5028 -146 116 -64 -91 124 -400 292 35 -180 227 -157 -87 -7 33 -15 222 -365 216 -71 -26 419 -219 207
5050 207 125 -232 59 99 -360 172 -269 -46 21 -257 166 99 55 189 99 108 181 45 175 -36 -258 79 -258
5073 -258 165 299 -379 63 130 -460 -21 -227 -205 90 -229 50 110 95 314 111 70 218 73 -133 66 -189
5095 -189 284 -48 13 78 -304 -75 158 -191 5 84 -303 274 -43 -40 29 -237 182 181 65 262 -154 -52 151
5118 151 -169 35 108 -166 147 11 -14 169 -86 117 106 1 219 90 -126 254 -192 -153 55 -195 16
5139 16 206 -327 62 -33 -90 8 -320 71 -12 -118 369 -18 46 325 -144 303 93 -37 308 -13 113 128
5161 128 -173 85 166 -281 143 -119 -299 88 -217 -79 88 -298 1 -138 -122 166 -138 -67 105 -134 249
5182 249 131 -202 379 -65 -49 331 -100 155 243 -71 233 39 -109 198 -61 205 149 -451 -8 41 -180
5203 -180 -16 -227 -94 198 -226 104 -14 -163 380 -200 -56 65 -150 207 164 -133 369 -54 26 184 -292
5224 -292 214 -1 -150 101 -139 -145 262 -32 4 127 -212 20 71 -158 -100 -218 -41 26 -269 241 -95 -45
5246 -45 114 -239 35 14 -89 140 259 -28 273 -135 130 124 -335 291 17 -216 247 -285 -122 -29 -311 -211
5268 -211 105 -141 151 -56 -24 286 -78 185 -119 -241 94 139 -18 109 -40 -2 77 -57 303 24 -130
5289 -130 189 -33 -106 296 -169 158 83 -405 342 132 -219 145 -177 48 -72 -128 17 -158 -92 -94 -289 214
5311 214 258 -183 376 54 19 148 34 291 182 -237 288 43 -180 223 -34 154 56 -208 -92 -171 -345
5332 -345 152 -67 45 142 -300 187 126 -318 226 14 -277 201 -227 11 110 -128 197 -18 -15 223 -167 41
5354 41 113 169 204 -147 -20 238 -114 168 67 -378 115 81 -116 210 -152 77 129 -199 197 -39 -108 281
5376 281 -119 -119 322 -42 173 47 -85 58 -156 -135 257 -241 -1 106 -275 105 -52 -195 162 -328 -68
5397 -68 82 -319 162 -17 -90 174 -308 -22 201 -96 461 192 -124 244 -249 16 18 -26 211 -59 -272 302
5419 302 34 -34 15 -349 73 -126 18 144 -327 -194 123 -163 -60 113 -215 134 21 18 360 -119 10
5440 10 150 -103 153 88 -207 243 -60 44 239 63 287 163 -130 211 -283 95 142 -390 71 64 -334 124
5462 124 -89 -256 124 -277 -52 -31 -2 106 -253 -166 -22 -197 248 100 -209 -13 179 -120 67 0 20 133
5484 133 -287 123 -90 -201 335 -182 -164 176 -232 -90 43 -107 154 -121 -254 142 -419 -53 -124 -333 141
5505 141 -123 -66 201 -204 154 161 -217 54 73 -40 7 -56 -161 153 -329 270 -17 -220 307 -139 116 220
5527 220 -259 -48 90 -225 142 -229 -26 -5 -318 154 236 -244 244 -164 -98 213 -65 -15 -2 -276 166 -6
5549 -6 -141 131 -132 209 138 -162 234 -58 -12 108 -322 -84 82 -298 193 -94 -179 54 -194 94 26 -51
5571 -51 234 44 58 285 2 63 314 -154 2 101 -189 -64 -147 -17 96 -163 5 -43 -383 99 -5 78
5593 78 330 44 -10 -84 -428 119 42 -131 269 -238 -28 320 -249 179 38 -290 304 -107 -78 210 -87 30
5615 30 118 -35 139 -138 -162 316 -414 -35 113 -203 -21 121 -234 203 -127 -168 183 -26 200 -162 -296
5636 -296 -19 -75 102 213 -129 261 124 1 22 -123 -59 123 -237 -27 -54 123 116 -30 -126 82 -160 171
5658 171 -99 -214 301 -59 31 -18 -171 -65 17 -94 278 -9 -32 34 -21 93 202 -154 117 129 -180 109
5680 109 -99 -83 185 -198 -83 -9 -203 134 -172 -103 10 -233 44 48 -270 168 -14 118 227 -151 -59 68
5702 68 -263 166 29 -7 160 -172 -47 255 -234 221 125 -92 258 -66 -78 49 -129 137 3 -133 189
5723 189 -258 -229 330 -213 -46 91 -150 203 125 -115 71 -110 -16 -91 -263 290 100 -212 2 -72 109 38
5745 38 6 158 -184 -4 13 -136 127 63 -268 30 -32 -167 -49 -20 -59 221 -120 -31 -18 -62 238 -145 -34
5768 -34 126 -135 78 235 -155 2 -85 97 194 -173 161 24 -327 40 -219 -51 111 -463 -61 133 -140
5789 -140 36 190 -83 -85 -174 -54 200 -186 131 -7 53 329 -183 61 171 30 50 146 -157 183 36 190
5811 190 293 -111 17 -14 -136 76 38 -196 96 -233 -97 -69 -136 240 -121 -67 236 -111 -25 111 -16 37
5833 37 57 -36 175 54 54 238 -48 56 -247 -187 146 -176 -37 239 -43 -172 90 2 265 -65 17 72 -213
5856 -213 120 -146 -125 46 24 -67 275 -123 61 81 -226 10 195 -68 112 -80 -24 39 -74 106 59 103 -6
5879 -6 -98 -211 -26 65 145 34 -111 142 -64 4 -83 -159 66 48 -275 85 218 133 17 -174 172 46 -94
5902 -94 267 5 30 318 -261 -96 78 -151 -76 105 -127 105 -103 -73 69 -352 -78 201 -166 167 -200
5923 -200 -288 -5 -106 81 41 48 213 -95 99 60 -108 110 -91 -154 110 -69 -35 113 40 -104 -31 -204 95
5946 95 -77 -63 353 -232 -179 55 -130 165 54 32 143 -84 -48 -64 -167 -141 -29 -115 183 -99 -14 82 -21
5969 -21 -38 82 -208 171 -124 -5 127 -231 0 107 -157 118 -9 -37 21 -144 -1 30 -179 226 -36 -64
5991 -64 231 -32 -87 211 -130 99 51 -93 126 -121 -59 182 -91 35 37 -152 120 -247 -74 50 -206 117
6013 117 -19 -133 -158 -96 18 -60 -54 5 173 -163 103 25 -108 282 34 82 111 -229 41 74 -229 87 -60
6036 -60 -3 215 -138 -23 -198 -152 119 89 67 181 90 122 83 -41 371 16 -13 68 -12 -216 175 -83 163 -92
6060 -92 -92 -2 -195 27 -40 83 51 108 -96 93 -79 -2 303 -118 202 -7 -134 28 74 -153 181 -145 140
6083 140 50 -185 119 -37 -178 133 -73 78 161 -106 -7 -74 -11 136 9 188 -62 -120 34 213 96 71
6105 71 -55 -220 143 -370 256 119 -186 -17 -78 -222 -144 -112 122 65 -46 90 -156 -59 28 -75 -99 -16 -102
6128 -102 272 70 -344 177 72 -7 111 -272 196 19 -183 133 -154 -7 -82 63 26 -156 -179 196 -142
6149 -142 -118 128 65 240 -61 -70 230 99 -146 70 -187 -37 -104 -221 127 81 80 168 61 132 132 -143 -107 -71 -90
6174 -90 -63 -207 30 -125 -386 -91 -40 -237 75 194 55 96 186 100 -76 -97 111 39 -59 217 -168 53 -100
6197 -100 -155 94 203 59 208 67 79 2 61 16 -147 73 145 -229 198 34 -88 68 -42 59 44 -105
6219 -105 24 215 -57 -91 19 -22 293 -256 -132 160 -59 57 135 -151 -148 -48 189 54 -204 132 -140 -171
6241 -171 75 62 -136 -141 -27 95 -15 105 60 76 157 200 -126 161 5 -199 369 -113 -92 155 -122 -221 241
6264 241 77 195 123 39 6 -57 -161 77 -25 135 124 -108 40 -69 133 116 -200 139 -21 -140 139 114
6286 114 -128 183 -223 -234 38 35 -51 -48 -98 54 56 -30 61 -216 234 -55 -139 75 -256 -152 0 20 23 -62 -29 120
6312 120 -250 -93 168 -139 44 74 55 111 126 -230 151 -19 39 -20 -252 227 -6 -96 78 -236 282 -93
6334 -93 -203 109 -19 -91 188 -73 -63 89 -207 79 132 -33 197 -39 -77 -131 125 -8 67 -41 -46 5 -66 -6
6358 -6 -185 -38 170 -153 73 120 -72 180 -79 3 126 -79 97 110 -148 -162 237 -10 30 -90 86 -47
6380 -47 -18 159 -230 -212 85 23 -20 -108 -36 199 -153 -172 74 70 37 96 -193 71 -315 -261 142 -137 -43 21 -160
6405 -160 -2 40 -8 -109 -98 186 27 -17 218 159 -40 -65 66 2 89 40 294 55 -168 225 -47 -25 54 -39
6429 -39 -20 137 102 161 -204 -166 2 -156 53 41 99 27 46 138 115 -97 -92 93 87 -107 70 -68 165 -149 7
6454 7 -25 -324 334 20 -85 -12 -207 -123 -144 -34 122 38 -56 -81 -68 -232 4 71 2 30 -284 -10 -116 117
6478 117 123 -7 4 49 -59 79 -38 -94 4 -113 16 145 -69 124 -58 20 96 -88 20 -42 -131 60 -28 -146
6502 -146 189 -12 -90 119 -69 96 100 -174 265 -37 -123 232 0 8 210 -17 241 -18 -197 -237 -210 -24 81
6525 81 -53 88 -150 -193 219 -228 124 63 -245 37 149 -73 30 -1 2 32 -104 109 33 -42 299 -115 31
6548 31 266 -152 87 154 -129 147 77 -61 56 67 193 -5 -81 208 263 -163 -132 146 -56 165 -88 23
6570 23 182 -191 -2 -13 -20 178 -100 172 -167 -63 142 -79 151 -25 -67 152 77 -19 119 -32 32 229 126
6593 126 3 23 -354 68 -49 11 220 -2 98 101 -130 97 5 -133 171 41 49 102 -163 -32 105 -89 78
6616 78 -179 -14 167 -173 211 423 -218 -9 7 91 5 -142 123 -99 -188 61 76 -123 123 -87 164 -64
6638 -64 -134 232 34 -55 171 -92 35 212 -62 92 -188 31 162 -193 -29 80 -188 -68 134 -12 -60
6659 -60 35 -178 208 57 41 -117 -147 62 37 16 37 -63 5 116 -156 18 -23 -81 259 -242 197 -19 65 155
6683 155 83 -92 -17 -141 -87 18 -23 135 14 -28 195 114 -95 83 -101 12 47 -153 -176 -165 -54 -22 -40 123
6707 123 -81 -106 297 -98 122 -56 -143 205 203 43 9 24 -5 145 36 -7 79 -51 191 28 -12 -76 -41 -36 173
6732 173 103 -97 97 -45 82 -215 95 90 -153 196 64 -96 100 -148 -9 279 -93 131 -8 -5 -122 -253
6754 -253 -72 18 206 158 69 -142 82 -183 105 153 -167 -26 98 -99 108 -33 48 18 56 217 191 -211 67
6777 67 0 -195 86 -100 31 227 -75 27 37 76 -155 -216 40 52 -306 -17 52 -159 -14 -159 -84 -2 -155
6800 -155 -36 28 93 59 -166 -104 -89 50 244 10 16 -4 -70 12 165 -45 -196 133 -97 -26 -4 -319 -139 -93
6824 -93 184 45 -260 18 -20 -188 48 -51 3 190 31 13 9 -156 10 -183 -375 309 -54 -27 212 46 -23
6847 -23 121 -57 -100 0 -106 75 -108 150 148 63 20 -51 -169 106 -76 27 115 -137 269 97 -135 -30 -152
6870 -152 13 163 -61 224 185 153 2 -219 19 -98 -214 -45 -170 -166 205 24 -23 30 -242 37 22 -70 92
6893 92 -153 -34 32 -34 -17 147 -24 -128 -95 -70 18 34 8 11 -140 -51 31 -171 206 -47 3 -108 8 12 -8 -5
6919 -5 45 -85 -209 78 136 -35 -39 -18 -92 56 2 168 58 241 44 -24 133 39 -216 -35 -97 115 19 37 32
6944 32 -152 42 150 -206 -137 44 -98 5 -68 27 207 -100 -28 -1 113 -8 -9 -282 101 -194 -64 -49 -15
6967 -15 118 -8 43 116 -107 -81 116 26 252 -28 -74 -89 -179 -153 260 -96 53 -246 -106 49 -33 175 -2
6990 -2 28 -31 78 -187 25 -117 53 215 -129 -95 -152 -8 -100 -58 95 70 -161 -135 33 -198 60 -76 -24 22
7014 22 -19 174 6 -71 142 159 -167 71 -53 108 120 8 148 -22 -16 -28 -58 -25 107 -55 66 -141 58
7037 58 -29 -101 -42 -6 133 23 -32 -215 5 25 -109 -49 -108 31 152 -149 61 -60 -101 -3 -63 4 301 56
7061 56 98 -85 -226 24 -188 -35 120 25 -142 10 -104 18 207 -17 129 -129 -85 82 -99 -29 -52 -31
7083 -31 86 -111 100 94 38 67 -173 -73 -73 77 34 16 10 58 24 23 118 62 -199 132 75 82 111 216 -75 23 -44 137
7111 137 -135 15 32 -53 186 -109 -122 65 -6 -110 188 -57 -102 60 74 -69 -93 21 96 -141 42 47 -93
7134 -93 -1 -77 -50 13 -153 75 327 -44 109 92 172 0 -129 -140 -90 -187 66 -122 -191 164 91 65 112 -6 141
7159 141 130 -182 -41 -79 -199 72 -52 90 -105 -165 -40 -114 31 -130 -147 -41 117 -136 136 53 7 104 -15
7182 -15 -17 -56 -101 242 -20 -110 13 101 103 216 -215 -154 24 -245 211 -130 46 -19 -35 -58 -24 -64 -76 13 -32 -100
7208 -100 -70 170 -170 -165 141 -187 137 65 -144 78 32 152 -83 -69 20 293 34 -100 82 -14 -150 95 49
7231 49 52 192 109 -24 -58 91 -240 10 3 57 -108 164 -16 146 -102 -55 88 23 -3 125 69 67 15 -101 131
7256 131 19 80 147 -108 56 232 -77 132 36 3 141 -228 -64 -66 -241 11 -58 -62 61 -370 -204 -58 78
7279 78 26 154 -188 -72 -32 -124 256 127 4 -78 -4 33 -44 -93 65 -207 108 -66 149 108 -23 -14 139 -139
7303 -139 14 -109 -144 -116 -217 -111 11 -143 -53 -135 -211 276 -91 95 -98 24 149 -28 27 -27 63 8 148
7326 148 -139 128 -28 -109 -218 82 -74 24 29 -74 127 -135 -47 28 -74 183 -136 -60 -67 -233 256 185 94 25
7350 25 -58 -40 52 87 192 47 -134 86 -82 174 162 -134 -81 18 143 2 -159 -205 178 70 199 73 138
7373 138 115 -37 -84 -25 139 3 95 93 39 -90 -90 113 -71 115 53 61 68 -150 153 -19 20 -6 53 -185 63 165
7399 165 10 -37 -121 269 28 55 53 141 36 138 -45 -198 37 -66 21 4 -74 -124 158 -62 -211 -13 -19 171
7423 171 -123 -36 -65 -166 -22 -80 106 -111 -7 -37 131 114 132 78 20 19 -72 -89 70 -42 136 45 -31 111 -146
7448 -146 -238 83 44 -15 -22 -119 119 130 -160 51 -123 24 0 -37 -21 -143 -26 109 -174 -119 -187 -43 -53 -8 -167
7473 -167 29 30 -141 1 -44 35 -21 76 20 -27 -67 86 17 42 165 63 197 -111 14 68 -21 136 12 -223
7497 -223 -22 46 -73 116 -42 -31 144 -56 85 -198 -190 16 51 -82 -140 -60 16 37 -117 -96 -111 -80 28 3
7521 3 -55 -268 -116 299 63 20 -4 -41 173 -216 -33 6 -124 -251 111 -153 142 65 -186 62 -72 -10 -67
7544 -67 -41 72 -5 147 289 88 -74 175 -81 -56 -14 -96 -6 -26 148 -41 98 102 50 -153 42 -134 -174 -69
7568 -69 50 117 123 151 -64 293 12 109 -157 -41 183 -6 -8 60 -1 111 64 131 -33 -87 106 196 -31 -39 119
7593 119 -17 -164 -55 -141 89 -208 -54 -89 93 23 -166 -47 -176 27 105 -118 -90 59 1 -121 176 -57
7615 -57 -175 -328 15 177 -194 -153 69 7 -120 -10 117 -99 68 61 1 43 -30 -145 103 94 43 -35 42 76 -76
7640 -76 105 38 -47 -114 -13 46 -179 46 131 -209 81 -54 -66 125 -32 129 -125 -131 -44 79 -46 105 -160
7663 -160 -5 -26 -10 -51 -17 -159 -4 -149 -164 27 17 106 249 -113 -98 -26 -88 165 142 -41 51 -171 23 112
7687 112 -15 -72 50 16 -55 55 -69 -70 81 5 -137 8 26 -267 12 79 -157 -61 -126 -38 64 9 53 1 -40
7712 -40 -8 -62 -220 136 -14 111 -46 -109 28 -14 -145 91 -122 -68 164 -71 91 87 -55 -24 6 -216 -10
7735 -10 -108 117 76 -98 120 -49 -177 -172 -30 -21 -25 -120 -166 43 -217 16 117 58 63 -150 -218 -39 -208 126 77
7760 77 -51 33 -19 14 -158 18 -18 45 -108 120 69 222 -96 -324 304 43 95 37 -88 -143 137 -81 226
7783 226 -54 -169 -154 154 -15 95 -42 -29 -86 -106 22 33 -3 7 -144 -4 170 -74 -126 -332 -161 -69 -58
7806 -58 204 98 185 -22 -117 -51 -29 87 87 26 -131 -24 -78 -30 137 -2 -87 55 6 109 -2 -110 103 34
7830 34 -167 -65 -14 111 -109 -67 39 -108 -82 66 -162 -74 93 -110 47 17 75 4 -51 -150 -98 -114 -79 -132 -181
7855 -181 53 -195 -221 48 -53 41 48 -63 -129 103 22 -66 -76 -74 137 -12 -10 2 28 -137 40 83 -52 -254 -74
7880 -74 40 1 60 51 -90 -15 -163 -147 -145 120 144 113 192 67 -42 203 -135 -102 65 -58 147 152 -75 -31 -177
7905 -177 -185 170 -177 -86 -7 -20 16 88 40 113 196 -85 195 82 191 90 -20 223 4 36 70 -55 218 -73
7929 -73 -116 30 -77 78 164 84 164 -35 -18 34 59 -18 220 120 1 -29 -52 -173 56 -60 209 145 -17 64
7953 64 -190 104 -11 -255 -34 -140 64 191 138 9 206 122 -243 -98 35 -103 -93 -38 -57 258 111 -21
7975 -21 43 178 -81 -12 -102 -27 241 -34 -19 71 5 37 -42 48 -35 87 84 98 -5 -95 -88 0 66 70 123 -10 40 85
8003 85 -66 -60 -35 -128 146 186 104 -135 -28 -38 11 -125 -4 47 -105 140 -149 -119 7 122 41 -73 -24 -119 177
8028 177 -246 76 61 -74 15 -71 -57 107 158 98 -24 -88 183 101 -78 -8 167 -14 4 -86 149 -196 -212 -193
8052 -193 135 -15 84 -159 -74 45 -222 -21 139 -113 -73 31 -61 -15 -13 -37 -150 -19 114 29 -84 66 -150
8075 -150 17 -282 68 100 -68 115 94 103 263 -47 196 -15 -32 -256 65 -92 -24 67 1 -205 -54 56 3
8098 3 27 40 61 192 -52 -47 -110 -2 51 -73 8 23 116 -65 -176 -118 -55 70 67 -45 -64 16 -121 18 -155 -152 66
8125 66 59 -142 26 -102 54 75 98 -16 -35 28 247 22 -37 -70 13 159 -73 122 -102 -125 49 -67 107 -67
8149 -67 86 -43 -88 -12 -32 30 32 8 -52 -181 -108 107 17 -144 11 69 -171 75 54 5 -114 -7 -104 -24 -6 24
8175 24 225 -32 -10 307 39 -1 146 -87 14 -194 45 40 -148 13 -174 -219
8191b19
$$ Imaginary data points
##PAGE= N=2
##DATA TABLE= (X++(I..I)), XYDATA
0 0 0 0 0 0 0 0 0 0 0 0 0 0 1 -8 8 -8 8 -16 16 -16 24 -24 32 -40 46 -49 61 -71 80 -92 105 -121 137 -153 175
35 175 -197 222 -247 277 -309 342 -382 423 -469 518 -573 631 -695 767 -845 931 -1028 1131
53 1131 -1248 1379 -1527 1694 -1886 2110 -2373 2688 -3073 3560 -4191 5048 -6291 8256 -11867
68 -11867 20739 -93702 -101973 -30393 -100513 -1775 8920 -788 28189 51511 38335 26629
80 26629 61912 53762 -45488 26656 65480 -36074 -5704 5017 -75304 -24987 -4349 -33182
92 -33182 -1710 28530 11607 -42560 -17763 39399 -26098 -11147 37049 -33150 3479 51020
104 51020 -15391 16204 52184 4240 -17222 -3141 26692 955 -22123 5852 -51707 -56420
116 -56420 7153 -43518 -16813 69009 27964 24934 61058 52647 48048 26449 17875 -4292 -26167
129 -26167 15406 -14732 -36939 28043 -18675 -61103 -14666 -31810 -24230 6948 -6266 5186
141 5186 10274 19606 17263 -11510 25995 18566 -29222 17310 19901 2833 41288 10798 -10203
154 -10203 6114 -15979 -17852 -21624 -15264 2445 -32442 -18484 3513 -23477 8502 9647 -17357
167 -17357 22667 17102 1288 18448 386 -354 -15039 -36606 -11066 -19782 -12230 12187 -15807
180 -15807 4260 15944 -16167 7158 7513 -1644 20415 3756 13904 27337 4341 14278 -4232
193 -4232 -19200 3215 -19556 -11805 10422 -10348 5689 -1129 -20613 2691 -13076 -15399 3887
206 3887 -10870 9945 15713 433 22589 8206 1148 13329 -8734 7496 14149 -6895 13384
219 13384 1388 -9948 8334 -12657 -4837 7978 -7998 8957 3497 -3890 12357 -10858 -6834
232 -6834 3043 -17519 4661 4444 -8989 14124 -2543 -8391 2734 -15621 -2039 368 -7642
245 -7642 15435 3278 4388 17755 -8310 3189 5722 -14209 8255 2730 -2207 14746 -3639
258 -3639 254 1425 -17307 -949 -9444 -12205 10307 -6794 1062 11759 -10557 3237 -910
271 -910 -12889 6059 -5339 -412 11358 -5044 9191 5266 -7551 11365 -2436 -1768 13745
284 13745 -5111 4783 5478 -11946 2582 -7996 -10305 5737 -8085 4413 10181 -5434 11258
297 11258 362 -8162 7380 -9384 -2599 6018 -9876 5207 -1096 -11039 3823 -11007 -5469
310 -5469 7034 -6211 12027 11956 1470 17735 1283 -1366 7352 -11867 -889 237 -11447
323 -11447 5463 -5650 -7875 4063 -12781 -2192 2687 -9088 10346 3703 -297 14356 -2834
336 -2834 1595 5756 -10223 3742 -1964 -7385 7868 -7193 -1598 6055 -10604 4500 3391 -5317
350 -5317 12192 1058 994 9246 -6966 1687 -2009 -11701 4823 -6591 -4204 9588 -7185 3220
364 3220 5876 -9277 5419 -624 -4713 6995 -5070 2855 3473 -9620 5641 -3998 -7905 10240
378 10240 -5078 2218 14483 -2045 7447 4758 -4905 3671 -9134 -5325 -730 -13334 2406
391 2406 -2476 -11170 10381 -2059 -4019 12187 -1023 5414 8560 -1296 7307 -1183 -1722 3128
405 3128 -11487 3549 4508 -11164 8815 2575 -5974 9694 -2763 -1829 5725 -4550 1844 -3140
419 -3140 -1490 8898 -8500 594 8224 -8877 7408 6548 -6008 10703 1379 -6230 333 -7098
433 -7098 88 -5483 -10400 5141 -5786 -979 12378 -4436 8547 13300 -6412 5262 4321 -1525
447 -1525 3687 -8699 -3985 -3536 -12873 45 -8042 -8160 7751 -10471 -5996 8465 -2988 5052
461 5052 2458 -4850 6196 -2411 -505 4880 -4613 7025 -479 -11245 7590 858 -2351 4509
475 4509 -9598 -1455 448 -9558 2700 -1399 -1146 5313 -9703 2417 11416 -694 7054 282
489 282 -2820 7451 -5462 74 5766 -5876 2457 -6634 -9513 11790 1666 -946 6182 -2781
503 -2781 5252 4065 -376 11452 2361 2912 3951 -8848 10399 10748 -8287 3316 -1902 -7562
517 -7562 2871 -4077 507 3094 -4286 -1541 -10713 439 13812 -7403 653 9263 -6938 6162
531 6162 7786 -2785 7598 1529 -6672 -6574 -2020 10572 -4025 -7715 6765 -11692 -6422 8201
545 8201 -10378 638 8194 -11279 -6312 3123 5626 582 -6543 3225 -5727 -8874 11187 -5479
559 -5479 -6033 12356 -13451 -16143 5368 -981 -1351 1667 1825 873 -1768 11671 3648 -4902 16010
574 16010 -3387 -17680 10966 2587 -8148 4781 -5831 -10404 -2411 1354 761 -1651 13496
587 13496 5922 -13948 10877 9718 -10847 7703 -109 -14469 4463 3395 -2896 3847 8485
600 8485 3750 -9490 5338 14096 -4805 9688 10440 -13986 4116 5835 -13173 1363 4853
613 4853 -5206 -5491 1268 9210 -1020 2627 8168 -14134 -3226 9250 -14029 -222 10815
626 10815 -9417 -4570 1969 -1138 1305 2506 6750 -2566 165 14299 -5423 -3667 12203 -11779
640 -11779 -11069 3052 -8385 -1277 5626 -838 -1324 -1632 4753 -2401 -6684 9773 -3274 -10417 7977
655 7977 -5205 -6458 6873 -7171 -6510 1611 -542 2655 1553 8084 5523 -6462 5497 40
669 40 -8804 8441 -759 -6624 8481 291 -1310 4172 -952 1200 -3525 -1296 3390 -5760 4274
684 4274 2628 -11342 2007 -2039 -10298 4027 37 -507 6619 1253 5027 2633 144 4676 -5851
699 -5851 20 5697 -6386 4537 4938 -6040 3850 -1731 -5254 3302 -2081 1904 2655 -1913 4883
714 4883 -3519 -4242 2428 -8538 -1426 2550 -5947 4618 2746 -3530 3884 -3294 -2114 1490 -4201
729 -4201 4392 1533 -812 7649 -2263 -264 4629 -5980 2294 3260 -3070 6524 624 -1148 3163
744 3163 -6223 -1364 -1894 -6656 3541 -1841 -1315 6308 -4467 291 2043 -6295 2703 525 -1528
759 -1528 6768 -277 2486 3774 -4667 2940 -1012 -3537 6422 -966 2061 6852 -3358 2349 -35
774 -35 -6324 1867 -3533 -1456 4109 -3718 2408 379 -6417 1686 -4946 -4466 3841 -3702 2309 4245
790 4245 -3307 3768 -1725 -3960 3357 -3894 1743 4607 -1780 5645 880 -3458 3483 -5100 -1736
805 -1736 3009 -4220 3775 1605 -3723 3328 -4679 -4016 671 -6465 1477 1223 -2802 5465 -1579 -2149
821 -2149 3339 -5735 480 2612 -2961 6168 1991 4 5310 -3197 517 1285 -4339 4597 736
836 736 -913 6947 -2313 -472 2011 -6558 490 -541 -3329 4217 -1433 987 2889 -5907 970
851 970 -1398 -6068 4418 -1467 -118 6609 -1760 1939 1951 -3471 3291 -1590 418 6559 -2078 3964
867 3964 3384 -5735 2741 -2187 -5851 2836 -2241 125 2711 -2843 2494 -2830 -4373 2293 -6008
882 -6008 -73 4824 -4752 3891 3391 -4222 2440 -1809 -1368 2715 -1432 4616 2108 -871 6224 -4320
898 -4320 -3291 4559 -6159 -358 3972 -2781 3686 1142 -1657 1066 -4098 679 -1539 -5400 6160
913 6160 -807 -4116 5427 -4835 -3655 2785 -4582 478 2965 1005 3808 -920 4151 3114 -6135
928 -6135 3911 -33 -5243 7220 -15 -2784 5749 -2510 -3496 -1500 -2339 1399 -4062 -42 2823
943 2823 -6216 2098 494 -8641 3348 138 -5987 4237 2569 2368 3533 -639 2128 -2817 -1082
958 -1082 4089 -5189 2438 6331 -7061 1555 3375 -4700 2022 -1000 -2424 2084 67 3994 -413
973 -413 -1466 4986 -7108 -4750 5222 -4214 1404 4621 -4477 2095 1586 -2276 1082 -1445 2890
988 2890 -26 -3608 7561 1904 -477 6711 -4161 -1590 5637 -2335 2401 3932 -5 1051 -5052
1003 -5052 -1516 647 -5819 774 -2796 -5819 5282 -982 -2167 5155 -2075 -717 225 -2128 5831
1018 5831 2209 947 3040 -4960 987 1045 -5559 3324 211 -3247 2290 -2836 1426 3816 -4344
1033 -4344 140 -2569 -3660 3788 -2134 712 3756 -4831 -1309 -2522 -3519 4336 -2570 -1803 2306
1048 2306 -4107 2295 2051 -3601 3787 -1204 -3386 2623 124 5299 3582 -2339 3442 -2375 -1413
1063 -1413 5062 -3258 1506 3996 -6139 -239 509 -2637 773 -4056 -2160 -1022 -2991 4961 402
1078 402 -1168 6848 -3659 -2688 6238 -519 2823 4301 -1420 1647 -74 957 1134 -3611 3564
1093 3564 -1485 -6374 6192 261 -2995 5328 -3602 -3269 2528 -1452 926 447 1486 1127 -5807
1108 -5807 1979 1547 -6549 3639 -894 -6826 4623 85 -2494 3690 -110 -529 -1296 806 4735
1123 4735 -1695 3668 4638 -5823 3520 2879 -6631 2896 910 -4932 455 -1024 -650 -1346 -1786 1142
1139 1142 -5668 -1290 4615 -5529 2125 6038 -5068 1894 3280 -2648 2915 1588 867 469 -287
1154 -287 4404 -2074 -1849 5176 -5092 -2447 4496 -5084 220 3697 -3306 494 137 -394 297 -2149
1170 -2149 3361 -1179 -3557 4785 -2923 -3517 4529 -4212 -2112 3232 -2749 812 1290 -18 1916
1185 1916 -2009 2191 1125 -3665 5062 71 -3373 5193 -1573 -2098 3435 -2661 -195 183 -2047
1200 -2047 1029 -2847 -228 530 -5647 1444 -215 -5178 3557 -474 -2047 4663 -334 1339 3003
1215 3003 -472 3218 6 476 3744 -3080 1687 2107 -4340 3009 225 -3296 3395 -1280 -544 2266
1231 2266 -1876 1912 -443 -1940 2740 -2882 -149 2857 -4059 1892 1296 -3231 2909 -153 -962
1246 -962 2895 -1560 1588 1329 -1471 3754 -1001 -1169 3558 -2784 800 2420 -3051 2121 -172 -2301
1262 -2301 2207 -2645 -370 941 -3575 1384 -1201 -2933 2562 -2865 -1117 2032 -3571 977 366
1277 366 -2874 2236 -1498 -701 2597 -2307 1875 1406 -2115 3522 -477 -914 3549 -2184 927 1289
1293 1289 -3267 1690 -1538 -2700 1680 -3499 -482 1194 -3286 2004 -39 -2010 2935 -1760 353
1308 353 2360 -2290 2476 683 -1854 3813 -1115 -113 3161 -1712 1944 1774 -1370 3226 -489
1323 -489 -224 2320 -3075 954 553 -3479 2311 -914 -1995 2892 -2006 168 1847 -2015 2271 -184
1339 -184 -814 3308 -2348 343 1882 -3798 1714 16 -2493 2997 -837 26 2665 -1226 2185 633
1355 633 -1623 3496 -1712 -420 2862 -3320 266 607 -4099 418 -1718 -2377 772 -2766 798 404
1371 404 -2819 2493 -1336 -1893 3731 -1860 178 3371 -1617 2035 813 -985 1809 -1767 637
1386 637 1128 -2938 2456 -179 -3743 2601 -1966 -2601 1705 -2274 346 907 -935 2189 -1455 276
1402 276 2300 -3697 1916 2001 -3267 2947 624 -2156 2359 -1234 -503 456 -1103 2338 -1245 40
1418 40 4418 -2703 356 3019 -3816 1635 1670 -2324 1759 -146 -806 -774 -2456 1384 -2135 -2576 2985
1435 2985 -2658 -855 4407 -2711 226 2810 -2046 483 865 1153 1781 -781 2746 107 -2800 3989
1451 3989 -1497 -3039 4366 -1887 -1985 2381 -1572 -769 -994 -1788 -867 -2867 1722 949 -3111 4218 943
1468 943 -3691 3980 608 -1507 3055 -506 -171 146 -105 825 -3125 522 1453 -4772 2444 3271 -2530
1485 -2530 3991 1614 -2911 1864 135 -777 -264 -674 1105 -3596 -1374 2473 -4056 138 2131 -4741
1501 -4741 1359 3049 -1308 2189 1353 -243 -460 -1444 1965 -480 -236 4231 -2614 -452 4267 -3052
1517 -3052 -189 2236 -3020 -373 -700 -1053 472 -1409 360 -2154 -3489 2848 -1184 -1111 4845 -1101
1533 -1101 -396 2871 -1433 840 908 -995 72 -1676 1304 1174 -2022 2845 -311 -3145 2396 -1271
1549 -1271 -654 3533 -1061 -23 298 -1620 923 -1298 -181 1394 -2534 1292 819 -2317 2560 -993
1565 -993 -3105 996 -2182 -297 1604 -589 2368 412 -74 2560 -444 2270 2702 -1679 2157 418
1581 418 -1919 1777 -2181 -2209 -393 -3896 -822 -177 -1471 1891 -840 -419 1429 -1820 1680 981
1597 981 -1623 3039 -377 -1155 2692 -1497 -2 1121 -2227 1011 379 175 2473 -990 919 482
1613 482 -3122 1856 -287 -1958 2927 -1140 -769 1990 -1630 122 -81 -1267 785 -1783 499 1558
1629 1558 -2533 1331 -21 -3275 2173 -206 -1023 3185 416 1361 2000 -51 1571 -1027 6 1566
1645 1566 -2720 1299 1203 -3647 1222 -449 -3674 901 -1661 -1422 410 -803 1321 -523 -537 1960
1661 1960 -2912 102 2069 -2909 1672 2127 -1933 1678 355 -1004 669 -1035 942 -311 -742
1676 -742 2671 -1453 -545 2382 -3333 -624 1543 -2555 962 902 -1246 630 -1387 -186 -516 -2411
1692 -2411 1679 -1096 -1261 3419 -1328 -106 2994 -1567 657 1608 -514 2268 953 1589 1759 -1505
1708 -1505 1854 -506 -2563 2227 -1531 -1682 1916 -1833 -547 1122 -1724 231 -648 -454 1725 -871
1724 -871 2164 1617 -1999 1982 -465 -2188 2214 -917 -636 1789 -1120 913 717 -458 1563 -1284
1740 -1284 412 1995 -1383 2127 1149 -2347 1182 -1825 -2439 277 -2297 -710 -202 -1859 920 -1326
1756 -1326 -1031 1513 -2225 623 1457 -1548 2175 565 -999 1698 -950 -1 1124 -1027 1841 238
1772 238 -557 2353 -1587 -381 1079 -3190 -293 -287 -2340 1072 -813 -459 727 -1557 1003 466 -1198
1789 -1198 2519 -318 -344 2287 -1685 -3 621 -2122 888 -321 -40 2301 -195 1834 1943 -1095
1805 -1095 2376 424 -1328 2296 -959 -188 1052 -1883 251 -497 -1871 1148 -1287 -136 1967
1820 1967 -1718 975 653 -2047 1096 -570 -965 1599 -702 1465 1439 -179 2783 -46 -213 2367
1836 2367 -1783 83 1001 -2403 220 -990 -2322 56 -1955 -171 581 -1312 2332 264 -914
1851 -914 2254 -1638 -1083 892 -2444 -551 -380 -1430 807 -841 276 1665 -1163 2049 1305 -1015
1867 -1015 3007 211 -1114 1633 -1809 -775 136 -1765 715 -988 -479 1548 -1973 506 899 -2767
1883 -2767 817 -133 -2036 1120 -889 -298 840 -1033 1709 307 266 3146 -416 876 2810 -1793
1899 -1793 749 506 -2272 209 -971 -861 638 -968 1370 331 -1323 2366 -491 -945 2068 -1823
1915 -1823 -816 953 -1912 -160 -630 -1263 670 -1439 1097 1582 -1213 2680 585 -1271 2441 -570
1931 -570 -802 1585 -840 171 99 -352 1424 -1181 76 1293 -2663 1063 748 -2917 1100 -569
1947 -569 -2283 454 -1264 -337 -39 -578 2131 -600 507 3160 -1581 817 2142 -2191 764 867
1963 867 -1223 815 -437 -191 -69 -1336 1567 -721 -1138 2839 -1644 -953 2308 -1911 -39 1012
1979 1012 -1661 -133 -419 -88 416 -1718 1446 -208 -2428 2407 -549 -1419 2951 -736 -507 2082
1995 2082 -6 954 340 400 1101 -1764 1235 942 -2652 1614 -375 -3193 1391 -749 -1706 819 -745
2012 -745 -301 -463 -143 1104 -1359 935 1743 -2502 1627 1809 -1898 2049 847 -1396 985 -379
2028 -379 288 144 -332 1164 -1733 -577 1930 -2082 571 2058 -2322 659 1089 -1316 975 -14
2044 -14 -364 -476 -1287 910 -1183 -1302 2200 -2063 -761 2124 -1642 685 1953 -964 1245 730 531
2061 531 1011 -468 1532 -42 -1615 2063 -1241 -1390 1930 -1992 -984 836 -1935 -85 -272 -866
2077 -866 507 -1335 692 975 -1224 2537 585 -1056 2615 -544 -240 1857 -1119 205 351 -1158
2093 -1158 668 -1031 4 825 -1814 1259 638 -1478 2288 106 -747 2003 -786 -182 431 -1537
2109 -1537 218 -720 -928 827 -1855 249 628 -1969 1632 217 -1107 2134 -44 167 1928 -446
2125 -446 1275 642 -546 1386 -846 169 1058 -1850 435 -219 -2357 763 -1225 -1349 952 -1378
2141 -1378 -53 666 -1031 1422 -425 -233 1414 -1325 1038 1559 -1450 1526 -110 -1487 1334 -756
2157 -756 -342 871 -1377 576 -218 -892 1608 -1013 295 1168 -1864 1115 559 -1423 1522 -474
2173 -474 -1353 511 -1533 53 155 -1425 1028 -1003 -313 2160 -914 966 1669 -1091 1471 1127
2189 1127 -376 1854 -139 83 440 -1090 1113 -354 -686 1583 -1656 -360 1300 -1859 423 291
2205 291 -1750 666 -626 -373 1141 -778 1221 163 -1017 1878 -519 -25 2187 -1247 125 788
2221 788 -1424 778 -136 -720 810 -1142 572 774 -1043 1703 -553 -1416 1238 -1399 -615 853
2237 853 -1530 -86 -177 -1575 396 -866 -82 879 -1293 1262 650 -780 2069 -290 -737 1458 -1264
2254 -1264 399 957 -617 1381 -518 -358 815 -1634 299 428 -1740 1083 -447 -1449 1319 -1121
2270 -1121 -587 679 -1041 824 162 -202 1731 -919 270 1042 -1692 971 389 -1286 1235 -241
2286 -241 -238 1377 -604 592 246 -653 1673 -500 156 1728 -1338 277 447 -1973 518 -311 -1189
2303 -1189 913 -1000 -50 277 -1195 1099 -449 -851 1838 -804 320 1831 -775 962 660 -818
2319 -818 1040 -592 -41 812 -1354 901 -178 -1631 1167 -1107 -950 1105 -1116 39 601 -1049
2335 -1049 893 -757 -356 909 -1307 700 804 -1433 1301 190 -1237 1232 -736 -426 648 -737
2351 -737 751 93 -167 1350 -951 472 1417 -1493 955 725 -1356 857 -575 -923 192 -1658
2367 -1658 -43 -726 -1315 1040 -745 -185 1850 -862 550 1150 -880 1346 211 -107 989 -627
2383 -627 537 340 -1408 1291 -343 -1039 1658 -779 -72 975 -1301 157 -305 -1292 485 -1086
2399 -1086 248 730 -1180 1102 287 -1285 1591 -483 -918 1243 -741 -153 308 -843 710 -687
2415 -687 -209 1177 -1013 1145 1431 -888 1479 162 -1062 767 -943 -482 65 -1204 451 -760
2431 -760 -938 1115 -1303 -262 1115 -1226 801 768 -706 1016 -155 61 654 -815 1013 481 -755
2448 -755 2122 -129 -194 1261 -1242 -250 384 -1137 296 -450 -553 602 -1451 326 420 -1371 1188
2465 1188 64 -903 1445 -414 -278 843 -874 110 -392 -554 1191 -761 296 1201 -1123 947
2481 947 577 -1084 1067 -52 -353 940 -632 442 -46 -1110 843 -1075 -679 1293 -1214 64
2497 64 988 -1529 276 7 -1028 397 -665 318 433 -535 1620 171 -513 2168 -680 -21 1388
2514 1388 -860 429 779 -626 301 -819 -14 83 -1275 883 -10 -1379 1280 -576 -917 1169 -898
2531 -898 -473 517 -495 577 -187 197 773 -1073 859 635 -1562 1410 230 -987 1216 -141 -553
2548 -553 627 -455 503 -320 -301 1271 -1134 261 917 -1755 232 302 -1457 509 -196 -599 539
2565 539 -700 174 -259 -600 1229 -669 150 1620 -1013 478 1352 -1084 898 460 -567 815 -235
2582 -235 344 360 -724 873 -668 -1105 959 -1325 -241 970 -1313 95 484 -866 282 -200 94
2599 94 565 -688 914 474 -649 1600 -352 -670 1331 -814 84 1009 -457 656 -298 -426 576
2616 576 -914 351 213 -1362 922 -380 -915 1318 -898 -660 405 -1107 -67 94 -393 750
2632 750 -744 -129 635 -1055 1092 279 -923 950 -267 -364 1209 -549 530 268 -651 575 -302
2649 -302 153 1053 -1122 41 -8 -1456 403 -218 -889 689 -907 -410 688 -523 497 -181 -499
2666 -499 929 -502 532 1072 -730 775 147 -1071 1028 -33 74 1059 -743 271 205 -574 1033
2683 1033 -594 -473 547 -1308 26 461 -910 740 -430 -832 743 -596 499 664 -685 577
2699 577 -345 -613 972 -703 300 575 -1000 891 421 -277 1300 -204 -82 636 -900 450 112
2716 112 -593 597 -1125 -713 487 -1291 135 193 -1106 716 -90 -459 772 -438 124 14 -967
2733 -967 724 -130 -62 1174 -599 221 896 -580 798 506 -676 774 -549 -118 432 -823 343
2750 343 -395 -929 999 -611 74 1096 -874 414 251 -992 572 -410 -440 471 -722 339 370 -486
2768 -486 993 92 -32 1206 -597 340 880 -708 647 -167 -541 564 -594 38 234 -921 620
2785 620 -47 -713 995 -611 -538 794 -1069 127 229 -700 372 -118 150 799 -524 1063 621 -814
2803 -814 1339 -6 -467 996 -429 -97 189 -715 385 -512 -131 607 -919 69 421 -1053 569
2820 569 18 -831 473 -731 -244 390 -522 716 4 -258 963 -406 126 1257 -715 542 636 -958
2838 -958 652 -89 -358 392 -659 267 150 -631 942 -414 -643 789 -1001 -398 445 -1327 244
2855 244 -319 -527 558 -484 290 446 -655 945 111 -645 1283 -399 -227 1084 -588 141 254
2872 254 -482 618 -181 32 449 -833 411 188 -1268 865 -246 -695 751 -449 -139 225 -592
2889 -592 689 -406 -273 870 -758 266 921 -929 886 368 -723 710 -162 148 577 -415 869
2906 869 -98 -517 962 -897 -199 929 -1071 13 275 -1000 404 -196 -576 205 -831 251 -24
2923 -24 -705 816 -308 -268 999 -557 183 892 -454 538 160 -157 514 -422 285 374 -799 730 -95
2942 -95 -692 797 -346 -469 472 -807 169 159 -646 302 -674 -83 561 -842 281 482 -838 827
2960 827 -103 -580 856 -390 108 318 -429 913 -293 -153 963 -691 1 676 -847 583 -254
2977 -254 -705 278 -687 -194 254 -628 338 -54 -617 822 -422 -377 964 -539 403 478 -582 840 -256
2996 -256 79 609 -543 870 639 -746 1002 11 -592 598 -681 -112 392 -800 368 -224 -541
3013 -541 565 -800 134 626 -736 621 198 -561 672 -102 15 580 -547 597 40 -535 990
3030 990 -316 67 1038 -652 378 515 -791 430 -12 -526 355 -623 50 32 -814 657 -480 -421
3048 -421 664 -568 -7 443 -901 309 158 -285 673 -278 455 580 -557 875 199 -594 874 -167
3066 -167 -484 547 -582 38 172 -478 254 -580 -248 392 -864 365 263 -902 650 -273 -765 590
3084 590 -565 69 168 -352 700 -46 -42 790 -488 287 710 -676 819 222 -860 528 -386 -33 603
3103 603 -500 525 -141 -715 610 -559 -67 800 -1098 -156 90 -906 554 -81 -330 331 -621 408
3121 408 352 -393 957 -93 -321 925 -531 1 855 -591 324 179 -424 622 -23 214 182 -1006
3139 -1006 221 -136 -598 652 -616 -412 621 -856 120 270 -450 535 -371 -179 632 -402 619
3156 619 155 -884 803 -404 -236 888 -437 -14 634 -487 458 -34 -247 486 -585 -168 327 -755
3174 -755 506 -209 -927 444 -721 -301 569 -411 290 253 -544 765 -341 293 841 -481 456 218
3192 218 -358 961 10 -97 546 -799 -155 175 -573 510 -278 -758 224 -786 -153 208 -661 446
3210 446 -146 -492 650 -294 103 442 -706 430 63 -429 1081 -258 -70 802 -573 410 335 -260
3228 -260 685 -208 -128 710 -552 400 562 -836 412 -417 -371 449 -482 127 301 -940 480 -463 -437
3247 -437 868 -611 349 482 -268 446 187 -298 785 -177 91 773 -350 776 217 -564 801 -542
3265 -542 -355 525 -567 18 68 -733 347 -500 -474 323 -655 336 223 -550 766 21 -328 718 -235
3284 -235 181 429 -199 589 -71 -246 736 -590 127 576 -672 591 221 -548 588 -205 -241 423 -638
3303 -638 374 -105 -531 717 -562 39 456 -870 205 152 -589 509 -5 -137 355 -385 485 436 -365
3322 -365 921 -80 -353 678 -271 83 615 -689 -47 -87 -722 444 -656 -57 326 -939 344 -215
3340 -215 -665 570 -366 -286 777 -306 133 459 -356 630 -128 -77 580 -516 431 497 -788 641 -28
3359 -28 -523 511 -421 -19 332 -361 351 -377 -184 670 -670 55 385 -661 111 153 -721 340 -211
3378 -211 -312 353 -221 609 285 -392 663 -377 -120 693 -675 22 485 -465 597 15 -167 319 -677
3397 -677 296 -39 -736 371 -412 -622 681 -727 -368 499 -536 74 -93 -118 632 -393 320 554 -494
3416 -494 760 278 -598 812 -175 -261 465 -380 78 260 -220 550 -464 -231 385 -793 232 69 -844
3435 -844 208 -53 -595 383 -272 10 243 -324 413 -135 -461 748 -474 239 477 -557 512 187
3453 187 -486 543 -57 3 506 -512 540 -99 -526 472 -431 -266 352 -968 -16 193 -617 275 -124
3472 -124 -144 293 -357 231 423 -357 625 30 -356 606 -392 81 524 -372 337 -80 -271 635 -425 2
3492 2 173 -941 211 41 -667 520 -485 -407 288 -625 125 -49 -603 599 -387 -104 551 -330 426
3511 426 286 -543 639 106 -273 511 -222 315 314 -399 545 63 -468 631 -285 -74 437 -488 -34 -325
3531 -325 -368 302 -466 -104 357 -576 407 73 -662 607 53 127 565 -293 305 368 -235 515 -175 -101 484
3552 484 -501 135 423 -596 333 -159 -466 398 -484 2 195 -548 184 -262 -457 577 -476 -70 244
3571 244 -561 309 280 -470 808 68 12 564 -455 486 354 -498 534 -303 -338 448 -459 169 356 -443
3591 -443 214 -254 -176 335 -535 116 155 -653 335 -186 -326 556 -210 -19 335 -381 582 284 -160 397 -138
3612 -138 -103 507 -313 506 406 -499 567 -142 84 488 -368 153 179 -523 388 -330 -227 335 -675 53
3632 53 215 -551 545 -16 -311 465 -274 38 270 -255 604 -277 -308 524 -222 211 421 -594 256 11
3652 11 -446 347 -263 -46 88 -604 15 -42 -438 385 -282 -402 124 -554 53 307 -397 394 -125 -463 315
3673 315 -236 265 367 -499 474 -87 -241 710 -104 66 336 -170 354 114 -149 310 -538 -150 199 -627
3693 -627 180 52 -460 196 -290 -177 316 -267 419 111 -318 375 -122 5 212 -601 88 288 -225 369
3713 369 64 -353 325 -268 15 131 -406 313 -124 -316 335 -415 -97 491 -603 183 -265 -352 326 -225
3733 -225 137 227 -511 256 347 -462 526 -200 -153 631 -133 147 382 -141 154 -330 -356 303 -382 247 187 -510
3755 -510 172 -228 -319 519 -299 -297 192 -528 299 124 -374 502 -204 -5 378 -504 409 284 -234 576 -20
3776 -20 -110 403 -438 184 -58 -360 235 -400 -180 505 -383 85 223 -403 241 -195 -196 232 -404 -38 264
3797 264 -428 428 86 -294 692 -175 -103 385 -132 249 238 -123 326 -233 64 424 -348 261 50 -446 509
3818 509 -119 -472 253 -442 -133 89 -214 140 -238 -225 472 -243 338 376 -349 341 65 -479 499 -7 -53
3839 -53 245 -319 418 35 -140 499 -331 -127 313 -562 -43 149 -568 125 -213 -353 284 -285 285 -129
3859 -129 -264 485 -126 -157 336 -661 77 215 -236 196 -4 -205 529 -300 384 227 -287 599 128 -393
3879 -393 495 -229 -125 223 -594 18 -242 -421 204 -196 80 152 -524 101 139 -350 584 0 -445 585
3899 585 -284 209 -24 -301 310 -124 33 316 -310 309 610 -362 103 -1 -332 475 -129 -88 138 -574
3919 -574 212 -208 -361 386 -394 -29 218 -398 150 83 -217 280 -158 -38 315 -312 397 184 -100 621
3939 621 54 -156 317 -266 27 183 -402 99 -186 -313 219 -544 249 163 -623 241 61 -392 281 -65
3959 -65 97 419 -263 309 35 -191 338 -139 32 266 -353 247 221 -394 375 -43 -220 167 -327 133 -84
3980 -84 -242 436 -337 -157 348 -592 -73 106 -320 -14 46 -386 132 -407 -120 249 -355 398 -209 -200 640
4001 640 -73 62 484 -348 278 11 -293 73 -295 -73 -10 -545 25 -27 -203 237 -269 -217 223 -182 90
4022 90 327 -177 134 -58 -293 375 -326 46 187 -443 435 171 -122 429 -232 55 237 -293 91 114 -187
4043 -187 173 -357 -174 230 -336 56 100 -520 289 -231 -192 111 -427 -3 3 -238 556 96 5 682 -195 129
4065 129 577 -109 204 33 -227 361 -374 -131 214 -213 29 -78 -418 316 -252 -35 214 -324 81 39
4085 39 -282 448 -138 -28 348 -409 84 71 -298 376 -204 -202 342 -188 86 182 -290 561 -135 -214 432 -53
4107 -53 227 325 -414 158 -3 -257 494 -267 -158 313 -313 86 -51 -295 503 -399 55 425 -128 283 370
4128 370 -76 533 -200 -112 308 -362 97 82 -667 255 -263 -236 321 -334 -30 -125 -293 410 139 -33 255
4149 255 -461 -126 60 -209 362 198 -278 498 -288 -99 366 -163 295 121 -129 507 -86 181 412 -400
4169 -400 45 86 -411 413 -154 -415 220 -276 -77 120 -259 262 -194 -276 235 -404 36 404 -325 319 -21
4190 -21 -299 474 -138 -61 427 -174 172 47 -338 545 -281 -221 409 -524 135 176 -265 504 -166 -151 257 -360
4212 -360 188 78 -703 92 92 -77 405 -238 -27 177 -384 428 -48 0 573 -350 226 145 -229 286 128
4233 128 -133 424 -161 -65 166 -286 152 8 -307 398 -374 -77 281 -577 -11 273 -396 354 40 -54 445
4254 445 -246 -3 168 -184 515 -23 -146 749 -350 129 220 -421 263 50 -388 195 -233 55 351 -370
4274 -370 -25 -72 -489 184 -83 -356 257 -314 72 -111 -249 277 -106 193 204 -204 287 46 -198 401 -92
4295 -92 -121 483 -217 -129 243 -303 326 -197 -166 97 -300 -212 105 -437 124 -69 -532 254 56 70 264 -419
4317 -419 261 66 69 456 -182 -25 380 -104 186 196 -251 353 -253 -26 272 -113 203 97 -348 286 -273
4338 -273 -317 322 -375 -207 3 -223 75 -132 -213 165 -319 89 200 -197 277 92 -341 592 -232 -182 323
4359 323 -313 66 67 -306 378 -162 68 149 -224 240 118 -348 250 -109 -294 342 -418 -66 103 -269 359
4380 359 -121 -191 582 -240 150 362 -303 62 50 -378 179 -193 -32 264 -331 368 -38 -359 159 -311 -415
4401 -415 38 -387 128 -53 -137 295 -186 -19 284 -338 205 109 -104 547 49 -15 653 -277 49 254 -214
4422 -214 188 57 -162 237 -239 30 247 -466 -145 35 -284 199 92 -276 138 -195 -52 65 -134 189
4442 189 -348 -50 453 -246 139 277 -258 353 -55 -126 381 24 92 237 -47 287 -34 -249 251 -344 79
4463 79 125 -295 175 140 -148 208 5 -39 48 -259 165 -91 -347 323 -284 -159 283 -323 49 174 -242 248
4485 248 44 -19 399 -83 255 319 -318 248 1 -176 427 -154 -83 143 -258 115 -18 -405 200 -389 2
4506 2 291 -238 44 348 -153 427 -213 47 333 -83 64 44 -289 364 -105 -98 179 -755 294 121 -122
4527 -122 218 -11 -225 222 -44 -123 -41 -483 234 60 -244 389 28 -58 187 -332 53 109 -35 290 -124
4548 -124 70 169 -401 354 -39 -48 486 -156 -165 297 -13 244 171 -418 420 -128 -191 96 -466 -137 76 -388
4570 -388 12 -33 -214 442 -13 107 49 -222 314 303 -101 367 -304 156 164 -377 135 66 -257 193 -218 -8
4592 -8 240 -250 18 55 -257 102 -41 -9 342 -365 138 273 -146 236 -10 -223 324 -292 140 218 -213 454
4614 454 70 -334 338 -44 -39 309 -158 258 -81 -119 190 -233 14 73 -472 28 34 -312 134 -233 -154 -75 -14
4637 -14 57 124 -120 323 -74 -59 246 -207 169 164 -229 383 -114 -21 191 -154 73 47 -276 235 64 -253 331
4660 331 -111 -39 138 -380 -33 218 -285 188 -173 31 168 -26 255 115 11 226 -140 -52 267 -125 141
4681 141 257 -396 265 -61 -25 139 -182 187 13 -359 149 -250 -241 236 -581 -114 215 -324 203 -95 -109
4702 -109 271 -144 164 182 -187 349 106 -155 339 -111 -52 246 -274 117 -76 -243 222 -205 -4 260 -272
4723 -272 5 -34 -412 94 -105 -249 94 -125 104 175 -243 168 72 -273 418 -63 96 132 -216 31 166
4744 166 -128 280 133 85 62 -144 245 -102 -409 196 -195 -85 158 -173 -30 -16 -264 120 -200 -350 344
4765 344 -261 -17 180 -401 222 101 24 215 5 47 174 -175 32 12 -218 253 10 252 323 -221 213
4786 213 -130 -198 98 -292 -28 113 -267 -58 51 -360 89 -156 19 247 -300 195 415 -162 244 -241
4806 -241 -162 449 -161 57 147 -241 157 0 -66 459 -186 42 179 -412 221 -11 -122 279 -185 -95 216
4827 216 -223 71 131 -152 192 117 65 186 -80 245 101 -68 189 -54 44 308 20 -75 279 -223 65 50
4849 50 -240 235 -98 -61 -182 -369 258 -254 -144 220 -38 -91 201 -67 36 34 -163 106 -86 2 246 -127
4871 -127 3 312 -87 319 -251 -131 265 -78 195 268 -119 69 145 -254 78 -136 9 35 -494 -44 12
4892 12 -276 279 -197 -36 118 -184 170 -198 -224 198 -190 -124 36 -149 127 140 -214 99 120 -366 25 -144
4914 -144 -32 -18 -208 221 -133 -197 187 -312 78 216 -124 41 94 27 211 -171 9 29 -217 141 -12 -152
4936 -152 277 -34 99 289 7 -27 33 -131 179 -42 69 246 -196 82 -1 -374 300 -232 -11 203 -323
4957 -323 125 263 -335 232 -239 -130 199 -257 418 174 -98 195 220 -69 287 -220 153 210 -385 59 -44
4978 -44 -44 169 -179 -126 48 -520 -159 12 -306 45 -21 -96 238 -149 15 2 -297 56 -184 -253 172 -93 372
5001 372 293 -157 104 106 197 262 -238 -147 113 -111 -78 38 -28 384 -306 -211 -39 -215 1 -222 -131 -34 -151 -129
5025 -129 162 -166 205 136 -193 183 35 106 470 -282 62 121 -229 445 -1 -48 4 -169 -39 163 -238 206
5047 206 -131 -242 7 -295 135 99 -93 25 -50 -193 425 -223 -147 177 -329 -27 59 -223 37 49 258 158
5069 158 -195 90 128 -198 152 -114 -414 276 -105 176 57 -288 138 -222 -264 167 -263 -7 83 -335 199
5090 199 30 69 131 -90 -7 153 -183 295 125 -186 141 -78 -100 314 -209 198 164 -224 165 -143 -37 15
5112 15 -161 -83 75 -114 121 -192 -278 390 -275 73 316 -215 202 360 -160 410 -85 65 348 -191 273
5133 273 206 -328 268 -223 48 337 -64 163 -27 -392 -96 -67 -191 25 -99 -83 -49 -300 145 -170 -46
5154 -46 89 -196 173 128 -194 63 141 196 251 -139 219 252 -68 23 -60 -248 247 -139 -36 111 -334 38 11
5177 11 -99 83 -344 -214 292 -198 140 91 -271 204 -62 -95 234 -168 185 -269 -152 230 66 -129 293
5198 293 -70 44 267 -352 40 150 20 194 -50 14 28 -264 -42 -329 -251 276 -255 -278 148 -298 26
5219 26 217 -151 192 134 -170 128 -283 233 -175 -246 209 -130 -203 295 -165 289 73 -326 223 -165 -98 157
5241 157 -277 -3 225 -281 79 -5 -222 232 -100 5 48 -265 178 121 -18 175 44 107 183 -216 376 97
5263 97 -32 73 -50 -109 140 -169 -21 89 -253 128 -63 -142 243 -353 128 146 -221 263 -64 -115 75 -182
5285 -182 -67 90 -185 86 -33 -180 242 221 -26 101 -161 88 193 -99 318 -21 -12 180 -377 107 25
5306 25 -322 268 -141 -104 141 -262 143 231 -81 212 -255 -41 151 -99 -42 98 23 61 29 -27 182 -201 48
5329 48 79 -186 124 -117 7 152 -188 76 -78 -199 177 101 -66 28 -122 54 -46 -285 137 22 10 227
5351 227 -2 -140 362 34 -13 208 -198 289 -24 -214 165 21 26 -14 -124 -29 15 -176 154 -88 -86 -34 -290
5374 -290 103 123 -259 -137 -159 34 246 -239 159 125 -113 227 17 48 227 -147 208 127 -118 147 -95 -195
5396 -195 178 -130 66 9 -259 184 36 -4 231 106 30 -97 -43 95 15 -116 109 -138 -174 282 -87 138
5418 138 4 -158 236 -116 239 250 -262 184 200 -11 168 -150 -22 37 5 61 261 -265 -36 23 -153 -38
5440 -38 -70 36 211 -301 46 -89 -138 43 97 -56 193 -93 130 44 -67 323 9 -40 155 -179 305 169
5462 169 -22 383 -26 23 95 -88 109 18 -76 116 -15 -126 362 -262 96 358 -59 151 82 -51 302 70
5484 70 -32 116 -26 27 -45 -351 164 43 -224 121 -207 66 82 -28 70 -182 -249 105 -247 213 50 -181
5506 -181 292 -215 -108 317 -114 41 116 -115 345 12 -133 349 -132 -39 151 -63 159 207 -288 217 39
5527 39 -160 -103 -147 49 128 -215 12 98 10 163 -339 -154 -10 -205 -15 -31 2 277 -66 100 -90 -115 45
5550 45 -99 -235 284 -134 6 224 -179 140 183 -277 -12 -328 17 90 -272 106 -80 -62 66 -177 -30
5571 -30 279 -178 174 135 -428 241 -93 -143 -156 -165 -104 144 -105 285 -38 36 125 -142 93 -114 -92 -20 -23 -227
5595 -227 171 -99 -71 50 -118 58 -30 -338 73 -53 -237 39 -148 64 -108 -143 301 -74 40 232 90
5616 90 118 95 -241 228 -174 -74 172 -315 153 99 -109 74 22 -299 43 -199 122 -70 -383 11 -133 -404
5638 -404 195 -152 -181 347 -49 254 71 -347 138 -11 -156 335 -345 165 -32 -311 101 -147 -40 111
5658 111 -222 -65 97 -141 236 49 -77 108 -234 110 13 -141 116 -199 -64 -48 -189 162 36 -114 28
5679 28 301 -93 31 -49 96 102 -146 237 206 -266 67 -17 -152 282 -243 91 93 -253 -14 6 -122 214 -128
5702 -128 83 24 -217 79 -49 -104 339 -62 -207 113 90 27 68 -45 169 -161 -85 32 -70 172 -28 -303
5724 -303 85 125 -96 112 -134 194 242 -128 342 -56 -146 -156 -216 173 167 -280 84 -32 10 219 -79 15 2
5747 2 -113 193 37 -98 157 -97 130 11 -188 214 -6 -99 111 -179 82 -44 -399 64 -110 -265 73
5768 73 -25 59 152 -65 256 72 -72 123 5 -176 193 -60 157 93 -134 340 -120 -64 271 104 39 135 -66
5791 -66 225 -181 -143 64 -205 -35 199 -113 209 -25 -32 238 -99 95 68 -208 -7 32 121 37 -82 31 245
5814 245 -25 45 257 -62 13 -257 31 118 -190 -60 -115 -330 71 -86 -243 108 -111 25 145 -299 -85
5835 -85 -44 -132 204 -79 -34 92 -202 39 -9 -211 182 -10 -177 273 -1 32 -3 -225 181 -138 147 202 -219
5858 -219 34 149 -257 -56 -26 74 93 -48 -71 -151 -31 67 -247 -96 64 -174 110 153 -97 157 13 -45
5880 -45 148 76 3 -148 -2 82 -138 -340 86 -140 -156 142 -19 10 15 -166 114 -182 -27 334 -111 -120 37
5903 37 -104 201 79 -30 -12 -59 8 51 -165 246 171 -186 151 -87 128 65 -71 -17 108 -292 -11 -44 -178
5926 -178 -46 -146 206 -8 -168 36 -4 -98 1 -126 -52 24 -196 263 113 10 166 -102 132 290 -85 204
5948 204 64 -73 -26 21 -88 4 -281 72 116 -177 174 -119 5 -124 -58 65 -52 -30 118 -86 -43 122
5970 122 -69 207 137 50 80 128 -60 87 -33 -4 92 -171 -43 324 -88 58 -230 -52 114 -130 235 37
5992 37 -55 226 -34 -56 15 -93 -55 54 -140 182 -167 7 157 -72 218 50 100 49 -27 69 56 -219 106
6015 106 186 -275 97 19 -221 -131 27 -33 41 -94 264 -70 -164 236 1 -36 216 -8 18 59 70 104 129 -128
6039 -128 35 -24 39 59 -53 103 -13 -158 12 31 -37 28 107 10 33 15 121 -148 68 31 23 30 -81 60 212
6064 212 44 -27 -40 -80 -71 -11 -112 33 -26 -40 36 -91 36 64 -65 -27 26 -162 -120 -289 -13 -117 -130 69 -58
6089 -58 -63 139 -121 -56 -260 -133 195 64 21 80 -157 56 2 3 61 36 -139 9 -199 124 221 70 -9 20 -117
6114 -117 -62 -15 121 223 -354 47 112 -2 105 -205 -201 181 -85 117 153 -62 -50 -121 -134 244 -124 -88 83
6137 83 -59 175 -66 -133 112 -217 115 64 -381 102 -22 -37 9 -85 -11 141 -182 50 161 -147 55 -86
6159 -86 59 6 -110 177 144 -123 351 67 -59 93 -88 172 15 -268 70 -5 -84 227 -89 11 -17 -135
6181 -135 48 131 -93 215 -17 159 109 -43 69 -103 -73 -11 -202 -123 -18 -52 302 368 -66 141 60 -10 120
6204 120 -127 210 51 -29 -38 23 -147 69 -220 -186 89 -83 109 -73 -183 95 -99 -30 -55 -228 50 102 60
6227 60 238 18 106 158 -106 163 91 -75 112 140 23 23 -92 278 270 -159 194 79 -177 127 -185 -199 -30
6250 -30 -126 213 1 -134 253 -146 150 173 -146 -91 -12 -121 -50 -105 -84 147 -143 66 -58 -90 179 70 -69
6273 -69 106 -81 -96 -143 45 110 -132 -18 58 -33 4 -177 -130 126 137 -222 213 -84 30 220 18 -119 177
6296 177 -63 93 13 -128 127 -166 72 -262 -79 -128 -177 16 66 -219 -87 -111 7 15 51 36 25 -284 68
6319 68 237 -35 118 -153 46 39 -4 185 11 -26 162 -31 111 107 -103 74 -106 -309 74 2 -50 81 -7
6342 -7 -33 -127 -49 -41 33 -74 -133 -162 7 -56 -140 34 107 -35 23 -201 -288 148 33 193 -23 72 138 26 -16 248
6368 248 118 -33 69 43 -174 11 -121 -18 -182 -247 202 -69 -7 -202 -145 65 -53 20 -52 -146 190 -76
6390 -76 27 169 21 129 211 -46 45 31 -123 115 -108 -10 83 138 -5 33 -295 38 -88 -178 39 -81 -52
6413 -52 -7 -47 99 -308 142 36 -7 157 19 -135 47 -38 -257 175 0 -221 -28 -5 145 176 107 41 -254
6436 -254 244 25 -133 22 8 -227 -85 -35 -33 12 -16 -209 96 29 106 -63 -36 22 7 19 49 -117 172 107 -30
6461 -30 151 -118 61 285 221 -12 156 -191 -10 -35 -117 18 16 -38 86 -61 7 -101 -52 161 37 -2 88 -42
6485 -42 -84 64 160 2 101 161 129 0 86 52 -159 -69 68 108 104 -141 213 63 -59 154 -85 -15 -35 -204 27
6510 27 54 -182 -68 -103 83 94 -302 90 208 -190 176 231 -219 1 153 -46 23 -178 51 -89 80 170
6532 170 -190 -23 -87 -156 -58 -27 -148 -134 -2 -6 235 -346 110 22 4 -90 -61 -76 79 -172 -69 47 -201 21
6556 21 35 -36 24 -17 -84 -127 -17 245 -28 -90 25 -134 249 14 -251 131 -93 -225 -64 -101 109 110 -12 155
6580 155 -14 -173 255 -169 -43 39 -284 162 -212 -12 -134 -168 93 -110 -258 124 40 -109 55 -120 -178
6601 -178 219 -262 -96 27 -227 -5 -114 -225 115 -12 191 121 48 31 -28 -107 177 28 -89 158 -46 175
6623 175 -9 -263 173 146 -209 123 -35 123 133 37 70 -85 14 291 48 68 97 -213 105 -210 49 87 -42
6646 -42 -173 153 -230 183 69 61 126 123 -180 126 196 -39 -13 -102 105 -131 171 86 -143 -30 143 -132 -59 50
6670 50 4 -92 -193 25 133 -106 -63 -58 -134 337 -130 -136 69 -139 111 78 -113 111 -12 97 89 17 -51 103 -16
6695 -16 172 82 -13 92 -10 -5 -78 -35 107 -47 -99 9 39 -28 86 -128 91 77 18 164 -272 187 11 -245
6719 -245 121 -98 42 52 3 45 53 -138 116 -35 -104 122 -21 -141 80 -104 -27 112 -342 35 11 53 37
6742 37 -208 47 3 -36 231 -46 -136 178 -119 93 3 -124 -45 37 126 119 -246 -211 244 -42 -139 -94 18 247
6766 247 -123 -21 -38 -149 -18 -106 10 -58 -177 93 -77 -193 13 78 92 63 125 -60 188 -13 39 221 -40
6789 -40 -79 -20 -105 187 -195 47 207 22 165 115 -94 87 8 36 -161 -9 204 68 -116 82 -211 128
6811 128 91 72 109 29 -67 -75 -18 -2 -15 -242 72 -50 -96 126 -203 -81 134 -167 21 176 -73 9 101 -15
6835 -15 115 -23 104 82 -95 -28 -56 128 -90 -120 147 170 -68 23 13 57 56 -225 170 114 -54 -172 34 -102
6859 -102 -50 28 -104 105 47 15 -99 -2 15 231 26 103 -275 39 51 32 -23 69 81 37 -27 102 239 -291 56
6884 56 -210 39 -137 -289 -16 -13 3 -191 68 76 144 -218 -51 -28 27 -6 -199 20 256 -173 20 18 -175 -1
6908 -1 -91 -206 -125 -102 106 -92 125 121 -16 -206 271 -55 -79 45 59 -79 -39 -80 -21 -134 -104 -53 5 26 -58 -169
6934 -169 -57 90 55 -50 -114 100 -87 -82 103 171 90 197 -136 -59 -168 -14 35 50 56 56 -32 148 57 -225 36
6959 36 46 -82 85 41 -63 96 95 -131 25 -81 -79 61 -175 -111 -41 -61 -14 94 143 79 21 92 -72 -169 60
6984 60 -189 27 -23 -241 78 -30 -89 112 -260 -59 -100 -8 115 -7 -89 -64 60 167 44 14 -19 57 -154
7007 -154 -36 211 -5 5 -66 -93 114 -32 40 93 -66 105 -68 38 -40 -79 -62 -164 -148 91 66 -20 34 71
7031 71 180 -23 -184 105 -166 -160 -59 -9 40 140 152 -146 -30 -71 -157 3 37 6 -163 176 42 28 104 -21
7055 -21 17 -52 -353 -91 -21 -134 71 268 42 73 125 21 -169 22 -94 -94 -28 225 69 115 -38 -162 69
7078 69 53 -207 109 -118 0 -74 -24 316 14 142 -80 -197 -140 -72 -54 -68 107 -63 168 -130 -49 36 -88
7101 -88 -127 -54 -61 154 -238 17 127 -12 -148 14 -110 72 -41 -165 35 -446 -304 6 -218 78 -152 -60
7123 -60 -76 -129 24 -11 -39 109 -85 51 172 30 1 -25 -83 -16 79 -217 58 115 4 -71 -68 -98 -14 -203 74
7148 74 -254 -88 -69 -8 -19 183 -56 117 -193 49 96 -21 -85 -212 146 110 122 -65 147 7 64 115 -33
7171 -33 20 64 69 131 -124 130 230 109 219 45 -118 149 0 -93 16 -39 196 126 72 23 -148 115 -111 -167
7195 -167 112 67 -152 44 27 -92 108 129 97 -110 -53 109 -268 92 87 27 -274 128 35 220 34 105 213
7218 213 -278 84 64 -105 -50 57 -165 52 -24 190 -106 -10 -134 36 -106 88 -230 82 -104 -53 -53 -77 108
7241 108 -40 -59 92 -53 -49 -184 -88 -183 161 -88 -47 94 -147 -13 57 -103 200 -77 1 231 -153 29 -106
7264 -106 -55 -45 1 -41 98 -132 -8 176 -175 40 128 -79 114 -10 -61 -224 30 -30 -141 -24 -50 -156 3
7287 3 -59 -173 27 38 88 109 -66 24 117 -53 72 21 -139 150 -157 220 -47 -46 -50 30 -110 -20 -58 -49 217 -12
7313 -12 -249 -188 -22 -10 -85 -111 -153 -26 -49 375 -192 60 40 89 160 -87 48 82 -159 -137 138 -142 81 -105
7337 -105 -80 59 100 134 122 -3 127 -64 106 8 -150 50 -127 -77 -127 57 171 27 -58 7 115 171 144 192
7361 192 96 0 -59 -12 130 126 -122 -112 56 110 -18 173 43 -123 -157 133 -32 28 -4 -119 -54 -224 64 29
7385 29 -126 121 -54 21 189 -181 -64 8 -38 -59 -149 18 141 -93 -219 73 -95 -68 107 -25 73 12 59
7408 59 -114 -147 -9 -42 22 65 -299 54 -9 -33 247 64 -209 -21 -145 129 -53 116 8 -24 -85 -22 131
7431 131 118 134 2 0 80 -91 113 -275 -105 21 -47 50 -29 -118 143 179 -67 64 -179 -131 230 -209 57 -50
7455 -50 -5 -136 149 -88 32 94 -58 124 14 36 23 -132 37 -137 -75 233 -79 -176 -72 99 6 -28 111
7478 111 -126 -176 -25 -107 48 -108 14 -19 148 27 -19 211 -106 278 32 110 85 6 -69 124 -13 -105 -212
7501 -212 16 128 -138 133 34 110 25 141 -16 193 -90 -38 55 65 -205 -2 15 -119 -51 97 82 -50 198
7524 198 222 -53 81 -185 60 85 -119 -77 -158 71 143 -14 -6 138 -29 53 -142 -268 74 -159 164 65 14
7547 14 36 117 -185 134 154 -61 38 -38 167 116 26 39 -64 32 -158 -242 -151 261 5 103 -81 -352 -78 5 19
7572 19 68 -149 -8 175 57 8 -181 27 -50 37 -157 34 -21 52 28 1 7 28 -74 90 1 -68 142 -208 -34
7597 -34 45 -160 -60 -14 -163 71 36 -114 -172 -62 -4 -233 -71 -53 -281 -143 -25 53 -2 -117 128 -101 -54
7620 -54 148 -2 -76 115 57 -116 71 -67 -56 -50 -41 145 31 -88 -165 53 75 -123 -181 138 -28 116 79 -162
7644 -162 21 -29 -61 28 27 -27 169 -23 189 103 -210 81 11 68 -18 -90 -128 -6 155 134 -128 -239 -146 22 8
7669 8 167 109 127 87 90 61 -40 37 64 -104 55 -15 -29 64 53 107 400 -41 134 68 102 24 -57 -54 78 -124 -1
7696 -1 -28 -103 -129 -5 -2 32 -41 54 -47 49 102 0 -193 80 19 113 -125 -25 -12 122 76 246 -56 37 46 -36 104
7723 104 -61 -101 -222 49 235 -54 43 84 -63 92 -96 -48 2 -36 11 -14 168 -131 138 114 6 -29 -315
7746 -315 38 -112 -157 77 168 -82 65 21 4 -81 -61 145 32 33 -107 -27 -239 174 -248 48 130 124 188 11
7770 11 -85 174 -169 19 261 61 -47 71 -39 -80 -43 32 93 -17 32 -47 -125 155 -79 30 84 62 189 -108
7794 -108 -5 -3 214 -109 29 -146 -22 -37 -144 31 -99 -10 165 -197 128 -88 -86 248 -104 -189 232 -115
7816 -115 46 213 2 60 0 52 153 192 -69 -72 -163 50 -25 73 -49 -7 71 22 -6 -102 -102 -55 -79 2 94 120 -162
7843 -162 103 54 -1 -38 -18 4 -134 -65 84 -118 -7 37 46 153 12 -265 -8 74 -209 30 -81 -74 83 -111
7867 -111 -54 202 58 -66 24 27 64 17 71 -41 83 136 89 -134 15 355 74 187 189 85 -66 -27 33 -24 77
7892 77 -215 -220 93 16 -104 42 99 -176 28 -39 98 85 -218 14 -168 -137 9 -88 -123 -145 -40 139 -164 131
7916 131 -177 99 -89 159 -130 -196 156 -189 85 0 -17 -140 -130 105 -86 -152 90 26 -99 -29 -12 198 137
7939 137 88 -13 90 180 -40 -6 19 3 5 -37 149 -196 50 -113 -9 38 -105 8 -268 -155 -109 -169 -61 105
7963 105 -74 162 170 -43 138 -105 94 -48 -96 -61 60 -53 66 -82 65 224 -125 -97 130 17 -44 97
7985 97 33 -47 -26 41 52 -157 45 4 -89 -35 -56 -102 166 28 -29 121 23 160 -147 82 95 -43 57 111 -199
8010 -199 160 172 62 85 -44 -30 -10 -45 31 -121 53 91 -115 37 -91 -145 54 -62 97 118 -76 120 -285
8033 -285 -129 52 -18 -92 133 -28 91 -174 -139 72 -80 -124 131 -21 -127 -14 -107 14 45 44 91 45 -77
8056 -77 -119 -106 -165 -6 108 10 -106 83 50 -142 -3 62 -57 19 -40 -14 52 133 83 35 -66 53 -73 45 175
8081 175 -266 -13 -79 72 47 171 -48 112 5 -31 -73 30 -134 -131 -27 -202 -134 -30 121 -29 -14 169 -281
8104 -281 118 -4 -77 15 56 156 47 -50 42 73 69 -58 -186 -8 -3 -172 31 170 -87 17 -26 -4 -235 10
8128 10 -29 29 -132 -167 47 79 -4 -134 1 -29 -129 102 46 134 94 127 -58 58 -145 204 -25 -27 93 245
8152 245 120 17 -137 37 -75 -154 158 -85 -83 -105 46 -62 309 75 17 120 -157 33 40 -41 -85 -85 0 201
8176 201 -75 56 -58 -149 2 53 36 40 18 -56 41 48 -17 -155 12
8191A2
##END NTUPLES=NMR FID
##END=
