##TITLE=1H_Bau-NOH
 DMSO-d6
 8 sc, 
 10.06.2022
##JCAMPDX= 6.0         $$ Bruker NMR JCAMP-DX V2.0
##DATA TYPE= NMR FID
##DATA CLASS= NTUPLES
##ORIGIN= UXNMR, Bruker Analytische Messtechnik GmbH
##OWNER= root
$$ XWIN-NMR		Version 3.5
$$ Fri Jun 10 14:22:57 2022 Russian Standard Time (UT+4h)  she@DPX200
##.OBSERVE FREQUENCY= 200.13135
##.OBSERVE NUCLEUS= ^1H
##.DELAY= (6, 6)
##.ACQUISITION MODE= SIMULTANEOUS
##.ACQUISITION SCHEME= undefined
##.AVERAGES= 8
##.DIGITISER RES= 18
##SPECTROMETER/DATA SYSTEM= spect
##.PULSE SEQUENCE= zg30
##.SOLVENT NAME= DMSO
##.SHIFT REFERENCE= (INTERNAL, DMSO, 0, 15.7039)
##AUDIT TRAIL= $$ (NUMBER, WHEN, WHO, WHERE, WHAT)
$$ ##TITLE= Audit trail, XWIN-NMR		Version 3.5
$$ ##JCAMPDX= 5.01
$$ ##ORIGIN= Bruker BioSpin GmbH
$$ ##OWNER= she
$$ F:/spectra/data/she/nmr/H-F/1/audita.txt
$$ ##AUDIT TRAIL=  $$ (NUMBER, WHEN, WHO, WHERE, WHAT)
(   1,<2022-06-10 14:21:36.04 +0400>,<she>,<DPX200>,
      <created by zg, POWCHK disabled, PULCHK disabled
       configuration hash MD5:
       00 E9 B6 7A A2 85 ED C7 34 08 36 98 17 FE 4E 26
       data hash MD5: 16K
       29 5A EB FD BE 32 0E 01 4B FF 0D 98 B4 03 61 BD>)
$$ ##END=
$$ 
$$ hash MD5
$$ CA 04 AA 83 6A 98 87 10 BB 15 30 9C 0F 2A 9D 2A
##$RELAX= 
##$RELAX= 
##$RELAX= 
##$RELAX= 
##$RELAX= 
##$RELAX= 
$$ Bruker specific parameters
$$ --------------------------
##$DU= <F:/spectra>
##$EXPNO= 1
##$NAME= <H-F>
##$PROCNO= 1
##$TYPE= <nmr>
##$USER= <she>
##$AMP= (0..31)
100 100 100 100 100 100 100 100 100 100 100 100 100 100 100 100 100 100 
100 100 100 100 100 100 100 100 100 100 100 100 100 100 
##$AQSEQ= 0
##$AQ_mod= 1
##$AUNM= <au_zg>
##$AUTOPOS= <>
##$BF1= 200.13
##$BF2= 200.13
##$BF3= 200.13
##$BF4= 200.13
##$BF5= 200.13
##$BF6= 200.13
##$BF7= 200.13
##$BF8= 200.13
##$BYTORDA= 1
##$CFDGTYP= 0
##$CFRGTYP= 5
##$CHEMSTR= <none>
##$CNST= (0..31)
1 1 145 1 1 1 1 1 1 1 1 1 1 1 1 1 1 1 1 1 1 1 1 1 1 1 1 1 1 1 1 1 
##$CPDPRG= <>
##$CPDPRG1= <>
##$CPDPRG2= <>
##$CPDPRG3= <>
##$CPDPRG4= <mlev>
##$CPDPRG5= <mlev>
##$CPDPRG6= <mlev>
##$CPDPRG7= <mlev>
##$CPDPRG8= <mlev>
##$CPDPRGB= <>
##$CPDPRGT= <>
##$D= (0..31)
0 1.2 0 0 0 0 0 0 0 0.06 0 0.03 0 0 0 0 0.0002 0 0 0 0 0 0 0 0 0 0 0 0 
0 0 0 
##$DATE= 1654856495
##$DBL= (0..7)
120 120 120 120 120 120 120 120 
##$DBP= (0..7)
150 150 150 150 150 150 150 150 
##$DBP07= 0
##$DBPNAM0= <>
##$DBPNAM1= <>
##$DBPNAM2= <>
##$DBPNAM3= <>
##$DBPNAM4= <>
##$DBPNAM5= <>
##$DBPNAM6= <>
##$DBPNAM7= <>
##$DBPOAL= (0..7)
0.5 0.5 0.5 0.5 0.5 0.5 0.5 0.5 
##$DBPOFFS= (0..7)
0 0 0 0 0 0 0 0 
##$DE= 6
##$DECBNUC= <off>
##$DECIM= 32
##$DECNUC= <off>
##$DECSTAT= 4
##$DIGMOD= 1
##$DIGTYP= 9
##$DL= (0..7)
0 120 120 120 120 120 120 120 
##$DP= (0..7)
150 150 150 150 150 150 150 150 
##$DP07= 0
##$DPNAME0= <>
##$DPNAME1= <>
##$DPNAME2= <>
##$DPNAME3= <>
##$DPNAME4= <>
##$DPNAME5= <>
##$DPNAME6= <>
##$DPNAME7= <>
##$DPOAL= (0..7)
0.5 0.5 0.5 0.5 0.5 0.5 0.5 0.5 
##$DPOFFS= (0..7)
0 0 0 0 0 0 0 0 
##$DQDMODE= 0
##$DR= 18
##$DS= 0
##$DSLIST= <SSSSSSSSSSSSSSS>
$$ [...]
##$SUBNAM2= <"">
##$SUBNAM3= <"">
##$SUBNAM4= <"">
##$SUBNAM5= <"">
##$SUBNAM6= <"">
##$SUBNAM7= <"">
##$SUBNAM8= <"">
##$SUBNAM9= <"">
##$SW= 18.05172834244
##$SWIBOX= (0..15)
0 0 2 0 0 0 0 0 0 0 0 0 0 0 0 0 
##$SW_h= 3612.71676300578
##$TD= 16384
##$TD0= 1
##$TE= 0
##$TE2= 300
##$TE3= 300
##$TEG= 300
##$TL= (0..7)
0 120 120 120 120 120 120 120 
##$TP= (0..7)
150 150 150 150 150 150 150 150 
##$TP07= 0
##$TPNAME0= <>
##$TPNAME1= <>
##$TPNAME2= <>
##$TPNAME3= <>
##$TPNAME4= <>
##$TPNAME5= <>
##$TPNAME6= <>
##$TPNAME7= <>
##$TPOAL= (0..7)
0.5 0.5 0.5 0.5 0.5 0.5 0.5 0.5 
##$TPOFFS= (0..7)
0 0 0 0 0 0 0 0 
##$TUNHIN= 0
##$TUNHOUT= 0
##$TUNXOUT= 0
##$USERA1= <user>
##$USERA2= <user>
##$USERA3= <user>
##$USERA4= <user>
##$USERA5= <user>
##$V9= 5
##$VALIST= <valist>
##$VCLIST= <CCCCCCCCCCCCCCC>
##$VD= 0
##$VDLIST= <DDDDDDDDDDDDDDD>
##$VPLIST= <PPPPPPPPPPPPPPP>
##$VTLIST= <TTTTTTTTTTTTTTT>
##$WBST= 1024
##$WBSW= 4
##$XGAIN= (0..3)
0 0 0 0 
##$XL= 0
##$YL= 0
##$YMAX_a= 42315
##$YMIN_a= -71498
##$ZGOPTNS= <>
##$ZL1= 120
##$ZL2= 120
##$ZL3= 120
##$ZL4= 120
##$ABSF1= 10
##$ABSF2= 0
##$ABSG= 5
##$ABSL= 3
##$ALPHA= 0
##$AQORDER= 0
##$ASSFAC= 0
##$ASSFACI= 0
##$ASSFACX= 0
##$ASSWID= 0
##$AUNMP= <proc_1d>
##$AZFE= 0.1
##$AZFW= 0.1
##$BCFW= 1
##$BC_mod= 2
##$BYTORDP= 1
##$COROFFS= 0
##$CY= 11.3945322036743
##$DATMOD= 1
##$DC= 2
##$DFILT= <>
##$DTYPP= 0
##$F1P= 2.36226072786647
##$F2P= -0.459571619588291
##$FCOR= 0.5
##$FTSIZE= 0
##$FT_mod= 4
##$GAMMA= 1
##$GB= 0.15
##$INTBC= 1
##$INTSCL= 1
##$ISEN= 128
##$LB= 0.24
##$LEV0= 0
##$LPBIN= 0
##$MAXI= 10000
##$MC2= 0
##$MEAN= 0
##$ME_mod= 0
##$MI= 1.114404
##$NCOEF= 0
##$NC_proc= 0
##$NLEV= 6
##$NOISF1= 3.799351
##$NOISF2= 2.8
##$NSP= 1
##$NTH_PI= 0
##$NZP= 0
##$OFFSET= 15.70392
##$PC= 1
##$PHC0= -18040.82
##$PHC1= 7.600692
##$PH_mod= 1
##$PKNL= yes
##$PPARMOD= 0
##$PSCAL= 0
##$PSIGN= 0
##$REVERSE= no
##$SF= 200.130013532006
##$SI= 16384
##$SIGF1= 3
##$SIGF2= 2
##$SINO= 400
##$SIOLD= 16384
##$SREGLST= <1H.CDCl3>
##$SSB= 0
##$STSI= 0
##$STSR= 0
##$SW_p= 3612.71676300578
##$SYMM= 0
##$S_DEV= 0
##$TDeff= 0
##$TDoff= 0
##$TI= <>
##$TILT= no
##$TM1= 0
##$TM2= 0
##$TOPLEV= 0
##$USERP1= <user>
##$USERP2= <user>
##$USERP3= <user>
##$USERP4= <user>
##$USERP5= <user>
##$WDW= 1
##$XDIM= 8192
##$YMAX_p= 0
##$YMIN_p= 0
$$ End of Bruker specific parameters
$$ ---------------------------------
##NTUPLES= NMR FID
##VAR_NAME=  TIME,          FID/REAL,        FID/IMAG
##SYMBOL=    X,             R,               I
##VAR_TYPE=  INDEPENDENT,   DEPENDENT,       DEPENDENT
##VAR_FORM=  AFFN,          ASDF,            ASDF
##VAR_DIM=   8192,          8192,            8192
##UNITS=     SECONDS,       ARBITRARY UNITS, ARBITRARY UNITS
##FACTOR=    0.0002768,     1,               1
##FIRST=     0,             0,               0
##LAST=      2.2672688,     0,               0
##MIN=       0,             -71498,          0
##MAX=       2.2672688,     42315,           0
$$ Real data points
##PAGE= N=1
##DATA TABLE= (X++(R..R)), XYDATA
0 0 0 0 0 0 0 0 0 0 0 0 0 0 0 0 0 0 -8 8 -8 8 -8 13 -16 16 -19 24 -25 32 -37 40 -48 56 -63 72 -80 89 -100 113
38 113 -125 140 -157 174 -192 214 -237 261 -287 318 -349 385 -425 469 -515 568 -629 695 -772
57 -772 859 -959 1079 -1221 1393 -1612 1894 -2276 2828 -3694 5267 -9082 42315 16780 -21213
72 -21213 31407 14539 -5069 -12882 -8023 1940 13189 -20209 -37079 7534 28212 -27830 -26046
85 -26046 23488 16853 -4814 226 -1430 12653 20974 -9488 -23972 14978 24424 -21848 -24267
98 -24267 19210 9820 -11364 -2874 -4235 4737 17074 -12055 -21893 14417 17686 -20533 -18508 16174
112 16174 8902 -10597 911 2381 5934 19520 -4027 -14686 18204 14970 -19286 -13674 9602
125 9602 -673 -16226 -6177 -2695 -3168 9337 -2789 -10670 19293 17189 -10796 1191 16967
138 16967 2218 -8157 -1347 -1724 -6312 -453 -7153 -13584 7426 7033 -14492 1680 16117 -688
152 -688 -3246 6791 4163 -1002 634 -2695 -6145 4016 1894 -13661 679 12988 -5872 -5114
166 -5114 9544 3857 -1591 596 -1198 -1348 2520 -2990 -11254 693 9198 -8513 -7747 11133 4676
181 4676 -2075 3110 2304 4393 4735 -4215 -6883 2539 4892 -10978 -10834 7605 2257 -7749 276
196 276 3249 5044 6133 -3063 -1640 8757 4845 -8508 -7572 6008 1950 -10575 -3755 2733 2277
211 2277 2947 -3713 -578 11429 5007 -6635 -2550 7057 2526 -10498 -6319 2263 -481 -2997 -5778
226 -5778 -2018 10174 4212 -5893 2887 10895 5260 -4501 -3305 5076 1153 -6380 -7204 -3910 3560
241 3560 -1058 -10185 113 8933 2046 -2599 768 7812 5924 -2907 -2461 2083 3639 -1428 -9049
256 -9049 -1197 6273 -2438 -6144 -80 4478 3245 -3943 -3160 4188 3154 -2669 -5847 -189 6334
271 6334 -1953 -5741 2562 5644 3224 -1490 -1034 6505 3906 -4279 -4075 -296 1718 -4874 -9750 -1072
287 -1072 2623 -2426 -3359 -34 6859 6591 -835 2041 7168 5249 -386 -4513 326 2011 -5964 -7846
303 -7846 -3780 -191 -527 -6039 -1933 5911 3954 557 695 4969 7090 -104 -3234 1804 1911 -1343
319 -1343 -5305 -4017 3118 -314 -5338 -1560 2075 3133 -1499 -3541 3110 3272 -1410 -2766 -933
334 -933 3597 1610 -4577 305 4616 2306 -700 -1480 2879 3378 -2636 -3388 -928 607 -1113 -6787
350 -6787 -2593 3368 -658 -2311 660 3711 5568 795 -141 3678 3958 347 -4007 -2220 2644 -3167
366 -3167 -7047 -2056 -229 -41 -1656 -2271 3092 5039 827 -658 1785 5653 334 -4259 740 1096
382 1096 -2014 -2015 -3424 -380 2835 -1926 -2777 2026 3888 -93 -3077 1719 2789 -2018 -1051 -1638 -1077
399 -1077 2671 -1432 -3775 2942 3871 -601 -1186 2333 2698 -1427 -673 -500 -2308 1001 -1610 -5803
415 -5803 1129 2473 -2829 -702 2860 2053 565 1749 1781 -323 2144 927 -4686 62 1930 -5119
431 -5119 -2320 2232 -1531 -1002 1901 863 52 2329 2452 -1947 764 3141 -4060 -1807 3147 -3570
447 -3570 -2856 2495 -542 -1840 2078 2046 -873 1335 3261 -1965 -572 3891 -3555 -3888 3713 -1807
463 -1807 -4767 1278 984 -1701 1281 1941 -1214 1731 5045 -2302 -2803 5739 -233 -5786 1547 617
479 617 -3102 672 -468 -2975 2089 3676 -2965 -2604 6357 1470 -5687 1811 2412 -2917 1072 -531
495 -531 -3665 3095 3829 -4252 -1873 6463 1937 -5259 1008 3038 -2953 623 -967 -5433 2548 3036
511 3036 -6551 -2359 6737 1487 -3758 2047 4489 -286 1834 693 -4664 2779 3709 -8388 -4329
526 -4329 5276 -1451 -5681 387 2242 39 2155 1429 -2519 4359 6700 -5728 -2948 7257 -818
541 -818 -5389 295 -339 -1688 1125 -1692 -4384 2889 5243 -5124 -2779 7411 561 -4246 2318
556 2318 328 -862 3023 -1775 -4002 3409 4291 -4615 -3038 5658 546 -4388 1749 -569 -2463
571 -2463 2963 -1659 -5229 3505 3814 -3924 -1846 5386 1508 -1888 2400 689 -1688 3844 -606
586 -606 -6104 2561 2724 -5628 -2838 2422 -505 -1734 1713 361 -922 4343 1449 -4158 3229 4367
602 4367 -3987 -1375 2520 -1497 -1535 196 -1726 -1814 2787 625 -4249 2140 4417 -3191 -797 3207
618 3207 -1577 -336 1757 -2277 -1237 2765 40 -3333 957 3490 -2417 -1114 2794 -1534 -733
633 -733 2456 -2579 -1668 2798 -692 -3090 746 2217 -1088 -754 2432 -317 -266 3326 -1342 -1522 3427
650 3427 -461 -3473 601 534 -1501 -1019 934 -446 -272 2216 -640 -1472 3542 752 -2516 1552
666 1552 946 -1261 87 -17 -967 -197 697 -535 -1643 2014 1087 -1908 1281 1164 -1403 803 190
683 190 -1492 389 541 -993 -1229 920 829 -1825 672 1359 -1062 988 887 -1388 544 765 -1430
700 -1430 -363 140 33 -1107 -58 872 -479 400 1441 -984 557 1583 -1087 -202 592 -264 -301
717 -301 -446 -174 -98 -367 715 -437 -304 1483 -701 -226 1278 -312 -16 197 -528 -113 -533 -27 38
736 38 -386 822 -33 -511 1324 123 -151 904 -491 -271 94 -399 128 -691 -205 261 -849 261
754 261 482 -490 926 429 -223 930 -6 63 402 -340 2 -557 -590 192 -867 -276 438 -722 449
773 449 274 -712 659 -99 -36 538 -379 496 -160 -433 642 -551 -331 450 -765 237 123 -678 299
792 299 -292 -473 490 -676 94 102 -326 680 -312 -12 839 -148 171 560 -558 374 186 -148 -1 -270
812 -270 71 182 -413 670 -142 -172 827 -175 23 871 -493 -70 295 -448 92 -539 -116 -130 -731 616
832 616 -212 -618 876 -139 72 807 -275 19 749 -246 227 -129 398 79 -870 520 163 -999 714
851 714 -81 -442 1046 -4 -499 354 360 -135 -553 87 392 -1142 520 199 -1066 782 229 -1325 664
870 664 191 -199 210 601 164 -335 299 325 -1000 611 706 -1733 723 882 -1163 -184 662 -306 -99
889 -99 442 158 -475 365 888 -1262 105 1805 -1039 -348 1190 -753 -89 883 -595 -598 690 671 -1086
908 -1086 -110 1591 -1080 -605 1479 -912 -346 1493 -981 -1197 1192 421 -1318 -212 1213 -437
924 -437 -454 1407 -860 -1032 1883 -871 -1853 1999 235 -1581 343 802 -476 -380 706 -306 -641
941 -641 2062 -534 -2237 2015 554 -2112 499 832 -676 437 601 -735 -251 1658 -343 -2413
957 -2413 1643 1206 -2351 536 899 -1388 642 571 -1964 49 1994 -461 -1939 1597 1813 -1945
973 -1945 272 1207 -1476 729 996 -2590 106 2364 -1372 -2031 1314 1247 -1458 -62 1203 -902
989 -902 947 1900 -2528 199 3125 -1511 -2003 1642 479 -1199 -169 922 -915 422 1856 -2218
1005 -2218 -443 3448 -947 -2029 1912 508 -1039 252 -45 -989 905 1129 -1923 -959 3295 -794
1021 -794 -2346 2020 509 -1371 1173 -312 -1351 1524 896 -2034 -478 2580 -428 -2026 1907
1036 1907 764 -1390 1444 74 -1722 1431 641 -2398 -275 2052 -637 -1862 1161 991 -1201
1051 -1201 1312 466 -1774 1839 1605 -2656 272 1970 -837 -1191 687 113 -1056 731 -19 -2022
1067 -2022 1244 1525 -2457 49 2448 -1171 -798 1037 -319 -749 1121 10 -1506 1012 1528 -2015
1083 -2015 -186 2189 -1265 -874 1097 -1103 -812 745 -494 -1352 814 1220 -1194 -279 2190 -371
1099 -371 -556 1457 -654 -501 1565 -908 -1651 651 264 -1449 -740 1154 -529 -551 1409 -124 -502
1116 -502 2040 12 -1022 1340 564 -1136 17 231 -740 -681 505 -474 -1147 1341 29 -1326 1137
1133 1137 766 -1093 453 680 -563 230 415 -480 -569 819 226 -1388 641 755 -1140 488 363
1150 363 -909 362 397 -579 -443 316 -139 -747 182 872 -803 369 919 -694 510 554 -912 -39
1168 -39 447 -325 -580 -247 372 -547 -480 668 -660 112 994 -564 -66 904 -584 -263 -141 73 -253
1187 -253 -528 375 -307 -232 537 -398 -291 829 -44 -233 553 84 -13 -83 -161 -152 -327 52 -163 -560 665
1208 665 303 -158 733 196 175 605 -77 -117 -121 -100 -159 -385 -407 -67 -867 131 274 -384 513 228 84 619
1230 619 -141 200 106 -30 381 -578 -310 385 -420 -13 336 -551 297 -2 -257 603 -38 -57 -51 -229 164
1251 164 -143 -200 438 -228 149 249 -320 624 270 -42 231 -408 -154 -177 -488 0 -509 -566 271 -305 -8
1272 -8 479 -164 245 633 14 509 87 97 245 -220 187 -200 -581 45 -351 -294 343 -25 -48 600 -84 222
1294 222 409 158 256 -273 195 -5 -568 244 33 -451 653 -307 -54 404 -332 91 -75 -188 -59 -311
1314 -311 379 -35 -379 254 135 -185 652 268 -25 641 191 -195 -43 -172 -150 -699 -372 -332 -1137 54
1334 54 363 -542 742 589 -179 574 501 513 251 111 -10 -466 -12 -19 -937 -178 164 -1076 -41 601 -265
1355 -265 190 457 280 457 363 592 -351 35 662 -677 -164 511 -694 -139 231 -186 -232 105 54 -371
1375 -371 15 440 -440 -537 783 -632 -417 986 -364 -368 1095 -154 -285 234 434 -574 -426 463 -625
1394 -625 -721 524 -374 -1062 1072 -99 -316 848 793 -226 19 649 -50 -358 473 -311 -959 752 -106
1413 -106 -1462 627 373 -719 299 650 -74 395 849 -334 -759 903 108 -1466 325 554 -1164
1430 -1164 150 341 -730 237 1046 -275 -535 785 261 -1172 28 724 -870 -235 821 -1266 301
1447 301 909 -710 -413 1017 235 -1021 406 755 -766 -38 900 -1273 -308 1123 -1013 -785 1332
1464 1332 -256 -826 690 381 -510 211 695 -684 -53 1259 -951 -1074 1266 -227 -902 550 509
1481 509 -340 387 516 -737 -95 991 -905 -1265 1027 -260 -1341 782 109 -813 967 343 -1068
1498 -1068 343 1396 -722 -623 1348 -25 -1178 713 -30 -1217 292 202 -1267 298 1109 -707
1514 -707 -293 1028 478 -661 596 569 -1104 474 401 -1433 160 544 -1157 -406 851 -120 -737 374
1532 374 531 -873 423 604 -1137 110 855 -1074 -278 1060 -293 -566 257 218 -515 250 498 -903
1550 -903 93 928 -1213 -680 1165 -597 -657 836 115 -889 611 733 -122 247 860 -595 -450 932
1568 932 -556 -790 721 -396 -1144 497 139 -701 -30 428 -323 52 1095 234 -692 1003 -27 -824
1586 -824 675 -97 -843 89 199 -405 -394 564 -378 -578 583 217 -1130 600 474 -730 254 333 -509
1605 -509 368 246 -389 -124 417 132 -639 272 652 -529 227 187 -534 359 73 -614 51 647 263 -227
1625 -227 244 690 -272 15 234 -576 236 234 -998 -67 412 -462 -988 -112 299 -115 -23 477 -1 312 661
1646 661 -401 -175 716 -581 -405 -70 -46 -196 -364 -50 -64 -33 381 -401 -197 709 -220 -662 508 -44
1666 -44 -212 -345 -94 -116 -264 136 -46 111 604 -172 -559 583 65 -280 -10 -495 -138 355 -261 -142
1686 -142 35 74 -321 -333 314 365 -168 -85 314 63 -124 -146 -90 495 -43 -110 -234 247 506 -351 -178 355
1708 355 -133 106 -158 -295 397 -176 -457 30 172 235 -223 -122 347 234 -99 134 -239 189 51 -625
1728 -625 2 234 -204 -410 -307 107 457 -285 -14 248 553 376 -196 219 612 -174 -229 -274 -21 161 -492
1749 -492 -319 364 -147 95 -263 -5 608 -219 -577 225 427 5 -310 -238 403 143 -284 -428 -125 755
1769 755 213 -468 330 170 -260 -38 -157 297 163 -263 -102 -112 176 172 -441 556 574 -388 128 239 -238
1790 -238 326 -471 -387 18 -70 -403 -346 -34 638 -686 -176 538 53 533 -88 27 593 404 -542 -149 132
1811 132 553 -468 -143 449 -14 -79 201 -453 489 176 -779 -55 579 -33 -524 -180 295 145 -317 190
1831 190 -236 151 191 -647 -195 714 -363 -745 -9 200 94 -115 -39 169 99 319 -357 -125 1030 74
1851 74 -455 386 303 -67 -128 -242 -147 202 -23 -262 -395 774 -51 -853 496 298 -230 363 6 -275 495
1872 495 -183 -457 -76 666 -266 -854 543 575 -676 79 19 -89 352 -202 -287 67 456 -325 -756 519
1892 519 430 -522 -185 527 -197 396 158 -669 195 781 -595 -584 556 296 -649 -19 698 35 36 -73 -455
1913 -455 175 714 -699 45 632 -213 -740 -18 364 -116 -179 228 -434 414 826 -885 -317 1091 -24
1932 -24 -566 203 432 -241 -161 -68 -331 60 530 -948 -448 1407 -146 -825 744 512 -185 -65 137 -119
1952 -119 37 425 -814 -376 1065 -10 -973 651 456 -164 255 -24 -102 468 126 -700 -117 761 -222
1971 -222 -923 265 444 -624 -95 278 -579 294 237 -610 353 875 -221 -813 330 745 -481 -145 337
1990 337 -519 128 274 -852 380 667 -350 -542 407 577 -474 -299 480 -529 123 215 -1003 344
2008 344 862 -466 -439 752 -3 -636 -304 271 -185 -148 229 -604 155 856 -716 -618 972 156 -600 210
2028 210 248 -68 -117 26 -393 -67 672 -586 -698 878 175 -544 223 220 -244 227 -54 17 -25 592 -591
2049 -591 -485 749 62 -833 199 308 -216 -50 -84 30 434 222 -445 -126 580 86 -891 90 431 -405
2069 -405 135 -5 -144 448 -76 -160 -68 562 170 -693 228 544 -514 -51 172 -214 552 -59 -265 190
2089 190 569 -56 -139 158 187 -306 -246 140 6 -49 24 -703 -51 419 -416 -291 389 281 -300 -195 426 155
2111 155 -188 138 -261 286 361 -517 -268 497 31 -430 -180 167 -43 -316 173 -172 202 390 -163 -404
2131 -404 492 203 -358 23 280 259 91 -301 117 152 315 -324 -437 449 52 -365 71 111 21 30 -162 168
2153 168 234 44 56 -122 228 274 -607 -54 397 -234 54 -214 -189 399 -84 -175 -27 324 251 -534 81 318
2175 318 -1 -314 -168 -220 233 -321 -139 142 488 63 -64 -159 482 -150 -153 243 105 196 113 -186 204 275
2197 275 -210 -322 -36 345 -15 -368 18 345 -105 80 -114 90 442 -295 -286 323 87 73 -19 -97 306 -327
2219 -327 -139 -213 -137 22 -281 -385 212 -219 -159 -260 -142 268 202 -141 167 -65 26 261 -275 382 56 -410
2241 -410 233 137 28 14 -419 -11 89 -195 -324 -53 237 45 -406 -172 148 -182 125 -356 -109 238 91
2262 91 -86 170 223 -167 -228 -199 383 -112 -93 123 -33 146 112 -482 -13 125 2 -350 -14 233 -107 -336
2284 -336 339 -204 60 325 -336 43 8 121 -165 22 207 -66 -311 -169 -219 -89 -128 -271 -70 302 -580
2305 -580 -324 204 58 -29 -32 -379 262 141 31 20 -217 562 -376 -269 237 89 -196 92 25 -197 16 -32
2327 -32 -95 -166 -47 68 -179 556 251 -481 267 -9 -139 191 -127 -198 -14 156 -115 -163 224 -2 -430 57
2349 57 184 -323 21 -32 -233 196 95 -18 123 32 72 -464 89 285 -269 -136 -23 -198 170 192 -336 -122
2371 -122 68 -159 -104 372 506 -264 -62 337 -296 48 345 -417 13 389 -127 -234 112 148 -146 -64 296
2392 296 -53 -236 404 -384 -342 483 -185 -144 542 5 -347 345 23 -77 -193 71 -269 -432 552 -100 -393
2413 -393 347 -44 -328 144 -32 -450 74 96 -395 -326 70 -237 -529 238 83 -503 170 35 -150 28 27
2434 27 58 -32 97 -282 -634 97 152 -470 60 215 -347 83 -40 -346 58 -64 -197 -110 156 328 -607 -145
2456 -145 473 -631 -26 460 -379 73 207 -237 -116 229 -7 -436 -89 83 -179 -175 263 -376 122 410
2476 410 -542 -424 117 -104 -261 -15 235 -107 41 136 -7 -200 282 -280 -257 405 -240 -315 -21 -91 -161 126
2498 126 240 -75 -195 330 -308 -166 259 90 -314 426 -126 -275 135 65 52 -107 261 -66 -105 314 -138
2519 -138 -410 114 63 -296 462 33 -238 55 239 -230 -140 373 167 -285 384 138 -305 338 309 -180 117
2540 117 265 -136 83 106 -238 -70 -153 106 -180 28 59 -214 157 298 -93 -82 96 -46 -166 288 344 -168
2562 -168 105 327 -174 -127 20 15 -144 224 -216 -24 84 -110 -264 93 -130 153 -73 481 41 -172 286
2583 286 -290 -111 185 150 33 184 35 -128 -86 306 -127 21 242 309 -226 129 -103 -273 61 -85 43
2604 43 -44 -103 213 -45 95 67 -166 131 338 -134 141 212 -203 258 40 -160 -53 -243 -63 -213 -73 -16
2626 -16 -154 99 -68 -172 1 189 -93 166 95 -53 86 -60 61 52 29 245 -42 -150 52 -120 131 147
2648 147 29 -81 108 -75 49 159 -78 -112 -3 102 -42 -284 159 -178 -46 161 77 -84 -62 -46 108
2669 108 -200 21 -110 -30 147 122 -75 40 30 60 342 26 -141 -38 -214 95 57 30 180 -32 128 74
2691 74 -41 -25 -231 135 116 126 -82 58 -32 151 -129 -5 -144 -203 -113 -242 -15 -36 -118 -431 1 -28 -35 64
2715 64 -338 58 67 -73 6 -161 -106 -29 -103 26 85 -104 91 -52 171 189 -148 30 171 55 19 76 -40 25
2739 25 -244 22 32 -85 17 87 -145 -53 -113 -154 8 -146 145 -212 -221 142 -51 -156 -87 -89 215 194 59 57 -253
2764 -253 125 208 -78 -5 158 -75 142 62 -286 136 -163 19 -15 -119 88 15 182 -245 -69 260 136 -3
2786 -3 240 39 -141 225 -171 -70 142 -61 -105 -171 -50 82 -88 81 254 -465 96 114 -381 242 141 -124
2808 -124 -22 164 -221 -134 -176 -125 -188 188 29 -188 24 122 -154 177 182 -86 -264 111 72 -127 94 154 -364
2831 -364 27 284 -209 7 145 -76 -48 98 267 -61 86 -120 -214 -24 78 -13 23 6 -59 -301 371 22
2853 22 -49 473 107 57 54 -81 -236 69 190 -549 79 525 -214 -179 138 25 -39 224 62 -152 33 138
2875 138 -95 204 446 -274 -139 446 -45 -195 197 -55 -260 -58 36 -19 -192 107 178 -169 128 -106 -183
2896 -183 189 20 -209 171 30 -21 -7 46 121 -246 -1 125 -21 59 93 -29 43 23 -92 -20 240 -126 25
2919 25 289 -118 -189 322 146 -243 50 113 -321 188 63 -199 34 -74 -91 -26 20 192 49 99 482 -68
2941 -68 37 412 -154 -101 329 -68 107 59 90 -12 -33 21 -214 -108 493 -94 39 269 -75 -222 161 -57
2963 -57 -133 35 7 -224 -208 221 -154 -52 315 -5 -66 326 64 -228 80 61 -16 -3 56 -23 -166 9 -61 -159
2987 -159 148 79 -167 27 170 -110 136 107 -94 -14 98 27 -93 180 125 -296 -9 24 -273 -240 117 -227
3009 -227 -155 157 -108 -170 182 96 -25 160 -73 -461 -14 68 -405 -6 103 31 -68 18 -214 51 121 167 -320
3032 -320 -257 214 -110 -77 161 69 -217 372 -144 -13 -142 -7 -381 -313 251 90 -200 211 -265 -116 158
3053 158 -60 -249 244 56 -123 -106 -87 57 -232 -286 -5 -183 263 160 -288 70 -143 -4 250 -51 -5
3074 -5 -131 108 -8 -95 -24 129 -347 298 100 -219 -56 191 -246 142 86 50 352 -104 158 16 -32 39 65
3097 65 237 23 -11 -109 -79 -203 56 218 -86 185 -114 233 -101 68 206 80 -36 -52 19 7 173 -27
3119 -27 19 -65 83 -81 161 21 -283 130 71 -160 75 158 -27 -56 28 12 90 -179 91 -137 -132 67 -230 -146
3143 -146 188 -65 -102 169 -75 182 -120 -35 187 27 161 60 -121 170 140 -96 20 -17 34 153 -293 -19
3165 -19 335 -275 51 -194 58 201 -13 81 69 -148 192 -123 152 98 -229 -54 128 -159 62 179 -69
3186 -69 23 -112 -244 62 -21 -124 312 -210 -103 146 -46 -29 215 -183 -123 107 33 -133 -72 107 -73 112
3208 112 109 -60 -27 70 207 -49 -137 207 13 -123 -16 -62 -113 161 -163 -98 163 -18 13 145 -123 79 15
3231 15 116 228 -74 16 -192 -427 192 -71 -104 144 -233 -63 -206 -202 24 171 -95 -151 -94 -62 290 -377 -75
3254 -75 -102 -13 187 -20 13 -11 -120 -195 77 -23 21 -98 -187 -94 155 29 -79 -59 52 -162 -111 139 8 40
3278 40 48 -19 201 -53 -37 -134 -314 2 101 -92 -5 204 -96 -97 89 90 -221 -92 25 -254 -87 245 -127 -48
3302 -48 387 -29 77 331 -21 24 359 17 -89 -197 81 -107 -239 304 -284 64 261 109 -99 122 -106
3323 -106 118 83 155 84 45 216 -45 55 279 -94 -38 239 89 2 -156 116 91 77 -47 80 -264 -42 -9
3346 -9 -231 204 77 -158 114 -284 83 36 -72 216 34 -118 24 -196 90 -194 -166 238 69 -198 233
3367 233 27 -171 -73 -62 51 -23 224 -170 -258 7 -81 -383 154 149 -66 212 -149 -57 116 -167 -210 128 -73
3390 -73 211 18 174 182 -53 -11 70 4 -143 352 -125 -114 171 20 -21 66 95 113 -104 324 -146 204 507 -46
3414 -46 105 -33 22 -56 -26 122 -102 -86 -6 -6 226 -83 -62 -89 446 91 12 59 100 -132 -132 18 -38 -60 217 144
3440 144 -299 379 -117 -268 -50 -340 -20 -118 -134 -129 -17 -14 44 -143 95 110 -92 -11 179 -72 69 204 -211
3463 -211 -4 -191 138 -24 -82 243 178 86 295 -247 252 92 19 109 -64 -342 -192 -46 -302 156 9 132
3485 132 -67 -238 95 -98 105 245 -39 -35 70 -217 11 -147 125 50 -155 186 76 -115 36 -193 -89
3506 -89 140 -427 65 13 166 105 -201 50 168 -82 -17 -230 -86 185 96 -84 122 126 10 44 84 115 -164
3529 -164 58 -101 -76 -139 -224 -223 -83 48 -146 122 132 -109 -94 235 15 31 20 5 -9 -7 -88 -318 155 -141 -182
3554 -182 192 205 15 -109 -36 103 36 -165 104 229 -54 103 -14 158 -50 316 97 55 -75 -219 137
3575 137 -386 79 24 55 25 71 87 -29 12 -78 -114 -114 131 -114 -63 -177 8 -83 -159 197 -59 -115 91 -22 -19
3600 -19 -52 -166 -23 127 -99 167 -294 15 90 -207 94 289 113 72 -201 -207 -25 20 -87 -129 -48 -149 8
3623 8 -41 6 21 174 -184 77 157 56 -24 -176 -33 -82 -22 -61 -36 -18 98 9 147 161 89 -248 -44 -34 -287
3648 -287 -94 315 134 22 24 -9 48 20 53 -37 -110 -12 -43 124 -141 97 203 -74 -8 -95 -38 -4 53 -94 -171
3673 -171 -38 -88 -115 75 257 -6 -51 225 -180 -229 29 -43 -198 146 60 86 -173 85 112 -105 -128 161 -50
3696 -50 220 -390 -196 -246 -38 54 -111 -198 97 -45 -56 69 -30 -112 137 -135 -191 -20 50 4 -59 -14 -58 72
3720 72 35 -14 41 222 -184 116 26 -25 -41 -63 30 -119 -270 70 -155 -104 268 375 201 -111 182 147 308 -33
3744 -33 -30 67 -60 -32 18 105 -135 -202 -23 254 -56 128 -90 -65 149 -80 10 -84 43 157 57 -176 193 -27
3768 -27 -146 -40 -294 44 -47 -65 190 50 80 160 -92 129 -83 36 151 -32 -9 79 -42 -129 -188 53 -37
3791 -37 44 26 -127 160 30 -108 -114 -112 158 -4 -21 -69 28 -134 -227 -149 243 -60 113 -115 -44 175 -119 248
3815 248 -113 65 191 31 -289 132 131 -81 59 -53 -23 -138 78 45 17 174 5 -15 -141 0 -23 63 304
3838 304 -115 -104 -39 175 -271 -57 94 -281 88 93 -202 -103 -198 13 269 -2 -65 -109 -120 47 -100 -161 158
3861 158 -113 109 36 193 -2 83 59 -46 176 -20 -209 -20 48 91 -46 -55 2 9 10 -101 361 39 -135 -128 93
3886 93 -53 122 -32 -29 -48 81 30 -25 -62 76 85 3 128 -239 -238 -44 35 282 76 -237 -45 35 42 215 66
3911 66 121 264 -259 89 43 -18 47 -92 96 -194 72 -149 -59 -120 77 -244 357 32 -58 133 141 84 -57 -68
3935 -68 -128 -200 -39 174 59 31 352 28 -72 98 96 -61 132 -99 -373 -47 153 -30 -156 -137 -75 46 -120
3958 -120 -71 -109 -99 10 -41 -159 69 110 49 -100 -112 102 176 172 -14 204 -76 -7 -42 -79 129 -68 -125 -45 -45 95
3984 95 -51 -76 230 120 -153 -31 -34 -8 -37 95 -35 131 -62 41 34 83 219 -185 -89 -43 -13 127 -78 -104
4008 -104 -70 -202 -1 13 58 74 -188 47 34 -93 -93 64 25 -288 71 -53 -71 3 -159 127 123 108 61 47 56 -78
4034 -78 -138 23 -38 38 279 -202 63 39 289 28 75 58 10 215 -74 -193 60 -39 37 230 -86 -51 93 216
4058 216 185 50 230 2 71 26 90 -110 92 6 5 -46 -62 9 -88 15 -112 -135 -149 25 40 -14 -21 -103 78 344
4084 344 -36 37 15 -11 143 74 165 157 -302 50 -212 17 148 40 -211 146 34 22 -21 90 85 65 -108 -31
4108 -31 -3 -70 225 23 -37 159 51 -172 50 146 39 204 -37 97 229 222 -75 44 35 -53 58 210 -92
4131 -92 -146 -48 81 -219 -2 111 -226 -180 -135 64 -20 -5 -150 114 76 264 128 210 47 -51 -84 225 183 -174
4155 -174 87 302 -22 165 -26 60 -87 29 120 76 9 -44 -53 -66 31 -8 -104 -59 117 68 -100 -87 216 58 25
4180 25 -180 -54 -47 -36 5 -103 85 257 -9 125 -16 -62 252 330 -237 -169 -115 -22 -76 -131 -89 171 -98 43
4204 43 -139 -221 58 56 -111 -82 101 -115 -117 97 77 105 -73 260 123 -153 82 -70 -44 111 -25 163 -148
4227 -148 5 285 23 -107 -115 -166 -282 -14 7 -33 33 51 -88 -184 -62 -63 -139 -38 130 -195 2 -252 -94 6
4251 6 26 72 -112 -75 57 -20 10 167 -38 80 -19 -23 83 72 79 -181 105 118 -10 -98 209 26 -89 34 -191
4276 -191 -346 -121 -40 -7 94 -12 91 -40 39 6 -43 5 -12 20 7 -175 79 -62 -114 107 232 101 72 106
4300 106 -256 105 -143 67 154 72 181 -167 42 -150 -5 27 131 -66 116 -127 32 97 103 10 110 111 36
4323 36 -348 -165 182 -189 -158 136 0 -82 -6 -84 -51 -97 129 36 27 56 -48 -40 -56 -57 152 -225 -53 -64 -5 135
4349 135 149 -46 -198 -91 87 -17 -159 88 -149 -113 -198 -114 -125 66 50 -185 10 184 7 82 -28 -142
4371 -142 15 -164 -48 -68 129 -95 80 -37 -140 19 10 -41 -181 8 -80 36 -33 -124 82 119 -160 -92 -196
4394 -196 65 1 -81 63 -131 217 195 -81 277 30 72 -223 122 -46 -174 -6 -98 94 -56 10 273 137
4416 137 13 165 -86 294 -32 243 -147 50 118 -54 -18 59 -44 20 -97 50 -61 86 -280 16 69 -32
4438 -32 -51 -27 244 30 -34 -206 3 15 -115 -433 -127 79 143 77 164 -93 -69 115 176 -116 258 60 -109
4461 -109 -30 125 -190 -204 -54 57 -99 204 184 -134 -11 6 -164 138 151 259 -22 -255 -25 88 -76 37
4483 37 -37 -171 -29 87 -80 -10 -47 -87 23 36 68 95 85 72 65 79 332 93 -18 -22 60 203 -129 16 -41 23
4509 23 -53 -122 -171 77 82 44 164 -86 -69 -71 -242 64 -77 48 15 4 190 -59 188 212 -240 -44 135 -9
4533 -9 162 103 -99 -49 -26 264 -166 139 -137 94 2 188 -30 36 -50 160 -30 118 13 -80 -5 235 -81
4556 -81 115 -72 -286 108 50 -215 -288 71 75 -126 167 -118 -100 430 -5 243 -149 143 124 -4 232 18
4578 18 32 156 68 -62 45 26 305 24 -6 102 201 40 0 -48 81 -44 15 102 -73 -19 142 137 -125 10
4602 10 -6 -100 -42 320 -5 10 148 -6 175 -99 141 -265 28 -106 -36 -175 220 145 104 151 179 -138 -133 146
4626 146 115 -48 -91 -151 44 196 98 -131 -126 -112 46 -31 85 117 79 261 73 -50 -54 -33 -121 107 -52 -156 155
4651 155 -11 146 28 50 57 -207 -92 25 13 69 -48 -43 50 -36 199 146 -36 -230 216 185 224 69 33 -155
4675 -155 -13 24 -156 -59 -251 153 -82 245 -90 21 -133 -197 204 -3 -75 -315 -330 102 120 85 161 59 13
4698 13 -370 -88 176 -9 -8 84 -149 219 -2 164 88 -72 131 -5 206 10 -127 -2 -228 -8 26 -79
4720 -79 -185 -443 -232 49 -74 -26 -191 44 -93 206 107 146 -27 130 9 -371 -51 -25 193 230 76 31
4742 31 -92 7 114 160 -216 -205 -52 201 77 -103 102 -126 164 283 -224 42 7 115 86 13 -211 -98
4764 -98 120 84 217 -101 152 -83 78 -64 -187 -69 0 5 -149 -77 -46 -20 -130 -86 -279 -22 124 46 270
4787 270 13 -102 13 -125 -91 159 6 28 -182 -110 -7 70 -227 -3 -93 245 42 -145 -72 -112 10 86 37
4810 37 175 -32 -155 -137 185 -24 -130 38 173 6 -114 42 22 -226 -87 -99 78 -1 -71 22 106 129 37
4833 37 -51 165 71 -19 -92 -114 120 21 46 -95 29 -25 88 26 185 125 43 -56 69 150 63 -178 4 175 22
4858 22 3 33 -52 68 356 -67 -36 -316 -111 -55 -35 -118 -41 176 66 39 21 -16 -133 -108 -100 19 149 295 -48
4883 -48 -124 -21 -128 -53 203 69 -193 20 -105 -196 -33 115 -4 -64 219 -165 213 -108 -51 195 -78 89
4905 89 36 -300 -126 -33 -57 83 -29 -322 -199 61 -132 75 163 -40 47 14 -17 62 44 -127 -162 -53 99 -9
4929 -9 90 -95 -13 -112 -74 -150 87 8 -136 -20 22 -263 37 149 -321 56 -176 3 -59 70 41 87 -3 21 70
4954 70 -156 163 -155 108 -132 -82 -29 -3 -71 51 -308 208 -85 120 -1 -4 -309 64 -8 -111 -53 223 131
4977 131 -106 49 159 56 67 73 -192 -243 -61 -144 -64 -7 95 195 5 44 -101 -326 98 29 -179 300 -161
5000 -161 140 -18 6 143 208 -19 -122 39 268 13 -106 -48 152 2 129 98 136 -64 121 300 38 -82
5022 -82 97 10 87 -114 141 75 -156 -13 -81 216 -11 101 -163 -85 -129 -10 -148 -201 -62 87 -17 28 -191
5045 -191 -115 10 169 -5 -15 105 56 -6 -126 -22 30 -117 232 -61 -48 -109 -64 -20 -33 125 210 132 -51 168
5069 168 63 -33 75 97 -46 -131 -29 21 48 -91 -50 -93 69 132 84 -2 158 -115 11 65 -28 -162 -18 20
5093 20 68 60 -7 -29 -200 76 -82 -138 110 -14 108 95 295 106 124 187 111 -182 -125 24 -15 -27 -160 117 -6
5118 -6 -250 44 -25 -38 -8 -81 167 -70 32 -5 -122 143 24 -30 35 128 -44 -1 121 -43 157 42 -48 -15
5142 -15 -100 134 9 -37 141 -6 1 -271 -12 -22 -139 -80 -41 -20 -11 151 -53 -24 108 152 -95 -59 -217 -15 29
5167 29 66 231 -35 47 84 -134 -67 92 -81 135 114 54 -126 -113 -161 -42 -27 -63 93 159 65 3 -148 145 3
5192 3 -120 124 114 52 -260 32 37 4 232 34 -147 -50 -156 -186 62 -17 -28 -47 -16 -7 -55 84 -24 -111 51 159
5218 159 -155 81 111 -211 185 18 -44 236 -68 230 211 45 -308 -132 -91 -17 155 -170 188 -48 -138 18
5240 18 18 -159 201 71 -26 -148 -124 -99 7 -48 97 -26 -36 -360 -34 225 -46 -202 50 -97 75 -110 131
5263 131 22 -177 48 92 91 -71 102 -276 -56 -432 -19 112 -68 43 1 326 23 -217 134 178 5 95
5285 95 154 11 -40 178 88 -201 67 62 95 -265 -46 136 120 -95 59 40 -12 -287 4 52 57 -80 -55 189 -76
5310 -76 268 -45 4 151 16 181 -80 205 -108 108 -151 -200 -312 111 -36 19 92 64 90 -51 -171 -226 -79
5333 -79 -93 90 -84 15 228 -68 68 1 142 121 30 92 133 24 -51 -37 -44 -48 133 113 72 107 -118 -85 99 64
5359 64 -121 66 88 77 24 -46 -65 -50 280 -21 59 30 -259 107 41 34 -200 -74 -36 16 18 246 -60 129 -180
5384 -180 31 157 22 152 95 171 255 117 65 2 -116 85 -182 154 -284 -41 281 23 49 -60 86 85 -67
5407 -67 -79 -148 -51 -16 -205 -192 -51 138 115 48 0 243 98 129 -66 81 -34 86 -24 -131 -243 -24 -157
5430 -157 140 -64 -88 67 -63 -1 -154 -30 116 96 -23 -175 115 152 -47 -78 108 20 77 124 170 63 -26
5453 -26 129 -25 276 116 56 -23 148 61 -146 95 314 -75 80 22 77 -107 61 46 130 -100 -125 79 -19
5476 -19 165 358 30 7 57 200 87 -337 -65 -253 -165 10 86 -150 107 -212 -339 133 38 -31 135 247
5498 247 -45 263 -27 -163 74 50 -163 169 -127 -64 32 68 100 -216 -30 -18 16 50 181 60 126 278 192
5521 192 47 -130 -5 -163 142 55 -198 20 329 74 -14 99 72 -22 -166 -252 -88 166 -114 102 -121 -50
5543 -50 159 -57 83 56 -81 -205 144 -224 -78 -14 -109 110 233 -16 27 -219 168 255 32 185 10 -44
5565 -44 87 115 26 -118 182 76 -50 75 93 64 -215 -162 -73 76 -67 -113 4 18 0 118 -227 -237 130 190
5589 190 -44 51 -59 -35 211 310 -4 -37 141 90 -142 -203 0 10 -151 -110 167 156 -3 68 -78 -23 -187 139
5613 139 -46 -4 -118 -233 51 44 3 44 87 -5 -38 -40 135 27 -65 -150 38 -234 43 -32 141 39 -50 138 55
5638 55 99 5 78 -104 47 -43 77 125 8 -34 125 20 70 112 78 59 108 303 96 91 -187 90 83 149 -102 -100
5664 -100 63 -193 -305 -139 3 36 -25 -36 -208 42 177 160 -33 42 7 -32 72 18 10 -111 -104 -44 161 -207
5688 -207 -125 -63 -128 -137 139 -151 224 70 245 -101 126 -346 221 -40 -44 36 157 59 -141 -45 -163 -173 -126 -177
5712 -177 95 129 48 -123 -233 24 -82 137 39 -73 -333 40 -246 -74 -326 27 -18 45 7 77 73 18 139
5735 139 -75 69 -37 -59 36 28 120 -44 57 -82 -81 246 -8 69 -28 108 -269 -133 -154 -152 65 19 130 97 -1
5760 -1 71 80 -52 100 -286 -31 200 121 40 -75 54 62 -429 110 -39 -344 39 5 34 -105 236 -36 61 70 -161
5785 -161 60 34 -98 -13 -80 -165 147 -207 112 10 362 229 -62 -112 -10 47 122 -54 93 139 139 42 47 14 98
5810 98 44 300 -281 -122 219 4 -47 -6 84 135 -36 -12 -92 47 22 -310 -35 -165 167 -106 152 -184 5
5833 5 -16 151 137 96 153 114 -128 -136 -99 -212 -32 -203 157 -117 150 -123 -24 183 14 240 108 277 -49 52
5857 52 16 -22 132 149 68 56 11 -53 291 59 -36 -91 -236 -108 -108 4 65 -119 69 -121 120 0 88 -25 -120
5882 -120 -138 118 104 -247 149 -85 -31 6 55 297 -62 116 -106 60 -71 7 120 -4 109 50 119 -31 -66
5905 -66 25 76 -177 -190 -38 -143 7 -54 220 -191 -20 -27 217 217 -53 -146 191 -93 148 -43 -163 -97 -71 285
5929 285 234 -19 -285 -146 -277 203 -86 -16 -14 110 -113 -27 86 165 -62 140 233 -22 -169 -345 -214 62
5951 62 -88 -113 100 97 -290 -130 -179 134 -170 36 51 113 -234 -126 -166 91 75 155 75 -58 -84 -92 89 157 204
5976 204 191 317 -83 -61 112 118 4 -86 -82 -96 94 83 -130 -288 194 -8 21 94 58 83 -56 215 -197 -141 -64
6001 -64 -93 61 -193 -94 -28 86 111 -177 -77 -71 134 8 -21 113 59 119 14 -181 -61 4 -161 -185 -185 -51 297
6026 297 130 171 -5 -116 203 -166 -149 -103 -145 -280 -351 -188 219 -242 19 36 64 318 80 -135 -271 -30
6048 -30 92 -190 -90 -35 -198 111 -104 -60 -99 36 68 15 -41 11 165 59 219 -24 230 188 21 -161 49
6071 49 156 62 -104 176 -171 -59 58 70 -9 -248 -10 45 60 71 -53 31 30 -188 -57 -31 119 62 1 118
6095 118 15 118 -205 -190 38 -45 -121 54 -34 123 103 -49 -89 170 -35 -132 -120 -73 94 84 -273 -120 71
6118 71 157 225 56 -206 -215 14 -286 359 197 -80 -33 -124 -201 66 -124 46 53 -121 181 -80 47 88 0 75
6142 75 179 90 34 -14 -88 -14 -184 90 -213 -276 -162 144 91 193 -8 -257 179 -85 20 -185 51 -81 55
6165 55 23 -144 -165 -376 103 -140 -29 11 -49 122 -119 156 386 2 -146 9 277 -214 352 278 183 224 188
6188 188 54 -148 -306 80 138 157 183 -40 242 60 -93 216 131 -72 -120 -58 124 40 95 -45 158 140 -59
6211 -59 67 -176 249 -106 -171 207 -250 385 -26 50 32 -104 43 168 -187 114 -77 -217 -64 -131 -102 -245
6233 -245 160 -128 78 -53 47 -136 -145 -91 6 -37 11 97 -136 -169 -28 -98 -51 117 -154 42 243 38 85 -37
6257 -37 -86 249 34 83 -242 -41 130 -14 -269 147 -165 8 86 -364 -78 -56 174 128 -130 169 29 -63
6279 -63 -145 9 -60 34 -78 81 -141 29 -134 139 71 -195 200 -2 -36 -22 201 188 -66 -117 103 -47 -150
6302 -150 61 -62 -81 -135 74 -235 -83 97 31 -242 -30 29 -54 10 57 69 69 110 57 -257 307 10 -113 -51
6326 -51 -1 -45 -152 -171 -38 -207 -99 258 -126 36 -32 13 -129 36 130 -138 -52 40 -79 -71 159 24 -125 -79
6350 -79 218 187 2 -176 160 -168 13 281 127 -25 196 48 81 -10 11 35 84 187 28 38 219 20 29
6373 29 124 -220 -174 88 -2 -78 -28 282 172 17 104 -79 53 -88 -43 247 -334 0 -39 -137 -97 -12 286 63
6397 63 -4 41 -94 17 72 36 158 -86 15 29 60 -204 -26 154 -204 -138 -82 -108 19 33 58 79 -69 107
6421 107 -19 13 -292 158 149 65 -115 49 -50 -129 -13 105 254 -114 158 66 72 -86 -90 -240 9 205 72 28
6445 28 -69 -30 302 -37 265 -70 -84 -12 141 20 120 150 14 89 -148 -127 -291 -269 57 -176 138 4 69
6468 69 142 -54 204 -22 118 72 23 107 -3 41 67 -38 34 -68 16 -221 102 -318 -35 -223 117 112 -200 -208
6492 -208 -81 -135 -46 337 -24 25 -18 -148 142 248 -58 271 -28 -41 -71 91 43 -68 109 213 273 -27 251
6515 251 -199 -122 141 -156 -91 51 180 -145 171 80 62 83 133 -314 -81 126 219 168 62 20 102 -124 99
6538 99 109 -81 -192 89 19 -68 67 23 -134 -245 50 5 -105 150 -122 0 -26 -55 38 -53 -114 4 -219 37
6562 37 28 -139 -33 120 165 54 230 118 111 108 -258 -69 50 0 -182 -157 -66 229 132 31 -96 -188 195 37
6586 37 53 -17 -32 -124 -164 -74 50 -222 -66 -229 139 -69 56 3 95 137 -83 101 -32 29 -177 -122 -8 -104
6610 -104 -26 64 203 -162 40 -176 27 90 -351 -31 33 223 65 -34 -83 203 -98 -109 -217 58 46 -40 114
6633 114 48 -263 -119 215 -29 111 284 -61 -271 96 -87 -118 162 -219 -77 165 72 97 -6 277 -154
6654 -154 -55 85 -36 219 65 -122 90 32 63 -58 -134 -50 195 67 -82 103 4 -122 94 -178 -56 164
6676 164 -33 -143 182 112 -202 -18 -19 -110 -15 -158 -114 -86 -94 152 -67 15 175 -80 -107 90 182 -44 100 91 -64
6701 -64 7 26 161 152 -162 -115 -26 96 -131 -65 -142 93 203 123 163 70 -42 48 -2 15 55 27 -21 -95 -248 -216 6
6728 6 56 -97 -187 66 89 -202 31 -206 99 -79 30 113 -16 134 96 150 -131 -52 -177 173 -132 71 -83
6751 -83 202 -119 -299 193 69 -159 -252 -24 -28 12 35 151 44 37 -39 124 11 18 -115 29 105 -25 -194 -47
6775 -47 -175 -72 323 -139 -87 72 162 -68 -109 -29 70 -17 59 -147 -187 -16 45 46 -64 -159 -78 124 100 97 16 -119
6801 -119 67 -47 -127 75 67 122 -63 -93 -55 12 124 152 5 -25 118 -35 -103 38 18 60 -12 -35 -91 6 -63 76
6827 76 149 38 120 39 -239 -175 -24 91 55 84 216 -202 -200 -47 -106 -27 -30 14 256 27 -107 -253 279 -157 86
6852 86 85 -65 174 -49 82 -18 120 128 20 69 -44 -24 50 114 157 28 -168 -81 86 144 -38 2 -155 62
6876 62 54 181 -67 1 -53 87 219 -67 100 109 -40 169 76 12 32 -4 -206 28 52 -29 -96 -32 76 -37 -118
6901 -118 -21 144 279 -403 33 331 -170 127 -63 1 226 -234 -87 -41 115 30 -92 0 -70 -47 -145 143 148
6924 148 68 143 -59 -220 33 -118 -29 72 32 -120 11 -49 73 141 16 -90 1 78 -135 -151 84 98 -64
6947 -64 -153 63 120 85 56 -25 -131 -153 -186 -6 16 45 -132 -103 151 92 61 50 -47 -214 -189 47 -288 -136 194
6972 194 94 122 -232 207 32 -18 -186 -131 -168 59 90 -48 -8 -22 69 -2 -139 -115 101 -80 -4 53 47 -76 57
6997 57 91 -99 44 9 97 7 -69 237 -79 -364 21 196 53 182 -278 -133 19 -114 -23 46 137 -45 -103
7020 -103 98 -125 -157 31 -51 -363 28 50 -110 -1 101 -225 -1 -74 -42 81 -19 36 253 21 -139 -138 -217
7043 -217 176 5 70 83 55 -15 76 -68 241 -305 -40 -227 -21 6 78 -75 -160 42 -17 -202 -254 -85 82
7066 82 55 -99 -16 6 -200 31 -42 -147 145 144 62 -190 90 -38 -88 -312 -52 -143 172 -33 100 -5 19 335
7090 335 -124 -31 -135 -254 -64 -42 -256 -38 40 177 -26 -158 -40 135 36 -18 14 236 -100 -5 115 -25
7112 -25 -332 110 30 51 31 164 -25 -73 176 -68 39 165 46 -90 -183 65 -37 -24 -50 51 74 172 94 -204
7136 -204 -13 218 28 -33 -152 -79 206 47 9 -291 137 -124 -163 -64 271 -95 21 38 42 223 -32 285 32
7159 32 -8 6 50 -72 193 36 91 -9 -5 58 -83 -123 -125 71 78 -96 -157 -166 53 -46 -57 -30 -138 -4 -138 -58 -142
7186 -142 -12 33 61 147 -148 66 -365 -147 -7 71 134 -50 -288 56 -198 -73 -19 181 17 22 -103 -71 -19
7209 -19 142 5 -191 129 76 28 -104 -57 -9 202 -7 111 -230 -25 46 -83 -23 -88 169 -34 50 114 -28
7232 -28 173 73 -7 -41 -41 55 -95 139 10 -47 136 232 -196 266 93 -111 -43 18 185 203 -78 36 -92 -81
7256 -81 175 -154 -98 123 271 -69 69 -210 -57 149 9 -45 -147 -194 -195 -80 68 128 80 -150 -66 1 -152
7279 -152 112 49 -68 137 -83 208 118 192 54 339 70 126 62 68 -61 -17 108 -183 -22 -34 153 -72 65
7302 65 122 -85 115 -58 -187 35 -22 -188 -57 -19 -57 11 -25 72 -65 -390 4 -41 198 112 49 -44 19 256
7326 256 -19 90 55 -5 -94 3 -80 1 -49 -182 84 94 -91 342 169 122 154 -15 -53 -65 -33 96 -9 47 -132
7351 -132 -67 238 -17 -206 111 118 190 -49 138 -122 -84 40 -49 -3 30 76 -49 -8 85 -80 -60 -39 -152 -132 -194
7376 -194 151 -18 -228 -279 101 16 -130 168 -127 125 12 -22 -8 163 -232 76 89 107 -262 -130 142 17
7398 17 24 -60 41 -196 -96 51 -19 142 98 -88 155 -183 34 34 -19 -28 -219 89 51 50 90 -29 -105 111 -25
7423 -25 -117 -229 -9 -126 167 18 191 191 -54 66 -83 -50 123 211 -207 28 -92 -327 69 -34 24 -63 110
7446 110 -95 -156 -41 -68 113 250 196 35 -266 -10 -252 -224 -67 -136 -195 24 20 110 -61 -64 173 33 -34 -102
7470 -102 -144 93 132 -3 126 -116 -112 -52 21 -183 44 5 12 191 225 179 -73 70 -37 -92 -113 54 -57 43
7494 43 193 -183 24 -21 130 -46 -143 -136 173 -171 -4 81 127 277 -14 76 189 -39 108 -221 -267 96 44
7517 44 -49 -220 219 -43 -175 54 -122 -14 -22 -115 186 -265 -114 -11 53 -11 63 -55 292 -100 71 154 131
7540 131 24 4 101 26 17 -108 159 -26 -171 -272 6 -84 107 183 204 -68 45 -157 -110 -109 69 -194 -92 -157
7564 -157 -152 206 -67 -120 -10 -91 -51 -142 -149 -19 180 30 91 75 -43 153 -156 128 0 37 -186 -128 186 163
7588 163 45 -100 95 -43 -93 -34 107 -71 23 -19 100 -54 6 -161 112 -5 56 -129 21 77 193 -122
7610 -122 17 173 77 -93 59 116 -227 -172 -166 -36 31 32 42 20 218 -85 206 32 -219 -62 -101 -60 -86 -252
7634 -252 162 56 23 113 127 55 106 -12 123 -117 -131 146 139 60 -59 -14 114 -87 174 -190 140 -311 192
7657 192 111 -43 31 -171 220 -205 47 68 127 -101 13 137 228 -248 -16 -155 -40 172 115 125 273 120
7679 120 -148 129 -161 -35 -22 -62 -162 35 124 -81 -1 -19 37 45 -56 112 24 -98 213 10 79 60 -73 -8
7703 -8 -22 92 -312 -56 95 -79 -2 56 -28 -212 52 -57 -44 -38 -121 87 -16 163 83 -120 90 49 -15 349
7727 349 55 93 -50 -114 -152 -208 25 -167 -71 -54 110 1 -36 271 118 -87 -83 -13 43 -139 -188 157 73 -193
7751 -193 188 -153 -101 55 79 -77 -168 -73 -49 13 -19 161 -50 -140 82 -226 66 -52 29 54 -112 74 -145
7774 -145 -1 318 -67 -15 40 -142 115 -177 236 114 51 91 -224 75 -47 111 93 -295 3 183 -7 142
7796 142 -74 -46 21 -208 -182 178 213 -40 -181 -82 -23 -164 -190 -112 153 45 -229 -196 108 -337 105 127 384
7819 384 -74 -124 25 84 71 17 -1 -62 -16 8 22 -288 -93 67 88 -148 -115 -263 -10 24 -66 -173 -194 355 48
7844 48 22 -83 -43 -79 270 -68 -116 19 94 -52 29 108 -181 -33 -95 -148 -148 18 -143 7 29 -176 71 -66
7868 -66 -46 -154 -62 112 59 -160 -108 -36 61 -137 -90 88 26 141 159 -8 132 127 24 -67 -208 122 -78 -76 16
7893 16 127 -177 175 -65 -226 98 -84 -48 208 31 -27 156 -37 -115 -124 -148 -74 105 -27 74 4 -157 -92
7916 -92 -119 115 40 -10 31 -70 -131 36 78 188 -30 -40 111 -76 -297 -92 -54 18 181 134 174 7 -33 34 -31
7941 -31 -155 333 -51 28 39 177 -47 -227 115 -23 -105 129 -19 -152 25 -155 31 -93 65 15 -13 70
7963 70 -141 -61 -124 -90 63 -179 261 14 85 64 255 -233 54 20 50 -263 -42 -22 -58 -26 -74 -56 -212 55
7987 55 -171 121 -118 -37 160 68 -175 9 -111 144 47 -103 82 109 118 -62 148 -156 63 117 -76 63 4
8010 4 -118 34 0 -3 -3 96 -185 83 -20 -115 -126 60 -90 -78 -68 -31 99 12 26 -17 129 -62 20 59 -19 47 -18
8037 -18 12 80 -19 -78 -189 71 -53 -217 16 -204 -297 -107 19 197 -139 122 -94 65 5 -59 33 -103 107
8060 107 -87 -65 47 -112 -116 32 108 18 -40 -59 29 -167 -60 -192 -208 -169 -51 -205 -4 142 114 51 27 54 235
8085 235 83 -60 -52 140 -108 -5 -96 4 -147 -112 -146 -48 -39 -363 11 -33 81 16 -84 2 282 39 219 55
8109 55 -28 75 -7 -86 -128 -111 -19 -111 -181 -171 64 -118 178 123 296 -165 28 -75 31 -38 -121 152 -106 -19 -107
8134 -107 102 -139 -105 22 -176 107 -138 -79 148 380 50 -224 -81 -80 -16 -40 -145 -15 149 139 84 -191 -12
8157 -12 -185 -4 322 169 185 105 165 -275 153 9 -118 -149 75 -95 205 -22 159 -220 -39 -71 -76 -97 123
8180 123 142 252 31 132 -60 78 -64 -51 39 253 -63
8191f3
$$ Imaginary data points
##PAGE= N=2
##DATA TABLE= (X++(I..I)), XYDATA
0 0 0 0 0 0 0 0 0 0 0 0 0 0 0 0 0 0 0 -8 8 -8 8 -8 8 -16 16 -16 19 -24 24 -32 32 -40 46 -50 56 -64 72 -81 90
39 90 -101 114 -125 138 -153 169 -186 207 -227 250 -275 304 -335 369 -407 450 -498 554 -618 691
59 691 -781 888 -1020 1185 -1407 1712 -2166 2909 -4326 8032 -41088 -71498 10843 11943 -11093
74 -11093 -4894 12212 18521 23077 -3410 -20980 12047 30802 -25612 -36743 17270 12803 -23116
87 -23116 -11736 -1393 6012 14519 -6578 -18395 17326 28831 -15569 -23915 22379 16970 -17815
100 -17815 -6566 3520 2867 12752 -6608 -18632 14938 21039 -17915 -20031 15309 9962 -19526
113 -19526 -9097 2226 -2017 7881 -3149 -14808 17635 22853 -11095 -6238 21290 10968 -11810
126 -11810 -4149 2814 -5866 -1963 -7987 -19623 4782 10930 -17016 -5921 19057 6824 -4442
139 -4442 6739 10621 2562 3254 521 -9389 2599 5349 -18406 -9024 11096 -5004 -10847 5280
153 5280 6133 -5 2858 3728 -195 5048 5296 -10443 -3531 11127 -6997 -12624 6392 3787 -4942
168 -4942 890 2920 2573 4805 1957 -5466 928 9293 -7322 -12910 6938 2741 -10053 -1744 2336
183 2336 2319 4378 -331 -1455 7147 9049 -5048 -8147 8247 4018 -11741 -4504 1807 -1186 403
198 403 -4320 -2961 8772 6439 -4828 -3053 9843 6319 -9225 -4415 4315 -1001 -3067 -5774
212 -5774 -4134 7682 3730 -7272 -241 10785 6840 -5109 -2444 7337 1722 -5195 -6003 -4662
226 -4662 3134 -784 -11768 -2124 8791 3026 -4143 428 10194 7137 -1708 -1159 2170 4073 -648
241 -648 -11284 -4194 5094 -3977 -9102 -2506 4666 4120 -3066 -948 6451 6253 1343 -4511 522 7946
257 7946 -1672 -8446 -673 3122 591 -4907 -3693 5076 3913 -2724 -3261 1408 5688 -1662 -7997
272 -7997 493 3744 -1406 -4392 -2322 5204 4947 -2630 -152 5618 6037 272 -5076 1051 3792 -4552
288 -4552 -7128 -4161 67 -316 -6902 -3144 5239 4178 676 67 5640 9323 903 -2301 2469 2464
304 2464 -814 -6709 -5776 1570 -1605 -6446 -3477 1506 4078 -757 -2564 4987 5855 947 -1197 -300
320 -300 4973 1553 -5580 -1785 2468 876 -2465 -4074 2012 3998 -2456 -2662 378 2599 679 -5655
336 -5655 -1696 3496 -38 -2684 -1193 3325 5143 -195 -875 3818 4158 1133 -3459 -1879 2951 -2400
352 -2400 -6805 -3080 -643 -368 -2926 -3088 3211 4484 1557 199 2628 7064 2525 -3403 1049 1833
368 1833 -1910 -3746 -5050 -1318 559 -3474 -3580 649 4473 1640 -2550 3094 5622 263 -55 -310
384 -310 153 2417 -2367 -4421 790 2256 -1253 -3790 1535 3969 -1164 -978 1280 -303 2167 -750
400 -750 -4589 1067 2576 -2682 -2649 1816 3075 -545 -199 2575 445 1819 1069 -4049 384 2829
416 2829 -4468 -3697 903 -214 -2201 -449 1509 483 1707 3203 -1550 1213 4905 -2494 -2689 2680
432 2680 -1732 -3428 -15 -651 -1998 254 1710 -1119 267 4836 -895 -1126 4706 -731 -3366 2144
448 2144 -815 -4199 -321 483 -2566 -668 2790 -371 -554 5286 349 -2882 4998 1525 -5215 664
464 664 1007 -3703 -1789 60 -2574 -1050 3175 -1271 -2851 5998 3265 -4347 2376 4288 -2562 -227
480 -227 704 -3242 102 2031 -3701 -4206 4503 2612 -5898 1115 5033 -2295 131 1476 -3018 1514
496 1514 3314 -4419 -3312 5286 2297 -5669 495 5409 -1100 -169 2032 -3030 1672 3945 -6027
511 -6027 -4410 5064 306 -6577 -504 4122 -844 -205 2542 -1766 2784 6656 -4254 -3479 7451
526 7451 707 -6582 -708 2028 -2226 -1821 -459 -3191 1336 5577 -4107 -3279 8703 2539 -5024
541 -5024 1842 3148 -985 437 -661 -3828 837 3800 -4755 -5132 6430 1852 -5785 1505 2749
556 2749 -1565 1950 -199 -3731 2277 4082 -3699 -4055 5544 2662 -4739 1307 2606 -1873 2593
571 2593 454 -5012 1771 3533 -5105 -4256 3505 919 -4313 682 2176 -1622 3096 2290 -3523 3067
587 3067 5706 -3668 -2776 3796 -89 -3857 -1000 -345 -2859 1064 1223 -4534 1574 5635 -2799 -1552
603 -1552 4926 757 -1251 1536 -322 -1610 1514 467 -4520 -255 3874 -2871 -2565 3434 -174
618 -174 -1606 2178 -673 -1250 2667 734 -3140 248 3474 -1793 -2374 3193 117 -1603 2659 -507
634 -507 -1779 3113 68 -3309 -28 1885 -1823 -2434 1514 30 -1549 2292 26 -1677 3634 1461
650 1461 -2712 1319 1992 -1377 -1236 359 -675 -1392 702 -535 -2441 2106 1533 -2538 1226 2492
666 2492 -1031 199 1180 -668 -292 301 -787 -2409 1000 895 -2587 53 2033 -1152 506 1485
682 1485 -774 563 1286 -520 -912 468 366 -1551 -813 1300 -1138 -343 1598 -829 299 1545
698 1545 -621 33 1247 451 -650 -585 614 -624 -1119 918 -817 -455 1415 -572 -312 1665 223
715 223 9 320 340 -10 -534 315 -230 -888 1105 -213 -1035 1275 -38 -268 483 -55 103 -26 -173
734 -173 172 -750 8 364 -918 448 254 -818 970 450 -137 678 4 14 -34 -607 115 -681 -84 540
754 540 -954 37 -50 -626 589 111 -116 923 217 -4 225 -355 189 -194 -566 362 -847 -264 431
773 431 -476 416 366 -251 706 -50 8 229 -537 337 -24 -508 515 -642 -389 535 -537 215 272 -155
793 -155 401 17 126 516 -483 245 -63 -711 392 -252 -417 672 -554 -90 541 -231 616 198 -237
812 -237 513 -340 186 55 -730 398 -370 -570 630 -460 -423 423 -305 320 503 29 516 -161 192 339
832 339 -1017 593 -4 -882 239 -77 -577 534 -284 -206 183 94 186 -523 316 657 -652 539 509 -759
852 -759 703 74 -798 323 137 -180 -224 -114 337 -597 -204 690 -820 269 614 -1160 209 1013 -629
871 -629 -98 185 143 -353 -141 690 -517 78 1140 -1169 -341 1516 -1012 -365 967 -377 -238 -37
889 -37 261 -359 130 842 -960 -865 1721 -706 -901 1255 -428 -532 989 -493 -689 759 620 -737
907 -737 -286 1509 -320 -1087 1247 -346 -1055 1310 -333 -1552 905 432 -1427 -212 1002 -228
923 -228 -562 1083 219 -883 1722 236 -1833 1673 688 -1863 29 801 -435 -592 513 -198 -1071
940 -1071 1448 410 -2207 1496 1720 -2252 85 1555 -875 -163 601 -857 -677 1287 114 -2180
956 -2180 1085 2275 -2035 -201 1930 -1373 10 1154 -1377 -742 1815 -234 -2158 958 1851 -1884
972 -1884 -659 1705 -968 70 1759 -1587 -257 2733 -482 -1939 1126 1459 -1300 -883 1554 -857
988 -857 -334 1640 -1499 -778 2966 -563 -2193 1890 1219 -1370 -234 919 -544 -108 1352 -1528
1004 -1528 -1496 2622 -688 -3116 1838 1337 -1943 37 448 -816 313 1254 -1546 -1090 2645 229
1020 229 -2592 1756 1743 -1877 813 793 -1295 623 949 -1760 -887 2023 1 -2803 1169 1855 -1547
1037 -1547 664 1304 -1197 1454 1689 -2012 -345 2111 -610 -2711 268 997 -1891 -72 967 -1953
1053 -1953 883 1838 -2063 -82 2606 -211 -1250 1128 829 -1027 175 496 -1936 219 1681 -2186
1069 -2186 -976 2501 -560 -1524 1447 205 -867 549 562 -1292 537 1757 -1256 -1051 2140 -536
1085 -536 -1435 1469 -247 -653 959 -312 -1558 243 1005 -1462 -1016 1502 -146 -1534 1383 129
1101 129 -1083 1464 380 -1291 1140 870 -726 -612 783 -283 -1488 609 -57 -1426 1107 498
1117 498 -1649 991 1011 -734 585 1147 -226 -517 514 9 -1162 896 337 -1908 424 959 -1239
1134 -1239 221 870 -660 28 735 44 -516 549 596 -1228 85 975 -974 13 1164 -409 226
1151 226 895 -568 -210 474 -10 -786 -392 594 -722 -632 654 -475 -77 1155 -385 115 1137 274
1169 274 -206 448 574 -304 -763 335 -654 -840 860 -526 -734 690 12 -406 589 137 85 65 126 220
1189 220 -497 503 -350 -1204 432 42 -764 277 91 -91 304 182 451 82 209 -177 -738 183 161
1208 161 -732 60 231 -666 278 170 -211 89 243 355 80 97 594 -740 -188 32 -855 -194 269 -519
1228 -519 308 3 40 298 -69 459 80 -93 316 -336 -238 458 -407 -47 186 -221 411 292 32 342 47
1249 47 166 -165 -578 217 -582 -546 183 -429 -135 462 -149 339 517 209 605 11 181 33 -467 59 -244
1270 -244 -433 -139 -358 -573 106 -235 192 390 175 400 162 327 649 -18 524 118 -793 148 -469 -621
1290 -621 3 -529 -209 89 -343 219 172 215 184 -352 236 41 -454 334 275 -388 423 -115 -225 156 -228
1311 -228 128 -332 -329 149 -617 40 239 -765 -26 315 -156 474 513 288 393 383 549 230 -120 322 -432
1332 -432 -388 152 -1218 -450 235 -848 0 346 102 176 491 649 117 256 628 -390 -279 593 -731
1351 -731 -617 406 -486 -471 198 -23 -201 44 391 -22 -193 994 -327 -652 744 -38 -574 824 -136
1370 -136 -401 619 131 -366 -107 683 -31 -504 480 -58 -663 626 -276 -877 888 43 -623 327 536
1389 536 -95 -176 485 338 -406 404 221 -1178 499 12 -1401 165 303 -731 -530 404 1 -17 808
1408 808 480 -357 891 768 -1143 230 600 -1147 -416 314 -520 -239 546 188 -722 601 822 -1075
1426 -1075 383 1169 -951 -257 835 -612 -238 779 -527 -458 727 746 -1037 241 1271 -552 -144
1443 -144 1044 -878 -517 1004 -914 -758 811 30 -980 10 994 -462 -339 1217 -544 -724 1491
1460 1491 -394 -1184 1411 220 -1304 221 628 -568 -237 938 -320 -463 1363 -250 -1236 1190
1476 1190 333 -1207 175 459 -713 167 134 -394 -228 1111 9 -1049 1294 390 -1245 209 349
1493 349 -1059 123 214 -1177 -182 762 -354 -831 1515 965 -974 458 940 -777 422 502 -1053
1510 -1053 -165 784 -793 -828 465 187 -1303 -13 1051 -628 344 1125 -652 -113 1488 -775 -732
1527 -732 1048 133 -730 -295 540 -560 -13 941 -915 -291 1434 -738 -995 1253 87 -529 534
1544 534 284 -637 232 903 -411 -129 1317 -438 -568 1127 -210 -1329 552 42 -1076 -16 -20 -699
1562 -699 -217 1079 -78 -587 1251 190 -723 1090 351 -1146 185 174 -1060 -374 314 -642 -496 475
1580 475 185 -644 861 820 -744 577 745 -580 242 511 -472 -363 361 -299 -717 370 131 -814 122
1599 122 559 -712 -117 560 -256 108 343 -163 -342 245 570 -556 405 820 -367 -42 631 -414 101
1618 101 523 -456 -383 279 -130 -556 -52 449 -199 -322 721 -161 -65 943 -298 -94 730 -343 -787
1637 -787 342 69 -566 -518 -118 -9 -258 396 -234 -223 851 -47 -308 731 326 -171 -122 -186 64 -183
1657 -183 90 -19 -357 763 207 -558 396 147 -99 -87 -13 257 78 -124 -250 -195 460 135 -512 742
1677 742 589 -324 -14 340 -42 17 -370 -126 -46 -172 -326 -739 196 392 -583 -215 424 78 344 38 -182
1698 -182 429 -68 -183 -234 139 -37 -268 -175 312 110 -46 232 -65 431 86 -593 0 132 220 -468 -512
1719 -512 219 -37 -510 111 40 254 74 -347 79 817 174 -314 -406 100 200 -597 -383 42 -142 230 -164
1740 -164 -246 489 86 -572 242 243 395 -249 -306 544 118 -240 -357 -301 139 -152 -809 386 329 -235 -15 -162
1762 -162 524 406 -296 283 -35 282 -27 -394 136 349 -190 -59 113 -32 177 -469 -415 68 -177 -155 -486
1783 -486 -52 786 -620 -114 278 114 540 -184 -20 469 232 -369 -549 -155 232 -552 -875 157 53
1802 53 -227 -287 -401 705 608 -324 40 443 211 -328 -397 312 143 -589 118 -425 -49 482 -543 -317 654
1823 654 266 -476 106 550 134 -449 221 84 -81 372 -269 -621 865 -63 -543 317 341 327 -141 -107 -168
1844 -168 93 -15 -288 -334 608 -182 -519 608 386 -409 25 -298 193 188 164 -356 -94 430 -88 -917 465
1865 465 735 -516 -89 300 205 136 3 -153 180 290 -5 -895 316 927 -810 -216 399 -99 90 38
1885 38 -219 312 551 -498 -380 303 366 -632 -394 504 -69 -34 183 -677 10 541 -388 -469 600 344 -600
1906 -600 -379 548 -202 -413 337 -349 55 739 -617 -278 808 285 -379 -331 670 -19 -596 7 -87 -194
1926 -194 769 -816 -611 992 81 -852 261 462 -12 -192 297 16 -117 519 -574 -525 911 130 -1359
1945 -1359 150 535 -378 -210 10 12 414 418 -457 -282 900 266 -1165 101 834 -593 -200 463 23
1964 23 151 281 -502 22 1102 105 -1084 202 727 -740 -368 231 -176 325 398 -684 79 781 -63
1983 -63 -853 302 736 -643 -211 741 -261 -78 739 -652 30 814 -386 -474 790 447 -321 -227 555
2002 555 -156 -311 262 -399 -148 972 -354 -821 707 201 -368 -61 510 -132 -119 214 -306 -107 907
2021 907 -455 -651 588 209 -864 -25 464 135 -296 219 201 54 472 -440 -508 731 136 -932 -31
2040 -31 101 -292 -127 -116 -101 114 369 -411 -420 627 62 -855 369 545 -264 -24 261 -180 187 91 -369
2061 -369 -29 503 -20 -729 331 635 -429 -114 294 -343 482 265 -612 56 603 13 -541 217 599
2080 599 -362 -262 277 -35 111 -29 -782 174 500 -174 -474 669 368 -333 -410 499 37 -259 362 -562
2100 -562 43 619 -279 -610 168 401 -246 -495 121 445 -49 84 75 -20 419 -242 -311 409 211 -296 -85
2121 -85 425 445 -73 -211 -231 3 173 -41 -448 436 158 -590 84 130 221 58 -345 38 36 197 -191 -314
2143 -314 476 321 -556 -78 529 103 -173 -244 -105 377 42 -499 -191 135 241 -456 27 391 60 -168
2163 -168 -255 98 75 -174 -309 170 353 -11 -406 -11 485 83 -349 262 -83 132 185 -226 -3 428 -315
2184 -315 -87 176 354 91 -495 113 72 -137 67 -246 -25 362 -122 -237 72 202 -289 -293 -138 343 -163
2205 -163 -92 -13 -135 344 -26 -244 265 144 -328 17 -126 34 -28 -217 298 -301 249 -108 -414 252 186
2226 186 -303 -117 -60 -166 85 -41 -161 130 16 -37 -286 112 354 -521 27 6 -187 -23 -51 -71 358 95
2248 95 -169 121 113 429 -128 -126 298 46 -96 -18 -62 262 -414 -143 160 -67 171 -236 -323 294 -185 -269 195
2271 195 86 146 58 -265 89 223 18 -72 13 336 258 -265 129 -55 -274 4 -103 -77 135 -241 -55 197
2293 197 89 -244 -247 60 216 -141 303 -46 -192 295 -107 -268 59 120 -492 -126 94 282 134 -137 -30
2314 -30 -260 396 213 -434 315 58 -36 27 -64 1 112 -293 62 228 -76 98 -294 204 258 -238 53 139
2336 139 -286 58 236 -52 -22 239 -54 -230 106 254 -518 176 542 -186 69 213 -145 108 152 -408 -82
2357 -82 86 68 -316 -60 523 -264 78 255 -119 -63 155 -169 -139 469 -125 -67 67 310 -194 -224 258 -222
2379 -222 -282 363 -308 -559 434 83 -238 563 -13 -176 -19 108 52 -75 376 -145 -379 461 104 -674 291
2400 291 -57 -300 -72 14 -55 -22 61 104 -428 531 160 -514 100 236 -534 -255 243 -327 9 240 -213 -205
2422 -205 190 336 -424 394 360 -490 -46 224 -258 -33 40 -199 -41 179 -20 -277 224 309 -408 -112 496
2443 496 -198 41 361 -312 8 308 -271 -122 56 41 -344 144 606 -360 160 427 -261 -288 548 -29 -266
2464 -266 332 21 -219 72 296 -309 14 358 -272 -428 175 3 -210 372 111 -408 -121 130 -256 -17
2484 -17 191 90 -177 123 74 -520 539 -62 -583 3 154 -94 48 169 -186 -40 -12 -15 -226 386 14
2505 14 -494 156 273 -317 245 174 -238 -133 7 281 -108 -2 275 -181 428 373 -364 -140 263 -388 8
2526 8 147 -187 -186 196 -116 -465 101 116 -352 -132 137 -305 205 251 -114 27 168 -54 -86 -169 281 -163 -122
2549 -122 441 -190 -308 -120 -64 -199 306 -10 -65 337 80 -12 -45 296 110 -125 277 -62 -287 261 -291
2570 -291 90 126 39 -235 165 108 74 -219 135 134 -312 149 45 -348 292 75 -252 112 -12 19 -109 -37 291
2593 291 37 194 -117 -67 256 128 -358 252 -155 -314 133 -93 -85 59 -101 174 -108 -110 214 -113 -44 172
2615 172 -259 -40 312 44 27 -44 58 72 95 107 -40 -66 246 -404 -13 226 -18 -111 407 23 109 -8 -30
2638 -30 78 163 169 9 -122 248 81 36 253 -86 15 29 -135 -127 243 -59 31 -43 -166 0 -172 -128 -22 -229
2662 -229 173 -4 -103 295 -51 257 0 2 -142 -91 -121 184 -227 122 251 -335 100 -7 -15 103 86 -182 -68
2685 -68 -153 217 -210 107 -33 -398 11 100 -14 -91 -74 -73 135 -69 -65 17 -108 91 -55 -221 191 -44 66
2708 66 175 -19 67 -74 -202 176 75 127 85 57 -78 66 -1 204 -52 -44 186 -184 -58 182 65 -32 42
2731 42 -129 177 -28 50 -101 -95 234 -88 9 374 -52 -93 229 -46 29 14 -72 45 -195 289 -8 -135 90
2754 90 -39 -184 178 -126 -156 242 -81 221 -179 -255 178 -102 200 -157 -237 204 15 -68 30 -204 -86 18
2776 18 -77 -253 -322 37 167 -240 90 185 -241 503 109 -16 80 -173 -121 68 119 49 317 -69 201 126 72
2799 72 270 -49 31 53 -234 208 198 -62 109 208 93 -42 119 -3 -94 129 -62 -279 -252 201 -59 166
2821 166 309 -277 139 123 -267 -163 151 -88 -219 10 125 -296 49 401 -331 -63 79 -179 -77 85
2841 85 68 -71 6 319 -95 -350 136 -205 -27 132 87 49 81 -166 -198 -122 139 69 -20 71 -2 -366 351 34
2865 34 -214 190 -27 -57 -73 86 83 -122 169 48 -188 14 -22 -527 78 119 -531 272 57 -340 159 132 -174
2888 -174 -166 95 16 -186 -49 214 -363 20 235 -111 47 -11 -160 -100 155 -170 -209 113 209 -235 -70 353
2910 353 -208 11 -109 -112 -161 205 -20 -145 38 76 -225 -21 205 -201 -94 197 -166 -494 254 -153 -99 14
2932 14 -86 -293 165 223 97 -273 271 -251 -49 293 -188 -253 383 -44 27 227 -103 -163 147 -125 36 -184
2954 -184 215 33 -280 237 -267 -345 325 -101 -197 61 84 -114 -246 51 43 -116 199 -83 -278 147 43 -276
2976 -276 -114 -59 -211 147 15 -22 -59 -11 55 -1 181 105 -396 278 133 -182 -162 13 7 -12 106 -59 -262 137
3000 137 43 -216 171 411 -290 61 242 80 -141 430 88 -34 163 278 41 20 157 -194 -60 300 -290
3021 -290 -165 140 -24 30 143 46 -196 -241 203 -421 -329 267 -64 -269 101 61 -187 330 -160 -30 -86 -91 -102
3044 -102 55 -112 47 -301 183 -32 -226 3 109 85 235 -114 -118 416 163 57 -59 143 -28 40 146
3065 146 95 -187 143 -79 -199 208 35 20 8 101 -38 -209 -63 135 -84 -33 240 -19 -138 -60 14 92 -55
3088 -55 -148 207 -99 -51 -37 -101 102 -198 125 215 -229 15 364 -171 -221 90 -4 103 -268 106 -70 -215 173
3111 173 -95 -91 4 -45 -149 369 55 -65 115 -170 -4 -226 1 75 -218 150 258 -293 52 -213 -68 70
3133 70 -60 -78 265 5 -98 99 131 219 3 213 -32 -221 108 -100 92 -192 162 -101 -98 -415 -162 -12
3155 -12 -24 124 -79 222 -50 -220 52 -49 -167 113 -140 14 -27 -162 -41 -129 146 312 191 -22 300
3176 300 80 179 79 -144 122 -118 306 12 13 56 -18 22 37 38 -107 -4 -49 250 183 26 -211 -172 -67 -59 27
3201 27 -141 70 122 154 -25 30 116 22 -158 148 -2 -236 170 1 133 -226 -40 -87 10 120 224 7 97
3224 97 19 -123 385 52 -1 23 -257 193 -268 -53 146 -604 138 -7 75 97 -107 -177 -251 -91 -1 40 42 201
3248 201 137 41 246 251 271 13 24 281 148 -35 53 155 -5 -74 291 199 371 -13 32 145 -175 316 -231
3271 -231 -8 -51 -98 188 -19 31 -72 -1 367 -174 -171 102 61 54 135 62 -79 174 -226 249 46 -182 -132 46
3295 46 266 -191 -262 351 -207 -57 210 -1 -69 38 -24 -41 16 94 118 24 10 72 80 238 -60 -124 145 -246 -67
3320 -67 249 260 -38 96 -55 -146 -192 308 -160 -494 105 -52 43 76 -51 -282 30 42 -261 -51 155 233 57
3343 57 94 -3 -54 391 -63 -174 109 -13 -84 -154 10 145 2 -38 220 -89 -237 3 -451 102 220 -334
3365 -334 44 122 -151 62 24 -223 -90 149 58 -293 -52 201 -74 -82 112 -305 16 191 -49 48 56 -262 -160
3388 -160 -26 -86 -134 119 -96 -21 -17 74 -55 -356 75 0 -216 48 -6 -124 -121 53 71 -7 143 103 -133 92
3412 92 124 -159 232 57 49 126 15 129 41 196 105 -54 -168 -146 -287 94 -211 -29 -223 122 25 -128 95
3435 95 -230 -238 28 256 23 58 129 -351 75 85 -178 182 72 15 29 -227 -72 20 97 -39 -145 58 4 -250
3459 -250 -153 32 -218 -22 -152 -53 -159 2 -136 -266 160 240 -41 -115 91 -152 436 113 -111 66 3 -52
3481 -52 -56 61 475 24 -351 157 -33 -190 292 236 -21 -61 95 60 410 88 -132 6 25 22 -3 164 -69
3504 -69 -180 -137 -127 63 9 206 -79 109 177 91 238 -30 -7 -150 -15 26 -170 -6 36 -63 119 36 -202 117
3528 117 -146 -49 118 136 35 -293 187 91 -83 146 178 -204 140 92 250 57 -163 156 13 81 134 -111
3550 -111 140 217 -125 -8 -184 -237 -91 40 -95 -106 11 -65 95 -218 37 22 119 119 -57 64 -100 195 -49
3573 -49 -44 -161 -64 130 38 -24 -252 -158 59 -46 129 -3 73 97 73 169 -66 175 -38 -129 -38 353 79 27 -34
3598 -34 -176 125 -200 -15 -74 74 289 -110 -6 27 -210 218 -36 38 -78 6 -193 -151 -111 66 -47 -175
3620 -175 184 63 -187 75 -22 -122 20 27 -264 20 -180 14 -23 -124 -132 -164 -86 -103 -68 113 270 115 -12
3643 -12 31 -137 93 208 -64 47 -79 255 -152 59 -7 -81 -24 -167 -11 179 33 -288 -122 7 -39 18
3665 18 -212 103 -46 74 199 -280 157 -32 37 86 168 152 348 -88 -147 160 -103 -65 -182 90 243 -73
3687 -73 -88 6 213 96 244 -148 130 -88 -45 27 74 118 -143 148 66 -58 -63 -76 -58 -114 292 -19 -41 -1 41
3712 41 -60 -94 -181 11 -61 88 121 178 101 -75 -189 59 -237 -211 54 -225 251 -54 65 133 -282 -298 1
3735 1 227 73 -207 6 51 35 -176 155 9 -36 -64 -89 -166 -20 88 -255 -122 90 -11 -50 -116 81 -98
3758 -98 -185 -22 150 42 -222 -173 -129 105 -110 -256 117 -91 -284 17 -169 93 -35 -97 -159 52 -43 -6 81
3781 81 -23 75 197 55 168 173 153 -67 71 144 -206 -65 27 -181 171 25 -80 -35 -168 270 -103 155 267
3804 267 81 -272 175 -1 128 67 -46 106 131 204 66 -117 -99 71 -61 -23 5 58 17 46 -72 68 89
3827 89 -38 -250 -213 33 -195 31 6 95 123 -111 47 43 117 -108 155 -137 -85 85 -49 353 111 110 190 249
3851 249 143 99 -146 -111 148 220 -55 -165 183 84 -177 66 19 5 -4 -44 -25 -22 -336 -75 -231 -39 268 -111
3875 -111 -37 -151 100 -40 -126 -178 65 54 100 65 -74 83 -103 171 109 -85 124 12 -166 138 -182 -206 168
3898 168 118 -113 214 91 189 67 28 122 136 84 40 -104 -282 -115 -161 68 151 4 87 54 -254 -18 -110 -71
3922 -71 -55 35 202 -161 -27 153 -447 -30 -105 -46 -331 -10 6 -67 27 96 -50 -65 254 -79 -63 48 159 -171
3946 -171 237 237 84 10 74 -86 -159 133 -42 -179 -107 -126 -142 123 -53 11 39 -126 123 57 202 -122 187 11
3970 11 59 -48 -135 77 -105 38 118 -28 60 -10 77 -151 96 -154 -80 33 163 -153 335 -279 -23 180 149
3993 149 -153 -130 -88 75 -128 -124 73 11 221 27 -123 -139 257 126 9 8 -118 40 45 -155 29 -176 99
4016 99 -299 97 156 247 -52 11 113 -32 153 127 25 -42 -89 -52 -297 196 -208 131 -31 134 -4 73 126
4039 126 -30 -28 5 -67 58 -81 -1 -271 -44 -72 -295 74 -144 -150 17 19 129 13 -6 22 80 -71 186 -4
4063 -4 55 -134 12 39 -144 277 91 -152 -78 5 -88 161 -56 97 98 107 32 76 -3 83 209 39 334 -61 -51
4088 -51 6 -73 138 86 252 -116 160 -200 38 -312 -63 155 84 66 -1 -48 -89 -159 -115 179 17 405 -204 -34
4112 -34 71 6 32 362 66 -159 -127 10 81 49 60 61 -117 247 -65 115 69 83 35 7 -208 61 71 46 47 54
4138 54 -101 -272 -273 -147 -24 -191 140 -1 -274 -69 -92 2 -26 69 218 -144 305 135 74 -38 34 -76 14
4161 14 171 -70 38 -6 -20 -46 404 128 -171 -93 141 -126 -42 137 -29 162 120 -150 139 -16 -23 41 373
4184 373 114 88 222 37 -216 5 -114 -136 -47 -216 272 -107 298 -69 -221 61 -59 -31 -141 136 -40
4205 -40 222 -38 -226 103 188 -40 -20 -215 244 70 160 -18 -39 75 60 63 125 -74 -329 -67 62 -199 -136
4228 -136 306 -32 29 -130 -87 -97 -2 140 113 10 269 -74 -68 29 -184 -48 6 4 -2 -17 11 -83 50 -112 178
4253 178 73 -97 -137 -365 253 10 121 114 -79 57 -91 -197 -237 -70 -49 -22 -42 -145 268 174 109 276 293
4276 293 -94 178 49 -7 -171 -151 -86 -279 -115 -223 148 30 -100 38 20 -88 54 -30 10 29 -63 2 -114
4299 -114 26 232 62 -94 195 -13 280 -46 176 -42 -7 57 -176 -49 17 126 188 103 -21 -55 -29 -227
4321 -227 -312 -20 -106 168 163 81 -32 152 16 10 2 40 -241 -142 136 -141 124 -136 -242 24 -156 -74 180 -73
4345 -73 -80 -78 99 8 -73 267 475 32 -86 69 55 -137 -89 -47 -14 -189 44 128 -34 -39 -90 -164 261 -151 -38
4370 -38 66 167 -145 -42 115 -24 -48 94 22 -125 62 -71 -137 -98 28 -7 -39 118 -11 -59 152 67 -14
4393 -14 -4 117 -216 -105 -45 61 -116 2 -9 29 164 124 -84 -159 -4 -71 48 -33 155 -166 134 120 54 -23
4417 -23 -73 -25 -218 62 -120 51 68 -12 -46 -46 -171 -176 -47 175 186 -77 29 -22 50 -99 -103 -52 48 -97 77
4442 77 81 108 96 117 -220 237 -73 237 -74 -12 232 155 11 27 -46 65 50 -76 36 113 95 -2 -115 147 -47
4467 -47 227 13 -203 -26 75 49 -143 46 4 99 197 -32 -310 12 -47 -35 65 120 251 -12 -86 -165 -155 100
4491 100 0 193 -144 -109 86 226 -27 116 70 51 150 -84 70 163 71 -161 -335 -169 -262 -67 -27 -53 28
4514 28 120 121 -73 178 -109 -10 -99 106 -247 166 -24 18 -55 48 -116 26 158 118 -63 78 0 -110 16
4537 16 76 70 39 101 -35 -58 130 59 -40 130 78 -29 -29 19 -30 59 122 146 -94 -374 -35 -13 53 -87 70 63 4
4564 4 -31 77 -19 156 -49 29 20 -63 330 135 -224 126 -160 82 105 152 -121 -51 -70 -33 -219 38 -29 244 -228
4589 -228 131 -86 -19 109 -72 -30 130 -106 -41 151 -88 -261 194 -6 3 -139 -89 196 -191 107 108 172 139
4612 139 150 91 63 -20 53 -203 -151 60 99 71 -97 -18 -29 106 74 -64 37 -153 5 84 10 -94 21 -182
4636 -182 -225 18 -339 -193 131 292 -193 23 85 -159 4 163 -311 -205 76 188 96 23 43 -108 49 8
4658 8 -112 73 79 -135 -293 23 27 122 -14 -242 -95 -112 237 -27 243 127 75 -4 -113 -3 111 173 137 51
4682 51 -222 -182 -117 231 59 17 93 134 151 -212 219 140 123 305 50 75 -71 107 -378 -197 -40 -83 -4 110
4706 110 32 -192 128 -40 45 34 51 -14 68 -286 229 -70 -79 -70 -53 -101 -275 7 152 47 60 -77 -197 -297
4730 -297 -47 55 -53 -168 177 188 148 -4 276 -72 -43 58 -178 70 0 189 -52 4 169 -49 76 -92
4752 -92 330 88 -153 -98 -170 74 25 109 -30 -76 83 53 -79 -69 -59 -10 -103 114 113 -6 86 -105 -176 48 9
4777 9 -165 243 -8 23 183 -112 101 -168 -161 -50 -180 19 44 -235 -21 65 -101 119 -6 54 119 63 -16 6
4801 6 -102 34 100 -236 33 -12 22 167 -29 11 47 -101 -129 110 3 -111 10 230 70 16 -9 -59 178 -214
4825 -214 -17 204 -132 -62 -78 -14 279 9 -25 -143 -142 -3 31 224 -34 -108 42 -172 -2 -17 113 -106 148
4848 148 -38 -29 -48 -40 213 126 47 -46 -32 -14 6 121 103 -172 51 104 -60 -59 -61 149 -209 43 -140 26 41 18
4874 18 -72 -225 192 -1 176 304 2 6 -226 179 159 -128 86 -56 17 152 -41 -21 -173 150 -35 104
4896 104 58 -102 99 -66 -63 160 -5 -10 -31 39 -155 -113 72 -241 139 80 59 -106 79 115 112 131 -139 -125 64
4921 64 20 -170 -112 -244 91 71 -115 304 12 155 -122 240 45 235 -125 -73 -53 -196 18 12 230 14 -223
4944 -223 -53 -73 -4 -293 193 76 -197 -73 -1 163 19 -175 71 -212 153 97 -175 105 -145 -111 77 -69
4966 -69 49 132 -64 60 -141 -73 -159 -25 74 90 187 137 64 -127 -237 131 -154 -145 -126 8 237 95 -20 -152
4990 -152 -28 -3 -79 -35 -22 -48 -37 -41 -14 -162 -20 -170 1 5 18 -164 91 223 -57 -14 157 74 -233 251 143
5015 143 25 -36 -122 76 13 -131 -74 -48 141 107 -152 84 -23 22 269 -48 -120 -64 -47 -99 -17 121 18 95
5039 95 64 118 -199 -55 24 141 55 -68 -42 94 98 93 261 92 142 -108 73 111 -113 97 267 -156 -26 136
5063 136 143 69 -20 -58 -290 -26 -113 224 -73 125 179 -139 117 18 -265 -259 38 -55 -16 -4 265 -216 -134 33 71
5088 71 -133 -18 -13 41 -9 49 214 397 -12 -195 -27 193 197 -129 -52 271 -34 -231 80 -255 -269 -40 80
5111 80 21 189 269 -237 -21 21 -288 -152 151 -237 -35 57 -168 93 63 -34 96 274 49 -76 38 93 222
5134 222 121 218 205 100 148 -129 161 139 157 115 -20 -101 -75 100 59 -159 98 178 91 99 -35 10 -89 -165 -205 35
5160 35 -265 211 124 -31 183 -20 -33 -64 30 42 72 -52 -99 -174 -237 -30 111 66 54 -225 -143 280 16 290
5184 290 28 6 -152 28 95 181 -220 29 226 289 28 -224 167 263 44 142 54 -22 -136 -178 -258 -248 21 13
5208 13 26 -109 -14 162 -21 227 33 210 -31 -63 8 34 69 1 -79 74 -48 -327 -64 -206 -9 -65 85
5231 85 81 -38 131 185 -118 -332 -161 -118 -172 -98 29 6 -125 -318 31 -134 142 195 57 132 87 52 -134 63
5255 63 -2 -43 -123 -32 -86 33 97 -105 92 -119 -89 204 -27 -254 108 110 -11 128 -229 -95 -64 -160 104 118
5279 118 108 -223 91 -208 -35 -104 -64 115 48 -124 62 126 65 -31 261 -366 56 77 -41 108 164 91 105 96
5303 96 52 -6 145 -332 26 58 17 -100 106 28 11 204 -58 15 -125 -50 62 -68 -56 96 -239 -161 -74 221
5327 221 134 94 -82 180 -57 -66 -31 119 -233 -40 38 -90 -69 -183 -31 12 -280 54 -53 44 223 7 -50
5350 -50 55 -91 117 27 -55 -66 35 -4 -26 -41 65 -82 45 83 287 286 -54 200 -88 90 -51 -16 -148 -54
5374 -54 210 -112 29 -5 -108 237 88 -34 44 222 140 70 -254 51 -217 -88 73 113 37 45 -271 -52 -102
5397 -102 -90 -9 91 -52 -192 39 -94 -12 -40 -142 17 -119 37 -150 155 28 91 170 -150 135 -187 -27
5419 -27 -76 30 -161 -46 17 13 42 217 49 164 -62 -2 159 -18 152 -239 40 -267 -351 83 11 25 -91
5442 -91 -30 -104 29 188 -173 -129 -42 -44 -39 -109 43 -248 -87 49 -202 71 -30 30 9 167 22 31 27 -17 232 -199
5468 -199 -156 267 -5 205 -56 8 127 -274 -42 152 -72 -241 113 54 61 -123 -174 -5 -15 -87 -8 77 -24
5491 -24 -152 -95 228 182 -34 407 -43 111 109 52 52 -286 -39 152 42 -410 -22 140 -220 69 27 -27 -92 184
5515 184 133 115 25 116 31 50 191 -99 -1 166 -181 -132 -7 -27 161 52 -11 219 -27 -119 -128 44 -172 79
5539 79 208 -100 116 87 437 -15 -257 71 189 161 147 141 107 70 65 -136 105 -4 119 -90 -73 -39 63 186
5563 186 -22 20 -104 -134 -11 -14 -284 133 18 54 -211 176 18 39 -58 160 -77 71 -229 -290 -256 -29 -35 151
5587 151 232 16 171 -30 174 201 -186 61 82 -214 135 -19 -194 163 66 -128 -203 146 13 38 239 -182
5609 -182 -75 -28 47 32 150 112 69 173 173 23 81 14 91 252 -343 150 179 -175 -89 -77 84 -187 201 -29
5633 -29 -83 -80 107 -158 1 -285 6 47 -187 2 -148 -155 203 41 -13 83 -109 1 -297 -28 65 6 108 -163
5657 -163 107 387 37 -189 101 1 198 -50 -294 -28 -68 230 18 -230 -11 12 9 -107 42 106 98 198
5679 198 -8 20 -123 55 -64 328 -48 10 37 34 -212 56 187 -39 263 -97 -9 -111 -170 -4 -81 13 -98
5702 -98 -20 184 -84 -172 -32 -13 79 -43 -270 173 6 -42 100 142 -64 5 64 16 -125 -141 -202 -5 -3 21 11
5727 11 25 -123 58 -55 -182 -240 -67 228 0 133 173 81 164 123 -29 31 -199 7 -9 -97 -227 46 -75
5750 -75 220 -35 -27 17 68 -79 45 31 261 133 51 182 -44 -171 94 118 166 -27 30 -157 11 -179 228
5773 228 124 119 30 -55 78 31 84 -195 320 -15 153 -18 -59 -128 -117 232 32 -122 -79 14 -121 -21 -15 84 -39
5798 -39 42 -41 -43 -76 -16 -30 96 28 127 -30 -70 -19 169 226 175 114 52 -63 -67 -146 28 -237 -19 22 -210 76 -44
5825 -44 192 -244 -92 224 -102 151 133 39 79 -7 -82 100 -193 98 -11 193 -49 134 -111 38 106 165 150
5848 150 -167 317 68 -6 48 -5 -79 -137 99 85 -112 52 -171 -76 8 73 -135 50 -36 -14 138 37 -87 135
5872 135 19 -92 44 -1 -28 -227 -177 -58 113 21 11 80 211 -262 -191 7 46 -178 -24 77 62 -4 -12 -19 91
5897 91 -142 -289 -6 35 133 -80 -332 -202 -41 -138 69 -2 28 101 -8 -336 99 -11 -130 9 -104 -36 -102
5920 -102 219 246 -130 173 33 207 24 23 37 135 72 100 252 147 107 11 -238 -72 329 65 -6 171 -49
5943 -49 238 138 407 62 62 -112 59 -151 -44 107 -148 161 -103 -127 -80 115 -62 -129 -100 -253 -4 -85 -11
5966 -11 17 -123 402 173 -43 -20 -55 138 -32 -50 107 187 -35 -106 28 77 -373 336 118 -340 13 79 179
5989 179 161 -132 152 -210 -199 41 58 -252 33 69 -12 225 90 14 168 90 -215 84 80 -48 -181 18 104
6012 104 -30 187 3 -263 102 -39 250 27 41 56 -205 -85 -57 54 12 12 6 176 261 -203 -70 262 322
6035 322 15 57 -141 -95 139 -191 -76 96 53 -65 -137 37 -90 249 -160 76 158 -14 24 -72 18 41 45 122
6059 122 -17 -20 89 92 -84 -11 268 171 9 -136 -268 -17 144 -70 -173 126 40 -156 23 101 -12 65 -249
6082 -249 17 -60 255 50 -98 61 33 -9 192 213 280 -57 17 -189 172 27 160 -55 -172 -178 -143 20 154
6105 154 -74 116 -215 0 192 -14 5 112 156 135 -176 -110 -320 242 186 -21 -193 12 -88 -65 -32 -198
6127 -198 -52 -18 -149 -121 129 132 227 -35 1 -69 129 69 -33 103 128 36 -66 -2 -262 -8 -18 -87 65 -42
6151 -42 155 -10 -54 -158 95 -269 -47 160 68 253 10 -70 -184 -192 26 53 195 87 -93 -33 -51 58 -93
6174 -93 -128 16 40 190 -109 91 -52 4 13 19 230 -59 204 -201 -79 80 26 -81 -84 221 87 6 163 112
6198 112 -56 -112 229 -241 -42 266 -28 -17 -58 -221 -152 115 77 -252 -38 42 -42 -27 196 -146 182 23 -123
6221 -123 -325 -69 21 -162 31 67 -253 -245 253 -185 38 81 -7 31 38 243 133 -29 15 -131 -260 96 151 -94
6245 -94 -261 -208 -277 -204 171 187 39 -250 30 -63 6 194 -128 -53 67 273 16 90 57 -13 -120 29 -196 -93
6269 -93 40 -121 -20 -133 157 -29 69 -318 112 -257 157 193 169 -62 -17 40 -179 156 126 -4 -21 25 90
6292 90 -135 -68 -200 85 -92 190 110 32 -101 -207 144 12 -100 -241 -76 -132 -62 23 1 -103 80 -29 21
6315 21 127 67 -14 -120 -47 196 220 -10 46 175 62 55 -49 -116 157 -21 -101 146 -114 -50 280 -175 171 54
6339 54 240 41 37 -29 -199 228 -54 51 31 52 112 -83 68 -276 26 2 162 188 51 13 4 -292 128 127 72
6364 72 131 122 13 87 -45 -78 -164 -10 -66 -136 -210 62 -8 -43 107 141 -200 157 192 -192 -117 -146 -10 -79 -46 107
6390 107 114 55 -20 -5 -105 -108 -11 163 120 -12 -29 -276 54 -24 109 -70 -131 -2 331 -59 -120 66 99 239 129
6415 129 143 38 -47 47 198 -74 4 94 -42 -2 -12 -192 59 68 14 -8 102 71 -200 -126 45 37 -72 -7 10 103
6441 103 105 -50 -170 75 -38 103 37 -32 253 22 22 -157 -190 -39 -116 113 63 -197 -111 -112 -287 59 129 -29
6465 -29 -75 259 125 -42 -142 102 311 -17 31 119 -148 -171 -95 -252 -101 -39 1 117 6 -119 57 130 246
6488 246 -211 31 -31 -94 -93 15 -20 -71 177 -61 -7 135 -59 157 41 -26 91 83 -20 129 25 93 -72 99
6512 99 57 -156 29 -202 43 131 62 80 110 100 123 173 141 -28 117 -203 83 121 174 8 -55 -152 112 186 38
6537 38 83 -127 15 -21 -41 176 -64 -19 78 -163 -98 -53 179 -298 86 65 94 139 -225 -32 42 108 -4 25 -73
6562 -73 12 26 22 -263 -188 -297 271 46 72 -131 -46 74 14 204 271 57 312 74 109 185 -222 95 -331 -68
6586 -68 -220 -18 -112 -90 39 -179 108 -119 -37 -9 35 53 102 -112 -16 261 -109 157 126 -39 -117 -53 -2 -214
6610 -214 -151 -76 304 34 8 91 89 84 -71 90 45 60 18 -100 -33 -41 -110 53 -35 64 61 16 68 93 32 -227 -222 44
6638 44 189 -64 -71 -31 147 31 -94 137 330 41 31 -225 -43 -100 34 20 110 5 127 59 149 141 22 -63
6662 -63 -111 159 101 -79 163 56 67 57 -58 -13 28 -6 -107 167 228 72 112 115 30 169 36 67 -20 -55 330
6687 330 -51 -39 54 -60 -11 10 -17 -163 -113 -54 -20 -42 -16 249 -61 207 53 20 -142 41 -14 11 -21 300 119
6712 119 382 -48 -58 132 -79 -63 -193 -35 -22 66 32 -27 23 -220 64 -124 172 347 -177 103 195 111 -7
6735 -7 60 -83 -113 123 -44 107 -154 -231 127 104 -8 311 -35 -115 104 -120 -239 -250 29 34 98 42 2 74 -23
6760 -23 329 -133 -38 -1 -223 58 -198 62 -3 -43 9 -110 48 192 156 -43 135 78 114 202 180 -36 25 55
6784 55 -6 173 89 170 202 163 -46 -159 -68 46 -95 29 9 -131 50 123 128 -192 -265 -106 -338 -26 -254 123
6808 123 328 8 293 -40 -67 92 43 -117 106 -4 28 -75 -217 -81 -17 87 86 72 234 166 -46 63 75
6831 75 16 -167 25 -83 44 -163 -134 -261 -59 -91 5 -15 87 2 31 213 -24 244 7 91 158 68 -193 177
6855 177 153 -45 38 -14 -93 62 100 -7 51 126 134 62 -35 106 204 148 31 -207 69 -42 76 177 -36 45 -260
6880 -260 -36 142 -166 -97 222 224 22 4 -35 55 -55 55 -171 128 -71 124 -54 -13 -314 158 46 77 247
6903 247 177 61 222 -142 20 197 -157 54 -65 7 122 -44 72 70 -92 61 -172 -54 138 -2 32 -229
6925 -229 -82 64 -44 -103 -73 -21 -31 -142 -77 35 90 53 -42 -30 30 210 -19 -37 51 -26 427 -107 10 -126
6949 -126 -137 -115 221 -52 -78 34 20 -54 -187 172 48 83 -3 -186 -150 -162 19 65 200 -119 -196 -1 92 11
6973 11 -5 10 -170 10 -128 -38 -82 -193 -20 62 -69 -151 -103 -140 -88 -42 62 -111 142 68 2 163 96 -134 -116
6998 -116 22 -52 19 18 81 28 -52 78 -11 -207 -16 107 107 -126 119 -187 65 77 -273 313 44 3 78 -39
7022 -39 -62 -113 -184 276 -53 141 -233 30 -42 124 83 23 -155 -45 -61 20 161 177 -42 -74 236 335 -233 -169
7046 -169 -55 -162 94 -50 79 -34 -22 -84 -24 -21 -39 34 129 92 -146 62 40 -152 16 -257 -140 -62 -63 11 -1
7071 -1 -57 163 -123 -93 57 77 19 98 -50 34 258 19 16 -4 -37 198 -153 45 139 67 -131 -17 93 -11 142
7096 142 193 9 -169 -18 -82 182 105 101 27 -339 -8 -120 233 -22 -96 54 99 165 -1 -48 -141 121 14 -47
7120 -47 -6 19 -149 -2 -212 49 174 83 -110 -37 -237 26 116 85 -2 333 -159 -115 9 -61 -71 -36 -49 164
7144 164 88 63 129 -24 -26 48 -151 -33 97 19 -112 -34 96 -109 130 152 85 -273 -15 101 145 71 42 -253
7168 -253 251 -66 60 127 43 -62 12 82 128 27 -14 -112 58 125 -138 -8 -112 42 -7 -43 -112 210 -39 -138
7192 -138 -50 15 -53 -200 135 37 152 194 -47 74 -224 127 -35 34 162 9 -5 -114 201 212 -29 -10 -73
7215 -73 105 26 9 165 56 -58 -273 128 176 -84 -48 -170 -8 -31 30 -67 -141 -88 30 11 269 -31 -67 -97
7239 -97 -116 54 -87 -131 47 -165 144 97 0 -76 156 120 -7 -103 -50 -11 -75 -145 -62 256 85 -99 -240 -151 135
7264 135 -172 -85 7 -216 221 83 -56 195 -56 135 84 76 48 13 40 162 -50 29 -87 180 139 -49 -44 -160
7288 -160 38 18 108 66 -256 -11 69 159 -116 117 29 -246 -33 -65 -128 -119 27 192 -38 -58 -24 162 -162 -257
7312 -257 -264 -333 -12 -155 74 -243 188 31 -240 -34 -37 -137 102 24 183 28 -50 116 -6 16 41 45 188 1
7336 1 68 -125 -319 -71 11 -84 137 241 61 -183 -26 170 201 248 -21 61 94 -12 -76 80 58 -34 -51 85
7360 85 -269 -97 246 -179 -210 -9 76 207 16 -99 -20 41 119 132 79 144 41 27 -85 162 37 148 31
7383 31 -113 14 -19 93 -114 -54 95 -51 50 83 117 140 -33 44 -33 80 -78 201 -122 69 90 -153 -26
7406 -26 266 1 -67 -164 -249 91 128 69 153 -109 189 24 2 -80 224 124 274 134 130 337 -210 102 26 79
7430 79 32 -97 77 -22 168 -33 133 50 -200 34 40 18 14 94 103 -33 -273 4 75 -69 -234 23 -185 -94 -16
7455 -16 197 12 190 141 -133 61 115 -165 142 -79 -274 86 79 -61 -91 76 125 -40 239 -189 -117 -38 1
7478 1 11 -27 103 31 -203 -60 -96 -78 61 86 -101 154 297 -102 139 141 -124 -133 -154 -34 149 -26 -21 -80 -9 28
7504 28 -127 118 -87 168 -33 -60 196 18 86 63 57 -130 -319 44 89 -301 337 144 -99 76 -194 61
7526 61 -155 152 -192 -4 -30 24 -23 16 63 -29 -212 166 112 -6 -59 191 -100 -22 -148 146 12 86 77 -37
7550 -37 116 252 88 -253 34 95 -88 -4 17 18 217 66 -111 -228 77 -89 -215 74 107 -79 330 53
7572 53 -120 225 110 263 -60 -112 -74 126 -54 -134 114 -13 33 -357 15 267 -39 202 -66 -155 -48 82
7594 82 0 184 -71 37 137 80 19 239 -8 32 -34 5 -60 -33 -21 -10 -208 -152 -147 62 -234 61 90 -340 11
7619 11 -101 5 -162 -81 116 151 -68 91 18 -29 44 -85 167 -121 224 33 -83 -86 220 -20 -70 -40 -131 153
7643 153 -32 -16 -84 93 3 14 -167 -210 -304 58 -36 -63 -103 34 12 -125 82 9 -100 233 -107 150 79 -153
7667 -153 -40 115 -80 33 -48 -45 -148 -30 -27 14 162 78 102 83 -135 294 154 100 -61 17 -26 72 -22 23 170
7692 170 -43 235 -187 2 -290 71 -76 -142 -188 -37 41 -137 197 -29 75 -223 -116 129 68 136 -219 2
7714 2 168 60 180 193 -133 39 -224 203 183 -49 43 101 213 -67 -37 -11 103 -237 -1 -11 -26 165 -155
7737 -155 23 -98 292 0 -224 191 -28 98 -48 -289 167 203 106 -181 -73 130 133 -83 72 -142 166
7758 166 211 135 167 65 -302 -161 -54 108 -130 -101 20 94 -53 189 -84 -10 -19 20 -98 -15 22 -68 -35 68
7782 68 40 -50 -76 -22 178 57 -164 23 316 -49 -45 -147 61 -83 114 -54 247 -92 -29 -18 65 72 -160 -56
7806 -56 -84 -66 -91 205 66 267 82 176 -93 -46 -161 56 -98 61 -123 -198 95 54 81 -97 -193 -16 -137
7829 -137 116 33 -113 132 -27 35 -51 -100 -7 196 85 -81 -18 83 104 -23 -138 169 56 -44 -20 -94 -37
7852 -37 -19 134 25 120 229 -109 18 422 -87 24 27 -114 -179 26 -84 -70 -33 15 23 49 -84 -16 48 -336 -59
7877 -59 142 144 214 3 117 -11 195 35 12 33 -43 -62 281 -98 -25 52 -129 111 -129 124 -101 9 -52 -102
7901 -102 84 90 -39 -245 -51 111 -164 -34 -65 -146 41 -28 -39 -104 87 330 -97 -75 14 -68 110 62 3 -38
7925 -38 11 -7 25 151 -255 -34 -41 27 89 19 -207 -41 136 53 -34 75 19 71 232 217 -230 172 -120 161 163
7950 163 -91 -122 142 86 70 -211 -315 -140 -77 -6 112 -164 248 -36 82 91 125 11 -149 -33 -128 -33 -9 -1
7974 -1 161 174 -48 171 169 175 -68 -50 26 102 4 136 -22 227 44 90 -15 -57 -69 94 -241 119 -79 -231 -57
7999 -57 -392 255 -130 -86 127 121 188 -4 64 -157 -62 -141 -41 4 11 -63 -47 91 31 96 -142 10 -319 -165 -61
8024 -61 159 -126 1 -136 -68 -24 135 -59 213 245 131 55 -282 -48 26 -32 -60 -23 222 84 12 9 106 -52
8048 -52 -116 -82 195 -381 40 -3 -3 14 -36 414 37 88 -108 180 -333 21 -119 -45 -104 -150 -21 -46 -20 -99 57
8073 57 -39 -18 128 -134 -65 17 34 48 -36 -137 -14 -152 16 -192 43 -177 -80 -39 -28 -217 73 46 17 165
8097 165 -87 162 -146 89 72 -102 103 -28 -28 -69 289 -98 -178 -52 3 42 208 -11 -88 -64 -49 95 268
8120 268 51 169 27 14 -15 87 129 60 -115 -80 179 -65 -27 45 -119 -36 222 141 -200 -150 92 360 36
8143 36 -122 -25 -71 -167 31 24 56 -22 139 17 -30 258 30 -17 195 57 -166 115 -140 4 134 164 24 90
8167 90 258 195 -45 -130 -253 -86 -10 -38 -70 274 -62 -366 19 -120 -44 -135 -112 94 49 46 131 66 19 76
8191G6
##END NTUPLES=NMR FID
##END=
