##TITLE=1H_Bau-NOEt
 DMSO-d6
 8 sc, 
 10.06.2022
##JCAMPDX= 6.0         $$ Bruker NMR JCAMP-DX V2.0
##DATA TYPE= NMR FID
##DATA CLASS= NTUPLES
##ORIGIN= UXNMR, Bruker Analytische Messtechnik GmbH
##OWNER= root
$$ XWIN-NMR		Version 3.5
$$ Fri Jun 10 14:11:51 2022 Russian Standard Time (UT+4h)  she@DPX200
##.OBSERVE FREQUENCY= 200.13135
##.OBSERVE NUCLEUS= ^1H
##.DELAY= (6, 6)
##.ACQUISITION MODE= SIMULTANEOUS
##.ACQUISITION SCHEME= undefined
##.AVERAGES= 8
##.DIGITISER RES= 18
##SPECTROMETER/DATA SYSTEM= spect
##.PULSE SEQUENCE= zg30
##.SOLVENT NAME= DMSO
##.SHIFT REFERENCE= (INTERNAL, DMSO, 0, 15.7039)
##AUDIT TRAIL= $$ (NUMBER, WHEN, WHO, WHERE, WHAT)
$$ ##TITLE= Audit trail, XWIN-NMR		Version 3.5
$$ ##JCAMPDX= 5.01
$$ ##ORIGIN= Bruker BioSpin GmbH
$$ ##OWNER= she
$$ F:/spectra/data/she/nmr/H-F/1/audita.txt
$$ ##AUDIT TRAIL=  $$ (NUMBER, WHEN, WHO, WHERE, WHAT)
(   1,<2022-06-10 14:10:11.07 +0400>,<she>,<DPX200>,
      <created by zg, POWCHK disabled, PULCHK disabled
       configuration hash MD5:
       00 E9 B6 7A A2 85 ED C7 34 08 36 98 17 FE 4E 26
       data hash MD5: 16K
       C5 5F 6C 88 4C 22 6E 85 19 E7 29 B1 69 8F 59 61>)
$$ ##END=
$$ 
$$ hash MD5
$$ 50 F4 5E EB 4F B5 E9 EC 6D 5A D3 74 B0 92 BF 7B
##$RELAX= 
##$RELAX= 
##$RELAX= 
##$RELAX= 
##$RELAX= 
##$RELAX= 
$$ Bruker specific parameters
$$ --------------------------
##$DU= <F:/spectra>
##$EXPNO= 1
##$NAME= <H-F>
##$PROCNO= 1
##$TYPE= <nmr>
##$USER= <she>
##$AMP= (0..31)
100 100 100 100 100 100 100 100 100 100 100 100 100 100 100 100 100 100 
100 100 100 100 100 100 100 100 100 100 100 100 100 100 
##$AQSEQ= 0
##$AQ_mod= 1
##$AUNM= <au_zg>
##$AUTOPOS= <>
##$BF1= 200.13
##$BF2= 200.13
##$BF3= 200.13
##$BF4= 200.13
##$BF5= 200.13
##$BF6= 200.13
##$BF7= 200.13
##$BF8= 200.13
##$BYTORDA= 1
##$CFDGTYP= 0
##$CFRGTYP= 5
##$CHEMSTR= <none>
##$CNST= (0..31)
1 1 145 1 1 1 1 1 1 1 1 1 1 1 1 1 1 1 1 1 1 1 1 1 1 1 1 1 1 1 1 1 
##$CPDPRG= <>
##$CPDPRG1= <>
##$CPDPRG2= <>
##$CPDPRG3= <>
##$CPDPRG4= <mlev>
##$CPDPRG5= <mlev>
##$CPDPRG6= <mlev>
##$CPDPRG7= <mlev>
##$CPDPRG8= <mlev>
##$CPDPRGB= <>
##$CPDPRGT= <>
##$D= (0..31)
0 1.2 0 0 0 0 0 0 0 0.06 0 0.03 0 0 0 0 0.0002 0 0 0 0 0 0 0 0 0 0 0 0 
0 0 0 
##$DATE= 1654855810
##$DBL= (0..7)
120 120 120 120 120 120 120 120 
##$DBP= (0..7)
150 150 150 150 150 150 150 150 
##$DBP07= 0
##$DBPNAM0= <>
##$DBPNAM1= <>
##$DBPNAM2= <>
##$DBPNAM3= <>
##$DBPNAM4= <>
##$DBPNAM5= <>
##$DBPNAM6= <>
##$DBPNAM7= <>
##$DBPOAL= (0..7)
0.5 0.5 0.5 0.5 0.5 0.5 0.5 0.5 
##$DBPOFFS= (0..7)
0 0 0 0 0 0 0 0 
##$DE= 6
##$DECBNUC= <off>
##$DECIM= 32
##$DECNUC= <off>
##$DECSTAT= 4
##$DIGMOD= 1
##$DIGTYP= 9
##$DL= (0..7)
0 120 120 120 120 120 120 120 
##$DP= (0..7)
150 150 150 150 150 150 150 150 
##$DP07= 0
##$DPNAME0= <>
##$DPNAME1= <>
##$DPNAME2= <>
##$DPNAME3= <>
##$DPNAME4= <>
##$DPNAME5= <>
##$DPNAME6= <>
##$DPNAME7= <>
##$DPOAL= (0..7)
0.5 0.5 0.5 0.5 0.5 0.5 0.5 0.5 
##$DPOFFS= (0..7)
0 0 0 0 0 0 0 0 
##$DQDMODE= 0
##$DR= 18
##$DS= 0
##$DSLIST= <SSSSSSSSSSSSSSS>
$$ [...]
##$SUBNAM2= <"">
##$SUBNAM3= <"">
##$SUBNAM4= <"">
##$SUBNAM5= <"">
##$SUBNAM6= <"">
##$SUBNAM7= <"">
##$SUBNAM8= <"">
##$SUBNAM9= <"">
##$SW= 18.05172834244
##$SWIBOX= (0..15)
0 0 2 0 0 0 0 0 0 0 0 0 0 0 0 0 
##$SW_h= 3612.71676300578
##$TD= 16384
##$TD0= 1
##$TE= 0
##$TE2= 300
##$TE3= 300
##$TEG= 300
##$TL= (0..7)
0 120 120 120 120 120 120 120 
##$TP= (0..7)
150 150 150 150 150 150 150 150 
##$TP07= 0
##$TPNAME0= <>
##$TPNAME1= <>
##$TPNAME2= <>
##$TPNAME3= <>
##$TPNAME4= <>
##$TPNAME5= <>
##$TPNAME6= <>
##$TPNAME7= <>
##$TPOAL= (0..7)
0.5 0.5 0.5 0.5 0.5 0.5 0.5 0.5 
##$TPOFFS= (0..7)
0 0 0 0 0 0 0 0 
##$TUNHIN= 0
##$TUNHOUT= 0
##$TUNXOUT= 0
##$USERA1= <user>
##$USERA2= <user>
##$USERA3= <user>
##$USERA4= <user>
##$USERA5= <user>
##$V9= 5
##$VALIST= <valist>
##$VCLIST= <CCCCCCCCCCCCCCC>
##$VD= 0
##$VDLIST= <DDDDDDDDDDDDDDD>
##$VPLIST= <PPPPPPPPPPPPPPP>
##$VTLIST= <TTTTTTTTTTTTTTT>
##$WBST= 1024
##$WBSW= 4
##$XGAIN= (0..3)
0 0 0 0 
##$XL= 0
##$YL= 0
##$YMAX_a= 226482
##$YMIN_a= -248477
##$ZGOPTNS= <>
##$ZL1= 120
##$ZL2= 120
##$ZL3= 120
##$ZL4= 120
##$ABSF1= 10
##$ABSF2= 0
##$ABSG= 5
##$ABSL= 3
##$ALPHA= 0
##$AQORDER= 0
##$ASSFAC= 0
##$ASSFACI= 0
##$ASSFACX= 0
##$ASSWID= 0
##$AUNMP= <proc_1d>
##$AZFE= 0.1
##$AZFW= 0.1
##$BCFW= 1
##$BC_mod= 2
##$BYTORDP= 1
##$COROFFS= 0
##$CY= 11.3945322036743
##$DATMOD= 1
##$DC= 2
##$DFILT= <>
##$DTYPP= 0
##$F1P= 2.36226072786647
##$F2P= -0.459571619588291
##$FCOR= 0.5
##$FTSIZE= 0
##$FT_mod= 4
##$GAMMA= 1
##$GB= 0.15
##$INTBC= 1
##$INTSCL= 1
##$ISEN= 128
##$LB= 0.24
##$LEV0= 0
##$LPBIN= 0
##$MAXI= 10000
##$MC2= 0
##$MEAN= 0
##$ME_mod= 0
##$MI= 1.114404
##$NCOEF= 0
##$NC_proc= 0
##$NLEV= 6
##$NOISF1= 3.799351
##$NOISF2= 2.8
##$NSP= 1
##$NTH_PI= 0
##$NZP= 0
##$OFFSET= 15.70392
##$PC= 1
##$PHC0= -18043.69
##$PHC1= 9.800692
##$PH_mod= 1
##$PKNL= yes
##$PPARMOD= 0
##$PSCAL= 0
##$PSIGN= 0
##$REVERSE= no
##$SF= 200.130013532006
##$SI= 16384
##$SIGF1= 3
##$SIGF2= 2
##$SINO= 400
##$SIOLD= 16384
##$SREGLST= <1H.CDCl3>
##$SSB= 0
##$STSI= 0
##$STSR= 0
##$SW_p= 3612.71676300578
##$SYMM= 0
##$S_DEV= 0
##$TDeff= 0
##$TDoff= 0
##$TI= <>
##$TILT= no
##$TM1= 0
##$TM2= 0
##$TOPLEV= 0
##$USERP1= <user>
##$USERP2= <user>
##$USERP3= <user>
##$USERP4= <user>
##$USERP5= <user>
##$WDW= 1
##$XDIM= 8192
##$YMAX_p= 0
##$YMIN_p= 0
$$ End of Bruker specific parameters
$$ ---------------------------------
##NTUPLES= NMR FID
##VAR_NAME=  TIME,          FID/REAL,        FID/IMAG
##SYMBOL=    X,             R,               I
##VAR_TYPE=  INDEPENDENT,   DEPENDENT,       DEPENDENT
##VAR_FORM=  AFFN,          ASDF,            ASDF
##VAR_DIM=   8192,          8192,            8192
##UNITS=     SECONDS,       ARBITRARY UNITS, ARBITRARY UNITS
##FACTOR=    0.0002768,     1,               1
##FIRST=     0,             0,               0
##LAST=      2.2672688,     0,               0
##MIN=       0,             -248477,         0
##MAX=       2.2672688,     226482,          0
$$ Real data points
##PAGE= N=1
##DATA TABLE= (X++(R..R)), XYDATA
0@%%%%%%%%%%%Qj6J6j6K4l2M0n4O2p2Q8j04J21j45J74j99K31k70L11l57M05m61
33b46N24n92O67p50Q42r43J055j177J308j453J610j780J970k176K400k647K917
50A529l214L541l900M300m746N248n816O462p208Q080r113J0361j1906J3874j6487
65h995K0139k5645L5023n5273J79378j19871j00665K61482k20143o3827J83214
76H4817r3203j23275K15805r5075k01164K65269J30103l56164K1433K77161r1020
87C4687m3473J66425j52666j19564J91634n8885j79066K44413J05538l12996j1247
98a35200K24236r4192k7456J48257j39578j02945J98426n0901j70431K00664R3654
109A44534k59931P392K00061p5245j4579J33720j39400r7371J90664m0457j71604
$$ y = [0, 0, 0, 0, 0, 0, 0, 0, 0, 0, 0, 0, 8, -8, 8, -8, 16, -16, 24, -30, 32, -40, 48, -56, 65, -80, 94, -105, 126, -144, 167, -190, 215, -246, 278, -314, 353, -397, 445, -498, 557, -620, 688, -765, 845, -935, 1035, -1141, 1259, -1388, 1529, -1685, 1856, -2044, 2256, -2490, 2758, -3058, 3404, -3804, 4276, -4837, 5524, -6382, 7492, -8995, 11144, -14501, 20522, -34751, 144627, 24756, -75909, 185573, -34570, -98397, 84817, -8386, -131661, 84144, -10931, -212095, 53174, 183277, -172887, -151454, 125707, 34687, -8786, 157639, 4973, -114591, 77043, 18158, -160908, 83505, 189043, -123953, -135200, 89036, -5156, -32612, 115645, -23933, -126878, 71548, 20647, -149784, 50880, 144534, -115397, -108005, 92056, 16811, 2232, 135952, -3448, -100819, 89845, 49388, -122216]
120a22216J56041O5801k28776R477J62832p1868l58J29145j16562p7170J91914
131I8260j2922j51462J25647N2073j92941J2249J18878q5984n739J05313j09049
142d5677p1472J71782O032j24522J02737N0228j47107K7351R6884q6795l153R1420
154F7708j00237o8870J42933J1536j06411P5558M0697j13979L4601P8995q7036
165b4505k105Q4434q9130o3135J20294J3951q6425N7742L5507q3136L9991O6882
177G0365q2556k664P8433p9599o2140R4556P341p3419M1039K5826n8682M1551
189E1N7199o7796P34P4915o0873n5414P3287K991o2040K6179J2394m3725L6441
202e657M3570n3443K944O7627m0110m5793N7311K751n1797J5875K511l6498K8369
$$ y = [-122216, 33825, 99626, -129150, -119673, 43159, -28709, -29067, 100078, -16484, -93654, 98260, 85338, -66124, 59523, 111596, -81345, -69096, 49782, -36202, -41941, 63372, -45677, -117149, 54633, 60665, -63857, 38880, 89108, -57999, -30648, 66236, -20559, -23712, 67708, -32529, -101399, 41534, 53070, -53341, 22217, 62914, -51065, -16464, 62531, -24505, -26610, 57824, -31306, -94441, 25853, 39804, -46621, 11121, 46628, -36508, 3483, 70365, -12191, -14855, 63578, -16021, -78161, 16395, 23736, -49683, -8644, 17182, -41500, 51, 57250, -10546, -9812, 65103, 4230, -51184, 22103, 25094, -36946, -10767, 1627, -42098, -5657, 37913, -15530, -12586, 55041, 14931, -30862, 26449, 29200, -22597, -6722, -4211, -40709, -12340]
215a2340K8327m3440N096N8234k2346l2967M7930R219l9076J1560m72l1902J8515
228c662J3105m0980J772M2101j6341k4094L7225J4470k5398J1402N828k1369J4121
241H180Q105l3364J882K8238j5506j8245K4507J1792j7932N205P658j3768O531
254C283L824k4832J554J8791j3300j1025J9474J1628p214M803J1324l348K692
267A7654J452j7807k664P066j8150j3629R419L467o465L046J2258P232O018O501
281A5398j543L730P550j2615j1346M137m165j1887n330K466L411n32N58M626O285
296G43P049l813l348Q318M30q479k169J495K695j955l905L721M941K23l931l120
312a105M581j247r781k661J397L15q82k669O292R937J839P34M873O468N25q247
$$ y = [-12340, 15987, -27453, -22357, 35877, 13531, -19436, 28494, 37713, -1363, 10197, 9725, -22177, -3662, 9443, -31537, -29765, 12336, -4005, -28099, 9126, 23596, -1802, 9600, 15428, -5941, 8180, 16285, -17079, -15197, 13041, -2465, -20710, 3797, 15589, -2343, 2862, 10520, -3248, 3283, 7107, -17725, -16171, 2620, -10680, -21705, -2231, 9397, 2183, 6986, 18310, 14962, 17654, 19106, 1299, -1365, 5701, -12449, -26078, -16659, -13192, -19657, -16611, -4353, 2879, 8897, 15398, 13855, 17585, 25135, 12520, 1174, 5311, 1146, -10741, -16071, -13605, -10194, -10726, -10168, -5542, 743, 7792, 3979, 631, 8949, 9379, 900, -1269, 226, 2921, 966, -2939, 782, 5723, 5946, 2015, -1105, 3476, 2229, -7552, -10213, -8816, -8501, -9383, -12052, -5760, 4177, 6016, 6750, 11623, 18091, 18616, 10369]
328A0369l431q56o716p097q297k086N061j983k267R099J0037M027O70M985N828
343A7343j612l901m706n333J069n875j0651L527M841l526n15N972M925J02J913
358C573M32k410L940p27j0126L445O782p344j470O998O08r61K685m99n159K645
374B412L12j1527L46P169r382k314J1019n87N67R590J641l797N869L835j0526
389D627k164M685j2834o834Q443o387n134J2068Q25o162J0349R441n153J410O740
404A3920r984n184R780r202j1022J2347j880j4538R135J0891n040K783N592p979
418c81j34J2785r172j2336J3383r70j9392P360J2986m978J950L098q508N490J5364
433A6545j0207j3139J3701L23k2392M344J3600n356L6J68r988J0729J9572j0526
$$ y = [10369, 6938, 6082, -634, -7731, -16028, -18114, -13053, -15036, -17303, -8204, 1833, 5860, 6530, 11515, 17343, 15731, 11830, 7124, 1791, 2860, -3015, -13666, -10139, -5298, -8824, -9339, -3367, 1558, 1660, 3573, 4005, 1595, 5535, 4808, -5318, -1873, 4909, -2435, -3905, 3093, 3701, 2740, 5425, 4926, -233, 2412, 2724, -8803, -8457, -1288, -10670, -12984, -1965, -2552, -1985, 7605, 9246, 5449, 11318, 15153, 4627, 2463, 7148, -5686, -12520, -4077, -10464, -15598, -3530, -2705, -8867, 1482, 10923, 5770, 7180, 13920, 3936, -1248, 8532, -670, -11692, 655, -1225, -15763, -6628, 4263, -777, 2006, 7598, -381, -515, 12270, 3098, -9238, 4145, 3175, -16217, -8857, 4129, -849, 1101, 4199, -4309, 1181, 16545, 6338, -6801, 6900, 7223, -15169, -10825, 2775, -2581, -2545, -2377, -12365, -1636, 17936, 7410]
447G410j3036J4766K892k1281J488J4281n060l124l918j3165J3153K3402j2026
460E782j4128J4861N176j6673R42J2659l565n410p534j5564J4278K6306j2826
473D304j7182J4498Q768r877J747J0024q56m871j1528j6472J2180K5511j4133
486B113k2856J0139J0914k885M011P238K749o26j0833j3896J3481K4419j3354
499A0614k7597K768J0963J159K390J159J050K222r588j0472J4839K4063r303k8048
513a3781k796J4053P261J946m040j722M343p357r069J3528J9585p839k6838r591
527b2317J3914J2820N05r613l440O727j789m225J3202J7335l339k1559j3920J2502
541c197J7930l156j6669p774L195M26k157R098J2350Q92j4615j3445J3949K5877
$$ y = [7410, -5626, 9140, 12032, -9249, -7761, 6520, 1460, -1664, -5582, -18747, -5594, 17808, 5782, -8346, 6515, 11691, -4982, -4040, 8619, 5054, -356, -7890, -23454, -9176, 17130, 4304, -12878, 1620, 10388, 511, 2258, 12282, 11426, 6555, -4973, -21445, -9265, 16246, 2113, -20743, -10604, 310, -2575, 1436, 8674, 11423, 10797, -36, -13932, -451, 23968, 10614, -16983, -14215, -3252, -2093, 297, 1456, 2506, 4728, -4860, -15332, -493, 23570, 14267, -13781, -16577, -2524, 4737, 6683, 2643, 921, 5264, -2093, -11162, 2366, 21951, 14112, -12726, -22317, -8403, 4417, 4922, -4691, -8131, -1404, -3193, -7418, 5784, 23119, 19780, -1779, -15699, -3197, 14733, 11577, -5092, -12866, -9671, -9245, -11402, -2304, 10046, 10938, -3677, -17122, -3173, 22704]
555B2704k048j9275q201J798K807Q15J671M015J129j1048j5471J1130K8414j312
569A7128k1129o272L042N634O780j690k735N091n904j5865R378K7453j592k2224
583b905n599J408M486J0756n802j1231O886q02j5486Q340K6658q69j8519k334
597e013K444N792J4801p446j8216O915K549j7759M998K1269m044j5780m76K035
611g931O740J8347n451k0134R356Q103j7038L517J8231q310j2945J351k289M229
625d224J8278n523k1705J0026J1982j5688K780J6101r888r524N397m835K244J9103
639A4524n692k1124J0267J2924j4106J091J3669j2023p151P980p891n95J8504
652A0377n384j9132J0509J3361j1788K121J1929j1553n195J0398q463m528J6836
$$ y = [22704, 20656, 1381, -6820, -5022, -2215, -1400, 271, 4286, 5415, -5633, -21104, -9974, 18440, 17128, -4001, -10273, -7231, -1597, 5183, 3493, 758, 5849, -55, -15920, -6542, 20911, 19319, -2905, -8504, -7096, -2610, 8146, 2344, -8887, -2001, -2803, -18289, -9949, 16709, 15840, -2679, -5013, -2569, 3223, 18024, 10578, -7638, -723, 1826, -15933, -10935, 10334, 6290, -9490, -9966, -7931, -1191, 17156, 11705, -8429, 927, 9030, -8008, -4491, 13740, 5430, -7515, -6164, -8453, -4224, 14054, 8531, -13174, -3148, 8834, -6854, -4074, 12027, 2139, -7385, -1988, -6823, -4579, 14524, 8832, -12292, -2025, 10899, -3207, -2116, 11553, -470, -7621, 359, -7532, -8127, 10377, 4993, -14139, -3630, 9731, -2057, 64, 11993, 440, -4755, 5643, -2820, -7348, 9488]
665I488n828j8527J0288J0861j0605K401J0452r786l345J2785q297o425J6052
678I514m755j6837R805P670j0782L172Q478r463j084J2103p062p066J4783k939
692E537j5250R155N662j0999L598O896r386M42J0978o188o083J2466j158j2465
706f795Q422M677j1292L615O143r923J077R315o168m891J0418m09r255O452M136
721E522j0103L437O185r266P97Q173o518l463Q461k84o216N148L337q029K347
736d72N197p621n75P075o098k822P281j636m184N217K217n513K575M568n922m54
752a167N346n128l292O000j786m218M388N40l801K564L605l483n23M706l322k392
768a963M549j216l995L439J58l654K215K101k576l19K750j079k435L360j1l503
$$ y = [9488, 3660, -14867, -4579, 6282, -4323, -1922, 8530, -1256, -4601, 8184, -113, -6538, 9514, 4759, -12078, -2273, 5397, -5385, -2213, 6265, -3198, -4282, 7821, 759, -6307, 8476, 5537, -9713, -558, 5104, -5895, -2297, 4599, -4787, -4345, 6633, 445, -5638, 6828, 5670, -6795, 1627, 6304, -4988, -1373, 4770, -5153, -4076, 5239, -929, -5820, 4598, 4189, -5066, 1386, 5522, -4581, -1144, 5041, -4225, -3428, 4745, -1773, -5236, 3225, 2941, -3275, 1873, 5210, -2819, -472, 4725, -2896, -3471, 3604, -2494, -5316, 1965, 329, -3855, 1362, 3579, -1934, 641, 5209, -713, -1167, 4179, -949, -4241, 1759, -27, -4245, 143, 683, -3118, -554, 3051, -432, -955, 3751, 429, -1963, 2586, 1370, -2625, 814, 972, -2682, -467, 1634, -942, -1261, 1489, 410, -2025, 1335, 1324, -2179]
784b179K730J50k657J843J473j488J0J372m32j524J801M66k842J014J032k961
800b192J015J598j743R9J573o1m64R84J400k018J30J853k383o41K049j868q22
817a491J511p04o15J027J234j337j48K332j739r78K956j514k136K544m67k104
833a629J735P90k007N9K592j356j874K992q18k548L543n29l575L119J251l318
849a573O68K744k076j255L082j143k752M400o00n170M408K047n343J554L564l361
865h06o06L524k229k086M897j188n890N135L158p100J751N040n225j82M661l823
881i69j845O627k314o821O310L689q234K134O141p246N92O303o442k131R248l599
897A443q147P624M390r062K551O082p922J042Q066q538j941J1375n493r815R676
$$ y = [-2179, 551, 701, -1956, -113, 1360, -128, -118, 1254, 822, -702, 1099, 1565, -1277, -263, 769, -2192, -1177, 421, -1322, -1223, 350, 289, -175, 809, 2209, 191, 321, 2174, -209, -850, 1199, -669, -1491, 20, -684, -1299, -272, 962, -375, -523, 1809, 70, -908, 2048, 534, -1602, 942, 475, -1629, 106, 896, -1111, -1052, 1540, 184, -1690, 1302, 484, -2064, 1479, 950, -2625, 494, 1745, -1573, -905, 1839, -237, -1492, 1590, 447, -2305, 2095, 1495, -3675, 733, 2780, -2563, -1009, 2555, -806, -1412, 2112, -117, -2203, 2694, 1506, -4384, 751, 3909, -3191, -1440, 3600, -1625, -1807, 2854, -969, -2814, 3813, 1499, -5322, 988, 4677, -3557, -1423, 4718, -2528, -1936, 4367, -2075, -4206, 5042, 1443, -6704, 920, 5310, -3752, -1201, 4881, -3041, -1999, 6067, -2471, -4412, 6963, 1470, -8345, 1331]
912A331M136r887L726N714r784K194J0051j0660k470J4869p214j1790J2345L408
926E969j1044N525M464j1632L952J1611j2147l549J6574p278j3563J4234L546
939F662j2261P547L335j4086N901J2970j3890m370J8137p745j4035J5546L697
952G408j3358R251L015j7406Q531J4952j6610m437J8500q300j4421J6919L370
965G414j4331J1023K748j9793J0887J7249j9073n479J9524r602j3609J8052K142
978G152j5050J2417K844k2167J2231J9856k1226o035K0304j1000j1931J9226J3
991F634j5712J4357K281k3000J2887K1716k1929p521K0439j1315j1111K0242k791
1004E177j6170J5187K637k3261J3554K2542k1776p890K0131j0789r696K1478m760
$$ y = [1331, 5467, -4420, -694, 5020, -4764, -2570, 7481, -3179, -5649, 9220, 2006, -9784, 2561, 5969, -5075, 450, 4914, -6718, -2766, 8845, -3302, -6851, 9723, 2445, -11118, 3116, 6662, -5599, 1948, 5283, -8803, -2902, 10068, -3822, -8192, 9945, 2200, -11835, 3711, 7408, -5950, 3301, 6316, -11090, -2559, 12393, -4217, -8654, 9846, 1546, -12875, 4044, 7414, -6917, 4106, 6854, -12939, -2052, 15197, -3876, -9355, 10169, 567, -13042, 5010, 7152, -7898, 4519, 7363, -14804, -2573, 17283, -3943, -9978, 10326, -674, -12605, 6621, 6634, -9078, 5279, 7560, -15440, -2553, 19163, -2766, -10287, 10152, -1163, -12274, 7968, 5177, -10993, 4194, 6831, -16430, -2876, 19666, -2110, -10000, 10131, -658, -10354, 11124, 6364]
1017F364j8283J6793K114k4284J3585K1974k1790p912J9945j0599p915K2705o220
1030F477j9820J9274K985k5063J4162K0662k2268p322J8996j0784p027K3006p708
1043E570k0821J9886M264k4539J3749J8911k1434o116J8079j0098n525K2557q262
1056F221k0752J9421N250k3636J1955J7339k1870m719J7071j0999m368K1851q123
1069D641j9636J9073P163k2151J0809J6710k0775l867J6354j2096m896K0763r196
1082B896j9152J8249P527k0332R935J5244j9611k318J7104j2150m836K0370r340
1095C586j8246J7362O975j8924Q250J2997j7724j751J6712j2060n841J9558q296
1108B598j6904J6459O606j7023P169J1545j5156n37J5440j0753o547J7618o921
$$ y = [6364, -11919, 4874, 6988, -17296, -3711, 18263, -3527, -11439, 8506, -2093, -10008, 12697, 6477, -13343, 5931, 8916, -16147, -1985, 18677, -3591, -10913, 8083, -2701, -9728, 13278, 5570, -15251, 4635, 8899, -15640, -1891, 17020, -4414, -10530, 7549, -2549, -8074, 14483, 6221, -14531, 4890, 10140, -13496, -1541, 15798, -6072, -10791, 6280, -4719, -9087, 12764, 4641, -14995, 4078, 11241, -10910, -101, 16609, -4166, -8033, 8321, -3775, -8671, 12092, 2896, -16256, 1993, 9520, -10812, -877, 14367, -5244, -7562, 9542, -2608, -7444, 12926, 3586, -14660, 2702, 9677, -9247, -997, 12000, -5724, -7475, 9237, -2823, -8664, 10894, 2598, -14306, 2153, 8759, -8264, -1095, 10450, -4706, -5243, 10197, -556, -7103, 10515, 3594]
1121C594j6189J4507N071j5669O223R868j3304K40J4417r717n824J6221m349j4738
1135i649J2828N040j5135N670Q180j2913L69J2694r094n844J4394k337j2818J1363
1149B748M672j3282N003Q017j1536Q9J1379q644n616J2479j942j0219R076L969
1163F193j1667M360P882j0434k76R749p711m995J0741q98q601O942L993r344L175
1178h91P710q324j463Q491o866m861R136p93p473N715K763p431K874P209o478
1193f82j615P479n507m717Q425r77p023M448K014o189L114N869n184j637O309
1208D127l758l743O763j26o952L321J750n741K466M751m047j301N104j909l157
1223b452N759O58o063K458J864n071J598L930m081j499L869j537j765M260Q59
$$ y = [3594, -12595, 1912, 6983, -8686, -2463, 7405, -5899, -5659, 8758, -959, -6783, 9438, 5089, -9649, 3179, 8219, -6916, -1246, 6934, -5979, -5610, 7084, -2010, -7854, 6540, 4203, -8615, 2748, 7420, -5862, -859, 7158, -4378, -4289, 7090, -1554, -7170, 5309, 3367, -6852, 2224, 6193, -5474, -1114, 6768, -3666, -3942, 5807, -1904, -6899, 3842, 2944, -5657, 1285, 5278, -4066, -891, 6819, -1505, -2968, 5523, -1343, -6204, 2932, 2139, -5334, 381, 3144, -4287, -1413, 5796, -682, -2297, 5182, -325, -5042, 3383, 2406, -4617, -169, 1845, -4344, -1230, 4639, -545, -2182, 4127, 369, -3374, 3389, 3263, -3689, -368, 1382, -4359, -1893, 2858, -1189, -2490, 2614, 705, -2452, 3307, 3965, -2098, 360, 2224, -2847, -1249, 2681, -1400, -2899, 970, -567, -2332, 1928, 2787]
1238B787m711J875K239l824J017L675l761j399L075j133j543K949R83l507J099
1253a79J865k859P09K402l036j361K614j054j011K890N76k407J364J949j935M92
1269A019K085k610j768J976j591j511K077n32j770J336J531p05O76J943r22p36
1285D98J767j209j052J347j136k004J307j12j116R87L92k68j0J211m74k50J283
1302A161n53j148J307o08r33J566n31m61R54L13j035j78Q35j220q77J068o84r86
1320b010J921o23o33K266j02m65J394N35j285k5Q78j601j334J396j708j417K255
1337e58k53j690K153Q27q74J347R60j221k5J657j486j827J988l69k992J948O27
1354B12k035J434J083j849J032J896j978j025K760p06k574K233Q11k572J914J268
$$ y = [2787, -1924, -49, 2190, -1634, -617, 3058, -703, -2102, 973, -160, -1703, 1246, 2229, -1278, -179, 1686, -1173, -464, 1938, -1098, -2459, 155, -899, -1910, 980, 1556, -851, 513, 2462, 527, 1019, 3104, 494, -1274, 702, -889, -2400, -323, -855, -2625, -1289, 242, -463, 213, 2156, 1234, 498, 2265, 1056, 4, 1351, 215, -1789, -482, -594, -1710, -723, -331, -599, -609, 602, 128, -122, 1161, 608, -540, 767, 159, -774, 792, 261, -200, 754, 1067, 32, -146, 689, -531, -1408, -340, -1024, -2010, -89, -712, -1345, 921, 819, 354, 1748, 2283, 998, 973, 1851, 250, -1084, 312, -1396, -2813, -558, -811, -2501, -348, 479, -395, 952, 1912, 691, 666, 2323, 837, -990, 998, 629, -2363, -415, 212, -1823, -389, 694, -1155, -123, 1773, -205, -1230, 1530, 824, -1750, 483, 1294, -1278, 636, 1904]
1370A904l035J223K508l140q96L051j275k578K029L94k851K333J636l390J581
1385e06L571k862n74L155j253k260J829k30k724J667O41l647J031M142l403q03
1401b226M339j452j405K564l85k489K443O21m256N54L906l343j377M086j608j882
1417a910L471p23k222K995O06m409Q99L485k759j810L621j862j447L743r57j926
1433a205L323L45m402J503K881k702j375K275j586j355L425j071k259M045L83
1448B225m362K096K881k514p98J153j608o52K576p17k794L594L58l449J990K709
1464B688k110o65J150k391j90L034j780k550L114P23l724K283K849j899Q6R09
1480A527k442R47K514k529j937K076n04k208J127K480j578O01O87k340J960K959
$$ y = [1904, -1131, 92, 2600, -540, -1436, 1615, 340, -2238, -209, 185, -2666, -333, 1303, -2087, -506, 3065, 203, -371, 2784, 1531, -729, 1100, 870, -1854, -187, 454, -3193, -2162, 1980, -1423, -2226, 2113, 661, -744, 1820, 1435, -1054, 1389, 2010, -2246, -1692, 2214, -1129, -2506, 1580, -28, -1910, 1561, 838, -1384, 1611, 2217, -2192, -1293, 2192, -567, -2377, 1244, -618, -2065, 1678, 721, -1205, 2118, 2463, -1939, -436, 2445, -257, -1632, 643, -943, -2298, 1127, 56, -2203, 1842, 2225, -2137, -41, 2840, 326, -472, 681, -927, -1579, 997, 280, -2514, 1080, 1438, -2011, -21, 2688, 578, -87, 1063, -1328, -1518, 1516, -264, -2814, 300, 1023, -2701, -418, 2431, 532, 618, 1527, -915, 32, 2546, 17, -1920, 156, -348, -2556, -1429, 1051, -527, 74, 761, -1579, 381, 3340]
1496C340k414j524J444j98k079J148Q68j224O72o6k194J401L367k432j189J773
1512F93r78q51J531J78p92R00k83k296K282K392k132p99J235j516k58J567j517
1529f44p42J477j360j362K215J855j331l39J318p93O67J530j995n47J302j899
1545f48j781K254M84j899M75M74j124J884J851k048P0K238j828j429K392k37k073
1562i45J092j73j731J783J399k808K47K531j590j380K516n84j800K225o41k029
1578a888K543J047k434N28K725k087j079K366j580j506K359r85k849K626R16l129
1594b427J548K617j898k40K416j312j163L018j254k906K203L81l649J537K349
1609A220k893k41K508j400m29L606j102k779K535R09l768K180J815l291j13K191
$$ y = [3340, 926, -598, 846, 648, -1431, -283, 585, -639, 33, -33, -2227, -826, 2541, 109, -1080, 693, -285, -1136, 395, 573, -219, 681, 398, -1898, 384, 2776, 644, -155, 1080, -436, -694, 873, -644, -1386, 91, -1269, -2631, -416, 1439, 108, -231, 1087, 294, 961, 2491, 496, -51, 1251, -648, -2429, -175, 309, -1590, -1115, -641, -1765, 119, 1970, -78, -8, 2230, 402, -1027, 1365, 1128, -945, 147, -26, -1757, 26, 1425, -1383, -1136, 1395, -195, -1575, 941, 357, -1443, 782, 141, -1888, 655, 1702, -732, -204, 2521, 434, -645, 1721, 141, -1365, 994, 9, -2840, -214, 702, -2427, -879, 1738, -160, -400, 2016, 704, -459, 2559, 1305, -1601, 602, 983, -2666, -1129, 1220, -1673, -1914, 594, -806, -1235, 2371, 1269, -1510, 1025, 1934, -1834, 346, 2161, -1130, -1243, 948]
1625I48k288J17L253j311k985K715Q37l251J984K229l661o3K339j975L26L277
1641B491j397k781K426P89k786J936J751l899j71K377k096l0L358k205k356L100
1657E07P94k280K206J552l521l57K404j949l58L341k667k667K998N78k144K377
1673H14J502l655L32K315j301n34K763k496k380K653N44j839K135P25k940M52
1689i10K083p98o05K178j891k409K779K79k445K507L60k944N92K353o68m79J520
1706A502j512j313K029J27j724J411L20k591K48K582j002NR24j197j042J549P05
1723A021j926J189M58k748P07K222r85j69J280j099p86J679N43j665N90M88k129
1740a330mK079r70n55J057q91l13J773L82j225P52M15j635j08J772o98j348Q30
$$ y = [948, -1340, -1223, 2030, 719, -2266, 449, 1286, -1965, 19, 2248, -1413, -1476, 863, -1112, -786, 2491, 1094, -1687, 739, 1528, -1258, 678, 2429, -1470, -1641, 736, -1360, -1390, 1968, -237, -2593, 507, 1301, -979, 1227, 2779, -742, -1099, 1305, -644, -1002, 2339, -328, -2995, 3, 581, -1563, 814, 2316, -1339, -1007, 1308, 7, -527, 2236, -260, -2640, 13, 557, -1282, 853, 1578, -1362, -910, 1173, 375, -230, 1948, 57, -2352, 427, 706, -1739, 768, 1128, -1816, -1224, 1129, 461, -18, 1502, -10, -1323, 706, 833, -891, 520, 840, -1751, -1503, 1079, 77, 82, 1006, -191, -1233, 316, 1021, -905, 284, 742, -2006, -1299, 923, -62, -231, 1049, -50, -836, 843, 1386, -279, 311, 799, -1330, -1334, 745, -225, -780, 277, -614, -927, 846, 1228, 3, 755, 1170, -465, -573, 1199, 501, -847, -17]
1758a7m98r48J473L46p90K95R68j331n6J750o53j080Q74m35o91J231L40j108J04
1777b26O36r42m2J326k21j461J061j23j267Q90R65j106M09Q60r22N4J148l62j000
1796c23L73O40j177J24O19j198J96Q91j040K45J128k18o59R13L81r13K36P57j038
1815f3j65J103j324m97J373o42r99J185M23q89N36O42r07J41Q55q01o12J512o94
1834A77j241J381K73j386O05R55j053j22J051r15n82J318n47j419J850K32j283
1851g06O93J058j075l0J152j091l45J263p17j688J705K79j952Q53J006r70K77
1868b88R08r69L00J291p26j223J571J73k236J134R02j766K85J347j419m0J503
1885G47p57r10J747M7j988J011J192j774L47J468j945L52J753j484p32J976k31
$$ y = [-17, -515, -1463, 10, 356, -434, -139, 829, -502, -558, 1192, 539, -541, 333, -102, -793, 438, 778, -330, -226, 410, -532, -574, 752, 531, -930, 131, 8, -1259, -369, 596, -510, -101, 759, -163, -109, 1039, 677, -323, 50, 690, -487, -363, 256, -942, -746, 145, -895, -650, 478, 260, -399, 514, 895, -18, 218, 975, -63, -228, 875, -449, -946, 427, -215, -1214, -29, 394, -495, 41, 683, -224, -83, 772, -29, -641, 871, 177, -1064, 317, 590, -796, -191, 764, -289, -411, 640, -275, -857, 461, -86, -1505, 345, 577, -706, -13, 1045, -30, -60, 1092, 1, -344, 919, 202, -1486, 219, 498, -1454, -601, 405, -565, -288, 620, -349, -49, 1242, 516, -707, 864, 1037, -1199, -65, 837, -929, -644, 703, -716, -756, 747, -10, -920, 827, 874, -1114, -103, 1089, -685, -338, 1130, -815, -463, 1290, -194, -926, 1050, 819]
1902H19k204J311J158j991L95J600j886j83K351j662r55K462j86k234J454J129
1918A378k269N80J481k070k97K582j626j478K821p18j868K151O85k280P75J375
1934A222k273K73J987j403j255K411m83k385K363Q72k554J384J257k175p1K207
1950A377j306j629K864j098k432K741O41k717J408J905k652L52K261j913j005
1965a203K462q67k265K635N53l031J409J930k868N10K487j833j125K328p43k299
1981a920K693O88l388J767J770k823L36K575j520j106K142r90k078K702L00k799
1997a651J498J716k402r3K939k439p55K807j235j519K276J75l110J976J336k891
2013a372L67K411k040n76K773j493j976K968J42k853J498K143k807J4K511k035
$$ y = [819, -1385, -74, 1084, -907, -512, 1088, -798, -981, 1370, -292, -1247, 1215, 1029, -1205, 249, 1378, -891, -311, 1170, -900, -1197, 1385, -241, -1719, 1102, 384, -1484, 667, 1352, -928, -153, 1222, -1051, -778, 1209, -194, -1449, 962, 479, -1906, 457, 1329, -1225, 159, 1416, -759, -830, 1377, 71, -1558, 1306, 208, -2224, 517, 1158, -1559, -151, 1754, -898, -546, 1715, -198, -1203, 1259, 392, -1873, 762, 1315, -1716, -307, 1623, -1245, -735, 1752, -81, -1206, 1122, 379, -1920, 773, 1461, -1927, -160, 1610, -1213, -877, 1698, 178, -928, 1214, 224, -1854, 848, 1148, -1651, -153, 1563, -839, -932, 2007, -432, -1187, 1620, 385, -1134, 1142, 1317, -1793, 183, 1519, -1372, -1005, 1406, -634, -1210, 1563, 70, -1906, 1062, 1204, -1649, -151, 1992, -815, -801, 1710, -325]
2029c25r65K608j339j848K836J49k929J701J940k688J5K249j456j150K821j373
2045B46j626K459L0k660J994J323k808L56J966j750q39K673j293j745K310N2k356
2062a668J792J880k852J84J841j206o48K061r46j954J862J70k109J621J307k411
2078a076n1K150j478n05K299r58j558J844J24j846J245J477k619m33K426j120
2094g9p45K052r48j601J486N50j694J120J210k309l88K180q15o75J856j010j751
2111a561J767N05j593J298Q05k207m78K358p88q22J769o91j824J675O82j399P08
2128B04R73k123M0J790m90j004J152m50j310J124R68j308P35P79k232K38J756
2145H42l41p91R46p87j130J208J020j527P84N11j796Q9J980n70p32Q94n86q81
$$ y = [-325, -1290, 1318, -21, -1869, 967, 1116, -1813, -112, 1828, -860, -845, 1404, -52, -1202, 1619, 246, -1380, 1079, 1109, -1551, 443, 1766, -1042, -686, 1280, -470, -1309, 1364, 71, -1674, 636, 688, -1668, 124, 2004, -848, -664, 1177, -29, -677, 1384, 438, -1516, 346, 516, -1593, 28, 1335, -1076, -1127, 1023, -455, -960, 1339, 381, -1177, 667, 791, -1055, 190, 1667, -952, -1385, 1041, -79, -824, 1228, 280, -1321, 165, 715, -979, 141, 1351, -958, -1346, 834, 19, -656, 1200, 190, -1561, 206, 711, -882, 416, 1221, -986, -1464, 894, 106, -716, 1053, 362, -1462, 213, 895, -504, 204, 1177, -946, -906, 884, 394, -610, 542, 92, -1218, -94, 874, -434, 301, 1080, -1152, -914, 842, 501, -290, 656, -131, -1261, -53, 967, -560, 224, 735, -1061, -972, 1008, 438, -294, 600, 14, -867]
2163h67P06R09r06k8O88j531L53J553l14j070J080m19j124R99P47q92j21O19j177
2182g95j37J944l53j117P03j18j094R32R79j038j80N07r02K16J300l56q67O96
2200C20j58r77J011P73r41j10P9o72K98J238k60j244R00j34o79P31O18j017L9
2219a85L04o08J39R52m09p20M39j14k23O36L77n22k55J61l02M7R87n91j66rMj64
2241b22N22J77o56n2L48m49M40M77m41m02K93k65j64O05L50m14m37M23j0j35M12
2262D00l13o87Q36p3o50P42m4k76k47L79k90R3O53n94k2M20l59j48K10L55p82
2283c97M02q1j15L78J05l44J0K37l04J07L17r8k89N3n8k69Q05l34l14O6K83k57
2305i7j5N27k38k04K21j78k62L38j60j45L07j06j62J39J81k69l9K19j77j38N75
$$ y = [-867, -161, 748, -158, -186, 502, -1029, -676, 877, 563, -507, 573, 154, -970, 29, 776, -116, -237, 382, -795, -932, 1012, 659, -458, 245, 127, -967, -35, 944, -94, -274, 233, -669, -453, 847, 491, -376, 320, 162, -815, 196, 969, 28, -82, -3, -675, -377, 861, 601, -643, 257, 123, -556, 175, 793, -224, -185, 119, -489, -350, 602, 193, -527, -88, -202, -425, 211, 588, 66, -189, -28, -330, -283, 704, 113, -53, -62, -58, -222, 300, 477, -179, -231, 117, -332, 108, 585, 144, -258, 35, -230, -394, 211, 561, 147, -290, 133, 123, -12, 400, 87, -600, 236, 163, -487, 255, 211, -65, -312, 67, -223, -130, 523, -71, -93, 327, -32, -180, 30, 385, -397, 5, -76, -191, 187, 292, -52, -42, 195, -109, -2, 315, 217, -72, -19, -77, -346, 459, 125, -189, -123, 160, -97, -112, 415, 177, -27, 194, 16, -246, 92, -68, -213, 94, -12, -174, -35, 146, -123, -162, 57, -120, -258, 317]
2326C17j70m92L84L25n62Q7M43m54n5L18k86j28N49j00k51J01L29m42pK00n28
2347d22K99N55o21P4L15l9n70P76j99n43O08K00m28n4K04l45j74N38m0p49Q26
2368B11P4l83J85J87q12M22J87m43M5R30o08k11O24k52n56M56J49n23L98M59o27
2389h8j78O74l52m65O21K49r26Q03Oo90L87R5j79j95Q63o91j75O62m12k25N50
2410C34r0m59J67M93l08j77N15m97r9L93k79l73M54L59p88M17K02l52n4L48k89
2431h3l21Q31m56m27M30K82n24K68K22m73J03L16l29o6L02j36l37M54J94n30K92
2452A2J97m79J10O02l49j19M28l78k05M41J6n09K17J28m07Q3L43l95N9N93m87
2473i9j53N07qn16L01L38m93M9J70n00K80M97l82k25N21j37k07J41Mn80K55M06
$$ y = [317, 147, -345, 39, 364, -198, -111, 332, -122, -177, 141, -145, -273, 276, 176, -75, 26, 355, -87, -94, 106, -422, -123, 432, -189, -115, 200, 161, -409, 367, 168, -375, 233, 433, 5, -49, 155, -190, -364, 174, 134, -615, 211, 285, -98, 87, 274, -538, -116, 71, -372, -327, 603, -5, -216, 408, 156, -400, 56, 205, -318, 80, 539, -88, -266, 408, 56, -409, 212, 461, -465, 338, 344, -346, 41, 136, -43, -238, 625, -66, -241, 421, 9, -216, 334, 244, -215, -48, 445, 137, -40, 475, -22, -121, 272, -7, -380, 74, 433, -355, 62, 264, -88, -142, 206, -83, -404, 427, -29, -456, -26, 256, -268, 0, 222, -251, -148, 168, -161, -227, 75, -61, -398, 56, 250, -280, 12, 209, -270, -160, 442, 93, -26, 402, 24, -181, 260, 276, -233, -16, 112, -295, -212, 131, -264, -205, 388, -99, -252, 255, 247, -269, 32, 370, -123, -74, 96, -404, -124, 373, -9, -234, 287, 150, -57, 84, 88, -492, -237, 169]
2495A69l52J93K91l08l24L99j21q0L39k16j17L24o5l12j13N73j12j37J34k40J12
2516C7K41m5k69j79M05j37j96L41k95j19O6P5j41N33l5l32J27J12l55L39l0n37
2538c94L6O13k46j47K88j85o1K79r2l48K56K66m43j07L42m87J36N80j67k78M69
2559C10j99l67N13j26r9Nj99k44L33M64l23j66L76l55j65L76L59p48m0L82j51
2580f4k29O40j41j45J0j02m09P61R7m19R7q3j74K85J87j28k33qpj68L13L33m43
2603c0j89N7k39N88M85n59k28J82k72m6N39J14l77j40N9l5lM46j18m52K96m4n0
2626a6L33k3l67J35j10j33K84L29rn69o4LO0L98L0n59OL32k87M82Ok91k31Q9J46
2651b6j80L09J88p68K59O07l88L85Q6n51r6j39K98K47J17j59n09O7R3K0j22O00
$$ y = [169, -183, 10, 301, -7, -331, 68, -53, -133, 206, -10, -127, 197, 132, -180, -293, 280, 168, 31, 165, -75, 37, 278, 233, -36, -215, 190, 53, -143, 198, -97, -216, -150, -75, -216, 317, 282, -50, 77, 189, -166, 173, 143, -394, -358, 255, 9, -138, 150, -35, -96, 183, 91, -257, -1, 265, -178, -285, 57, -430, -294, 286, 119, -159, 310, 111, -256, 257, 131, 32, 37, -162, -406, -73, 391, 68, -98, 278, -77, -242, 134, 493, -255, -295, 87, -64, -293, 347, 206, 61, 71, -31, -440, 321, 418, -1, 96, 13, -161, 124, 311, 183, -50, -58, -65, -233, 80, 413, -30, -219, -162, -401, 187, 672, 113, -115, 67, -205, -251, 288, 402, 25, -115, -56, -91, -94, 352, 234, -218, 78, 34, -16, 317, 294, -73, 62, -48, -181, 103, 432, 423, -146, -210, -207, -147, 251, 281, -278, -272, 60, -227, 255, 261, -30, -261, -172, -26, -206, 103, 291, -477, -218, 389, 1, 386, 472, -79, -175, -314, -16, 231, 348, 189, -320, -253, -160, -140, -262, 338]
2673C38m77k46L79J0j06N13m87j15j30K39K77J98L4o73j78K83J15K81J7j65n87
2694d80M48j35J40l0M24n20k64L43J20k5K85k55r4J66j85QJ80K11m05k97N65j9
2716A81m77K52R1k73r9Q11l44k79K96j87r7J55K01n86L39J32k64j12N76j85n55
2737d24O20k35k58K04J27l17L23O1n35M02M4N6l30M19m02J01K98l1k82L19O7n32
2759c05L7L55P1k51K98l80K0K60Q4k61J10L58m77k11O00l21K1K61l91p8K51L51
2781D02n49J84J35p04L15M54k66j95K77Q8j37J41r8l41J95M12l59j09M33k90l43
2802c55L85N1k33L1J86k77J29K7m1J52K60l33l17M23k43o4L11Q3m40K89M7j97
2824a26K0J38r6k18N44l51j78L60j49l90M86J18k85oM68m46o1M12j19k83L12o8
$$ y = [338, -139, -385, -6, 4, -102, 411, -76, -191, -321, -82, 195, 393, 427, -246, -424, -141, -26, 255, 272, 107, -480, -32, -167, -27, -57, 367, -153, -417, -74, 46, 21, 306, 51, -43, 123, -62, -54, 126, 337, -68, -365, 200, 181, -296, -44, 47, -226, -325, 486, 142, -137, 159, -28, -125, 30, 231, -355, -16, 116, -148, -260, 316, 131, -424, 196, -39, -297, -93, 34, -283, 40, 101, -434, -32, 12, 68, -262, 157, -245, -144, 154, 123, -159, 160, 227, -305, -268, 87, 158, -93, 205, -175, -155, 105, 189, -72, 38, 396, -81, -292, 308, -13, 8, 269, -122, -200, 51, 402, -147, 37, 172, -532, -217, 237, -29, -224, 53, 141, 4, 145, 47, -294, -99, 313, -46, -155, 278, -12, -355, 30, 81, -152, -121, 65, -212, -83, -56, -97, 55, 315, -18, -335, 88, -155, -219, 92, 175, -265, 24, 71, -126, -106, 32, -64, -282, 262, -89, -267, 93, -56, -446, 40, 158, -127, -133, 335, -111, -172, 240, 121, -162, 150, 82]
2846H2l07K48N1j11j07N31m09j79K51j71R1K79k6l72L32j53k3M3M4n7l09P02m96
2869f6r1K31q6k80K63J54l25K03L23m33r0N27m39QM28j10l10L09m9l02q6L73m8
2892A04l79N84l45l59L97J55l20K53J52m22J84K35l05j45K92j08j7L82j84m71
2912c17M54L30q01K78L03k94k13L88j21n44N95l7k64N15j05n03J08N86o56J0O85
2933C97n20l50O50nm86M28J67m46J66L13k10l09M61l38n3L76j04m16L81M8k02
2954e2j56M33k55r6K59j85J21p9M4j87K55k9j70K55k0k63O9L4J3j95K74P3l07
2977a64L11K08n67J04K30j28j28K38N1k24L31j84n27L41L34m59L36O6n68K68N62
2998D31n52j52N10n17P0L63K85n02K21K36m38n8N20n67J5K66q7j88PN54o67L33
$$ y = [82, -225, 23, 74, -37, -144, 387, -22, -201, 50, -121, -30, 249, 223, -149, 183, 30, 7, 50, 94, 37, -272, 430, -66, -157, 74, -12, -292, -29, 125, -200, 3, 326, -107, -197, 330, -109, -101, 327, 217, -93, 216, 167, -135, -221, 152, 104, -275, 309, -36, -395, 2, 157, -163, 90, 242, -180, 4, 239, -66, -211, 81, -27, -44, 338, 154, -317, 137, 467, -334, -56, 247, -47, -260, 128, 7, -537, 58, 21, -243, 272, 167, -336, -228, 358, -298, -288, 397, -123, -473, 177, 172, -314, 114, 281, -165, 1, 314, 104, -205, 256, -82, -135, 241, 137, -279, 102, 150, -52, -208, 225, -30, -126, 133, -52, 69, -10, 34, -153, 102, 73, -97, 158, 138, -125, -56, -22, -9, -204, 70, 143, -164, 147, 355, -212, -108, 122, -6, -134, 104, 155, -69, 262, 78, -449, -108, 226, -233, 103, 169, -399, -131, 431, -121, -273, 237, -280, -210, 153, 438, -64, 157, 393, -45, -103, 417, -150, -135, 131, 44, -144, -137, 417, -250, 83]
3020H3J63l63N6K65l07l1K74o9m47M48R3m15K17R0m49J13M05j68k52M05J37m98
3042b50K30J77k49N9L04l40LM20l85j06L08m05k9J55L69n4k60K08l43J37O58m98
3064A09j95j7O0j90K37K10k73PO4l27k26O88o6m45K80R4k69M62P8m51OK89m1l22
3088b38M31k12j74L26q7k10J21K58j08k39K01l36N78J38l80l09R0P3K7K2L52k69
3110E5j19L24n59N67J42l77j11p7k01L78K8K97k74m18K50j44K19L60n58k3J56
3131h5K22k05L27q6j09j58OP1q8K65k64j56K48L00o15N34K7k81j80L48n3MJ15
3154A87k74j60N8L67j94K02j13l82K69J16j85L59q6r3m36M49J96l56K58j73j14
3175a05j62L84l19J50J42j37j8P1K11k76K27j3k10m2J09j73J44J70j98k44L45
$$ y = [83, 246, -117, -61, 204, -103, -134, 140, 71, -376, 72, 165, -250, -33, 57, -392, -279, 126, -42, -294, 111, 248, -250, -20, 157, -92, -33, 271, -69, -66, 354, -31, -137, 171, -234, -263, -108, 261, 207, -53, 155, -188, -51, 607, 109, -86, -103, -43, -233, 4, 214, -59, -52, 12, -315, -541, 147, 81, -364, -84, 10, -259, 203, 281, -170, -164, 125, 84, -238, 193, -19, -193, 133, 46, -164, -43, 215, 107, -132, 69, -267, 311, 449, 69, -240, -150, -77, -50, -28, 324, 55, -64, 260, -299, 268, 410, 33, -78, -155, -356, 22, 50, 347, 73, -345, -95, -239, -20, 340, -218, -241, -85, 137, -68, 259, 173, 64, -94, -88, -17, -105, 160, -104, -260, -12, 288, -327, 207, 234, -47, -227, 121, 68, 72, 187, -87, -247, -189, 178, -16, 186, 73, -309, -40, 76, -109, 250, 164, 71, -365, 84, 280, -76, 182, 9, -105, -267, 117, -202, -52, 90, -47, -65, 6, 217, -59, 168, 155, -55, -97, 12, -161, -17, 153, -45, -289, 56]
3196E6K34k59k0r7k90M11M2O3j30m3j52K0K35J16lj06j17k51L10J49l48K31Rl46
3220b86K14l1K15k17K42j99j39L00J7R1k80l4p8J63k21N51k53K32l35k12L00j05
3242f5j82K45l2K9j78L05k91O5O6J4J46Q4M7n70L52p0m0P3J17o7j20j9j02KJ30
3267f1L45m66p0K71K91l0j48j39j05O3k8K9L5K98o72L67J71l13P0J08j93L48j03
3290F8k00P2J49o0k5K5oQ6JM28o41R4L47j59j73K59n2l58K23J42k29K89j00j77
3314CL6K14K4m34J41M9r3L01k28l57L74M9k24k63M31j98R5M35l80k97M00p3o0
3337e5K28M8l01L5L21l22Q7K01l19RJ81l69K35k1N4k58K95Q6j89l8K09k11k84
3360c78M96k53K2L19r9n14N58j29j5q2L44l35j67M35k39p9J58J53n58M77Ol01
$$ y = [56, 290, 31, 11, -86, -376, 35, 77, 140, 10, -33, -185, -165, 70, 186, 183, 77, -40, -291, 19, 168, -180, 51, 60, -286, -72, -103, 112, -105, 137, -62, -201, 99, 116, 207, -73, -107, -185, -22, -243, 308, 55, 287, -48, -260, 40, -65, -247, -2, -34, -5, -183, 122, -169, -104, -38, -24, 122, 206, 253, -317, 35, -35, -75, -2, 115, 48, -72, -91, -193, -191, -61, 284, -182, -252, 19, 310, 280, 132, -7, -112, -49, -77, -48, -13, 285, -387, -20, 151, -162, -92, 16, -177, 171, 68, -132, -60, 89, 29, 4, 29, 23, 109, 110, 538, -103, -9, 338, 179, 6, 265, 213, -145, 78, 220, -9, 280, 180, 3, 39, 253, 277, -157, -16, 33, -60, 241, 13, -344, 30, 79, -145, -408, 23, -175, -80, 355, -25, -322, 78, 5, -55, 173, 221, -80, -45, 276, -46, 41, 242, -77, -68, 113, -256, -21, -42, 12, -246, 49, 135, -54, -92, 117, -94, -378, 118, -135, -113, 206, 107, -407, 151, 22, 7, -75, 269, -66, -233, 202, -37, -116, 42, 195, -363, 114, 120, -181]
3382a81ML04j62k12L13J1l44N35k3m63N35o8m03K15K6k28O7M03k34l53N09k56
3404ej74L33k16j45K84K41k03k1Q3k31l85N34j31q4k4M21m21J38k5j08k09N38
3426A90k31lJ76r6m7J66j08k82m6M21k19k78R70n93l9Q2l2l78K34J01m1J55J26
3449B28l37n2M04k63j88N23l01k82M44k62j74P3K05j23K1J04p3rK32j61Q0k40
3471a51L20l84K21J86l94K15m3r8R7K74j76l33N24j10k44J20J33k02R7J82k34
3492@j81L99m32J58l8Qk6K86m8m33K54J05r6j26O13m22m1O1L5N4j43J57k85J84
3516D3k8n8j94K97l20N2M31O0j14j74p8K4J38J27p2k39K80j61k29L33P0l65q1
3539b58N2K1J67J97l7k6J19l92J71K4k8p4K18j36j88L30lK6l14K54l09j51K81
$$ y = [-181, -177, 127, -35, -247, 66, 77, -267, 268, 245, -218, 317, 249, -154, 61, 87, -141, -74, 329, 95, -258, 251, -5, -179, 154, -62, -207, 77, 318, 115, 94, 177, -54, -439, 95, -36, -120, -144, 277, -144, -6, -31, -139, -348, 190, -41, -44, 132, 36, -11, 155, 47, -235, -281, 140, -79, -357, 613, 20, -19, 63, 31, -347, -113, -12, -53, 102, 228, -109, -161, 243, -20, -208, 315, 14, -268, 176, -86, -260, -187, 18, -105, -84, 20, -53, -62, 170, 9, 89, -151, 169, -215, 6, 192, -202, 13, -30, -128, -31, 243, 67, -266, 258, 148, -96, 24, 157, -45, 52, 234, 0, -181, 218, -214, -56, -94, -86, -112, 174, 126, -307, -53, 52, -44, -170, 443, 21, -20, 41, 76, 130, -13, 144, -141, 43, 15, -43, -237, 60, -260, -208, 223, 283, 169, -5, -83, -59, 79, 206, 134, -105, 175, 14, -215, 118, 188, -177, -258, -206, -185, -18, 179, 142, 116, 235, -157, 14, 38, 10, -64, 154, 18, -170, 160, 157, 183, -131, 123, -186, -337, -56]
3562e6J44l57N0K47j52J86j58K31l6L8k54J0K29j30k47L32j98j69K40J80j16m7
3584c3k11j76K04O68k49k66j8q0J23O5r4l3O5j55l9K89L0l49JK93j02o3L95q9
3608A76k01r6Q7q2J04K70j18m99K24P6m4J00K91l84j29L77l49K02L26l64m1L3
3630d1r9j14M09nl2j36pP2k14K67j61j1m2J15P1J13L3j70l3j63L01J69P0n15R8
3655b5J05Pq6L47j93j16k01L49j26o1K51r2m01J81q4K0J11k00R1j45K32O9R3J9
3679A45p7m19K13L27j35O0n3l22J20L67k84J82M8m09J22J25J58k38J42M4l16K95
3701I5j11l6J99N3k81J40j64k6K21K13q9m24K5K92K7p6k86J92j8J64j27K5K89
3724B97l29q8mK79k02J5J32p0j74L17l4j51o2K12l15M8J71J26k88J49j89K1M98
$$ y = [-56, 88, -269, -219, 28, -124, 62, -96, 135, 99, 137, -117, -107, 122, -8, -255, 77, -121, -290, -50, 130, 14, -33, -244, -420, -216, 452, 203, -63, -81, -161, -38, 27, -67, -100, -35, -190, -229, 60, 90, -259, -258, 35, -67, -130, 265, 176, -25, -121, -34, -116, -12, 258, 140, -359, -135, -59, -103, -3, 288, -96, -225, 152, -197, 5, 331, -33, -74, -41, -140, -254, 155, 150, 118, -18, -25, 47, -167, 100, -61, -72, -114, 1, 72, 185, 218, 48, 15, -148, 153, 322, 392, -123, -25, 80, 87, 1, 348, 155, 39, -162, 187, 61, 0, 251, 159, -242, -61, -145, -125, -14, -214, -123, -268, -36, 33, 126, 145, 68, -351, -138, 189, 54, 114, 61, -261, -141, 226, -58, 124, 172, -237, -115, 10, 168, -70, 72, 116, -200, 95, -16, -52, 147, 200, -81, 59, -105, -131, 90, 303, 214, -210, -185, 107, 134, 58, -228, -36, -54, 110, -17, 8, 297, -32, -120, -124, 155, -47, -32, 100, 30, -144, 173, 139, -12, -74, 138, -177, -129, 42, 168, -120, 29, -160, -139, 359]
3747C59l52k16L28j4l7K2j51p4J42J02j40PL56m04k51O24k17j59K53n6j16m3L79
3770C42o35N14j18m9l66N03N7m75M61l02j09J91p7j52K48J35r1m24O93m98K36
3791H4j14k31K53n4J89o57N11J26l2j56L81l20k59L85j23q2l8J76j17lL51l37
3813f7j17Q0K33k65K81Q4k47J22k38k3J47K13l61J98J98k57k58M10j75m0n7M40
3835C01l04p9L88l52j26K78k09N5J29mj26J5J75l59J21K89j36L4J89k97l09N28
3857B01k47j0L02J0k14K84n1k79q8R7P1j82K74p6m10M06j27j49L58Km57J93M45
3880C53m35r7J92K29l61K47J7k94N25l17l02J22L80m13R2J91l8m99N50l4m86N82
3902B04O4n63L13L49l25m4L02k94j34L94l00o4k9M03m97J32K30n14L71K15l18
$$ y = [359, 7, -209, 119, 105, 68, 90, -61, -135, 7, 109, -31, -24, 332, -72, -323, 301, 84, -75, 178, 122, 6, -37, 342, -293, 221, 103, 54, -312, 191, 248, -227, 234, -68, -177, 14, -63, -215, 33, 168, 77, -347, 346, -152, 84, -30, -261, -8, -62, 127, -530, -19, 107, 75, -81, 300, -20, -279, 106, -17, -99, -137, 39, -78, -81, 270, -67, -184, -104, 129, -136, 145, 229, -18, 104, -134, -157, -10, 203, -158, 40, 238, -19, -277, 133, -42, -82, -139, 301, -3, -82, 306, -46, -172, 106, -103, -48, 81, 77, -49, -34, 141, -218, -97, 192, 56, 90, 279, -18, -327, 201, -46, -56, 246, 256, 42, 326, 275, -4, -92, 5, 76, -106, 168, 92, -318, 88, -39, -188, 170, 172, -285, -92, 353, -82, -179, 13, 242, -119, 128, 145, -149, 376, 59, -243, -121, 259, -154, -62, 129, 91, -408, 142, 108, -378, 204, 268, -295, 18, 367, 42, -2, 300, 6, -128, 266, -34, -98, -127, 276, -221, -89, 141, -373, -2, 213, -105]
3923a05Q5O0k2m4L79m74mj2L51j30j51M87l19l91N68l99l7J53K42l98J75J55l41
3946a72J93K73m89J1L94k00k03N03j36n15N03M8j01o7L08k98j86K29j71j65M60
3967B19j80k34L59P3l18J09Q3j0j79K2P2q5l8R9j58R3L08r1k93N43n37r0L93j56
3991Dl05L76j53m36N00J95l91M28j40j94J17K04l49j38J81K38j09r8P0j98M27
4012B29ll56N4L98m41LK56r5r1J0K79k72K7P5k00j30O06j85J68l88K8k6J60J78
4036B84m79K26j23lK16m1j42k96K87J74j81J58R9k16O0N3j88m6L80K06q15L36
4058e1n7o6M9J18P9k2Q6l60K64M6j35RO1O5l84M41J4j77K38l46K43k08N5N6j17
4083i9L9q6k06N55l23J35j5k02O8J20J7q0J91k40p6J58q8J39j91P2L54k18k4J59
$$ y = [-105, -20, 40, 18, -26, 353, -121, -125, -137, 214, 84, -67, 420, 101, -290, 278, -121, -158, -5, 237, -161, 14, 169, -172, 21, 294, -195, -184, 210, 10, -193, 310, 174, -341, 162, 210, 109, 42, 350, 52, -134, 95, -76, -241, 219, 39, -195, 164, 237, -81, 28, 111, 101, -78, -56, 16, -69, -107, -8, -166, -73, 235, 144, -149, 394, -143, -233, 160, 4, -301, 75, -78, -514, -14, 181, -210, 218, 78, -116, 1, 205, -144, -282, -101, 137, 28, -70, 0, -198, 229, 226, -130, -76, 322, -119, -116, 140, 45, -46, -36, 243, -29, -2, 73, -127, -257, 349, 164, 332, -56, -28, -54, 106, 284, -195, 31, -92, -95, 121, 80, -62, -358, -71, 103, -78, 80, 179, -37, 23, 76, -112, -158, 222, 428, -387, -51, -108, -174, -125, -7, 72, 50, 136, -224, 40, 86, -49, -40, 21, 86, -298, 143, 157, -20, 218, -128, 115, -93, -38, 18, -99, -60, -146, -352, 203, -120, 15, 0, -202, -134, -14, 3, -77, 114, -126, -202, -44, -132, 7, -184, -112, 242, 24, 0, 159]
4107A59k26Mj36J06q6J00L20q2k11J40l26J30K34j79J7Q9j14M7l05L74K72m98
4129a71L11k51P5K99j88R0k14R2o3J19Jj24n5r4L7K52j98Q1p9K78j0j20q0l3L41
4154B96p7k12l1j13J56O4O1K67l47k11j0J41J0j96M77l99L5L0k64M26k61K30J
4177G3R1j47l04N17j71q8oJj96J41O1M3J73j25J15k55q3p0J33OP8J0l0J66K2k72
4203a17M33k53r7j5k7J0K62r1M6j75J75j10l36N11k55J24k28K78m92R8M67l72
4225a64O2K70m32l8L06O6R2m31K40k00K04J10l42M26l2k38M9N9J25l35L07k17
4247a13r6J80K61l10K3l2r1Q5N3J10p4J00R6k37J74P5l50J15m7j69J50K23j68
4270d2o1K42m31K57L10M1m02K54K1l37n1J96O3j09M8k21k5N41k75m12O67j96l35
$$ y = [159, -67, -63, -199, -93, -179, -79, 241, 159, -52, 88, -238, -108, 126, -53, -36, 53, -61, -14, -319, 55, 327, -171, 140, -111, -36, 263, 75, 165, -49, 43, -20, 99, 100, -24, -79, -173, -136, 116, -82, -1, -80, 198, 188, 68, -12, -45, 296, 219, 7, -24, -137, 19, 83, 144, 411, 64, -147, -157, -16, -6, -202, 275, -124, -89, -59, -323, 103, -158, 72, 73, 164, 17, -287, 230, 59, -29, -35, -34, -230, -89, -28, 15, 188, 63, 178, -77, -160, -230, -97, -91, -13, -3, -33, 133, 155, -117, 316, 63, -34, -49, -76, -66, 196, 105, 151, -24, 151, 41, -295, 216, -39, 85, -143, 135, -357, -259, 208, -164, -102, 168, -264, -302, 4, 70, 162, -269, -29, -229, -25, 85, -257, 169, 137, -101, -52, 7, 132, -203, 104, -113, -209, -29, 232, -78, -55, -87, -178, -93, -40, 70, -4, 96, 192, -45, 129, 204, -146, -31, -78, -247, -97, 126, -42, -103, 139, -292, -35, 275, 316, -86, 168, 189, -148, -199, -3, 60, -49, -1, -222, -247, 294, 19, -393, 274, 78, -257]
4293b57L37j06K6l7J89K6l16M3J22J16k49L42n53L36j20q8O3K28l3q3K04k9j3
4316A48k07K02k68K5K32j93R9J80q7k15L60l88Rj14L10l83K23L98m33M5L20o1
4338B02l81L14N1k98N1J20j9k93L69k56N9O8r1ML13n7j2J26l24k40L76K6o6j89
4362a47M00m63M3N24m30o07P27Lj57O3J74k10J68n5j08K7j5J77l97K41Q3j24L03
4385B20j0l36O5l9J65k06J32P9p5K1R0m42L40J96l22l2L10k13k01L99pk31R8O3
4409F4r3N08m76Q9m72M27j35kL22k38O4J78k30j37M9L25l01Q8n9j95L41l1j07
4432b1j37K62k48k5R5L01m77K31J89r6k74K33k88K65J12o6j80J69L45m36KL35
4454B91l78O5P9p2r8N5L18n60L67J79k69k79L52j02nPK37k29J09j57O9J18M3l08
$$ y = [-257, 80, -26, 0, -37, 152, 178, -138, -95, 27, 143, -106, 236, -317, 19, -101, -189, -126, 102, 69, -14, 190, 161, 148, -59, 143, -125, -100, 132, -61, 38, 218, 131, -84, 276, -112, -103, -217, 93, -290, -67, 331, -102, -57, 263, 202, -179, 135, 186, -112, -61, 59, 40, -253, 116, -140, -81, -13, -104, -100, 213, 156, 144, 270, -54, -294, 82, 108, 42, -147, 253, -210, -167, 357, -73, -680, 47, 50, -107, -44, 130, -80, 88, 33, -75, -48, -63, 114, -283, -42, 41, -83, 220, 210, -126, -61, -100, 65, -141, -9, 70, -5, 16, 106, -336, 4, 200, -122, -154, 156, -57, -258, 141, 134, -97, 1, 64, -29, 479, 3, 92, -380, 47, -88, -90, 232, -6, 58, 236, 6, -131, -82, 243, -58, 30, -29, -224, 117, 86, -21, -158, 104, -144, -169, -74, 227, -250, -19, 170, 74, -200, 33, -255, 10, 122, 56, -124, 45, 390, -46, -44, 291, -87, -22, 57, -15, -113, -58, 260, -300, 67, 246, -23, -302, 50, -52, -57, -50, 187, -42, 67, -90, -21, 97, 140, -168]
4478a68M00k66r5J31K31m25mM89k0m67K46ok0L26k03K3k42K25k75j1J87J39m94
4501b99K61j2L2L2L0n5Pj58j06J85L34k40k85L89j12J35J6o1k40p7L60k34Q5j79
4525a92%J66J9l9J50l17J31P5j09L82l34J09M2j59o7M10m84L42k6j02k76J47K24
4548I2K49o62K30N5r3O3J45J12k03J34k30J00l6J70j95J37J8k05M47m90J69k16
4570b09L58j18j0J48k67J65k71K32j79K30N0j24P3k4k89L16N9o8o6J92j13J9k4
4593H0J38m06K51k90J33R1Qk1N9N0k44K12K65m21L03l04K70j54P7L0j64K14j97
4616b0j22lJ14J47l14L23q5n9n1J60q2j55J55J19j57k7L85l44q7L35k64j02L64
4639B30k02k6K3j66R7%K9R4l4J4P4l83N24l08pK26j43n7J62j38J52o2lp7L4m2
$$ y = [-168, 232, -34, -129, 2, 233, -192, -196, 293, 273, -194, 52, 46, 26, 352, 149, 172, -70, 155, -120, -131, 56, 195, -299, -38, -50, -18, 14, 44, -11, -4, -162, -268, -83, 251, 11, -274, 115, 3, 138, 154, 93, -147, -224, 136, -98, -13, -192, -192, -26, -7, -46, 104, -213, -82, -7, -116, 266, -68, 41, 83, -76, -143, 267, -217, 125, 99, -3, -279, -132, 92, 341, -321, -91, -36, -129, -66, 79, 191, -12, 122, -108, -8, -44, 126, -69, 68, 86, -119, 328, -162, 7, -209, 149, 31, 21, 169, -98, 67, -204, 28, -151, 79, 129, 5, 78, 54, -235, 81, 140, 72, 6, 198, 85, 104, 80, 218, -188, 63, -227, -94, -3, 5, -16, 43, 93, -151, 61, 326, -95, 208, -96, 174, 20, 97, 127, -37, 177, -20, -142, -145, -31, 116, -198, 125, 40, -19, -70, 90, 8, -147, 8, 127, -30, -57, 328, -16, -103, 232, -32, -134, 230, 28, 2, 25, -141, -44, -44, -15, 79, 45, 59, 133, -250, 274, -34, -41, 185, 42, -15, 147, 9, 161, 99, 96, 19, 53, 11]
4665A1q6K50k4j14p4j26K8k3J06RN9Q3J04k74N7J28l47J93J02N2l75K28J53k75
4689a55K9N20k51j80J71q7nO3j52K59j55J8j70N2J16j49P0l9K40m46K41J34J92
4712C16l73m1l09K59N37l68q4N2Q1J36l16j15K37j60J59l8k42K73J27j05J98l68
4734a44j01M44k56OJ50j91R2k0J58p1j75J31l29N0J81K11O1k40j81Q8K42j18L
4757ik63M72l26J73j23J92k42J42J02k8k51N5J51Nk05J8J71j02K54j11r6J9j94
4780a96L48L3k19J68j26Q3j34R5p9K22k52J04k2L2J36n17N33l4p9l5J25J0j76
4803B0J19j6k33K12J4M9j69k12l5M05j63r6K23j11o4OP3j70j08L57k23K5K90J80
4827C73l98M0J26j72O6r0K48k67K07j30n5l2k45K43QJ37j77J84K92l16j40K34
$$ y = [11, -75, 175, 151, 37, -37, -163, -135, -158, -52, -43, 16, 99, 203, -71, -14, 114, -233, -40, 62, 114, -261, -33, 120, -155, -126, 394, 143, -37, 134, 47, 42, 105, -47, 212, 57, 75, -95, -43, 73, -76, -6, -45, 195, -251, -10, 124, 316, -57, -98, -407, -148, 389, 21, -63, -11, 70, 206, -110, -225, 12, -148, 11, -27, -269, 4, 131, 26, 224, -144, -245, 199, -57, -51, 99, -92, 0, -20, 138, 67, -108, 23, -306, -256, -75, 136, 197, -43, -224, -136, 106, -12, -9, -272, 200, -126, 47, -76, 116, -126, 16, 118, 90, -161, -106, 45, 50, -155, -137, 34, -68, 186, 75, -21, -2, -196, 152, 185, -34, 134, 8, 91, -43, 52, -27, 195, -57, 47, 25, 57, 193, -324, 209, 175, 96, 61, 186, 196, 20, 139, 123, -110, 102, 116, 165, -4, -216, -251, 154, -9, -105, 118, 7, -57, -51, 22, -148, -256, 101, -122, -97, 193, 373, -25, 15, 141, -31, 35, -55, 193, -74, 133, 3, -52, -84, -329, -86, -78, 59, -118, 66, 358, 42, -98, 136]
4849A36k93K6L04k00J26r4j59L63k99Pn5j10K49j57L24k14R3k3R2j93J83M8J35
4872B89l90Q0K2O8l64M89k55J5k6j99L28o6J86k80J84n8k16L29j76j11K49j09
4894a1J61l24K18m5j57K12j44K86k79K69J83l75j47K98k50k0L54k73J78J4j12
4915C6j84L35j43k46L30Jl6K74k89L9j67K77o3j83K7j38RR0m5J20j72L85l45P1
4939a7K43k50P4oN6r6j3J18k30o5K50l36k08O44q4j14J62R1m03J39N4K09j69M1
4963I0j34p7M63k84m44L63p5J8M9p3M9K60k63J65j60L30M8m83K64j08Q7m30L05
4986d0o7K03l14k05K49M2M5nK40l34r4L08N3j54K35n9Q0l06K10n5j5J15k91O9
5010i0Q4J34K2K3j22q1O5j70K71l0K5m4r7n3j37L41m9J98k16J70n75M94j89K69
$$ y = [136, -157, -131, 173, -27, 99, 5, -154, 209, -90, -83, -138, -248, 1, -156, 168, -46, 47, 24, 116, -77, 106, 154, 289, -101, -21, 1, 69, -295, 194, -61, -46, -72, -271, 57, -9, 177, -103, 81, 23, -193, 136, -40, -151, 98, -11, 150, -174, 44, -1, -158, 54, -90, 196, -83, 186, 369, -6, -153, 145, -105, -125, 229, -44, 134, 148, 36, -148, 187, 44, -202, 128, 129, 93, 367, 78, 117, -50, 227, 164, -19, 8, -130, -121, -31, -76, 44, -128, 257, -88, -17, 226, -24, 50, 44, 100, 4, -9, 109, -121, -186, 64, -272, -480, 164, 80, -34, 128, 219, -184, -45, 9, 218, 49, 90, -44, -121, 342, 58, -386, -23, -98, -80, -31, -104, -55, 205, -58, 107, -53, 277, 325, -158, 106, -2, 85, -345, -40, -107, 96, -218, -423, -174, -132, -87, -92, 148, -186, -280, 28, 81, -73, 162, 103, 183, -123, 87, 32, 17, 132, -159, -90, -6, 128, 150, 173, 51, -30, 35, -135, 136, 106, 131, 87, -10, -63, -200, 141, 92, 290, 74, 244, -331, 163, -26, 243]
5034B43k56j45K7J41m29N62j76J24q6j31j46N8J95j78J31Q0j26m4L38j47J97j24
5056A08J44l51R5K9J10j57J5P3Mj4p8j15J82q2J4J68J00j17j17N8j10Rj67L25
5080A26J18j71K8j54K33j83j08K30Oj16N0N0Q1k68L42l24m5k4M34l44j03J99j4
5103D3j76L41l69J59K2J25l43Q5J66j76K06P0o6j56K03j13J72j06n0R5k01k2m3
5126a34K3L48k66J93m9r0j22K64j19k0l68K60N8Nljj48J51j00K08r8m8j08K68
5150A04p0q1K08K3j87mJ14o5j65L00k86Q0J86j76l7Q0M5j82j52L05k4LL3j17l8
5175a03L2k1Q9K1L19l28r3J74M5k26M1K18l26J44Q6j76L02J24j34l99K66j89m
5198a38J85Nj93N00j97j67J89k77j9k3J12J35j0K3j35L13k06j14L7j72K64l29
$$ y = [243, -13, -158, -131, 10, -419, 143, -33, 91, 5, -126, -272, -214, -19, -197, -66, 14, -112, -156, 182, 35, 232, 108, 252, -99, -4, 25, 135, -22, -7, 66, 70, 56, -22, -137, 45, -37, -23, 145, 245, 128, 11, 69, -41, -32, -199, 126, 244, 73, 101, -53, 180, -3, -111, 119, 125, 9, 59, 109, 190, -78, 264, -60, -105, -129, 305, -39, -142, 57, 43, -133, 208, -161, -2, 20, 145, -198, -113, 53, -123, 83, 153, 87, -69, 134, 21, 193, 87, 37, 132, -69, -91, -134, -111, 237, -29, 164, 115, 25, -97, 167, 48, 28, -340, -80, -22, -17, -20, -21, -169, -18, -118, 90, -8, -56, -164, 104, 34, -47, 161, 184, -3, -7, 107, 42, -123, 177, -109, -29, 157, -19, -56, 24, 69, -113, -265, 40, 16, 19, 52, -65, -103, -71, -92, -3, 18, 337, 9, -84, 90, 135, -91, -50, 168, -158, -14, 72, -104, 198, 322, 188, -211, 55, -134, -138, 47, 52, -141, 359, 162, -5, 184, -93, -112, -135, -23, 112, 102, 125, -10, 303, 97, -17, 20, -152, 112, -217]
5220b17J02J12QK02k44L49n01J15J69k00L10k88o7R6K18j68j47Q5m2J75m3J36
5242A60l58J3J55J53K2j11P8k93L65j6k54J38J51j66J06om4Q0j56J2p7j4L1jR
5267b3J94n09K77J83k38J44R2K3j85K36l43J1K1j0J86J45k42j84J9L50M8j49Q
5290E4q3J52j80J60k90j9J56JJ53j50k43M01J0J08n1j02M9j76J67k59L18k78J75
5313G3k23KN5K77n46K83K52k67L3J54j11L32m14N7j85L91o9j03N6n8rj07Q3r5
5337a39J79J37j31J47j28j21L08k16j94mM3K30j14j44J20J07r2R4J50k26K10m26
5359b10J70KM04p40L41O5j16Q9N6j22j90N0K46j88K27J37l30J64N1J32k52L3J06
5382A25j89j63M71j42m9K5j12J08j43j3M3n9J74j07J84L6k76J24j6K6m1j20J39
$$ y = [-217, -115, -3, 5, 207, -37, 312, -189, -74, 95, -105, 205, -83, -150, -54, 164, -4, -151, -66, -108, 67, 24, 160, -198, -185, -30, 123, 145, 34, 112, -181, 184, 168, -86, 52, 203, 37, 143, 137, 93, 173, 17, 29, -48, -62, -31, -32, -23, 171, -338, -61, 122, -116, 28, 120, 143, -42, 194, -149, -138, -117, -127, 59, 204, -38, -222, -203, 147, 195, 46, 54, -29, 123, -57, 103, -187, -206, -50, -49, 104, -46, -289, 112, 122, 230, 179, 77, 126, -50, 117, -142, 176, -102, 73, -150, -148, -93, 184, -362, -79, 173, -94, -61, 93, -18, 314, -100, -43, -228, 163, 94, -9, 47, -11, -20, -127, -44, -139, 40, 177, 46, 193, 65, -56, 252, 36, -158, -162, -119, 111, -3, -147, -27, 80, -12, 82, 232, 6, 216, -210, -40, -38, 366, -374, -33, 32, -84, 5, 61, -61, -251, -201, 45, -143, 84, 221, -109, 55, 106, 238, -14, 19, 125, -64, -227, 244, 102, 53, 78, -34, 74, -69, -82, -39, -98, 76, -31, 153, 189, -87, 37, 21, 47, 6, -114, 25]
5405B5k82K42J31l45M7J68J5j5R7J87l68j05Q7O9P3k06J76qJ27q8k8J01l49J06
5429a43J60j16j82L65p7n0j3NJ9K95l82K48j58J04l7j52K93l83n7L36k02P4J58
5452A05K1k39mJ62Q9J2k01L2p3P7n7J3L79j82q5J16j55K8j74K15Qn1j27m2K03
5477G0j12L00k51K2J0l28L85k07K58r4j00J8R3r4j14J95r6P5j58M36k73l0P9M1
5501A25j3M9j72J23n3j7J45k68J84j7l0j93J45o7K71j28k68O9o8K90n6m3J8K68
5525B94l32j53J33k8K43l0ll8N7m3j55K98j26n28L55O2j66O0Q8LJ00L5o1J31L0
5550B26m32J16N5j88M28n8l64%J75p1J94J60l26J6Q0J42j47n7J04j78K23O0l13
5573a55K09r5J69L4l9j0Q3j51j33K30j43O7P4l08N11k28j67J67m0j59M0N3n9L63
$$ y = [25, -257, -15, 116, -229, -182, -14, 1, -14, 83, 270, -98, -203, -116, -47, 26, -180, -4, -12, 115, 27, -1, 100, -249, -143, 17, -99, -281, 84, 7, -43, -56, -51, -32, 263, -119, 129, -29, 75, 38, -114, 179, -204, -261, 75, -127, -53, 105, 126, -113, -117, 45, 134, 146, -55, -23, -96, -19, -76, -63, 316, 134, 49, 165, 10, 38, -136, 79, 87, 36, -91, -133, 70, -42, 258, 7, 29, 39, -289, 96, -111, 147, 53, -47, -29, 64, -30, -144, 51, -45, 30, -128, 308, 35, 5, 84, 125, 112, 161, -11, 112, 59, 42, 187, -81, 103, 86, 56, -137, 8, -59, 212, 84, -184, -115, -183, 107, 51, 8, 26, 294, -38, -191, -58, -86, 157, 127, 124, 86, 143, 100, -55, 243, 117, -411, -56, 6, -160, -100, -12, -9, 91, 126, 65, 196, 226, -206, -90, -35, -223, 205, 147, -217, -217, -42, -113, 81, 241, -85, -69, 11, 153, 6, -51, 53, -125, 98, 158, -155, 54, -41, 128, 162, 123, 113, 196, 45, -88, 142, -1, 66, 140, -168, 343, 115, -52, 115, 75, -84, -44, 9, -50, 313]
5597C13k64n5m6j36J65r5MQ6K40k16k26J24J65k12Q8n5K11j10K0J05j06J48p3
5620G5j71J96k48K19k28K7J93l1j47rK11K6k66L90j45j65j9J62Ok03J12R4Kj05
5644b4J00j33K01m1m79L84J19k12L13k08P3j63J37j68K7K61N4l68K76k0j81Q2
5666C0J00L4l9k41L40L3l05O0J96k90P0j8J65j54l9O2jP5N8j99QJ33J55j70j54
5691i1Q8q0O9j04r2Q2L08L2k83K83l42K55m6Qj85k5R8R7Q7j72K5P8J8J4l6o2M2
5718F6m74L86J54l9mj18o3j46L3M28p8k5k17J29j19K2J17M6j67J75mr6N2m0J8
5743C6j72L79k99l4l0M2m5J30k3j84L79k75Q0J26j17L8P3K3j06q8K26K8j09l4
5767D4j26m6J80j0j27N5J72J4r8K47m82J80k2O7j25k6r1L2M20j91k25K88M9l17
$$ y = [313, 49, -6, -52, -188, -23, -118, -114, -28, 212, -4, -230, -106, 59, -153, -65, -120, 91, -19, 1, 106, 0, 148, 75, -96, 100, -148, 71, -157, -130, 63, 32, -115, -124, 87, 113, -153, 237, 92, -73, -92, 70, 76, -127, -15, 79, 81, -24, 76, -57, 144, 103, -376, 8, 127, -85, 228, 20, 93, -70, 67, -101, -74, 187, 241, -127, 149, 129, -52, 30, 130, 164, 125, -116, 224, 257, -48, 12, 208, -82, -12, -30, 135, -19, -58, 4, 3, 78, 136, -63, -55, 78, 233, 63, -91, -3, -83, -14, -118, -210, -128, 180, 212, -71, 212, -130, 125, 79, 87, -98, -123, -25, 72, 159, -13, 12, 90, 108, 122, 86, 24, 66, -408, -22, 132, 93, 89, -29, -92, -238, -205, 223, 145, 120, -97, 32, -87, -65, 52, 98, -69, 106, 102, 6, 58, 18, 36, -136, 243, -56, -90, -120, -78, -123, 7, -16, -200, 179, -96, -16, 110, -7, 31, 104, 127, 21, -67, 159, 187, 78, 44, -82, -128, 52, 42, -85, -30, 142, 156, 58, 305, -177, 3, -19, 48, -77, -103, -194, -162, 258, 67, -158, 130, 179, -138]
5791a38K40J5j27j47J22J9R8K8J63k18O3k6O4j91J22Q6j89j79J45N8%j39L2J13
5815A4J53l37J40J56m8r7Q1P4K1l64K0K36l8n0J72j00m5k31K0L56Nk16m0O0J50
5840I2k30J40q9n0k7L1K39k57K84k05L67j77J90m45K92q8K2N9j9j36n4N4J98k09
5864a8p4K19j85J42j50j57L3J36N2j6K2J13q4j2N6l7j20J06M4k85J58J08l2k5
5888fj24jJ38Qj8r0K40m2k27J22j21j42J78K9O8n4q2j22K37j46K29j00K04k09
5912c1J00Q8k96K59p8j80K6J60q5J31rM6n0j7P7o9J01l70M11j37k59L67k89p0
5936a74n0R2J19l2J17j29p8J08j6J06j55J39j50M4O6KPK01l01O4o7J16k20L01
5960A10j46j27K60r8o9J18j92pJ38K7j81K04m3R1o4J4J9p1k13M73k10l6l11K69
$$ y = [-138, 102, 117, -10, -157, -35, -16, 82, 110, 273, 55, 118, 92, 156, -35, 87, 173, -16, -195, -50, 8, 8, -131, -99, 14, 167, -170, -30, 126, 78, -19, 62, 136, 157, -207, -187, 49, 11, -39, 133, 33, -12, -243, -223, 133, 138, -78, -118, -58, 92, -138, 2, -87, -137, -164, -133, 106, -151, 133, -72, 295, 118, 308, -137, 155, 67, 89, 148, 129, -7, -61, -7, 191, -18, -92, 127, -58, 84, -66, -223, -190, -54, -2, -18, 4, 117, 33, 21, 77, 40, -80, 26, 70, -215, -57, 51, 19, -6, -130, -131, 7, 15, -3, -93, 147, 105, -122, 0, -121, -263, -85, -56, 12, -42, -124, -246, -9, -155, 74, -26, 178, -31, 69, 157, -139, 120, 42, -138, -112, 48, -37, 94, 85, 131, 81, 64, 141, 72, 173, -197, 214, 77, -182, 185, -104, -174, -224, -132, -13, -45, 72, -57, -135, -27, -43, 63, -92, 47, -103, -59, 7, 9, 16, 217, -84, -20, -87, 29, -191, 110, -36, -163, 97, -1, -70, 48, -144, -151, -13, 14, -167, 37, -6, 85, 21, 35, 54, -17, -230, 243, 33, -3, -314, -45]
5984d5l0K36k18K15r6J03k14q4J28j52K0J56J21o9k97J65jJ16O1J9j18l4J07J54
6008B43j91k20L89l48R7N3j39J85l94J74J70R2k06K65l4j49j10J90J21j03j22
6029c7K7P9L8k20M8M0k19O04l32Jn5N9K1j56J18n9K46j20j3k45J65J35P7j47j7
6054C8oR3l03K95j10j25k7O9M30m38p4J44J52N1j77n9K9J26P4n9j17J0q2N8J24
6079A16n7j84J50o6j13J80Kk86J82K48l70J70L8J30k28Q5l4j2j94M39J7l05J94
6102A02O4j1k0j41O5k48P9J20K4oj8l4o0L9J2L3j4J37Jj30J5q0j6j66jL07j4m23
6130c84J56K92m1N0N8j23J79k23J97m7o5R3k33k4J38nRP0k05O6J83k17J11M2j7
6155F0q0j78J03J8l8K70k34j61J39N5N5J38k21k11J00j95M11M3q5J5q1K14p2j14
$$ y = [-45, -75, 161, -57, 158, 62, 165, -49, -133, -5, -157, -137, 19, 140, 71, -226, -61, -62, 54, 115, 134, 16, -18, 89, 243, 52, -168, 221, -127, -30, 23, -116, 69, -325, -151, 19, 111, -95, 170, 136, -13, -123, 67, 188, 85, -37, -10, 69, 107, -113, -65, -25, -244, 360, 28, 29, -26, 33, 54, -102, 16, -43, 203, 83, 70, -175, -10, 125, 202, 55, 38, 32, 125, -178, 117, 7, -118, -145, -76, 354, -84, -158, -14, 138, 189, 12, -47, -18, 108, 182, 123, 6, 16, -66, -8, 116, 59, -125, 25, -41, -154, 26, 28, -258, -76, 172, -198, -28, 10, 140, -88, -3, -37, -49, -243, 196, 213, -92, 102, 166, 155, 135, -6, 59, -189, -110, 10, 34, 28, 10, -24, -84, -45, -33, 0, -14, 123, 124, -6, 9, -71, -87, -253, -254, 53, 39, -384, -228, 64, 23, 73, 131, 8, 187, -36, 161, 114, 49, 142, -91, -115, 23, 18, 27, 97, -108, -42, 141, -76, 35, 77, 60, -20, -198, -95, -77, -115, 155, -79, -240, -101, -46, 9, 147, -74, -285, -185, -380, 31, 74, -11, 4, -77, 137, 65, -49]
6179d9l7k07K68N4o4l9J06K27j55j59Q0k00M39l39J21k61K77mj11J94k27Q8j34
6202a32R3K21k78K78l53K57k11jO0J60j09n9L3M42m09k41K50J5j00j3J39k04J72
6225A0j16R0O4p6L18j71j76Q1n8Jk41J16J88J71k15M%lq4K27j76N0J4R2j69K72
6251B13k00l78J52K41Q0j18l3j39M76l88r7J26K82k43k14M08j71J10j12J36j86
6272e5N1J42k6j01J2J99j50j63P9o4J24J00m15L58j54R8P8l80R9o7L55k2J1j29
6296b0K58%l59J55j15J21P5n8J44m70J35O2O4K47l60m4J89N8j19n7J48j5J56J5
6320B10J2r4r1j32J42j23K40l49K35l20j05M87rN4n3O8k21K81j10j58J30L7j13
6343A8O7KP8k38J03k4L8j74K26O2j3N7m78L36KOPP8l28J62k62L31P3l41K95q6
$$ y = [-49, -86, -293, -25, 29, -35, -74, 32, 259, 104, -55, 25, -175, 264, -75, 46, -215, 62, 58, -53, 141, -86, 2, -132, -39, 182, -96, 182, -171, 86, -125, -126, -66, 94, -15, -74, -41, 401, -8, -249, 1, 16, -84, -97, 42, -162, 10, -106, -16, 48, -28, 290, 119, -57, 24, -34, -33, -274, -158, 30, 201, -14, -10, -10, -13, -97, 130, -46, 4, 18, 110, -59, 213, 13, -365, -213, 28, 108, -10, -43, -182, 294, -94, -191, -65, 217, -26, -240, 168, -3, 107, -5, 131, -55, -4, 138, 112, 11, 23, 222, 72, -91, -12, -76, 48, 148, -267, 91, -63, 35, 113, -267, -168, -235, 120, 98, 109, -20, 238, 238, -121, 34, -81, 40, 115, 57, 201, -269, -134, -72, -8, 239, -121, -165, 24, 82, -37, -94, 54, 39, 195, 210, 222, 128, 37, -95, 47, -76, 164, -185, 50, -270, -375, 112, 103, 157, 104, 172, -49, 232, 122, -36, 94, 131, 18, 85, 87, 165, -73, 30, 6, 44, -130, 96, 158, 145, 202, -276, 60, 62, 68, 75, 153, -175, -13, -275, 56, 129, -212, 83, -3]
6369cl2l0j24o5K10n8r3m3K13M9n0R1j11K6j44K65r6k1J68R2k41J60l16J71q8
6394g0QL09l71K4K63m8r7M6k5j50K20j12j13Q4Rk7K32k89R3R9j73K6l5M57m00
6419d0K0M9m5j19J26rJ28l1l14K96L5j46j51K22L0l5o5l5R9k5l1K8j98L48k29
6444i2j87M56k99l5J59L7R0m3J47j56j98k1J15l8M3r4J4n8K87k90J02O5j01J42
6468D5L2j98K92k74J47l0J44K5p0k73R1J05oj41L7J46j3o4j32J62j63J04J49J2
6492A27n0k52M3R0K46l17L30k61J4J54L6J00r3m3J16l76K06j98r7J94oJ02k83
6515b18J17O4K71k23J76l19L04k24k3j27M34m7k21L50n52L57L8j04j78J49J44
6536A68k25j13M49k18o2M0j52k30M14J01p1k13J39L8j39J11m9j82K05k27J21k6
$$ y = [-3, -35, -65, -189, -254, -44, -102, -195, -238, -25, 24, -26, 65, -46, -20, -164, 101, 5, -16, 152, 244, 3, 163, -153, 18, -70, -62, 247, -124, -100, 163, 115, 18, 64, 39, -111, 109, -3, -116, -32, -23, -50, 182, -107, -14, 85, -88, -62, -97, 360, -40, -20, 29, -16, -135, -9, -18, 110, 79, -235, 61, 96, -50, -201, 21, 51, 16, -49, -84, 15, -10, -41, -13, -211, 137, -92, -279, 177, -122, -157, 2, 39, 129, 86, 233, 77, -121, -142, -27, -65, -22, -116, -102, -160, 127, -163, -61, 4, -97, 45, 77, -121, 171, -103, 44, 14, 158, 183, 113, -160, -69, 36, 30, -111, -74, 72, 59, -5, -137, 25, -138, -34, 115, 127, 77, -175, -132, -42, 204, -113, 217, -44, -30, 124, 160, 260, 167, 124, 240, -136, 70, -128, -225, -31, -37, 65, -218, -101, -37, 234, 11, 187, -132, 172, -52, -75, -202, 232, 185, -36, 314, -238, 119, 157, 53, -125, 24, 168, -57, -170, 279, 61, -1, 39, -113, -343, 71, 172, 101, -112, 27, 65, -74, 37, -12, -194, 11, -216, -95, -121]
6558a21R9P3l13N16k85j3J15m2%j16L63k85k31J80k00L69j85L19l18P5L07l29
6580b2q8K0J18j9j95Q4R0p6M72l41L61m10k6K02j50j51J3K79k56K5j16M06k83
6603f3J15J2lJ58k82K11j64J3k74L6M27l75L04l54L82k64o2J4M72l87rK11j73
6626e5j73o5L04n5K5j0J71q7lpk6o1j90M07o1k18k6J17Oj1k20M08Q1j47PL3J61
6653C05l80K40k61J95j34nJ11j44J37r0J11p7Oj11J71r8j84K12m5j48K83j99J08
6676CQ6j57J86l69J62R7q1L10k50J45K6j36k05K81j14Nq6Q6l8N1j44J75K70l74
6700g1p4K06j87p1K46j15J55p9n9K13k72K68p3q3q5Pq5p4P2J45Q6k18k36M71j70
6725h3N17k68k07O4L65l11k7%j11J71j6jQ4k69J49Ok01J21J71j11Po8l1J95J76
$$ y = [-121, -22, 51, -262, 254, -31, -44, 71, 29, 29, -87, 276, -9, -240, -60, -260, 109, -76, 243, -75, 0, 307, -22, -110, -90, 28, 9, -186, -102, -12, -88, 384, 43, 404, -6, -32, 170, 20, -131, -118, 161, -95, -70, -186, 220, -63, 52, 64, 61, 219, -63, 148, -16, -3, -277, -241, 186, -189, 115, -239, 143, -121, -183, -169, 303, -84, -93, 118, -55, -228, -293, 11, -44, -19, -29, 142, 55, 52, 45, 19, -42, -232, 175, 114, -104, -130, -13, -7, -18, -238, 170, 251, 104, 111, 144, 305, -75, 165, -96, 99, -35, -40, 71, -73, 64, -26, 85, 8, 14, -97, 74, -24, -208, 4, -41, -189, 94, -105, 3, 89, -68, 118, -251, -89, 8, -73, 237, -13, 132, 158, 22, -183, 98, -16, -11, -97, -11, -49, 2, -142, 33, 303, -71, -145, 61, -126, -197, 49, -66, 89, 10, -49, 164, -108, 160, 87, 4, -81, -74, -159, -233, -161, -16, 70, -148, -384, 87, -83, 434, 166, -41, 23, 388, 77, 50, 50, -61, 110, 94, 93, 177, -92, 57, 63, -138, -17, 154, 43, 50, -18, -49, 146, 322]
6750C22k47m8nN8j49K3k1k1j8K90k94J9n5M9J06J38k17J08R0K0j04J09P9l78K17
6775G1J6J58l08J10j36j16J67K29j09jJ86k50J23p6j81J71J16j53J59J60l75o2
6797a01pN2j21K48k29J12j0o3J24K69m15L25j80n2J21o4k1P8j4L15k31l25M89
6820C00l53K38jj83J62j87q7J57r9J88o4l49J25L31j24j11K47j25n1r0K02j92
6842f6K00j36j37JJ34R1p7p0jL09m07L88l8k18n0R9j30K30r5j16K29k78J28j2
6866b2q4K22J9j32P4j98K09P4j73K26M1k31J61l87K66k0j50R2l3j26K84j59PN6
6890A6j34J16l4P4j45M3K03j64P6O5r7j02Rk56M39rl21L58j54L0l7o1K83n06K49
6915e9K9j23j00J17m2K02Q9k4q6k03O7n3J58J46rj43J52n3j10J96j63p9N9R2j78
$$ y = [322, 75, 27, 22, 80, -69, -46, -67, -88, -106, 184, -110, -91, -146, -97, 9, 147, -70, 38, 128, 148, 44, 153, 232, -146, 71, 87, 245, -63, 47, -89, -205, -38, 191, 82, 81, 267, 17, 140, 64, -117, 54, 170, 17, 176, 336, -39, -101, -108, -56, -177, 71, -158, -46, -56, -119, 5, 274, -141, 184, 4, -48, 73, 9, -12, 66, 52, 367, 136, -189, 300, -53, 185, 184, 1, 163, -24, -111, 46, -53, 135, 71, -278, -153, 178, 54, -57, 190, 65, 14, -76, 126, -66, 134, -2, -139, -138, -4, 87, 10, -60, -61, 248, -159, 229, 191, -27, -77, 22, -108, 122, 27, -89, 140, -138, -10, -22, -106, 116, 135, 3, 77, -121, 88, 162, -11, 215, 256, 25, 186, -201, 65, 45, -105, -13, -46, -172, 112, -47, -40, 16, -118, -2, -36, 38, -107, -64, 139, -25, 51, 116, 19, -83, -74, -330, 109, 100, -221, 137, -17, 13, -24, -85, 198, -308, -59, -30, -153, -253, -136, -178, 24, 113, 89, 3, -200, -133, -186, -28, 118, 109, -34, 118, 65, -45, 151, -12, -91, -32, 60, -118]
6940a18p6L34q0j17M41j35l02j5J96k06J97j3j67K01l11K25L3k5J86l24j04J83
6962Cq7L82m03r1M06l77Q0j0qK37l06K21k2J15j84N5J08j75J03J19l42J42k12
6985b46K14p4j6j39J15J91k66L15j84n2J09K58j50P6j95K35m42L80j14O9j50J83
7007A17J1N3j69l74J50K68j50k1L03j12J11k81J30j7J2O6j45J3K38k0j68k13J57
7030d1k3R3j70O5k6K1K97l91K56j78J07j41P0rM8j04J02L94k98J9k32J89J34k57
7054g5J27j81j82M61m2m8o6k29j8L14J29k06J4R5q7R7Q7k41J18j02k6L5K76k4
7078B26n3j67J43k53k2K39K35k41o6p2p5k1K01j9m1J58j13j81J81j11J74q9j92
7101a59L37m41J48J08j3j42N8O6o8MK37l41J35j0J12l0m2J44p4m0L8K28k19r8
$$ y = [-118, -194, 140, 60, -57, 384, 249, -53, -68, 128, -78, 119, 106, -61, 140, -171, 54, 87, 62, 248, -76, -180, 3, -84, 298, -105, -196, 210, -167, -87, -97, -105, 132, -174, 47, 25, 140, -44, 11, 119, -56, 47, 166, -176, -34, -246, -32, -106, -122, -261, -146, 45, -221, 94, -90, -142, -33, 225, 75, 151, -44, 191, -251, 129, 15, 84, -66, 117, 128, 181, 12, -362, -212, 56, -94, -115, 188, 76, 187, -94, 36, 19, 31, 97, -48, -35, 203, 183, 15, -198, -41, -64, 29, -141, -76, -102, -81, 216, -175, 81, -97, 10, -131, -61, -70, -22, -126, -24, 370, 72, 91, -141, 48, 182, -75, 52, -129, -311, 150, 108, 60, -6, -235, -253, 61, 190, -16, -2, 93, 6, 103, 190, -51, 67, -35, -61, -26, 250, 226, 173, 6, 149, -104, -126, 113, 348, 107, 41, -31, -106, -127, 74, 55, 14, 172, 59, -122, 59, -52, 122, 33, -159, 178, -263, -115, -7, -20, -162, -104, -38, -106, -102, 135, -206, -71, -81, 31, 1, -41, 103, 29, -11, 27, 255, 36, -62]
7125f2L4K19p4R1k18j38J44J45j41j87J13J78RL9j16j87L19j27k90J60J88k96
7147a97O4J12j72L60l68K76j96j24M00j84J00M9k68l0N9K36k74K45n9L36o03N29
7169B91m18J91K08l11k5L1L8j81K12M30m50M8K58n05J30J07r8k56N73m41K28K2
7191H2k6k01J80Jo1l0K67l43J15J95k07j50J73J70j18N0j64L1J54P6m9j31k7j32
7215a45N0J07k44L50r3j88J91l6m9J07k7Lk30MK97M1k62K22J09l1k72q7J62j6
7239c7J42P7j71j5J26j48j13K61k83J70j6J9j54L55l14k9J56j70j7L03k59K3J79
7262H5K10l02j13J66o0m1J06K30k53J01K3j67P7j0o4J40m13J12l5K59L00j06o08
7285c63M16j56J46K1l8J50j17Q1l21K87j00j32K6J21l5K44k02j8j3o6J45q6K92
$$ y = [-62, -28, 191, 117, 208, -10, -148, -4, 141, 0, -187, -74, 104, 113, 152, 36, -151, 168, 41, -249, -89, 99, -197, -133, -21, -193, 167, -201, 75, -121, -245, 155, -29, 71, 120, -148, -178, -119, 117, -157, 88, 29, 365, -238, 291, -127, 64, 272, -39, -64, -33, 5, -176, 36, 466, 16, 64, 322, -183, -53, 54, -44, -300, 273, -168, 60, 82, 56, -145, 35, 36, -25, -55, 212, -131, -16, 179, -28, -178, -5, 165, 47, 97, -67, -36, 118, 194, 145, 14, -13, -145, -95, 12, -232, 118, 25, -163, 28, -8, -57, 50, 23, 26, -204, -200, 97, 138, -124, 98, 207, 176, -96, -183, -21, -37, 105, 182, 11, -4, 122, -26, -139, 122, -161, 9, -7, 12, -142, 213, -101, -130, 26, -144, -161, 142, -117, -94, 85, 295, -7, -120, 46, -14, -55, 51, 281, 28, 129, 152, -15, 62, 52, -12, 128, -285, -173, -208, 51, 351, 245, -363, 53, -103, 43, 64, 26, 176, 59, 140, -181, 106, 6, -126, -100, 21, -14, 230, 28, 10, -3, -69, 76, -10, 282]
7308B82N9k98n7J42P5j22L5k16K8K99k90R7J27j98m4M8J41j84l0L69n69K82L5
7331A1K79m26K05m0ljK6Q7nn4j46R4J50q9k08P3Q4k20J28j12mL44mj76K2L08r6
7358B27l33K83J8k05N6l1j97j21M65q0k15J15n1n6M3J99k26K51m99L64J39n9j31
7381d4m0M8Q9j17n4O4P5j40j05j28M29R5j74M4Q6j20j6j09K01Q4k62M0J62L8m65
7406c19J91j10L13j4j07rN9L7j78P5j66R0N7k8L42l26P5j60K52rk49M91k32Q3
7430A58R2m70L67k79l1J67Q1j82nL01J63k31j54J29j35p7K4J20Pj63N3J73j79
7453g1J62l11K21j7n6J60J2pJ39m17J30j25K06j76K29k25K13k09N18l46J95m9
7475A76j42L57o57J09J85mL1q7L35k76MK28j53j31J68j30J20j47N3L7q6Lj1o5
$$ y = [282, 341, 43, -14, 128, 203, 81, 116, -100, -72, 227, -63, 34, 161, -37, -81, -33, 108, -76, -106, 263, -306, -24, 11, 290, -136, 69, 29, 26, 25, 51, 138, 133, 79, -67, 27, 177, 88, -120, -47, 37, -183, -55, -167, -171, 173, 169, -7, 15, 323, 227, -106, 177, 195, -10, 46, 15, -182, -303, 162, 82, -133, -18, -69, -125, -82, 117, -109, 142, -357, 7, 146, 87, -44, -84, -36, 53, -64, -118, -54, 21, -119, -224, -352, 77, 172, -2, 42, 128, 8, -8, -117, 84, 168, -94, -54, 108, 146, -319, -128, -238, 75, 61, -46, -55, 4, 41, -137, -62, -228, -138, -81, -109, 233, -93, -18, -178, 74, 65, -184, 307, 75, 158, 250, -220, 147, -132, -163, 4, 85, -97, -102, 199, 362, 131, -23, 106, -29, -106, -82, 38, 45, -118, -65, 108, -71, 91, -220, 1, -16, -72, 88, 100, 93, 232, -185, -55, -180, 26, -150, 79, -146, 67, -142, 376, 30, 225, 176, 34, 391, -266, -157, 28, 24, 55, -32, 303, 27, 31, 259, 106, -25, 143, 13, 133, -14, 39, 76, -10, -7, -18, -83]
7499h3J16oK4J64o36N31K04m20j5L44Jl11K8K74m94M29l80j2J29K12k79M8J11
7522b1o6Q8Q5j86r8K24j28Q7j46J03K31k97L38k37j66K39j36K32j56J42r3J15
7544A54j61r2L0J84K5j41N5K48k37Q1j84L67m38J07P4m5K08l63K50k63L8l8K18
7567G7J24j95J2p3J43r6N0O8j30K50j22j5j69j25J63Q8rj16K16k37J75j05J25
7590I9p0k9k6P3k93J70J06K8K8j26j33p8L07j68J32j11K85l25L1J41l7J40j43
7613Ap8J44l5r0%q8J38k20L13J6Q8l42K8J24Q6l68J87P2k7M4j9K0J30j08J34j2
7639A38j52j39J97N7j6n5J60j71l4J20k37R7j12J32q2J00jj8J32j48P0j0k68O45
7663D05l65l6J08r0r1K65l61N3K30j8j04O5j16n0k3J37k3j53J62J91l88K13J95
$$ y = [-83, 33, 27, 51, 215, -421, 110, 314, -106, -121, 223, 224, -87, -59, 215, -279, 150, -230, -242, -113, 99, -180, -132, -21, -87, 1, 86, -100, -198, 26, -102, -15, -161, -58, 173, -124, 214, -23, -189, 50, -86, 146, -10, 132, 39, 154, -7, -99, -69, 115, 140, -1, 54, 302, 65, 146, -38, 329, -109, -2, 72, 27, 235, -128, 122, -141, -103, -141, 77, 201, 6, 18, -55, 88, -8, 42, 110, -20, 230, 108, 93, -76, -201, -38, 50, 41, -75, 141, -96, 79, -26, 99, 29, 0, -26, 47, -246, -76, 30, 58, 86, -40, -173, -251, 56, -112, 20, -91, 194, -131, -100, 41, 4, 144, 1, -77, 67, 32, -58, -58, -146, -8, -228, 85, 101, 189, -153, -125, -1, 85, -283, -96, -24, -51, -7, -26, -6, 124, 16, 150, 138, -14, -153, 44, 101, 85, 30, 190, 19, -15, 105, -132, -35, -147, -15, -97, 3, 2, -16, 116, -32, 38, 28, -240, 405, 40, 4, 112, 22, -69, 196, -165, -112, 118, 100, -4, 61, -55, -105, -128, 9, -14, -167, -5, 186, -202, 11, 206]
7686B06l35Q2L16k76j00J69j73o1K35p4Q9j94L94j05k64L58k94J07n2p2J36k21
7708a29J96l2j00L4R6n5j55L10k2n4p0j70K96j88L0N2O0j14j76N4N2N8O2rJ43
7733A69k39j17K98r2j78L11l04l8r7K23K9J41k38J14j73K69j19J3n5LK35k25J45
7756G5j11K95j11L9Q2j17k49J48j25M4N0J7k22p9N40j16k97J61R6j79K67l70r3
7779b55J28R5P0k01N2K17k61K53j40L1K3J69l47N1K85j68j3o3L2r0N2R0J3J3K8
7804F4N8l2o4p8K2lr8J85O8k03L3K04m4o5P0j28n5J38J51l44K08j3j07K58j34
7829I1j34J71k22K26j90O4k72J58j1K34j38KQ2m5k20n4M81n7j52Q2K9j59M1n3
7853d6K29j97J05K12k69m3R7Oj43k0J53M4k89K5p3M54r0k74N2J12k89K48k10j4
$$ y = [206, -129, -47, 269, -7, -107, 62, -111, -172, 63, -11, 78, -116, 278, 173, -91, 267, -27, 80, 28, -44, 92, -129, 67, 35, -65, -31, 65, 10, -145, 165, 143, 89, 19, -151, 145, -43, -13, 39, 99, -15, -191, -137, -85, -27, 35, 26, 169, -70, -187, 111, 19, -159, 152, -152, -190, -287, -64, -35, 106, -132, -18, -191, 78, -41, -28, -83, -80, 155, -70, 75, -36, 259, 148, 187, 269, 152, -97, 51, -74, -30, 20, 37, -185, -264, 276, 160, -137, 24, 120, -59, 208, -162, -255, -127, -32, 38, -163, -111, 106, -155, 98, -42, -11, 12, 181, -166, -115, 170, 2, -11, -74, -42, -132, -80, 10, 23, 36, 64, 122, 90, 26, -52, -30, -33, -131, 54, 122, -81, -48, 156, 112, 47, 117, -11, -66, 72, 223, -121, 87, 74, -33, 225, 91, -43, 128, -94, 132, -58, 6, -266, -108, -119, 115, -23, -21, 61, 16, -204, -258, 223, 166, 14, 96, 125, -34, 7, -46, 183, -14, 91, 303, 34, -9, 88, 94, -49, -69, 84, 128, -161, -136, -209, 245, 155, -119, -67, 45, -244, 4, -206, -220]
7877b20L64k27o2K53j14r1Q1k6j97J75R7k79J20J86j27K98k11r6j27J09Lj27Q2
7900a36o3N06o62M41j97K6P0j05J43J70j23k46J70Q6j19R3J08m15O9P4J47m2j5
7923b0r9J22m5j80M23j14m1J07l03Q3O4k8J51Kk1j01K60kl29L29j47k00K77P4
7947B62j97M6j70O7k7K40k74j10J86J46n8p1q7K47j81M7k05q8K15J44J28m1j00
7970A19l68M31j16J4j18J46L1j62K50k17j7j14P1J11J14l84L46l21L36m0j80J10
7992D2l34K79j43J50l7J48j51J43j86K95l92L2K23k28J83k2Oj07L53k98J40N6
8014A52R9j18m9mj85K8Q3j71Q8Q0PJ13j11J81l97L49J7J6l11K93j39m6J2Q8l51
8039b76L20J45k86J6N0l9j9P6N4j53N1J50l81K06o8N13l76l3M7p5K16j77n9P3
$$ y = [-220, 144, -83, -145, 108, -6, -97, -16, -42, -239, -64, 33, -246, -126, 60, -67, 231, 20, -76, -203, -94, -91, -218, -136, -199, 307, -355, 86, -111, -85, -15, -120, 23, 193, 70, -176, -6, 80, -39, 54, 162, -253, -184, -110, 37, -5, -20, -119, 3, -42, -222, 201, 87, 46, 153, -150, -67, -3, -31, 120, 122, 101, 0, 260, 258, -71, 258, 111, -89, 188, 262, 65, 111, -59, 8, -19, 221, -53, -163, 23, 169, 111, 40, -47, 200, 19, 66, -139, -227, -12, 132, 260, 219, 119, -249, 182, 66, 80, -38, 108, 139, -23, 227, 10, -7, -121, -50, 61, 175, -209, 137, -184, 152, 112, -68, 42, -292, -13, -156, -6, -43, 105, -46, 97, -89, 206, -186, -154, 69, -159, 24, 2, 8, -99, 254, -44, 96, 152, 251, 133, 84, 80, -105, -77, 6, -165, -77, 3, 10, 123, 12, 193, -204, 145, 162, 178, -133, 160, 21, -25, -13, 75, -276, 44, 189, -97, -81, -31, -70, -89, -13, 41, -112, -61, 89, -292, -86, -154, 359, -17, -50, -3, -78, 138, -39, -98, -25]
8063b5K59k61r3K67j82O6p2l4K7J16Km5n9mj10nJ08L06j49j05O8p4N8m1q0J48
8089H6Q8k78J78k78p8K52N7j10N5O6j85j6J10J9k34K01L65l42o4J65k12O3q8K57
8113G7j21m9Q0K30q2j2Nr3J4o6N2p4K23k44J18k38K17K2l9J87k99J52j20Q1K01
8138B22k54k0M28k01l56L62k97R3l1J47Q7j71L09k20j17r1K12j46Q9%k98L05o7
8161a5K22l00qJ95j84j43K06M7J18M8k17k7j07p7m5L64j5o6m9R6O5j62J33k30
8185a51J23k2OJ24j94J14
$$ y = [-25, 234, -27, -120, 147, -35, 31, -41, -75, -48, 68, 70, 25, -34, -38, -148, -153, -45, 261, 112, 7, 75, 1, 59, 18, -62, 86, 174, -104, 74, -204, -282, -30, 27, -83, -28, 38, -147, -163, -53, -34, -268, -67, 298, -44, -108, 57, -155, -92, -180, 77, -44, -93, -13, 217, 135, 123, 128, 35, 49, -17, 35, -39, 184, -60, 58, -180, 37, 59, 20, 207, -92, 60, -60, 21, 222, -32, -52, 376, 175, -181, 181, -116, -23, -54, 93, 180, 9, 318, 98, -19, -110, 102, -44, 45, 45, -253, 52, -15, 207, -93, -101, 94, -90, -233, -27, 20, 138, 186, -31, -58, -165, -242, -287, 77, 62, -4, -53, 43, 108, -54, 79, -151, -28, -50, -44, 80, -114, 0]
8191@
$$ Imaginary data points
##PAGE= N=2
##DATA TABLE= (X++(I..I)), XYDATA
0@%%%%%%%%%%%qJ6j6J6j6K4l2M0m8N6p1Q3r3J09j31J51j75K03k30K62k99L42l89
34b06M38m92N51o18O91p70Q58r52J055j171J297j430J577j741J918k112K326k563
52a344K825l119L447l814M233m714N275n935O727p698Q919j0510J2674j5801K0737
67A1902k9680N0783j89915r1567M74959o1860j68148J33366p0975k09259J88400
78C8006M4674j89327J79080J48563l79818q7315L21603m3378j37421J77841m3456
89B9052j46777J80716L1593k06021J53607J43596k95061o0993K87790m6467j32619
100f1584J30604o3375j35348J88574L4875j96087J22776J23835k58314n2001K43004
111G6959m1042j06558J23834n7589j14289J92490M6084j85574J03349J15324k17814
$$ y = [0, 0, 0, 0, 0, 0, 0, 0, 0, 0, 0, 0, -8, 8, -8, 8, -8, 16, -16, 24, -24, 32, -39, 44, -49, 60, -71, 80, -95, 108, -122, 140, -159, 183, -206, 232, -260, 291, -327, 364, -406, 452, -500, 555, -616, 681, -749, 828, -913, 1005, -1107, 1219, -1344, 1481, -1638, 1809, -2005, 2228, -2486, 2789, -3146, 3581, -4117, 4802, -5708, 6966, -8835, 11902, -17778, 33005, -156910, -248477, 226482, 164622, -3526, 129840, 58865, -150394, 38006, 82680, -106647, 72433, 220996, -158822, -246137, 75466, 32088, -105333, 72508, 29052, -117725, 62991, 94584, -111437, 42170, 185766, -109295, -170288, 117502, 71035, -61584, 69020, 5645, -129703, 58871, 93746, -102341, 20435, 144270, -114044, -166045, 76959, 35917, -70641, 53193, -4396, -118685, 73805, 119889, -65685, 37664, 152988, -64826]
122f4826m2368J93621n9923r9804R8811o6443j08329J77619N3246j65538Q8322
133D388J17080j64098j4379J65541o0805p8021Q7423p0192j05979J44756M2350
144F8064j54560N6966R8608j25525L71J38776n8184n4153Q9632n9267r2166J23918
156C2480L9281j34267L3735Q0591r6569N607J12682o0568m2344Q9462n2337q4615
168g6862J04728L3014j16218J8776O2964p2849R687R1572n6198k9984R1685l8341
180B1974p4133R0178K8776r8333Q415M3163n9905P222O5363n3362k4186Q4477
192C9649k4343o1286P7127L0417p5909P301L0267m6596O107M1901m9577k1186
204d6128O8861j5395n0901O1821L1782n4922Q892K4676l5306O118K5719m6837
$$ y = [-64826, -107194, 86427, 26504, -73300, 25511, -40932, -149261, 28358, 81604, -83934, 4388, 121468, -42630, -57009, 108532, 47727, -30294, 57129, -13063, -119042, 25714, 68064, -86496, -29530, 69078, -56447, -56076, 82700, 24516, -29637, 59995, 728, -91438, 32480, 71761, -62506, -28771, 51820, -44749, -39142, 73540, 12972, -29372, 60090, 7753, -76862, 27866, 60880, -55338, -36562, 26402, -46447, -36760, 54812, -1386, -31370, 60315, 21974, -52159, 38019, 66795, -31538, -23123, 20040, -39865, -32643, 32720, -20642, -44828, 39649, 15306, -45980, 31147, 61564, -14345, -7044, 23223, -23373, -17266, 24635, -24942, -46128, 22733, 7338, -43563, 18258, 50040, -4882, 4010, 28686, -6620, -502, 25217, -21620]
216b1620j9429M9900j3557m3902M4685L1376l8090J0475K6677k1761R979K0688
228C5421l8519j3699L5097j6375l8948K6354K0794k9811M432K3084j2726R240
240D344J8948k5921n182K8244j3445k7728J7779J4276k1399n0J7329o129L742
253D808J3153j6775l187J9135j4122k1773J0778O383j6324k841J3350J860L438
266b117J2339k323L241J7097q137j4702P596j128j7873r780J749k269m292K345
280a8254K605O331J4826Q99k618J3939N686j0029m194P48l033q284p103j454N82
295i353K388k222k275J0294O011o550L72N242Q12l045n423J774M575j259j940
310e99J036O470M150o316q32L800k981n644p868j897K930m928m654N086P705N226
$$ y = [-21620, -41049, 8851, -4706, -48608, -3923, 27453, -10637, -162, 26515, 4754, 14733, 35421, -3098, -16797, 18300, 1925, -37023, -10669, 10125, -19686, -15254, 7830, -4896, 4344, 23292, -2629, -7811, 20433, 6988, -20740, -2961, 11315, -10084, -10134, 7195, 1066, 4808, 17961, 1186, -2001, 17134, 3012, -18761, -7983, -1600, -17924, -20765, -7415, -5555, -2117, 10222, 7899, 11140, 28237, 20100, 5398, 12994, 11866, -6007, -15787, -14038, -16307, -20599, -18254, -15649, -9318, 5508, 6407, 3789, 17728, 23414, 13385, 9191, 9939, 6906, -1378, -8481, -9935, -9353, -6965, -9187, -11462, -1168, 4843, -1707, -1335, 3907, 4719, 1674, -3749, -1975, 2600, 1341, -599, 437, 6907, 11057, 4741, 3909, 7709, 4728, -916, -8784, -10681, -7751, -12679, -17333, -12247, -4542, 684]
326F84P87N075J0379J556k308k882l274k90q584j2677r42J007m468k987M311R100
342e513L675K504N768L211N494k59r062Q99K804r341p456J792J286k553k56K914
358d093P53M327L499o843J976P759p616n993O130pl304K542K515n85L899N490
374A0449o602j195Q075q758r555O041l015q647M767J028l854O630R569k499J348
389C782J1555l707p619Q758l974j3263M422k071j3272L622Q735n811k69J0759
403A647p50k358J3438l65j2100R204J251j7821K688J0231r377m604O180l189O5
418e860J4358j543j2237J2406N033j9549K498J4118r732p792L779n333L160J5728
432I034m625j1984J4015Q624j8935J647J6568q903j0725N58q055M813J6400r150
$$ y = [684, 1471, 6546, 16925, 18481, 16173, 13291, 10017, 9727, 1143, -11534, -12476, -11469, -15937, -18924, -14613, -5513, -1838, 666, 6434, 9645, 15139, 14880, 5818, 6717, 9521, 180, -7276, -5484, -4198, -6751, -7007, -4093, -3340, 987, 4486, -2357, -381, 7378, -238, -6231, -101, -108, -3412, -870, 1645, 1060, 4959, 10449, 3847, 2652, 10727, 1969, -7586, -1545, -4560, -13207, -8440, -7412, -11266, -4636, 4933, 2434, 3782, 15337, 11630, 4011, 12769, 8795, -4468, -46, -2117, -15389, -11767, -3032, -8843, -9112, 1647, 897, -1461, 11977, 11612, -488, 8716, 9967, -7854, -5166, 5065, -4312, -8916, -2736, -5925, -5860, 8498, 6955, -5282, 7124, 12157, -7392, -4894, 9224, -508, -8300, -4521, -9854, -6694, 9034, 4409, -7575, 6440, 15064, -3871, -2224, 14344, 5441, -5284, -4726, -12781, -7968, 8432, -718]
446g18j4325J5143J1264j5762J969J9176n821j1808j611q441O799J7805j3874
459b04j9845J5424J2339j2713J295J7846k083j0478k707p842Q055J9281j6854
472A514k5654J3056J3654r491J326J3722J089o226k975m661J1370K0461j7360
485I825k9902R052J4280q189k494O068m21k322l495k171J5211K1923j3743k9003
499a5381O413J8369k487n014j808l480j44m810m108J5191J8751j2231k7746L010
513a5475K1592M794o276p083m916M116j413l999J3866J6219j0048k3924j074K1306
527G685J1046r050j4746p105N101K78m941R790J2510p477j7143j723K1560K0091
541B5876p057j9088n964O936K595m531J852M344p754j4200o058J7663K4062n499
$$ y = [-718, -15043, 100, 11364, -4398, -2429, 16747, 10926, -882, -2493, -10934, -4135, 13670, -204, -20049, -4625, 7714, -4999, -3704, 14142, 12059, 1581, -1126, -8968, -913, 18368, 1514, -24140, -11084, 2570, -6921, -5595, 8127, 9216, 2990, 15, -4646, 6724, 27185, 9825, -20077, -11025, 3255, -4934, -7428, -1360, -1781, -4103, -7598, -9769, 5442, 27365, 13622, -15381, -8968, 9401, 6914, 1900, 92, -3388, -3532, -8342, -12450, 2741, 21492, 9261, -18485, -15475, 6117, 10911, 4635, -2448, -7364, -3248, -4661, -8660, 5206, 21425, 11377, -12547, -13621, 7685, 18731, 9681, -5065, -12170, -7069, -6791, -11732, -1942, 10568, 3091, -14052, -15775, 5785, 25876, 18819, -269, -6233, 703, 3298, -1233, 619, 4963, -2791, -16991, -23049, -5386, 18676, 13177]
555A3177k1806k522J1556P237O27j030j022m029r521q646J2213K3619o683k6316
569a3146k203J2478P008L910l829p403J336k711r529R060K3811n071k5775m55
583a2519J3586P066O805n789j4108L659K775j3100L972K0453o477k4010Q6J3505
597d096P208J0309l829j7010P416J1021j2645Q05J8059q107k2843P4Q792L349
611a497R989m832j9832Q791J7251j1767n25J8601p642j7922L504N612J059J0250
625A1040n326k1641P607J9103j2209l871J7201p771j4219P842J763k258J2289
638I550m601k1306Q082J9720j1261m957J6033p269j1496J0999o69o032J2509m165
652E137k1616P442J7196j0351n363J3693n840q313J3371p12p853J3334j747k0083
$$ y = [13177, -8629, -11151, 405, 7642, 8269, 7239, 6217, 2188, -7333, -15979, -3766, 19853, 13170, -13146, -15349, -2871, 4137, 8047, 4218, -3185, -1849, -4560, -14089, -5029, 18782, 13711, -12064, -12519, 1067, 8133, 14938, 9149, -4959, -1300, 1475, -11625, -7653, 12800, 6323, -17687, -17601, -4096, 3112, 13421, 9592, -7418, -2, 11019, -1626, -821, 17238, 9131, -13712, -13638, -4846, -1497, 8492, 3660, -16172, -7381, 9870, -1897, -2422, 16179, 8537, -9385, -5881, -269, 790, 11040, 5714, -15927, -8320, 10783, -1426, -5297, 11904, 4133, -10086, -2244, -481, -2739, 9550, 4949, -16357, -8275, 11445, 184, -4773, 11260, 3991, -7505, 3494, 2825, -3207, 9302, 5137, -16479, -9037, 8159, -2192, -7555, 6138, 298, -8015, 5356, 4644, -3209, 10125, 8378, -11705]
666a1705P165J4124j1860m764J0906o365o321J3011j185r112J3435J136j7887
679i422P441J2103j1785l094R375p641m897J2095k367r313J2208K975j5511O844
693i89J1206j1747j787R017q368m097J0923l523r213J0539L707j2504N632R828
707H624j0408m51Q951p877l399R516m547p338Q533K277r752L962P820q157k36
722b482Q643o912l099Q798m507o455P594J087p828L612N751o211q8P800n236l147
738b680P934m016o006O648m3o877L243L206m955P54O229l651k443O909k051m645
754b444N978Q8o304K826J254m407Q86L335k518j983M484l48l614M523R51m526
770a819K390J867l951J039K275j995j408K130J06k704K645J309l481J350J918
$$ y = [-11705, -4540, 9584, -2276, -7040, 3866, -2499, -8820, 4191, 3006, -6106, 7329, 8465, -9422, -1981, 10122, -1663, -4757, 4618, -3023, -7920, 4175, 1808, -7505, 4703, 7678, -7833, -989, 10217, -1530, -3317, 5700, -2668, -6765, 4158, 635, -8578, 1961, 5668, -6836, -1204, 8624, -1784, -2235, 6716, -1161, -4560, 4956, 409, -6929, 1604, 3881, -5871, -1909, 5911, -2246, -2482, 6161, -751, -3850, 4948, 441, -6014, 1580, 2667, -5161, -1549, 4202, -2009, -2097, 5703, 467, -2680, 5254, 1238, -4768, 1880, 1837, -5040, -1797, 1409, -3546, -2792, 3437, -214, -2657, 4252, 2201, -2444, 3534, 3622, -2682, 144, 1398, -3009, -2123, 1212, -1306, -3289, 1195, 847, -2767, 1756, 2707, -1819, 571, 2438, -1513, -474, 1801, -194, -1602, 528, 634, -2070, 575, 1884, -1597, -247, 1671]
785A671l247Q33J857j971o86J835j9j360J474J782k390K30K496k504o22K300k048
802c69j316J466o69r50R24J286j002l20K699j185j214K786q75j522J113m80j202
819h30M74N69j115n65J980m87j912K718L87k497K049N40k376J371J084k085k59
836i54K022m81k398K176Q16l186K611J045l314J533K214l195k96L145j409j840
852a511K336M75l125K631J204m890K514L975n286k66M666k871j929L492p41l126
868b452L659J246o015L247N005o894l65O523m161k552N349k186l731N665J5p213
884d860M413N891p811n85P396m815l235P512l677m473Q451j594r011N835O764
899F201r166q32Q470n732l221R491n172n483J1162k173j1580Q379P110j0823J44
$$ y = [1671, -1576, -743, 1114, -857, -1543, 292, 273, -1087, 387, 2169, -221, 9, 2505, 1, -621, 1679, -369, -1685, -219, -888, -1838, -914, 372, -630, -950, 1749, 564, -650, 2136, 1261, -261, 852, 372, -830, -356, 213, -902, -1467, 513, 26, -1886, 832, 1219, -1278, 771, 1311, -1065, 306, 1390, -695, -954, 1068, 587, -1811, 365, 1181, -2005, 606, 1651, -1663, -130, 2084, -1111, -1407, 1738, 329, -1511, 825, 1300, -1825, 806, 2010, -2880, -366, 3609, -1677, -1943, 2723, -148, -2077, 1415, 674, -2452, 1207, 2453, -3562, -315, 4690, -2204, -2569, 3954, -207, -2759, 2590, 404, -3327, 2338, 2353, -4860, -447, 5444, -2367, -2952, 4444, -371, -3606, 3906, 229, -4244, 4207, 2613, -6398, -563, 6201, -2965, -3797, 4673, -1059, -4280, 5211, 39, -5444, 5718, 3545, -8035, 344, 7454, -3369, -3225]
914c225Q142p375k180J0894o456p213J3953k423j4196J0655Q155j2108P96Q461
928E880r534q48J2652q565q196J5366k082j6182J2126R302j4124K069Q453j1681
942e364J308J4316j0660r626J6659j820j7255J2826R982j5729L239R158j4157
955g123L063J7073j3147j0628J7974k174j7626J3521R647j7159M535R188j6400
968i256M382K0511j5979j1902K0005k476j7683J4788Q498j8290N230J0099j8586
981a0659N209K2982j7872j3539K1555k768j6720J6070N967j9251P171R709j9329
994a1475N735K4123j7955j5364K2213j796j6256J7234M208k0475Q499R835k0485
1007a1959N621K4432j8677j6361K2854q36j5691J8637K504k1404J1096J0755k1927
$$ y = [-3225, 4917, -2458, -4638, 6256, -200, -7413, 6540, 4117, -10079, 576, 8731, -3377, -2581, 5880, -3654, -4502, 8150, -415, -8611, 6755, 4673, -11509, 617, 9919, -4205, -2136, 6317, -5364, -4056, 10260, -400, -10026, 6633, 4813, -12442, 384, 10366, -5363, -2124, 7034, -7123, -4060, 13013, -134, -10762, 7212, 5038, -12588, 933, 10580, -6579, -2044, 7144, -9256, -4874, 15637, -342, -12244, 7761, 5285, -12398, 2390, 10888, -7402, -2172, 7927, -10659, -5450, 17532, -340, -13879, 7676, 4908, -11812, 4258, 10225, -9026, -1855, 7854, -11475, -5740, 18383, 428, -14936, 7277, 5481, -10775, 6459, 10667, -9808, -1309, 8526, -11959, -6338, 18094, -583, -16944, 5910, 5074, -10617, 8020, 10524, -10880, 216, 10971, -10956]
1020a0956N953K3931j9218j6728K2017j098j4945J8849J053k2948J3601J1921
1032A1432k2396O319K3961j9795j5406K1528j404j3135J7757k01k3954J4783J3346
1045A2835k3247N178K2868j9563j3697K0872k398j2314J7710j008k3123J4974
1057i13J5090k2465M056K1991j8538j2440K0241l813j2035J6993k553k2877J4334
1070b929J5399k1333L053K1005j7008j0333K0823m449j1339J6993k723k2444J4080
1083a205J4029k0704J343J8877j5732r006J9995m724j1657J7534k447k0426J4270
1096A47J2786j8936O40J6556j3417p989J8590n224j1968J6665j492j9848J2907
1109e83J2240j8141K60J4847j1955o397J7098m547j1490J5924J37j7823J1140
$$ y = [-10956, -5003, 18928, -290, -17018, 4999, 3901, -11044, 7805, 8858, -14090, -489, 11432, -10964, -4645, 19316, -479, -15885, 5643, 4239, -8896, 8861, 8660, -15294, -511, 12835, -10412, -5234, 17634, -1929, -15626, 5246, 2848, -9466, 8244, 7236, -15887, -913, 14177, -8288, -4232, 17759, -779, -13219, 7022, 3209, -8826, 8167, 5614, -17263, -2929, 12470, -8863, -5810, 15195, -1813, -12146, 8677, 4228, -7111, 9882, 7159, -15285, -1205, 12824, -7880, -6537, 12340, -3392, -12398, 7597, 2873, -8784, 8750, 6303, -14123, 147, 12933, -6003, -5363, 11193, -2224, -10213, 8377, 3153, -8815, 7850, 6358, -13490, -583, 11657, -6484, -6224, 8623, -3332, -9729, 7369, 2822, -8668, 7256, 7393, -10430, 710]
1122G10J1425j6655K84J2768j1680n721J4889n022j1046J4136J833j6108J0145
1135d2J0803j4776Q09J2194j0368m609J2937n742j0080J1978K067j4171P442J0109
1149H551j3232N70J1799r159l895J1994n448q800J0968K095j2321N424Q266j0750
1163c938M58J0800p706m429J0791m314q365R327J816j0548L970O649q387J61R543
1178E828o051m174R553l132p245Q803J503r522K985N112p105j00P960m807m574
1193d966Q383j471o496P591K040q154K215M457o602K72O509m427l809O212n31
1208A223n055O228K549p279J884M350n602J68N383m296l861M814k85l964M328
1223E85K609n579J498M577m210j36M806l471l108L218k11l676L091J982m528L68
$$ y = [710, 12135, -4520, -4236, 8532, -3148, -8869, 6020, 998, -10048, 4088, 5921, -10187, -42, 10761, -4015, -3206, 8988, -1380, -5989, 6948, 1206, -8874, 3104, 5171, -9000, -1558, 8551, -4681, -4111, 7688, -1471, -5366, 6628, 1180, -7620, 3348, 5443, -6878, -1454, 6812, -3938, -3480, 7320, -386, -4815, 5976, 1662, -6703, 2624, 4440, -6108, -2138, 4511, -3876, -3715, 5828, -223, -4397, 5156, 2024, -5221, 3582, 5085, -4437, -1452, 3660, -3445, -3545, 4415, -392, -4966, 3417, 1946, -4550, 3041, 5081, -3073, -858, 3599, -3003, -2731, 3778, -649, -4458, 1754, 1223, -3832, 2396, 4945, -2334, -450, 3900, -1702, -1534, 3849, -447, -4308, 506, 221, -3743, 585, 3194, -2385, -887, 3690, -520, -656, 4150, 679, -2429, 789, 578, -3098, -7, 1975, -2553, -2185]
1239b185M150k669j1M051l250k534L367j04k447K255Q64l398O09L439j935n37
1255c35L201k064k461K504k58k510J678M84k711L34K575j095j0K672q44j592K554
1272B122K62k413J579n67k621J38R96j376L8J211n99o47K244N95j432K275L30
1289B135j873O66N83j364j42K60j296k16Q26j96l35J058J92j347J254M75j354
1306f74P40K70r16M87O26o07K68R01l83p34R81j55j486Q56l62j789J050K70j566
1325b223J125J229q05O36J570j21l87J381l63k421J423M3l086R06P12k002J80
1342b203J951r90J53K468p22r99K118P62l131J096J422k853J90J560k450K15K496
1359A083j437j165K429J59k528J031J871k637N50K134k743j15L391j894j525L222
$$ y = [-2185, 1965, -704, -715, 3336, 86, -2448, 919, 815, -1632, 623, 1487, -1911, -1302, 2137, 202, -335, 2866, 802, -1659, 845, 587, -1923, -245, 239, -2472, -2138, 437, -658, -668, 2004, 1160, -432, 2122, 2384, -29, 1550, 983, -1638, -1500, -504, -1880, -1842, -631, -1230, -1877, 367, 962, -470, 1805, 2135, 262, 928, 1511, 147, 5, 265, -1031, -1247, -421, -617, -952, 106, 298, -1049, 205, 680, -674, 66, 336, -580, -93, 533, -74, 194, 1095, 712, -22, 959, 804, -682, 174, -188, -1977, -927, -657, -2223, -1098, 131, -674, -38, 1532, 1411, 1024, 2405, 2042, -379, 1044, 1087, -1999, -1093, -381, -2383, -2203, -252, -1242, -1089, 1379, 657, -342, 1776, 2538, -593, 503, 1925, -928, -738, 822, -1628, -1413, 1083, -354, -1519, 910, 1069, -1459, -428, 1443, -1194, -644, 1490, -1253, -1368, 2023, 129, -1396, 1826]
1375A826R1k665J406J516l165L87J628l189k54L623k433j888M168J31k406K252
1391A028J371k441R45K084l841m96L604k802k996M145n92k812K631J162k198J666
1407D58K088l418L5M021k592k892L440m88l291K641J072k981K413J628l665O46
1423h85M025k297k759L057m63l156K724O42l364K462J699l712R93M228k001k581
1439a388K656m41k430K677k73l493K466J585m384J703L925j851j930J681Mj253
1455g46K489l74l298J721J503m148J172M083k134j554K285q50n92K863j185k849
1471a614J437J423l582O22L246j857j124J428q49L59L472j582k223K263K21k720
1487a080N41K255j962j268O88j319R47L176j738j950K329M35j693J380J240j552
$$ y = [1826, 1917, -748, 658, 2174, -991, -604, 1024, -2165, -2419, 1204, -1229, -3117, 1051, 1182, -1224, 1028, 2399, -42, 903, 2987, -854, -1350, 2254, -548, -3544, 601, 9, -2803, -172, 990, -1208, 458, 2546, -872, -837, 3184, 592, -2300, 1140, 652, -2639, 2, 1074, -1907, 506, 2134, -1531, -885, 3140, 843, -1916, 1141, 678, -2478, 246, 888, -2476, -14, 1685, -2027, -1034, 3194, 1193, -1388, 1268, 827, -1603, 1074, 801, -2692, -226, 1359, -3025, -1322, 2603, 752, -1178, 503, 507, -746, 1743, 1369, -1929, -208, 1295, -2853, -1681, 2402, 268, -1286, 999, 149, -443, 2420, 1235, -1614, -177, 1246, -2336, -1714, 1532, -325, -1449, -21, -870, -511, 2961, 1379, -844, 1419, 1640, -1080, -539, 1716, -246, -1514, -826, -2145, -1198, 1978, 240, -1710, 619, 1054, -639, 741, 1981, 429]
1503D29o68M15j543O96K990k218k054K282K17j255J405rj058K36%j365J316K370
1521B186k382j424K145q9m23J843p76j281J028p61j785J704R77k138j550J849
1537h77j12K17K058p20j039K176l03j813J921Q08k558n33P20j332N37J505j786
1554a131j280L100q55j242K685O83k346P96P21j927R44J583k154j049K836j097
1570B67j973K781m5k400J431N92k339J451J198k314m05L233p50j970K638l9k172
1587h16K457L48l294J693J330l663K89K549k031j439K829j53j882L197M88l322
1603a420K174K306l572K73K756l112j329K651j250j501K928n65l137K460K245
1618A907l036O02L415l358q99K895j224j391K674o49l450K184K328l123O45K987
$$ y = [429, -239, 176, -1367, -671, 2319, 101, -1953, 329, 546, -709, 696, 687, -371, -135, -135, -1500, -184, 2186, -196, -1620, 525, 436, 13, 1856, 1080, -201, 827, 66, -1719, -15, 962, -1176, -2726, -877, -989, -772, 1286, 566, -473, 1703, 1400, -413, 1508, 2316, -242, -775, -55, -1387, -850, 655, -1131, -2411, 689, -166, -1408, 1277, 1960, -386, 410, 1131, -796, 148, 1731, -423, -1472, 1364, 267, -1706, 1075, 1030, -1370, 61, 653, -1686, -235, 963, -1351, -1756, 1477, 727, -1243, 1395, 1356, -816, 1641, 1989, -1305, 388, 1718, -1945, -1656, 893, -1138, -2577, 252, 99, -1783, 1414, 1902, -1420, 754, 3060, -512, -239, 2517, -595, -1924, 727, -523, -2024, 904, 339, -2798, -338, 1907, -1129, -527, 2888, -470, -1369, 1526, 302, -1089, 1585, 936, -2514, -330, 1998, -1125, -480, 2507]
1634B507l249j330L257j183j519K655p23l202K364K114k515R07K647l175j359
1649a804L640j073j769K683j658l190K474J785k590J301J955k916p13L675n92
1664A208j659K623j445l033K345J335k584J103J238k789k78L167k89j777K702
1679A867j276k859K706J270k755J091J247l245J13K860l54j187J753p50k433K443
1695D91J760k855P36J461l475O3L062r54j409J992q72j958K301J450k229N65J334
1712A463k682j33K591q67j186J224o41j205J756J309j627Q7J218k220p1K487j124
1729C79j367R82l44j137J884Q52j367O6J202j287o35K676r63j557N72j22j163
1746a329J070O28j088q3J069n55k45J872l10j357P59m5q62R74R8j391J32R70j352
$$ y = [2507, -742, -2072, 1185, 2, -1517, 1138, 415, -2787, -423, 1691, -824, 83, 2730, -445, -1804, 1836, 763, -1006, 1677, 19, -3171, -697, 1088, -1502, -201, 1754, -1162, -1875, 1800, 1208, -451, 2172, 727, -2306, 39, 1374, -1210, -107, 1131, -1658, -1936, 1231, 942, -835, 1867, 591, -2268, 438, 1708, -1047, 44, 1291, -1954, -1841, 1019, 665, -522, 1231, 481, -1952, 491, 2251, -604, 132, 1593, -1882, -1819, 1243, 289, -1120, 872, 0, -1958, 343, 1793, -436, 129, 1463, -1219, -1352, 1239, 372, -814, 410, -231, -1436, 320, 1629, 2, 89, 1307, -913, -984, 1503, 379, -988, -6, -350, -1487, 397, 1249, -118, -52, 1150, -137, -772, 1904, 941, -616, -44, -166, -1329, -259, 369, -719, -802, 267, -288, -533, 1339, 1029, -328, 431, 386, -476, 498, 596, -795, -663, 307, -1045]
1765a045k7J768p4j551R60L11p53Q01O97j430k24R63q68J24J209l06j260N31P95
1784F21j000J76R63j360lR51r86k54J411j52j044P58Q57q14K51Q64r49p30R28
1803D88q86l94Q88k07j128O84R55n87k21J314o60k44J105n27q81J243m41j694
1821a193J016M24j034k86J454o01l83R54l28p12J525m60j103R07R20j440j61J275
1839G74q79k92J046m39j031J176M7j607J097Q83j547J02J331q80m28J209l54q28
1857f20J654J91k034J622R70k553L95J107j118q51J440p87p90K152o03j242J459
1874C92J032k104N01J758j547p13J335j294m42J670n41j546J720J112k088K35
1890e20J793j600k82J575j244l97J840q93j565J964L83k043M82J845j635l47J803
$$ y = [-1045, -1072, 696, 622, -929, 31, 342, -411, 390, 1087, -343, -567, 396, -472, -348, 861, 555, -705, -174, 621, -379, -203, 760, -600, -603, 348, -638, -892, 519, 367, -677, 81, 938, 124, 375, 1239, 290, -440, 488, -398, -792, 96, -111, -1239, -555, 400, -187, -408, 906, 246, 2, 1107, 580, -301, 942, 501, -1193, -177, 247, -787, -1073, 381, -220, -603, 351, 23, -689, 836, 376, -727, 180, 1100, -340, -501, 774, -105, -397, 649, 210, -821, 355, 402, -1205, -108, 775, -772, -670, 661, -219, -647, 562, 208, -620, 1034, 1225, -809, 813, 1783, -770, -375, 732, -386, -1237, 203, -584, -1374, 778, 175, -1067, 392, 1424, -680, -179, 1579, 32, -681, 654, -640, -1082, 588, 47, -1499, 221, 1333, -755, -520, 1273, -327, -609, 966, -278, -675, 1165, 272, -1293, 671, 1054, -989, -507, 1338, -297, -644, 1159]
1907A159j329j075K089n19k046K239N50k791J399J860j923j47J889j554q01K260
1923A260p57k091K089K95k305J237J543k039J95K118j671r21K427r09k035K388
1939H24J72k768J403J898k661M42K058j902p34K831q61k336K462K06l184K231
1955H1J593l027M94K247j989o22K606j155j641K019N02k609J932J607l253K66
1971i49K432k020p65K989j409j940K827k41k617K047J718l469N24K842k641r90
1987a662L114j180j810K726l90k650K458J046k884P26K318k239j164K784j364
2002a71j517K323j30k281K330J225l232P98K690k626n71K393p25k258K576m72
2018C52k443K384Q84k911J298K253k400p84K926j218j806K553j16k899K386J115
$$ y = [1159, -170, -1245, 844, 325, -1721, 518, 1068, -1723, -324, 1536, -387, -534, 1355, -199, -1000, 1260, 503, -1588, 501, 796, -1509, -272, 1271, -768, -573, 1545, -126, -1047, 1380, 471, -1564, 824, 996, -1772, -369, 1529, -1132, -690, 1368, -534, -1268, 1563, 702, -1634, 828, 1034, -2150, 81, 1674, -1353, -859, 1388, -601, -1223, 1383, 228, -1413, 606, 1108, -1501, 431, 2038, -1215, -949, 1483, -537, -1302, 1687, 278, -1662, 1165, 924, -1693, 354, 2072, -1397, -873, 1969, -672, -1662, 1452, 272, -1538, 1188, 798, -1852, 606, 1652, -1232, -506, 1812, -427, -1591, 1193, -171, -1688, 635, 505, -1776, 554, 1779, -1453, -655, 2035, -591, -1162, 1231, 506, -1752, 824, 352, -2091, 293, 1177, -1734, -436, 1817, -583, -1367, 1559, 341, -1465, 1088, 972, -1927, 459, 1574]
2034A574l097R42K506k547j021K636o53j828K399j67k537K026J213k974J101K386
2050A959k590o20K475q58j385J912k26k237J678J208k774R28K079k274j043L044
2066A276j036j407K558n05k407J876R55k232N63K139k609n30K270p54j160J665
2082F62j58k171J808J252k114N51J698k139r10K630m54j741J849k35j962J090
2098c44J613j925K96J399j863l65K052k06j427J271O3k001J443J290j727M29J214
2115A212k050l84J998R2j490J078j43j782J477J491j964K59J095j675k81K366
2131A299m39j371Q15m8j573J071J506j379k93R77j471q6K087k08j642P90M25j360
2149i00P81J568j353j64O46j056n23K140j66j621O92J74j315J286R49j050n65
$$ y = [1574, -1523, -581, 1925, -622, -1643, 993, 340, -1488, 911, 744, -1793, 233, 1446, -1528, -427, 1959, -631, -1251, 1224, 366, -1019, 893, 667, -1570, 108, 1316, -1458, -530, 1549, -725, -1768, 1276, 240, -1167, 1391, 886, -1521, 355, 1310, -922, -359, 1780, -829, -1359, 911, 157, -1003, 662, 504, -1667, 141, 1393, -721, -170, 1528, -611, -1521, 1109, 655, -1086, 763, 528, -1434, -344, 1269, -656, -360, 1039, -824, -1189, 863, 657, -770, 501, 564, -1437, 6, 1296, -431, -2, 1212, -838, -1222, 776, 868, -622, 456, 313, -1469, 8, 1499, -465, -206, 889, -786, -1067, 1299, 860, -511, 304, 256, -1317, -246, 1260, -119, -412, 565, -906, -992, 1095, 887, -755, 35, 460, -900, -119, 1449, 96, -68, 578, -478, -1001, 1139, 973, -648, 44, 218, -1097, 189, 1138, 88, -477]
2166d77O70n65l74J552Q7j584L86N77r45J001J033j103o32M89m17k37J441j00
2184H02j580N18N13r67O93J054r34p05P20j86l88J251l09j173N42M14r63P46P80
2203H28r05p88J067l73j71J052j01j312N80M22o28K13J128j032l95M30k81K32
2221c4O93k22j033J78P73q46M03P30r48k79P56l89j01P41l81o74O83L62m80l8
2241a06Q19o59m82Q27l41m28O20j77o32N44K58m00R5M10m13m28N43J95k22L86
2261D09m47k65M50j40j75K55J34m27K0J54j75j48M87l0m54K13L58o91P44J43o97
2282b82L80K58n15K24K5k13nL59j74k18L10J65o43N43n5l34J28P4k3m9L19k11
2304F3l23L31K49n03K92j53j15M28j05j68k8R9j68j55N96k51l56K85N0m81P12
$$ y = [-477, 193, -372, -746, 806, 893, -691, -305, 272, -673, 328, 1361, 258, -374, 115, -302, -539, 902, 802, -778, -260, 253, -714, -21, 1033, 99, -606, 114, -72, -460, 791, 482, -691, -149, 265, -698, 48, 828, -77, -865, 202, -171, -342, 710, 609, -703, -123, 299, -329, -116, 1012, -20, -415, 15, -266, -34, 659, 437, -596, -418, 355, -491, -88, 642, -306, -585, 171, -218, -319, 422, 41, -633, 50, 412, -68, -106, 713, 54, -428, 399, 58, -370, 250, 73, -559, -15, 243, -157, -62, 348, -65, -493, 50, 245, 23, 409, -38, -303, 147, 7, -168, 87, 221, -206, -186, -32, -207, -355, 132, 102, -352, -139, 219, -472, 272, 415, -282, 98, 356, -159, 65, 90, -123, -128, 231, 57, -161, 149, 314, -329, 214, 159, -175, -47, 27, 4, -45, 274, 63, -260, 71, 320, -183, 109, -44, -159, 269, 164, -4, -32, 67, -101, -256, 340, 89, -267, 18, 68, -413, 299]
2325B99l31j25J66L35m80J45K67l99k75O49k35l57M45N2n29N17K48o99K21R2l71
2346c65n4N44R3j15J05P1m09L6L52k21R1N22q56j4M74k34m02O46j50m94M40J07
2368A67l09J48N09o33j03P43m23l70N08k14j64J92J76p58O24L58p31m5Q83m88
2388G0l25M96j77k76K06J79o61M45N64q65J32M38j94l27Q68k30p00L24K34p50
2408e49M91P18q58j54M80j04k71O34l83l14N80j03o44M42M16q97K32N47l70O5
2428d2M04l04k64L94R1q35M28M17m96J17L94k84l44L84Rl86N02J9m06K85J94p28
2450d51K97N54o31L1N13l71m25O25j73l61M17O3k98J40N24l86l66M81l69k9M38
2471B23k46j49J63L3m65J24M89j99j63L55l52Q6O18k92p78M10L88k46j05N00n48
$$ y = [299, -32, -157, 9, 344, -136, 9, 276, -123, -398, 251, 16, -341, 104, 156, -373, 144, 392, -307, -86, 6, -365, -419, 125, 218, 103, 208, 279, -130, -94, 258, 37, 128, 650, -206, -220, 254, 20, -382, 264, 114, -380, 60, 167, -142, 6, 515, -118, -221, 522, 99, -271, 237, 23, -141, 51, 227, -531, 93, 451, -280, -325, 558, 70, -255, 241, 64, -212, -6, 173, -488, -43, 521, -344, -212, 226, 32, -295, 573, 343, -357, -33, 201, -549, -58, 660, -198, -352, 128, 24, -247, 387, 4, -310, 270, 167, -477, -35, 381, -516, -284, 263, -107, -42, 362, 58, -206, 188, 279, -556, -128, 289, -207, -90, 304, 20, -324, 60, 69, -317, 185, 204, -202, 83, 277, -451, -154, 400, -231, -200, 313, -58, -483, 142, -31, -392, 25, 88, -210, -70, 454, 68, -298, 183, -186, -215, 223, -23, -172, -9, 24, -441, -317, 172, -27, -190, 165, -187, -101, 517, 225, -553, -143, 245, -1, -106, 394, -154]
2492a54j48M55m8k80Q08p38k61N53k56M2k16M73r6l42K56j86M8N86m36k58N01
2513C03m5m48N18N3o83K56j2j63k06Q84k69m60L82j15j84L89j19k90jL17k50L03
2535A60J49k23k41Q2n7K9L20p7k96L3M51m39K3L13j49j88K32k02j22K46J99n41
2557b98L52k78l3J55N50m31j17L01k72l9N44l22kq9m9j46O35k01n73J36K87j50
2579d0O4K90r9n68L49J07k33L51rj21k58J23O1j94M34k18n16K12J19O2J19M6j98
2602a17k84N42j10J12K84m19l52J5L87o5L74j23l90l18P00k91K48L03n18k23J36
2623a09K85k99K81J28p03K08L13l58L10M3l5p05O52L0o4L21j0o61J63K68N6OJ39
2646B59k86m18L82o1M13q2k0m54K2J39J9Q8L64m96l7K85L11m49L61k94m39M0M25
$$ y = [-154, -302, 153, 105, -175, 633, -105, -366, 187, -69, -27, -243, 230, 134, -208, 48, -138, -90, 496, 60, -198, 303, 258, -190, 328, 381, -302, -46, -58, -221, -427, 457, 188, -272, 110, -5, -189, 200, 81, -209, -210, 107, -143, 160, 309, 86, -155, -73, -130, -101, 219, 142, -154, -121, 330, -109, -86, 227, 78, -110, 122, -80, -202, 44, 243, -298, 54, -224, -257, -102, 448, 17, -100, 201, -71, -110, 434, 112, 110, 21, -28, -174, 461, 260, -313, -177, 110, -40, 24, 314, 215, -353, -4, 103, -130, 221, 212, 91, -167, -44, 17, -177, 257, 39, -477, -265, -146, -84, 35, 81, -117, -401, 141, 31, 143, 427, 8, -344, -329, 58, -7, 367, 244, -146, -464, 236, -55, 193, 496, -22, -245, -109, 176, -123, 158, 286, -417, -209, 104, -254, 56, 99, 64, -641, 11, 41, -23, 298, 288, -373, -210, 58, 114, 120, 259, -27, -445, -63, -124, 289, 207, 187, -267, -245, -106, -87, 1, 365, -131, -168, 117, 428, -21, 340, 46, -393, -353, 72]
2669G2m6m7J5k37q6J30K51J33P2m51k39J65L36J33l51N12m90k60K81K79Nj27R8
2692A48n81l2O70k43j24M88n79k19O64J86k52j98J06%k79M85j86n1K64m90j08
2713c31L24K24j70j13K22j68n6J48n9j57J93j28mJ32J88m74JL15n01K97L35l66
$$ y = [72, 26, -21, -6, -243, -329, -199, 52, 185, 257, -194, -433, -268, 68, 201, -150, 362, -128, -388, -107, 172, 177, 50, 148, -433, -465, 205, -38, -162, 326, -253, -472, 192, 378, 126, -72, 34, 34, -245, 240, 54, 3, 267, -223, -331, -7, 217, 47, -66, 156, -12, -68, 80, 21, -136, 57, -71, -75, 57, 245, -229, -228, 87, -414, -117, 218, -148]
$$ [...]
8191C5
##END NTUPLES=NMR FID
##END=
