##TITLE=1H_Bay 97-2024
 CDCl3
 8 sc, 
 27.11.2024
##JCAMPDX= 6.0         $$ Bruker NMR JCAMP-DX V2.0
##DATA TYPE= NMR FID
##DATA CLASS= NTUPLES
##ORIGIN= UXNMR, Bruker Analytische Messtechnik GmbH
##OWNER= root
$$ XWIN-NMR		Version 3.5
$$ Wed Nov 27 16:38:35 2024 Russian Standard Time (UT+4h)  she@DPX200
##.OBSERVE FREQUENCY= 200.1315
##.OBSERVE NUCLEUS= ^1H
##.DELAY= (6, 6)
##.ACQUISITION MODE= SIMULTANEOUS
##.ACQUISITION SCHEME= undefined
##.AVERAGES= 8
##.DIGITISER RES= 18
##SPECTROMETER/DATA SYSTEM= spect
##.PULSE SEQUENCE= zg30
##.SOLVENT NAME= CDCl3
##.SHIFT REFERENCE= (INTERNAL, CDCl3, 0, 15.7039)
##AUDIT TRAIL= $$ (NUMBER, WHEN, WHO, WHERE, WHAT)
$$ ##TITLE= Audit trail, XWIN-NMR		Version 3.5
$$ ##JCAMPDX= 5.01
$$ ##ORIGIN= Bruker BioSpin GmbH
$$ ##OWNER= she
$$ F:/spectra/data/she/nmr/H-F/1/audita.txt
$$ ##AUDIT TRAIL=  $$ (NUMBER, WHEN, WHO, WHERE, WHAT)
(   1,<2024-11-27 16:37:50.15 +0400>,<she>,<DPX200>,
      <created by zg, POWCHK disabled, PULCHK disabled
       configuration hash MD5:
       00 E9 B6 7A A2 85 ED C7 34 08 36 98 17 FE 4E 26
       data hash MD5: 16K
       A9 34 DD 7D F9 7B E0 55 B0 33 39 52 27 7A FA 9E>)
$$ ##END=
$$ 
$$ hash MD5
$$ 18 F8 85 AF 5F 54 DF 7C 8B A6 9C 9E E0 A1 E2 59
##$RELAX= 
##$RELAX= 
##$RELAX= 
##$RELAX= 
##$RELAX= 
##$RELAX= 
$$ Bruker specific parameters
$$ --------------------------
##$DU= <F:/spectra>
##$EXPNO= 1
##$NAME= <H-F>
##$PROCNO= 1
##$TYPE= <nmr>
##$USER= <she>
##$AMP= (0..31)
100 100 100 100 100 100 100 100 100 100 100 100 100 100 100 100 100 100 
100 100 100 100 100 100 100 100 100 100 100 100 100 100 
##$AQSEQ= 0
##$AQ_mod= 1
##$AUNM= <au_zg>
##$AUTOPOS= <>
##$BF1= 200.13
##$BF2= 200.13
##$BF3= 200.13
##$BF4= 200.13
##$BF5= 200.13
##$BF6= 200.13
##$BF7= 200.13
##$BF8= 200.13
##$BYTORDA= 1
##$CFDGTYP= 0
##$CFRGTYP= 5
##$CHEMSTR= <none>
##$CNST= (0..31)
1 1 145 1 1 1 1 1 1 1 1 1 1 1 1 1 1 1 1 1 1 1 1 1 1 1 1 1 1 1 1 1 
##$CPDPRG= <>
##$CPDPRG1= <>
##$CPDPRG2= <>
##$CPDPRG3= <>
##$CPDPRG4= <mlev>
##$CPDPRG5= <mlev>
##$CPDPRG6= <mlev>
##$CPDPRG7= <mlev>
##$CPDPRG8= <mlev>
##$CPDPRGB= <>
##$CPDPRGT= <>
##$D= (0..31)
0 1.2 0 0 0 0 0 0 0 0.06 0 0.03 0 0 0 0 0.0002 0 0 0 0 0 0 0 0 0 0 0 0 
0 0 0 
##$DATE= 1732711069
##$DBL= (0..7)
120 120 120 120 120 120 120 120 
##$DBP= (0..7)
150 150 150 150 150 150 150 150 
##$DBP07= 0
##$DBPNAM0= <>
##$DBPNAM1= <>
##$DBPNAM2= <>
##$DBPNAM3= <>
##$DBPNAM4= <>
##$DBPNAM5= <>
##$DBPNAM6= <>
##$DBPNAM7= <>
##$DBPOAL= (0..7)
0.5 0.5 0.5 0.5 0.5 0.5 0.5 0.5 
##$DBPOFFS= (0..7)
0 0 0 0 0 0 0 0 
##$DE= 6
##$DECBNUC= <off>
##$DECIM= 24
##$DECNUC= <off>
##$DECSTAT= 4
##$DIGMOD= 1
##$DIGTYP= 9
##$DL= (0..7)
0 120 120 120 120 120 120 120 
##$DP= (0..7)
150 150 150 150 150 150 150 150 
##$DP07= 0
##$DPNAME0= <>
##$DPNAME1= <>
##$DPNAME2= <>
##$DPNAME3= <>
##$DPNAME4= <>
##$DPNAME5= <>
##$DPNAME6= <>
##$DPNAME7= <>
##$DPOAL= (0..7)
0.5 0.5 0.5 0.5 0.5 0.5 0.5 0.5 
##$DPOFFS= (0..7)
0 0 0 0 0 0 0 0 
##$DQDMODE= 0
##$DR= 18
##$DS= 0
##$DSLIST= <SSSSSSSSSSSSSSS>
$$ [...]
##$SUBNAM2= <"">
##$SUBNAM3= <"">
##$SUBNAM4= <"">
##$SUBNAM5= <"">
##$SUBNAM6= <"">
##$SUBNAM7= <"">
##$SUBNAM8= <"">
##$SUBNAM9= <"">
##$SW= 24.0689530833862
##$SWIBOX= (0..15)
0 0 2 0 0 0 0 0 0 0 0 0 0 0 0 0 
##$SW_h= 4816.95568400771
##$TD= 16384
##$TD0= 1
##$TE= 0
##$TE2= 300
##$TE3= 300
##$TEG= 300
##$TL= (0..7)
0 120 120 120 120 120 120 120 
##$TP= (0..7)
150 150 150 150 150 150 150 150 
##$TP07= 0
##$TPNAME0= <>
##$TPNAME1= <>
##$TPNAME2= <>
##$TPNAME3= <>
##$TPNAME4= <>
##$TPNAME5= <>
##$TPNAME6= <>
##$TPNAME7= <>
##$TPOAL= (0..7)
0.5 0.5 0.5 0.5 0.5 0.5 0.5 0.5 
##$TPOFFS= (0..7)
0 0 0 0 0 0 0 0 
##$TUNHIN= 0
##$TUNHOUT= 0
##$TUNXOUT= 0
##$USERA1= <user>
##$USERA2= <user>
##$USERA3= <user>
##$USERA4= <user>
##$USERA5= <user>
##$V9= 5
##$VALIST= <valist>
##$VCLIST= <CCCCCCCCCCCCCCC>
##$VD= 0
##$VDLIST= <DDDDDDDDDDDDDDD>
##$VPLIST= <PPPPPPPPPPPPPPP>
##$VTLIST= <TTTTTTTTTTTTTTT>
##$WBST= 1024
##$WBSW= 4
##$XGAIN= (0..3)
0 0 0 0 
##$XL= 0
##$YL= 0
##$YMAX_a= 257165
##$YMIN_a= -140106
##$ZGOPTNS= <>
##$ZL1= 120
##$ZL2= 120
##$ZL3= 120
##$ZL4= 120
##$ABSF1= 10
##$ABSF2= 0
##$ABSG= 5
##$ABSL= 3
##$ALPHA= 0
##$AQORDER= 0
##$ASSFAC= 0
##$ASSFACI= 0
##$ASSFACX= 0
##$ASSWID= 0
##$AUNMP= <proc_1d>
##$AZFE= 0.1
##$AZFW= 0.1
##$BCFW= 1
##$BC_mod= 2
##$BYTORDP= 1
##$COROFFS= 0
##$CY= 11.3945322036743
##$DATMOD= 1
##$DC= 2
##$DFILT= <>
##$DTYPP= 0
##$F1P= 15.6554695791079
##$F2P= 12.8336369535428
##$FCOR= 0.5
##$FTSIZE= 0
##$FT_mod= 4
##$GAMMA= 1
##$GB= 0.15
##$INTBC= 1
##$INTSCL= 1
##$ISEN= 128
##$LB= 0.24
##$LEV0= 0
##$LPBIN= 0
##$MAXI= 10000
##$MC2= 0
##$MEAN= 0
##$ME_mod= 0
##$MI= 1.114404
##$NCOEF= 0
##$NC_proc= 0
##$NLEV= 6
##$NOISF1= 3.799351
##$NOISF2= 2.8
##$NSP= 1
##$NTH_PI= 0
##$NZP= 0
##$OFFSET= 15.70392
##$PC= 1
##$PHC0= -26719.82
##$PHC1= 17.98745
##$PH_mod= 1
##$PKNL= yes
##$PPARMOD= 0
##$PSCAL= 0
##$PSIGN= 0
##$REVERSE= no
##$SF= 200.130013532006
##$SI= 16384
##$SIGF1= 3
##$SIGF2= 2
##$SINO= 400
##$SIOLD= 16384
##$SREGLST= <1H.CDCl3>
##$SSB= 0
##$STSI= 0
##$STSR= 0
##$SW_p= 3612.71676300578
##$SYMM= 0
##$S_DEV= 0
##$TDeff= 0
##$TDoff= 0
##$TI= <>
##$TILT= no
##$TM1= 0
##$TM2= 0
##$TOPLEV= 0
##$USERP1= <user>
##$USERP2= <user>
##$USERP3= <user>
##$USERP4= <user>
##$USERP5= <user>
##$WDW= 1
##$XDIM= 8192
##$YMAX_p= 0
##$YMIN_p= 0
$$ End of Bruker specific parameters
$$ ---------------------------------
##NTUPLES= NMR FID
##VAR_NAME=  TIME,          FID/REAL,        FID/IMAG
##SYMBOL=    X,             R,               I
##VAR_TYPE=  INDEPENDENT,   DEPENDENT,       DEPENDENT
##VAR_FORM=  AFFN,          ASDF,            ASDF
##VAR_DIM=   8192,          8192,            8192
##UNITS=     SECONDS,       ARBITRARY UNITS, ARBITRARY UNITS
##FACTOR=    0.0002076,     1,               1
##FIRST=     0,             0,               0
##LAST=      1.7004516,     0,               0
##MIN=       0,             -140106,         0
##MAX=       1.7004516,     257165,          0
$$ Real data points
##PAGE= N=1
##DATA TABLE= (X++(R..R)), XYDATA
$$ [...]
2017d80Q83q18l50J287l64r30N81M64o29L2P52r47N8R89j171l22J361k87j357
2036a248J006K30p66M47M50q45k25J217j145j86J243l66o97L59j19o69J046L38
2054G0j752P06J089j077j10J198o79m08O48m24m95J221J67q70J90O75p09J30P51
2073C21r57N2P09l20r18J141Q10j207J1P19j063O37O97j026j81J043o01l36Q63
2092C94J52q51P09j04j409J195N83o15o55J238j049L56O39o07q6R69j96j155Q70
2111C78L02j049J08R87p50N06j34p3j3Q91J5j802O29Q71q47q09Q18o30M84J113
2131I95o09j350J135N85j523P35L23o11K81J69j135M56J108j110m4O61l10n27
2149g71Q32L5r27Q00J8j046N32R35l55m24Q23r05J02M87m63m84Q33j9q62L72J113
$$ plain form
2017 -480 403 -415 -765 522 158 -772 -191 273 -356 -324 428 -519 -461 528 -643 -965 396 109 -1248
2036 -1248 -242 -12 -778 -331 119 -726 -951 266 -879 -1065 178 -188 -885 -526 -645 -1314 -268 70
2054 70 -1682 -976 113 -964 -1074 124 -555 -963 -315 -739 -1234 -13 154 -716 -526 149 -560 -430 321
2073 321 -636 -584 125 -195 -1113 28 838 -369 -358 361 -702 -65 632 -394 -575 468 -133 -469 394
2092 394 546 -305 404 300 -1109 86 669 54 -601 637 -412 -56 583 -24 -110 859 663 -492 378
2111 378 680 -369 -261 726 -24 482 348 275 262 1153 1168 -634 -5 866 19 -790 28 -602 -118 995
2131 995 386 -964 171 756 -767 -32 291 -320 -39 130 -1005 -549 559 -551 -595 66 -244 -771
2149 -771 61 96 -831 -31 -13 -1059 -527 408 53 -371 452 -453 -351 136 -327 -811 22 3 -859 -487 626
2170F26p94q6Q06j176J00Q89L8q28N02K41r36N47M01o73L73M22p56l50J048J04
2190D98j014J114P9j170J019j33o81K01P11q18M41L60j61l87R01o82l25O55L23
2209I31j006O81J34p05l7O88j06n58L97l34n81J351q1q88M54K83o69J07M32p61
2229b68M15Q29o18q34J012j89p17O64j68l41K13N11q50l6J373r97o38P55L10q35
2249d09Q59k09r67P54J21j12O4L31l89j50L79m84K32N21m09p45N98O84j036J61
2269b06R97q69J27L05o16J84M53o68o24R76M20o81j37M11m80r9R86o43o04J046
2289B78kq97M57M56m71M62k82o04L22P07o71j94Q86n66j69L70j81m84O45N26j206
2310f18J49J193r89l63O25l82j20Q67q17m65P53J61p64L51O64m84m10O94q02K6
$$ plain form
2170 626 -168 -254 552 -624 -524 365 403 -425 77 318 -618 -71 330 -343 30 452 -304 -654 394 498
2190 498 -516 598 677 -493 526 393 -288 -87 624 -194 247 607 446 59 960 278 -47 608 931
2209 931 -75 606 740 35 -2 686 580 22 419 85 -496 855 774 -114 340 623 -46 61 493 -268
2229 -268 147 976 358 -476 536 347 -370 294 126 -215 -2 509 -341 -377 996 -1 -639 116 426 -409
2249 -409 450 241 -726 28 149 37 101 432 43 -107 272 -212 20 541 132 -613 -15 669 -367 -206
2269 -206 791 -78 49 354 -262 -78 375 -293 -917 59 479 -202 -339 72 -408 -507 479 -164 -768 278
2289 278 276 -621 -164 292 -179 283 1 -603 -281 426 -245 -439 447 -119 -288 82 -99 -583 62 588 -618
2310 -618 -469 724 -265 -628 -3 -385 -505 362 -455 -920 -167 -6 -770 -419 245 -239 -649 45 -757 -731
2330g31N45l29n08P85O3n97N82l5l98L30J96l76m6P36n68m1M42K38m56L16j8m78
2352c48N29P17j507J38O91l50K97M34k96o42P50P2p57O82L80q84K38N00m01k96
2372e3O78k14q00P62o9l35M77K0n21O25j15k21J21L28m83J17J10J64m63M78n2
2393E54o36O06J9n97J0Q69r25m93Q99j39k27K81K60q54O08M10o91J39K66m49m4
2414a34M59n64k65J115n34o54P07J58n95jK87n62K60n5q0k12O93l27n95N12N05
2435A18n78M3N38o34P3K43l69k6N48j34n22L69J26l04N56J05n32L43O02n94k14
2456b43N05k06l48K55J44k25L20J63o15r5O98l32J63K19J6o42P60m59l84N30N30
2477G54n31L46r7l17J40L13l82o4N32m57O7J57J07q28L15L19k12j0M16p31RP18
$$ plain form
2330 -731 -186 -515 -1023 -238 -175 -772 -190 -225 -623 -293 -97 -473 -519 217 -351 -392 50 288 -168 148 130 -348
2352 -348 181 898 -609 -471 220 -130 167 601 305 -337 413 485 -272 410 790 -94 144 644 243 -53
2372 -53 625 411 -389 373 304 -31 446 466 -55 570 455 234 355 683 200 317 427 591 128 606 554
2393 554 -82 524 543 -54 -44 825 -100 -593 306 167 -60 221 481 -373 235 645 -46 93 359 -90 -134
2414 -134 325 -239 -504 611 77 -577 130 288 -307 -308 -21 -583 -323 -378 -458 -670 23 -304 -899 -387 118
2435 118 -460 -417 121 -513 -440 -197 -566 -592 -44 -178 -700 -331 -205 -509 47 152 -380 -37 565 -29 -243
2456 -243 262 56 -292 -37 107 -118 202 365 -250 -345 353 21 184 403 419 -223 537 78 -306 224 754
2477 754 223 569 472 155 295 608 226 162 694 237 304 461 568 -260 55 374 162 152 568 -163 -154 564
2499E64p92oJ78L19k93Q3J75n05K46Q8k00k24M65k09k89K97j01k86M25P9p03L66
2521c23N41m43m14R39l48l2P2k24m45P85k89l83L94O48r26L89K30o68K43L72n3
2542F5n66K55J12m39L76J01n28J23P83p38K31N79p09k59N20L96p27L35K26p30
2562e94N76J9l49J24K69k58%L17j00n58P29k83k97O55n9n06L49J45j40j29K43
2583A53P3k71K39j91r0L32K02p80J31O69o21J2O47o37N2O24m72l18M80m73l07
2604e46O45l29j15K91M59r22L64K81k66j02K88j54q3K86J41m64j03N26p77M10
2624a70M19m90L6J38pl56Q53k6n32J86O26o07J94J73m15k0O23m94k48K31L31m40
2646EJ97%n82P29R5m70N3K96j48j99L98k01l49J90om8K74k5m62K17M68m52l39
$$ plain form
2499 564 -228 -234 -56 263 -30 53 228 -277 -31 57 -143 -367 98 -111 -400 -103 -204 -490 -65 14 -689 -323
2521 -323 218 -225 -639 300 -48 -80 -8 -232 -677 108 -181 -564 -170 478 -448 -59 171 -497 -254 118 65
2542 65 -501 -246 -134 -573 -197 -96 -624 -501 282 -456 -225 354 -355 -614 -94 302 -425 -90 136 -594
2562 -594 -18 1 -348 -224 45 -213 -213 104 4 -554 175 -108 -405 250 191 -315 34 179 39 -90 153
2583 153 226 -45 194 3 -87 245 447 -333 -202 467 -154 -142 505 -132 -80 544 72 -246 234 -239 -546
2604 -546 99 -230 -345 -54 405 -517 -153 128 -138 -240 48 -106 -189 97 238 -226 -329 197 -580 -170
2624 -170 249 -241 -205 -67 -74 -430 423 397 -135 51 677 70 264 437 22 2 625 131 -117 114 445 5
2646 5 202 202 -380 349 444 -26 27 323 175 -24 374 173 -176 14 8 -40 234 209 -253 -36 432 -20 -359
2669c59P67j89j3K43k96rK67k17n7k5N45n27q9M99m32j37P77o07K97J91j4r91
2691c76L33K76j19j91L84k26n8L63O6l17J52Q5l19K95p9l01J76N32p73J12N03
2712E18m41K5J84m52J76N69k95l49j38L09k20M9RR5j71K74j29m20P01l3l45K19
2734A35K7j67L20k73J8N3K05k1m76P26j62l86M16p1l45J0L18n79J38L34k9o6k97
2757a72K65k11R2J87j96J7L21m49J5K09l26J33K29K49o80L79L0k47J06K46m40
2778b43j46P13p06K54L81m76j02O05j61n86P97j77o98M56J21q6P2L48j22m96J38
2799a14Q3k92J67J21k47K43K10k38K46R1l14N7O4j0M6k0k28K30J38l14k39L11
2821iK72n25l8P34q04N61j64j0k36k1K22o26P94j84j20J60Ml92J91O94p42j10
$$ plain form
2669 -359 408 219 206 449 153 144 411 194 137 112 657 130 41 540 108 -29 748 141 438 629 615 -376
2691 -376 -43 233 114 -77 307 81 23 386 452 135 287 372 53 348 269 -32 144 676 -97 15 518
2712 518 77 102 286 -166 10 579 284 -65 -203 106 -114 -65 -56 39 -132 142 13 -407 294 261 -84 135
2734 135 162 -5 315 42 60 113 318 297 -179 547 385 -1 415 344 -1 9 327 -252 -114 220 191 125 -172
2757 -172 93 -118 -26 161 -35 -18 303 -146 -131 78 -248 -115 114 363 -317 62 92 -155 -49 197 -243
2778 -243 -389 324 -382 -128 253 -223 -325 280 119 -467 330 153 -545 -89 32 -54 18 366 244 -252 -114
2799 -114 -31 -323 -156 -35 -282 -39 171 -67 179 270 -44 13 77 67 113 93 -135 95 233 -81 -320 -9
2821 -9 263 -262 -300 434 -370 191 27 17 -219 -240 -18 -644 150 -34 -154 6 10 -382 -191 503 -239 -349
2843c49L50j33J01K24p5k21n7J99m24J21J019r15P1J75lJ52M0j79j14J06K28m92
2865a76K61j00P3n6k4P8q3M01j95m5Rj23n2K55P0l04M62K1l65J30K12k90j83o2
2889h6M19n46L59R0k55j31N1P2L94l1L0k32j43k2j01N55r3m58K11K16r0k44q5
2912a20N02l83K62j42m34O89J1o84J73K75J49m56j6J09K07j41l1k96J51L57m91
2933c09K77o3j36J41K35l94K55L98m04n2J16j68j67K41o6K65k66j16M2J8O53m55
2955D5m42Q58k31m71M40J60l75L64j4n00Q3L30J48l68K65m07q4M84J1l01k73L86
2977A08k06L24K96k41o45L14N6N9J19Q2m45K12Q4m68J43M42l74K56R6k75m41N78
2999G4j15p5K27m4j84P6L01k39K7M7j74J19Rl1k52K25k15L59j18r9O0l86N98k74
$$ plain form
2843 -349 1 -132 -31 193 118 -103 -160 39 -385 -264 755 -160 -89 86 83 235 275 96 -18 88 316 -176
2865 -176 85 -15 58 2 -22 56 -27 374 179 134 143 20 -32 223 293 -11 451 472 107 237 449 159 -24 -86
2889 -86 333 -213 146 236 -19 -150 -99 -27 367 336 366 134 -9 -31 -132 423 330 -128 83 299 209 -35 -120
2912 -120 382 -1 261 119 -315 374 385 -299 -126 149 298 -158 -174 -65 142 1 -30 -326 -175 182 -309
2933 -309 -32 -95 -231 -90 145 -249 6 404 0 -52 64 -104 -271 -30 -96 169 -97 -213 -171 -153 500 45
2955 45 -397 461 230 -241 199 359 -16 348 334 -166 -83 247 395 27 292 -115 -199 285 296 -5 -278 108
2977 108 -98 226 522 281 -364 -50 6 65 184 266 -179 33 117 -351 -208 234 -140 116 212 -63 -504 74
2999 74 -41 -116 111 67 -117 -41 260 21 48 95 -79 40 49 18 -234 -9 -224 135 17 -82 -22 -408 190 -84
3023h4J3J62k15J77k64l22L58J72l27Q9K86K36m07q1J11J93l40J81Q6k68L98j17
3045C7k32M31J03k05J47j58J2m61O70m07O6n6n6r2K09L00l87L71m78J0M12j71
3067F5r7K40j00Kl77L68R4n02M01J20J21l73N72n21j57M21n56L91l44K97l03M5
3089a93J66L64l32l32l9K75L79k03k34K77J60p78O64k23N9j3J32M4o01K12L62
3110A46j81L7l8K32o0nm69O38m10K75K2j11M8l0k4r4J21o2L6j31k14P49p00M55
3134B30j68M8r0J14O8m0M11l85j85M7M1l04L54nj64lJ1j85KK45j61p6K85l59L65
3159I6o2j37K43j60Q9J4n10M78qR0M3j12j65J20k13j51J09N31l75l9L89m80L56
3182A46j16n52O03L6J68j20n43L92j04K44j49n66M64j7L95l31O3k4j83K83J8j98
$$ plain form
3023 -84 -71 91 -124 53 -211 -533 -175 -3 -330 -241 45 281 -126 -207 -96 97 -243 -62 24 -244 154 37
3045 37 -195 236 339 134 281 123 135 -326 344 -63 3 -53 -109 -201 8 308 -79 292 -186 -176 236 65
3067 65 -32 208 108 110 -267 101 195 -307 94 214 335 -38 534 13 -144 277 -279 112 -232 65 -238 -193
3089 -193 -27 337 5 -327 -366 -91 288 85 -149 128 288 -490 174 -49 10 -3 129 173 -428 -216 146
3110 146 -35 2 -36 196 136 131 -338 300 -110 165 187 76 124 94 70 -24 97 35 71 -60 -274 475 -225 230
3134 230 62 110 20 134 202 162 573 188 3 50 91 -213 141 136 -28 -31 -20 -205 -203 42 -119 -195 90 -269 96
3159 96 34 -103 140 -20 69 83 -427 51 43 133 176 64 -101 19 -194 -345 -236 295 -80 -119 270 -210 146
3182 146 30 -522 81 117 285 165 -378 14 -90 154 5 -561 -97 -114 281 -50 13 -11 -194 89 107 -91
3204i1K04j14J3q4L05m0l49L31n30N71j5j29p5r7J66l50j17M31j72j1K15k43O5
3227a16K27j86j59K59K90l05l7K08k95r6j07J14L82r8j93J1M51m27J15j99K68
3248A07r8j60O8J14J23p0q0M0rK2j10k08N00o63M03m0J18r2p9k3K15j28k8n4N03
3273C71m76n4L5K07l5K2n9m46O08k39n3J82k11L77j4j55Q9R3k36n0J29j08K76
3296B53l31J34J49L58n55rK3l09K07J13j1k50L04m25K99K81k01j73K8q8L71J8
3318A86j71K37k85%j4J89L51n79m5k6K91o7m72J65J23pL19k76J86r3K61m59K83
3341I7k21M45j80J59j96l94M10n6j24J32j55L6J49m24L60J15l79K70J19j29m71
3362d37L32j1J66n4mk29R9K51M5l53O1M07k21j23O0K7K7Q0k80J34K88M7o45J95
$$ plain form
3204 -91 113 -1 12 -72 233 193 -156 175 -355 216 201 72 -3 -100 66 -284 -401 30 -142 -153 62 -181 -116
3227 -116 111 -75 -234 25 315 10 -27 181 -114 -210 -317 -203 179 81 -112 -101 350 -77 38 -161 107
3248 107 9 -151 -83 31 154 84 4 44 35 57 -53 -261 239 -424 -21 -61 57 -35 -114 -137 78 -50 -78 -132 371
3273 371 -105 -159 -124 83 48 70 11 -435 173 -66 -119 63 -148 229 215 60 149 242 6 -44 85 -23 253
3296 253 -78 56 205 563 8 -1 22 -287 -80 33 22 -228 76 -349 -50 231 30 -143 -115 -203 168 186
3318 186 15 252 -33 -33 -47 142 493 -86 -131 -157 134 67 -405 -240 -117 -124 195 -81 105 12 273 -186 97
3341 97 -124 321 141 300 104 -290 120 64 -60 72 -83 -47 102 -322 38 153 -226 44 163 34 -437
3362 -437 -105 -116 50 -4 -8 -237 -138 113 158 -195 -134 273 52 -71 -11 16 43 123 -157 -23 265 312 -333 -138
3386a38N30l44m6o0Q7Q8r2J95l33K33O5j82p1L30k11J10j30M4J51j46K47l48j99
3409b20L43l8%j10j08J13K22m43K95J29k89j01J31R7j22J06p4m6J60j92O4n1M03
3432B69o42N10K6m1r4k24k87K65L27j30L1K65l06K22j23J91l3j38l62J57n7K78
3454A04k71K7J69k60J61O7M2j41M9J77k46L47Q1k28j71k6J40M6K30j45j62O7J22
3477A79p3j05l7O0M6K20l94j15j2P5M7l3K52j95K58j22l29K91K0n0N5l83L61L7
3501E3J51n56O86m84J48j51k89L63J18k34J35P3k64R0n0J05M05l10m7L73l17L2
3523C0q6O8Q1J89r6n74K36J01L09k5p8j30k15N10n4r6j78j23K64P1m87M84o01
3546d00M39L22l53j58k08P17j05k34j24K59K6k07K88Q9J06n62N3j5R4j43L22m72
$$ plain form
3386 -138 392 48 2 -58 29 117 25 220 -113 120 185 3 -68 262 51 161 31 75 226 80 327 -21 -220
3409 -220 123 85 85 -25 -133 -20 202 -241 54 183 -106 -207 -76 21 -101 5 -69 -115 45 -147 -83 -134 269
3432 269 -373 137 163 122 28 -196 -483 -218 109 -21 10 275 -31 191 68 259 226 88 -274 -117 -174 104
3454 104 -167 -140 29 -231 -70 -3 39 -102 -53 124 -122 225 306 78 -93 -119 21 67 297 152 -10 57 179
3477 179 106 1 -36 24 70 290 -104 -219 -231 -156 -109 -142 110 -85 173 51 -278 13 33 -17 38 -345 16 53
3501 53 204 -352 334 -150 -2 -153 -442 -79 39 -195 -60 13 -251 -161 -211 -106 299 -11 -58 315 -2 30
3523 30 -56 12 93 282 186 -388 -152 -51 258 233 155 25 -190 320 266 170 -8 -131 133 204 -283 201 -400
3546 -400 39 361 8 -150 -358 359 254 20 -104 155 181 -26 262 351 457 -105 -52 -67 27 -116 206 -266
3568b66K45K26m61K37q4j05K81kR0l32L06k63K15J31k30N6K9k9k52J90J90J75
3590C47o12M24j91r2L35k9k5l08n2r4L74K02l57n2L11m05K51J7j17P7j23J91m8
3613B4N2l5k19K3K95m15n8K15Q0J4J10P9Q9n36K55J33l53j10L5J93Q3L1lj39L3
3638a24J36J66l11k2J3J75k75R7M38l11j26k8M68n65N79l00R4J37l85O9K95P8
3660B98K6j76ml19K48L04j25n33O03m59j60N98o6j84J45k69J92j41m7j84J25j11
3682b39L58Q0m64M10l61O0K60J36k44Q4J30k14J13j3l6j88N2j50K14P7k08M4J71
3705G2j6q7r4J60k38K56k06K52k37op3L08K10m96J55N32m70k90N36n20k5J35K02
3728F0Ol5k76o2L98k86K76j48K46j59q8K33k38K98k08k53J96J70k24k70K16k0
$$ plain form
3568 -266 -21 205 -256 -19 -103 -208 73 71 161 -171 135 -128 87 218 -12 44 73 44 -208 -18 172 347
3590 347 -265 159 -32 -124 211 182 157 -151 -203 -297 77 279 -78 -130 181 -224 27 44 -73 4 -119 72 24
3613 24 76 41 -178 -155 140 -275 -333 -118 -38 -24 86 165 254 -282 -27 106 -247 -357 -322 -129 -46 -15 -18 -157 -124
3638 -124 12 178 -133 -155 -142 33 -242 -145 293 -18 -144 -172 296 -269 310 10 104 241 -144 -75 220 298
3660 298 324 148 144 -175 73 377 252 -281 322 -137 -297 301 235 51 196 -73 119 -22 -69 -253 -128 -239
3682 -239 119 199 -265 145 -216 -156 104 240 -4 80 210 -4 109 96 60 -128 -76 -226 -12 65 -143 -99 72
3705 72 56 -31 -125 35 -203 53 -153 99 -138 -144 -217 91 301 -195 -40 492 22 -268 268 -252 -277 -142 60
3728 60 66 31 -245 -307 91 -195 81 -67 179 20 -68 165 -73 225 17 -236 -40 130 -94 -364 -148 -168
3750a68J4J65O4j3m24K54J72l24L87n68M13L5K83j31j49L69l04J6J06j76j25J77
3772G3k48K90Pk41p7K07m93M33K77j35l63KM42p0k52K44nL2K26l76Q6m06L99J00
3796A52k75N50n57K35k06K03j31j85J77l82M03M3m10K12P4j4J16j02K52k22M4
3817b3k81L20k87L36K50o52K01J61J23k9k02N9q6K25j58M4j2J16o1O4J06k21k19
3840b26J13l51K00N3K58O6n8J90j67l72M90l35Q9K65k73o1J19L2k11O75m93l26
3862c23L55J70k57J8J61p7J59l37j06O47k95m5q1o5k15K01J06k8j07k7J60j60
3884a46mM72j58r7P5k4j50K16k00j02K24J21m01K27N0n2k02L23q5j25L46o90J86
3907a96l03N81l65K83m3j02M31o27K80J99J78n7m07k45K21M0L24m36M24j73K7
$$ plain form
3750 -168 -154 11 75 62 -362 -108 64 -260 127 -441 -28 7 290 159 10 379 75 91 197 21 -104 73
3772 73 -175 115 122 -119 -196 11 -482 -49 228 93 -270 -268 174 104 -148 96 91 123 349 -27 59 -347 52 152
3796 152 -123 427 -130 105 -101 102 -29 -214 -37 -419 -16 27 -383 -171 -97 -111 5 -97 155 -67 -23
3817 -23 -304 16 -271 65 315 -337 -136 25 148 119 -83 -24 -110 115 -43 1 -11 105 44 108 214 -7 -226
3840 -226 -113 -464 -264 -211 47 113 55 245 78 -294 196 -139 -50 215 -58 -119 0 32 -179 496 3 -323
3862 -323 32 202 -55 -37 124 47 206 -131 -237 410 115 70 -11 -76 -291 -90 16 -12 -119 -146 14 -146
3884 -146 -150 322 164 67 142 118 -32 184 -16 -118 106 227 -174 53 103 51 -151 172 87 -38 308 -382 -196
3907 -196 -499 82 -283 0 -43 -145 286 -341 -61 138 316 259 -148 -393 -172 -132 192 -244 180 7 34
3928C4K37k72k36M52q8l12j19J86o7n6j41M95l3m9P1L21m00l5q0Q1O8q2M1k24
3952b08K27J17j16K42j51k91K47j65j35n1L73K82l05q2k01K13O5L9m7l10M50P
3974B00k97K18j51M3k52L26j98K11J25l88M21J16n46L60j03n16L97L54o43O1K23
3995c9k25J99K29j0l80K76J84N8j88q1J25l98K44J61l20K28J02n27J44K75j26
4016f9J94O8k6q4rk22J20j11L19l40L58Q0k67j90J28P0R6K95l79q9J80j03n77
4039e58Q61l80K98l26J00J15k8J78k06k08J05J97l48P5R0k96L01K92j74k76L65
4060A77j15k24O3KL66Q2l70M0L5o7j90m8L51k53K70l06L92j71j84K08k89K47J28
4083A44l18K79M55l76k05P0k33n4M77r1j15L31k06k45K25K84n19J64Q4k51M1J06
$$ plain form
3928 34 271 -1 -237 215 127 -185 -304 -118 -185 -241 -382 113 80 31 102 423 23 -12 -92 -11 57 -25 16 -208
3952 -208 19 136 20 262 111 -180 67 -98 -233 -284 89 371 66 -16 -217 -4 61 100 53 -257 193 200
3974 200 -97 121 -30 13 -239 87 -111 100 225 -163 258 374 -172 188 85 -431 -34 320 -323 -262 -39
3995 -39 -264 -65 164 154 -226 50 234 292 104 23 148 -250 -6 155 -165 63 165 -362 -218 57 -69
4016 -69 125 193 167 83 74 -148 -28 -139 180 -160 198 278 11 -179 -51 19 115 410 31 -58 122 19 -558
4039 -558 303 -77 221 -105 -5 110 82 260 54 -154 -49 148 -200 -125 -35 -331 -30 262 88 -188 177
4060 177 62 -162 -99 -97 269 351 -19 21 56 -11 -201 -249 102 -151 119 -187 205 34 -150 58 -231 16 144
4083 144 -174 105 560 184 -21 49 -184 -238 239 148 33 364 158 -87 138 422 -97 67 151 -100 -59 47
4105D7q1jj39K19q6M8K16l73K7L34m93J99K27J31n06j6L80O8m65L19M3l18L54
4128A34j92J0j53J84R0q6K80j07k57J21k75J31J22L06l45m2K85k76k8K75k80M1
4150f2L02m81P3J24J73j27J47j15K05j43m13J67M90m32KN5J23m57K46L87j66p6
4172B2N43m83k5n7j06J10O3Q9k82K75j71l7J38k9k31l3J65j25p8M92j71k34N9
4195a06j08J26j19L25j01M0k6j81k69O07K9m30L37Kl71J46K43m24K41K39k64l64
4217d28K95L29k64K2j08QJ16m0J92o1j6Q1j87j55N41l91L92m0l01J77k04qj5m7
4241a12N7K96l93l5k70M94q6j23J87n4O7L1n0M8K0j55j78o4K05J50J8O9r6m7p1
4266i2J92j21k7J43M0l54L21N8k80K30j04J53k44l6Q5j95M13o6j76O9L42j56l24
$$ plain form
4105 47 -34 -35 -174 45 -41 7 223 -150 -123 211 -282 -83 144 275 -231 -247 133 201 -264 55 98 -220 134
4128 134 -58 -48 -201 -17 73 -13 267 160 -97 24 -251 -120 2 308 -37 -79 206 -70 -98 177 -103 -62
4150 -62 240 -241 -168 -44 129 2 149 34 239 96 -317 -150 340 -92 -90 -35 88 -369 -123 264 98 22
4172 22 565 82 57 0 -106 4 67 156 -126 149 -22 -59 79 50 -181 -214 -49 -174 -252 240 69 -165 -106
4195 -106 -214 -88 -207 118 17 57 31 -150 -419 188 217 -213 124 126 -245 -99 144 -280 -39 200 -64 -428
4217 -428 -133 196 -68 -46 -154 -146 -30 -70 122 61 45 126 -61 -216 325 -66 326 286 -15 162 -42 -50 -65 -112
4241 -112 -55 241 -152 -187 -457 37 -49 -172 15 -39 28 59 9 57 77 -78 -256 -320 -115 35 53 122 26 -21 -92
4266 -92 100 -21 -48 95 135 -219 102 160 -120 110 6 159 -85 -121 -36 -231 182 116 -60 9 351 195 -129
4289a29L04n2J5k55N6j7j22K50J9k69J99k99M09m9k28L5j5L22o50L87K78m32K73
4312C0J40m09O06k70j13J30O9j81j43N6P1J01q0p0j19L7k26J57J34j29K67k06
4334a48N5k98K34K49n43K88J80M16j68n30O3P0K68K15n98K22j50N3M23l65O2j02
4356a04J71m81J51N35l02k58L41J14l46J38J76m36L31M7M6j75J43J70k46k76K73
4377A2l4K01j48j09j76J91J94j61k90K13J38R8K15k89k07L50k9j00j77r7P3J38
4399Fp6J94m4j65k8L62j65q8p6K52j15r6K41l95L05K48j83l13L73j77P7l6J0L0
4423A41l8J48j43k54M14j99N3j50L58l89N00o78Q3N6J55l2J12j88J91k83m1K20
4445C6k90L35K80n46K67l17M23l2K47m26P7K39k21r2L52k67N9q3j38N4p9P3J00
$$ plain form
4289 -129 175 123 138 -117 -61 -78 -200 50 69 -200 -1 -300 109 60 -168 -133 -148 174 -476 -89 189 -243 30
4312 30 170 -239 367 97 -16 114 183 2 -141 -85 -14 87 7 -63 -182 -145 -371 -214 -80 -209 58 -148
4334 -148 -93 -391 -157 92 -451 -163 17 433 265 -265 -202 -132 136 351 -247 -25 -175 -122 301 -64 -2 -104
4356 -104 67 -414 -263 272 -30 -288 53 167 -179 -41 135 -301 30 77 123 -52 91 261 15 -261 12
4377 12 -22 179 31 -78 -254 -63 131 -30 -320 -107 31 129 344 55 -152 198 169 69 -108 -205 -132 6
4399 6 -70 124 80 -85 -113 249 84 -4 -80 172 57 -39 202 -193 112 360 177 -136 237 60 137 101 111 141
4423 141 103 251 108 -146 268 69 122 -28 330 -59 441 -237 -154 -98 57 25 137 -51 140 -143 -184 36
4445 36 -254 81 361 -185 82 -235 188 156 403 -23 54 293 72 -20 332 65 124 41 -97 -43 -122 -49 51
4468E1L9j10l06J76K14j2Q9k56K22K28k12O3N6l60K17K8j55R0R7n9K93n25J11
4491b1k4j0k9R5J13r0Q7j44L47l18j6K82j97l24M87n02J17J61j76J46L23l66j7
4514g6o2J29l04L82m6n7K62mm94K5J61k71K01L31j08l71M39j09R3q7J22j07M6
4537I5L52l25k83J58M3j76r5M2J60J99j37l3j41K41n4j43L70m06M1k9r5J63k34
4560b87M25o5k61M51m14J18J1l25k1L27p9J3j09O0K38K09j15n08K74J80j6J1M
4583A21j72J32k32L57j11M4R7n38K30J22q1j40M82m51L27l04kl4L62l72j47O6
4605b44K12j49J49q1j44K27J35k07q3K39j40r6J19J90ok13J08o0j55K10j14k31
4627c34N40r2k19J68j45nk4MN7r6L57j31j9l4k83J95J51p0J00o3R1o3k61N38m04
$$ plain form
4468 51 90 -20 -326 -150 64 52 141 -115 107 335 123 186 242 -118 99 127 -28 62 159 100 393 -132 -21
4491 -21 -45 -55 -84 11 124 34 121 -23 324 6 -10 272 75 -249 238 -264 -147 14 -162 -16 307 -59 -76
4514 -76 -138 -9 -313 69 23 -34 228 224 -270 -245 -84 -355 -154 177 69 -302 137 28 121 34 156 49 95
4537 95 447 122 -161 -3 40 -136 -231 -189 -29 170 33 0 -141 100 46 -97 273 -133 -92 -121 -216 -53 -287
4560 -287 138 73 -188 263 -151 -33 -22 -347 -368 -41 -120 -107 -216 -156 82 291 176 -332 -58 122 106 117 121
4583 121 -51 81 -151 206 95 139 236 -302 -72 50 -31 -171 311 -140 187 -117 -119 -153 209 -163 -310 -244
4605 -244 -32 -181 -32 -113 -257 -30 105 -102 -185 54 -86 -182 -63 127 121 -92 16 -44 -199 11 -103 -334
4627 -334 206 114 -105 63 -82 -87 -111 -107 -50 -146 211 80 61 27 -256 -61 90 20 120 57 148 85 -176 362 -42
4652d2J13r4j42j53L15Rj79K62j14L44n18M61k24nN2q6J50j01j22r8R4K19j98
4675e7L26j47K00n88K59j88M41j93q8mm0K51j37j10O9Q5l20M28n0j23J97l2k40
4698f1m5j58J25J44J88j87j11L45k09l35L60k37L68N5J92n69J10K08o77M41J34
4719H1P2J29k34k21J23L01l97P9j25J19r4k0L94m51n1O09k02m58J85K56n13N36
4741A18J54k94K01k5j97N7l7R3j55M5K4j34J17Q8j50j2L94p62K65J58m9J02N9
4764F0j93J17j14L41j96N85l39j76K07j93qJ0L07m92j28N04n40K79Q8J47l95N29
4786D00k8n54L01K03m45K83J73m76P1J31k3l8J25r3j15M21Q7n26K70k04K6k40
4808b51L69k52PN51k68l38O1Q1j70j11L99J91k53k00l0J34n3J12J79k69K01k69
$$ plain form
4652 -42 71 -23 -165 -318 -3 6 -173 89 -25 319 -199 262 38 33 85 -1 149 48 -74 -172 -78 141 -57
4675 -57 269 122 322 -266 -7 -195 246 53 -35 -39 -79 172 35 -75 -6 79 -241 187 137 14 211 179 -61
4698 -61 -106 -264 -139 5 193 6 -105 240 31 -304 56 -181 187 242 434 -135 -25 183 -494 -53 81
4719 81 153 282 48 -173 -50 251 -146 -67 -192 -73 -167 -187 207 -244 -295 314 112 -346 -161 95 -418 118
4741 118 272 -22 179 154 -43 14 -23 70 -85 -40 -16 -150 -33 55 -95 -107 287 -475 -210 -52 -101 1 60
4764 60 -133 -16 -130 211 15 600 261 85 292 99 91 101 408 -84 -212 292 -248 31 119 266 -129 400
4786 400 372 -182 119 322 -123 160 333 -143 -72 59 36 -2 123 30 -85 336 423 -103 167 -37 -11 -251
4808 -251 118 -134 -127 424 156 -182 -121 -40 -210 -321 78 269 16 -184 -214 -80 -133 -21 158 -111 90 -179
4830a79K78nk65K74j16j22Q8M3l71K44J99P6l77J56k5k0J15O8k02k08M88P9m75
4853b57N50m01j82J16K28m62J31K41k40J43K41j97n4M22n37J74l6L73m59L89k87
4874a04Q2M8K82j95j5m2K4J26k76M2k04J53N8r7q1J27k01L49K0kl78J89J62K46
4898C13m66J33j48k9N04m07K06k1k30o2K21L24n63L82k11n0J01m5K3j89M62m99
4920b51K78j62K51m31K32K10j18j66J64k81L82l43J13P9J71l71Q1K60k74J48J53
4941A25J1j56N4k55J44PJ76L59q05K36M0k31L97J29k03j34M11k30j52k6K31QJ03
4964B39k00k46K03L03m18kR2j43j68J55LM15m68kJ48J85O3j97J6K25p7k95qn8
4988b35l8L97k81K26K0j64n8K39N0j50K01l06j27r7M30k62j35Rj9O67l90q2M4
$$ plain form
4830 -179 99 94 -171 103 -13 -135 -47 -4 -375 -131 68 144 -233 -77 -102 -122 -7 61 -141 -349 139 218 -257
4853 -257 293 -108 -290 -174 54 -408 -277 -36 -276 -133 108 -89 -143 279 -258 -84 -120 253 -206 183 -104
4874 -104 -22 26 308 113 98 56 80 206 -70 -28 -232 -79 -21 -118 -199 -72 -273 76 96 94 -284 -95 67 313
4898 313 -153 -20 -168 -197 307 -100 106 85 -145 -207 14 338 -225 157 -54 -104 -3 -48 -25 -214 248 -251
4920 -251 27 -135 116 -315 -83 127 9 -157 7 -274 108 -235 -122 -43 128 -243 -162 98 -176 -28 125
4941 125 136 -20 34 -221 -77 -70 106 465 -340 -104 -64 -295 102 231 28 -106 305 75 -77 -103 128 136 239
4964 239 39 -207 -4 299 -119 -121 -29 -172 -340 -185 -182 233 -235 -237 -89 96 159 -38 -22 203 126 -169 -177 -235
4988 -235 -273 124 -157 69 89 -75 -133 106 156 6 207 -99 -226 -323 107 -155 -290 -281 -300 367 -23 -105 -61
5011f1p2L2j76K54J39k96J79R8N2O9N2j78l07M53k10L12n89L51j39o1K77l11M
5034a28N12nk51M4J47k07P0l41K89M4l38Q7j24P53l47m33P72m95k06L30j37q8
5056e2K88R0m12K14K88k62l3j56k46J00L94j26o9J98r9K21n38L95k15J20r6K2
5078B6j79L96l83m7M75l84j90K51K6j42r7L09l39L50m6k32l6M46l02J5J3J36j43
5101g7j58N15n11J85J17l77J96J48j4m0M4L18n83J57M74l18l3q8Kj87K52m0p5
5124i3K89k82Q3k3M29q44N33K0j50J68k82K57k88K60l38K15K52O6l89J15K77k08
5146F7j88O2J51m22L94q4K24l9l83J43L22K8n06L03M4Q9l2K9j02J28m12J52P4
5169D2J30k70R5K22j89k53K50L3m8L1k06J52k24J69J88k05Q4J33k39J4J09q1m4
$$ plain form
5011 -61 -133 -101 -277 -23 116 -180 -1 97 149 218 270 92 -215 238 28 340 -249 102 -37 -98 179 -132 -128
5034 -128 384 379 128 172 319 112 182 -159 130 174 -164 -77 -201 552 205 -228 544 49 -157 173 36 -52
5056 -52 236 326 -86 128 416 154 121 -35 -281 -181 213 87 18 216 117 338 -200 195 -20 100 4 26
5078 26 -153 243 -140 -187 288 -96 -286 -35 -9 -151 -248 61 -278 72 26 -206 -242 204 -98 -83 -70 66 -77
5101 -77 -235 280 -231 -46 71 -306 -110 38 24 -16 28 346 -237 -80 394 76 43 -45 -43 -230 22 -18 -93
5124 -93 196 -86 -3 -26 403 -441 92 112 -38 130 -152 105 -183 77 -261 -46 206 272 -117 -2 275 67
5146 67 -121 -59 92 -330 64 -20 204 165 -218 -75 247 275 -231 72 116 205 173 202 100 228 -184 -32 42
5169 42 172 -98 -3 219 30 -223 27 60 12 43 -163 -11 -235 -66 122 -83 1 134 -105 -91 18 -63 -107
5192a07J8K26j71k41L84j89k42K68J0r4O9L85m39N8R2l72O03n91J65j65K57p7
5214a53K21J99l03J77n08L27j32q0M56l95K40l01Q7K48j69k1M40j66q0k01K55
5235A41M6k86PK27k8K2J1k06k72K64J58l9P8O0o4j92J2j13M03l25m2K26j53j47
5259b12L19o8p8k15L23K03m68L94k38k09M73q0r6j79K06j26j78Q3k46L34K34j19
5281E7l11P44m25j11l0J95q8K2J46k10l3O4K48j31J62k78K1j3J47m8q7j79K16
5304G8j92O1ML09k56j46J27J20J00j07j20k51J53J24k5N9j82K41J7J1l29J34M3
5327b7J8l93L92K32j38j65n1N00n26K06j81j8K47n4J12j91j17K38m88L91Q2o8
5349Ap6J65k67K09J22O2k05q9r4J47j82L5J41K50k8l43N8Kj04Q9M0K87l69k21
$$ plain form
5192 -107 -89 137 -34 -275 109 -80 -322 -54 -44 -138 -69 316 -123 -65 27 -345 258 -333 -168 -333 -76 -153
5214 -153 68 267 -36 141 -367 -40 -172 -252 204 -191 49 -252 -165 83 -86 -107 333 167 87 -114 141
5235 141 187 -99 -92 135 107 129 140 -66 -338 -74 84 45 123 183 119 -73 -61 -174 229 -96 -138 88 -65 -212
5259 -212 107 39 -39 -254 69 272 -196 198 -40 -249 224 144 48 -131 75 -51 -229 -146 -392 -58 176 57
5281 57 -254 490 65 -46 -76 119 31 53 199 -11 -44 20 268 137 299 21 42 29 176 128 41 -138 78
5304 78 -114 -53 -49 260 4 -142 -15 105 205 98 -22 -273 -120 4 -21 38 -144 97 114 125 -204 -70 -27
5327 -27 -9 -402 -10 222 84 -81 -132 368 -158 48 -133 -151 96 42 154 -37 -154 84 -404 -13 69 1
5349 1 -75 90 -177 32 154 216 11 -78 -172 -25 -207 -172 -31 219 191 -152 -94 -92 -196 -107 -67 220 -149 -370
5373c70M69j78k41L76%l0r2L82n40J38K34k00J39j0j64q0J03j36m3L69n0p1J21
5396A26j67N9j81J67L06k17N7N8k07j48N31l06P43p22K81r2L75r18m37R40O98
5417I46j219J050J61j001O06n42M43m56j02LN3n0L72m80P43n28L03o30R83j194
5437e39K26N99k25J01M7l11J59K49k37j15M61l35m20L82J83j18k19o9R3Rl0K15
5459A06k9K11l47k33M68j67k93J93N0k10M9L11l05J11m6J44k12n4j24L85N2l24
5481b64j8L45J09l01o9J81n6j56K26n5R0k35K15J21j66pr9j27M96n83K56M12k67
5504D8k1K14k61j67J62p6J29J2p7K60m46L06q5K8j69k3J98l6J08k57m5J20J4r4
5528a58M3J98k36N93n7l92l8Ml27L30k25K42K9M6L5m1mk01J26k69K04K3j25k34
$$ plain form
5373 -370 99 -79 -320 56 56 26 -66 316 -224 -86 148 -52 87 77 -87 -167 -64 -200 -243 126 76 5 126
5396 126 -41 18 -163 4 310 93 150 208 1 -147 384 78 821 99 380 288 663 -255 -692 248 946
5417 946 -273 777 938 -63 543 1 444 -12 -114 -111 -58 -108 264 -216 527 -1 302 -328 655 -539
5437 -539 -313 286 61 162 209 -102 57 306 69 -46 415 80 -340 42 225 107 -112 -181 -88 -79 -109 106
5459 106 77 288 -59 -292 176 9 -284 -91 -41 -251 -202 109 -196 -85 -131 13 -199 -253 -377 8 60 -264
5481 -264 -282 63 172 -129 -198 -17 -73 -229 -3 -58 32 -203 12 133 -33 -40 -139 -266 230 -353 -97 315 48
5504 48 27 241 -20 -187 -25 -101 28 40 -37 223 -223 83 -2 26 -143 -166 32 -4 104 -153 -198 -78 -64 -158
5528 -158 -115 83 -153 440 383 -9 -47 -43 -370 -40 -265 -23 6 52 87 46 42 -159 -33 -302 -98 -75 -200 -434
5552d34N6L05O5r1L61k18p7J84kR0m93K58M67o84L56N59j068L9L40K35j12o9n4
5575A3k53K15k14N1L35K48l10rln9j28J44P6l22J86J84k86J24K33l83J7K45m43
5598c39J13K61K11l50N3K83m56M48k47k6L24m26K19l62N60l26l0J97P6j59k04
5619a80K52r5K99k42M4n91P82l43J94J69l31k23J40J40N5k4o0L1l7M42k70k38
5641h6L34m9m30K48k71j29O13k95J75Mk20N82n87N69m83J0K39l38l5K58n9K15
5663B65l10p5K43l7LJ08l14K06N6J44j83K3j50r2J82j41M5k57K53j65M49k73j65
5686a85J23p9K36j98L08j99k41L45o3r2NK48k47K82l3l80L49l85K18k4J71j69
5708a0L09q8l86q2J78L62l06j09M9L40m66M60n03K90J8r2R5j71K46n18N57n8l08
$$ plain form
5552 -434 -378 -73 -8 -99 262 44 -33 151 149 239 -254 4 471 -213 143 702 -366 -327 13 248 136 67 13
5575 13 -240 -25 -239 -188 147 395 85 76 73 14 -114 30 106 -216 -30 154 -132 -8 225 -158 -141 104 -339
5598 -339 -226 35 246 -104 -51 232 -224 224 -23 -49 275 -151 68 -294 266 -60 -90 107 183 24 -180
5619 -180 72 -23 276 34 78 -513 269 -74 120 289 -42 -265 -125 15 70 46 -14 17 -20 422 152 -86
5641 -86 248 199 -231 17 -254 -383 230 -65 110 114 -106 476 -111 458 -25 -15 224 -114 -149 109 50 265
5663 265 -45 -120 123 86 89 197 -117 89 145 289 106 129 -21 -113 69 -72 -27 -284 -31 -196 253 -20 -185
5686 -185 -62 -141 95 -103 205 6 -235 110 47 -45 -40 208 -39 243 210 -170 179 -206 12 -12 159 -10
5708 -10 299 211 -175 -257 -79 283 -23 -132 -83 257 -209 251 -252 38 56 -36 59 -112 134 -384 173 115 -193
5731a93j3K08n73N89N7k14q5K35l62J22L33j90K09j22m52M46j39P1J29J01o4j74
5753h1m9J62r9k54L67m50Q8L23k37K86k09J51J53J42k39j54J68k10J96k07L95
5774B42k05m7l2p0J49L6o6m54M77L98n75L78j17K34m40J4L29k07K22m15K11k92
5796b30J60K95k61N00n42j03L54r8n4J44n9k64J84r8P7K74Oj11l94K82r4Mn3p6
5820a57k75N14O7j72k31K80j9J37r5m66L05L90l2l71K13O2j58j47L48j48k50K34
5842B9R1K1j10J57l83K21m3J46L15l16j84J24j00J47q1j77J69k55M65k39k03O6
5864a40j3nJ27K15kn8l70J77j43L84m76J54p4M3M73k68K2j53J25J78k17k92N64
5887B51m36RO0n7Q2O7j08M0M9J02J44k27L17j14j33K4J65j19k74K21J40k70M13
$$ plain form
5731 -193 -206 2 -571 18 75 -139 -224 11 -351 -229 104 -86 123 1 -451 -5 -144 -73 56 157 93 -81
5753 -81 -130 32 -67 -321 46 -404 -316 7 -230 56 -153 -2 151 293 54 -100 68 -142 54 -153 242
5774 242 37 -10 -42 -112 37 73 7 -447 30 428 -147 231 114 348 -92 -78 251 44 266 -149 62 -230
5796 -230 -70 225 -36 464 -78 -181 173 75 21 165 106 -158 26 -72 5 279 285 174 -220 62 -32 -28 -81 -157
5820 -157 -432 82 149 -23 -254 26 7 144 49 -417 -112 278 246 -125 88 150 -8 -155 193 45 -205 29
5842 29 120 141 31 188 -195 26 -17 129 444 128 -56 68 -32 115 34 -143 26 -229 236 -3 -206 -140
5864 -140 -153 -158 -31 184 182 124 -246 -69 -212 172 -304 -150 -224 -181 292 24 46 -107 18 196 -21 -313 251
5887 251 -185 -176 -116 -173 -91 -24 -132 -92 -43 59 203 -24 293 179 46 70 235 116 -158 63 203 -67 346
5910C46j97O8j62r2k3N8j33J82o4L27o6k58J17J32M0Jj51k12rPJ10O6L09n63J34
5935c3O2j27K31J00N4n42K94J91j77l5k0q6J12J01j38o9N8O5L0Jj12k76N08k96
5959a04J0J88N5o4k22k2j49J82K40J35m9j24l66M08l66J82j06J47j01P2k11J30
5981a35R1k42L80L8l59r8L69j16l8j35K53N1m4l9J42k20K53k58K70J21m06L09
6003A87J0j20o2K73m19j84K06P4j69L66J77Lk4m98q8J24M48or9j99P5p6J08Q3
6027A90K72q07K91K35k37K63m50N44j15l92J68n4J01q8j2K33k02j74L80K8o43
6048d69M53j56J17L84o5j28J31j36k93J69K03k51n7K72k32M1K09m8k47J85r3j14
6070a25L30j79k47K11J72k65KM13k25j73K47l80J57j3j32J06J43K7P7j0l16J04
$$ plain form
5910 346 149 217 55 -37 -60 -2 -135 47 -17 310 244 -14 103 235 275 276 125 -87 -96 -89 21 87 396 -167 -33
5935 -33 29 -98 133 233 287 -255 39 230 53 18 -2 -88 24 125 -13 -82 -24 41 71 72 -40 -316 192 -104
5959 -104 -94 94 149 85 -137 -159 -308 -126 114 249 200 76 -290 118 -248 -66 -172 -25 -126 -54 -265 -135
5981 -135 -44 -286 94 132 -227 -325 44 -72 -110 -245 8 59 15 -24 118 -102 151 -107 163 284 -122 187
6003 187 197 77 15 288 -131 -315 -109 -35 -204 162 339 342 318 -180 -268 -144 304 298 199 0 75 -1 107 190
6027 190 462 -345 -54 181 -56 207 -243 301 186 -206 -38 -92 9 -79 -91 142 -60 -234 146 174 -469
6048 -469 -16 -172 -55 329 264 136 267 131 -162 7 210 -41 -98 174 -58 -17 192 144 -103 82 -11 -125
6070 -125 205 26 -221 -10 162 -103 -101 312 87 -86 161 -219 -62 -75 -207 -101 42 69 146 136 -180 -76
6092g6j07M9L35l69k2j83M8J91L94m16j77K56M1J62k33J90k93L98l72Q1J24M9
6114G0k26o9J32r5o1M63l65J84J3J35j45J10n4j37J52k42j41L33J91m19J85K47
6136B61n20L82j65N54q18K25O5J37J13Qm58J59K79m36K41P8L03l84N5J41l47l40
6158d67O38k55nJ01K3o2K03k08j90K08L21k99J17m2k58M62M5k11r1l4J18j32J88
6181A70k41Lm1J04o56O90Jk37L06N0k71j4K51j83nj11M54k02J54P7l66K14j79
6204c2Q1j55J70Kl33O14k47j00K7j88L45l2j06Om5O8l91J76J22lP8M4k80k54N92
6229A59k41qRK46j74K62k09j26P0l00O09l99J68J2o6O5k10J27N1mK65k62j98%
6253a54r4J15K74O7k59J99l17j63O03m06K43L1k29M3J15K6J96P3j55j79J60l10
$$ plain form
6092 -76 -183 -134 201 -168 -190 -373 -325 -134 260 -156 -333 -77 -36 126 -107 83 -210 188 -184 -103 21 70
6114 70 -156 -225 -93 -188 -249 214 -151 33 46 181 36 146 92 -45 107 -135 -276 57 248 -171 14 261
6136 261 -259 123 -42 512 -306 -81 -16 121 234 242 -216 -57 222 -214 27 105 408 24 79 220 -127 -467
6158 -467 171 -84 -89 12 35 -27 176 -32 -222 -14 307 8 125 83 -175 287 332 121 30 -4 114 -18 170
6181 170 -71 -68 -109 -5 -661 29 30 -207 99 149 -122 -136 115 -68 -73 -184 270 68 222 299 -67 147 -32
6204 -32 49 -106 64 66 -267 347 100 0 27 -161 184 152 46 52 7 75 -316 -140 -18 -21 57 101 -179 -433 159
6229 159 -82 -90 -81 165 -9 253 44 -82 -12 -312 297 -102 66 78 12 77 -133 -6 45 41 306 44 -154 -154
6253 -154 -248 -133 141 208 -51 148 -169 -332 271 -135 108 139 -90 -47 68 94 290 363 208 29 189 -121
6275a21K65j70K7Q3k94j9J2J31K97l20O8n1M10k42p2J43j42k3O9J62l68J15j49
6298a89j17J23K18L7j5k15J74J3m8q9L36l62K11j46R3M4J3o0j3k77q0N08l06J5
6322a32k1jj9M63p1k34k69K54R6N5j42J48k27J94P9l99N44m06j3r9N21o57N00
6345A64J12n18M92k27k39K88j38j21K95J4p2J2k50R9J57K34p0k75j01J24J49j26
6367CJ02J14j46N2j7j85J02K09k14j38J93j34j24K33L75n14N2L55m41K30o5j59
6389a17N1L83m57R9O9j61O5l65K28J78J18J12n2m4l27J06K15j75J49k32LR8r8
6412a54P2L2L0N51o88P6K6j97K62J62J20j35m5j61L11n36M15j20l8j95K90k49
6434a71l2L02k5m8j99L31k90J88n0L16n17L9L14Kk33R0M0q3j10J90k87K83j8j94
$$ plain form
6275 -121 144 -26 1 84 -210 -229 -217 -86 211 -109 -41 -92 318 76 4 147 5 -18 51 213 -155 -40 -189
6298 -189 -306 -183 35 72 57 -158 16 29 -19 -108 228 -134 77 -69 24 68 81 21 8 -269 -349 159 -147 -132
6322 -132 -153 -154 -173 290 219 -15 -284 -30 66 121 -21 127 -100 94 173 -226 318 -88 -101 -200 321 -336 164
6345 164 276 -242 250 23 -216 72 -66 -187 108 122 50 62 -188 -89 68 302 232 -43 -144 -20 129 3
6367 3 105 219 73 125 108 -77 25 234 20 -118 75 -59 -183 50 425 -89 -37 318 -123 107 42 -117
6389 -117 -66 317 -140 -41 28 -133 -68 -433 -205 -27 91 203 151 107 -220 -114 101 -74 75 -157 -154 -56 -154
6412 -154 -82 -50 -20 531 -157 -81 -55 -252 10 172 292 157 112 -49 262 -274 141 21 -17 -212 78 -171
6434 -171 -203 99 74 26 -173 158 -132 56 6 322 -195 -156 158 160 -73 17 57 -26 -136 54 -233 50 32 -162
6458a62K22J37k6r2m86L64K73q4k87L04L9j61J40K65n79P0K51k98L41k41q7k2
6480a19j3n0J70L03k27k81L31k1K16r0k50J09j99K43K07l89J45k31P6Q9rj2r1
6503i3M4P9J08j91J67l35J35Pj96N8L7M7J52j66K09j64K01J05l94O8J70r9J09
6526E8M8j11j4R2p6j2j46L38K8k76J15N3J00j92l83N50l5l7l8J07j86j62L11j22
6550A0m41L77N33n48j52L21K0l75M66k7j65l7q5K65J2k06K80j79K76m33K01O6
6572A79r9m09P48n32P4N3J81n31M84K62m64J99j90k14N12j56l86L77J01j17J03
6593A75m40K85Ok36J39J79j91k71K93j23J2j13L33N7k0P0j83K1l0PL57n80J09
6616a44L19r9j80L78k95n4j45N13k11j30J97m19K95J74l41J22J26R0Q7k12k85
$$ plain form
6458 -162 60 197 171 79 -407 -43 230 146 -141 163 202 41 181 446 -133 -63 188 -110 231 -10 -97 -119
6480 -119 -132 -182 -12 291 64 -217 114 93 309 219 -31 78 -121 122 329 -60 85 -146 -70 19 10 -2 -93
6503 -93 -49 30 138 -53 114 -221 -86 -79 -275 -217 -180 -133 19 -147 62 -102 99 204 -190 -122 48 -51 58
6526 58 106 -5 -19 73 -3 -15 -161 177 205 -71 44 97 197 5 -378 172 137 100 62 169 -17 -179 132 10
6550 10 -431 -54 479 -69 -221 100 120 -255 211 184 19 -18 -103 162 174 -32 248 69 345 -88 113 179
6572 179 80 -329 419 -113 -39 14 195 -336 148 410 -54 145 -45 -259 253 97 -289 88 189 72 175
6593 175 -265 20 26 -210 -71 108 -83 -354 -61 -184 -172 -285 48 105 85 155 -28 -7 -37 -30 327 -253 -144
6616 -144 175 76 -104 274 -21 -75 -220 293 82 -48 149 -270 25 199 -142 -20 106 196 283 71 -214
6637b14K37l05L27j78j55J51N3k16K00K30R0l54K44j09J06n3j17N2k37L60k48
6658a36K35j27j21k34L48j36K10K28l47k14M56k08o5R8J53J48k84J62l83J16K14
6679A13m75J42K77O5J96j27l73L10j00J23k39m4K89j04o4M1R2n0O7l51K13N2P4
6702A27l45M40k87k39M48k02K51m17K22n4l7M6K91P1j16l45K08J2m9p6k16K94
6724B7j28m2J19l7J93k26j36N0K43j6J6j78J59K31j33L6L5k71R9M3K6k26K27m67
6748c56L78j14j8k8k7L37p2Jr1m5r0L5P4L74l19k2K8K9N9k92N03p93L20K88j09
6773E0M2L92n99q4K76k1j89M9J90j55j17L27m45N5L36m4l32K60J91l21j1K48M9
6796A47k23K06j71L51k60k24j31K92O0J58l93K87j96rL04l82kQ9L48j25J65l56
$$ plain form
6637 -214 23 -282 45 -133 -288 -137 -84 -300 -100 130 220 -134 110 1 107 54 -63 -11 -248 112 -136
6658 -136 99 -28 -149 -383 -35 -171 39 267 -80 -294 162 -46 -111 -13 140 288 4 166 -217 -101 113
6679 113 -362 -220 57 122 318 191 -182 128 28 151 -88 -132 157 53 -11 30 122 72 139 -212 1 53 127
6702 127 -218 222 -65 -304 144 -58 193 -224 -2 -56 -93 -47 244 315 199 -146 62 74 25 -51 -267 27
6724 27 -101 -143 -24 -61 132 -94 -230 -180 63 47 63 -115 44 275 142 178 213 -58 41 84 110 -116 111 -356
6748 -356 22 -92 -110 -138 -165 172 100 101 10 -35 -125 -90 -16 358 39 17 45 74 133 -159 344 -449 -129 159 50
6773 50 92 484 -115 -199 77 56 -133 -84 106 -49 -166 161 -284 -229 107 63 -269 -9 182 -139 -150 98 147
6796 147 -76 130 -41 310 50 -174 -305 -13 47 205 -188 99 -97 -106 198 -184 -186 -97 251 126 291 -65
6818f5L7Q9R5L2j65j41J47k75K11j26J75k8j99L19k5J47r7j3p5k26o2j05M52j70
6842f8LK46m36N72l14J39k42J68k60LL94k97L8J94j72n5K48l12NK54m0J3l13L07
6866G5j23L41l84j35K46k86J68L9J94L1k19j16J10L07l38M28m57J19l5M21n30
6887a44J92j12n29N19M76n62J37Mk36L73j75K29l4m9j39J85j1L9p5J93m91K54
6909D4j78J91J0Q0M0j0k54K4J32J99j61k45O2m9J89j10OL3rr6J63O9N5m51L76
6934A10j04K25K2k36m7J80k26N1J03K64l38J25l64J33j28L77J00l3j81k94K13
6955d8P3j66J60l8q0m2R8l66J65M12l69Q1l00L85R2q9K06j27k16N19k74l18KL85
6979A45q3j7k40K37Q3m25J79J83m06N77k24k07KR9J45m3j59O1k69L89j26O8J80
$$ plain form
6818 -65 -28 61 156 188 23 -118 29 -246 -35 -161 14 -14 -213 106 81 228 131 118 43 -183 -245 -350 102 -68
6842 -68 -65 181 -255 317 3 142 -100 68 -192 -189 205 -92 -54 140 -32 -87 161 -151 -146 108 68 81 -232 75
6866 75 -48 293 -91 -226 20 -266 -98 -59 135 166 -53 -169 -59 248 -90 338 -119 0 -35 386 -144
6887 -144 48 -64 -593 -74 402 -160 -23 -19 -255 118 -57 172 138 89 -50 135 124 163 88 281 -210 44
6909 44 -134 57 67 147 187 177 -77 -53 79 278 117 -128 -66 -115 74 -36 -30 3 -6 -102 61 130 185 -266 110
6934 110 6 231 253 17 -30 150 -76 -25 78 342 4 129 -235 -102 -230 147 247 214 33 -261 -48
6955 -48 25 -141 19 -19 -99 -141 -43 -409 -244 168 -201 -120 -420 -35 57 -32 174 47 -169 350 76 -242 -240 145
6979 145 62 45 -195 42 125 -300 -121 62 -344 233 9 -198 -196 -97 48 5 -154 -93 -362 27 -99 -31 149
7002A49l92L98j74P2J01k82L05j01k02M89m28k51L24K58r9l1J76j82J58k88r8
7023i8J92n39L22p1L07k1k35J26J29j8K54k81j68J8k4K11Q5l80J74K06k47oL12
7046B48q5k11k55K95K76l60M62m88L8K34L0m39m1K67k2k47L17r4o0R2m6K02J79
7069B92o23J19J23M7J83k28J80q9J23k73j8K3N5j40K52j43K14l38J37O7j90K73
7091D6K85l69l2j61jM88rm96M12N5o8j79J81l71J29N0N1K14l34k60N45m56J74
7114a06M1J57k0k09M06k02L9j94k32K07J92j83R7K01j20k41J2K67r0k35J14J1
7136h8j88j44N53j69L57o81Q8L72j91K75k53K14j13P98j313N49n26k38N74j71
7156b95P93m81M1J84j55J14l39L27J45l92L51K76n98j50L77m39N3K77j43L47L3
$$ plain form
7002 149 -243 155 -19 53 154 -128 177 76 -126 363 -65 -316 8 266 167 136 312 130 288 0 -98
7023 -98 94 -445 -123 -194 113 92 -143 -17 112 94 348 67 -101 -83 -107 104 189 -191 -17 189 -58 -64 248
7046 248 163 -48 -303 -8 268 -92 370 -118 -80 154 184 -255 -296 -29 -51 -298 19 -75 -135 -43 -89 113 292
7069 292 -331 -212 -89 -42 141 -87 93 4 127 -146 -164 -141 -86 -226 26 -117 97 -241 -104 -37 -227 46
7091 46 331 -38 -70 -231 -232 256 247 -249 163 218 150 -29 152 -219 -90 -40 11 225 -109 -369 176 -280 -106
7114 -106 -65 92 72 -137 269 67 106 -88 -320 -113 79 -104 -7 194 74 -167 -155 112 22 -213 -99 -88
7136 -88 -276 -420 133 -36 321 -360 -272 100 -91 184 -69 145 32 830 -483 66 -460 -698 -124 -295
7156 -295 498 17 58 242 87 201 -138 189 334 -58 293 569 -29 -179 198 -241 -188 89 -54 293 326
7177C26m30R5j3k50L79j00j20M4j3O7j05l3J08P9j26J63k8J36j74M9j86j86%K5
7201b93L66j4k94J76P4o2K61r5k67M5M87k93j38J09k65N42k39m55j66N28q94Q88
7223AK47K16k77l07J62j70L1L00k56J2l3J72k71j7J30M89m26M20l08K06m90k08
7245c77L66Q42r93Q0M16j75J0j0N01j272P83m6j92J33k11J36J75j44n4j91M56
7266B33l75RK15m6k5k69P0K35l98J04J79P6j13J28Q2J19Rj26q2m6l0n2k1J05k8
7291d7M2r8o2K77j11O9j51j96M40l4k07J73k64K89o09O89j84j4N4J54k57K99j74
7314G8j32NJ82m22J08j61L34L5Ol2k4K04m96L30L9j92J7K17l74M52j16P5k60J52
7338B5j60N06j69k56o4J58k7q5k5M7k9J04kk63N02n0l19K56k28K38k24K84j83
$$ plain form
7177 326 -104 -9 -22 -272 107 7 -113 -69 -82 -15 -120 -153 -45 34 -92 71 43 179 5 54 -132 -318 -318 -293
7201 -293 73 59 -235 -59 15 -47 214 119 -148 -103 384 91 -47 62 -203 339 100 -355 -521 7 -887 1
7223 1 248 464 187 -120 42 -128 -97 203 -53 -41 -74 98 -173 -190 -60 429 3 423 115 321 -169 -377
7245 -377 -11 831 -162 -82 334 159 169 159 660 -612 171 125 -67 66 -145 -9 166 22 -32 -223 233
7266 233 -142 -133 82 36 11 -258 -188 47 -351 -247 -68 8 -105 23 105 224 233 107 25 -21 -51 -103 -124 -19 -47
7291 -47 -5 -103 -165 112 1 70 -81 -277 163 129 -78 95 -169 120 -489 200 16 2 56 210 -47 252 78
7314 78 -54 -49 133 -289 -181 -342 -8 27 33 1 -23 181 -315 15 54 -138 -121 96 -278 174 58 133 -127 25
7338 25 -135 371 202 -54 -118 40 13 -72 -97 -50 -79 25 23 -240 262 212 -107 149 -79 159 -65 219 36
7361C6j5j50J54J45m57N45L07n08K25j45j96L7r4K82j35K17l62M57o64L96K33
7382C08k52OK1N2j08k84K22N8k45N52k82k56L33O3l31K51k52n6M29p4k27J12m99
7405d59N15p2k7J47m09M76j01j08l4J86KJ44k42j24Q7M9Q4Q4n5l89J64j73J36
7428a19J78q1p9lJ50j45J35j34R4J89K7j64M0J23q6j32K38l03K05k84lJ42j5p2
7452i9J12P6j36J14r7J35r2k15L02j54K18N8k62K49l11L24n07J57n8J86j0j77
7474a87M6l9M81l14k03L97l9Rj00L5J6l2m0l17J98j8K41M4k16m4j55J70K24n05
7498c48K84o5K84m68L62M1j35J45l4j3k42k6O7K16l90N95k94m4J48j30r0L20j63
7521B0K16j17k29N74o36l8qK19J59n45N95k28J95j56J11k01J18j97J30M3K10l30
$$ plain form
7361 36 21 -129 25 170 -287 258 565 57 282 137 -59 -22 -116 166 31 248 -114 343 -321 75 308
7382 308 56 62 83 135 27 -257 -35 23 -222 330 48 -208 125 188 -143 108 -144 -200 229 155 -72 40 -459
7405 -459 56 -16 -43 104 -305 171 70 -38 -72 114 116 260 18 -106 -19 30 114 198 143 -246 -82 -255 -119
7428 -119 59 -22 -101 -104 46 -99 36 -98 -4 185 212 48 88 211 125 -7 231 -72 133 -151 -154 -12 -27 -99
7452 -99 13 89 -47 67 -30 105 13 -202 100 -54 164 222 -40 209 -102 222 -285 -128 -186 0 -10 -187
7474 -187 -141 -180 301 -13 -216 181 142 151 51 86 102 70 30 -287 -89 -107 134 178 -38 -82 -237 -67 157 -348
7498 -348 -64 -129 155 -313 49 90 -45 100 66 53 -189 -215 -148 68 -322 273 -21 -65 83 -47 -137 183 20
7521 20 236 119 -110 464 -172 -210 -218 1 160 -385 210 -18 177 21 132 -69 49 -148 -18 25 235 -95
7543i5M09k46k92J59j75Q3L80l57o7n0K60p1K7K54k18L01k36m6K21k1l93O8P3
7566c2P4l13L26j90M7j35J82n8K3k7J8L0L49k71q8L20n43L91j03P3l39K07j1Q1
7590A1r8K68k62J52j65K78j19j12K21j08J51l3k2k20p5L42K7m04L01l2k65N12
7612C48k54Pj60j7m1n7L53l9j54K99p4q0P4l62K80k31k0J82j55k59M71k1j46p6
7636a32K74J02Nj96k46q2M35l56K03J11m85J68J89k46O5N55m00L38j22k04O3O4
7658A03j20J90l52K87l69M17k64K10k19K42j90j4K40k48j64K56J35k15L6P8q5
7679d6P3K00k75L86n03J69J13qJ6K27k60j00L04m15K97k77M6K29j55k68K74n7
7701c0L67m64L13l48J82J75p6j40k69K77J90j33K75l01j00p7L14j5j54o9R4J82
$$ plain form
7543 -95 314 68 -224 -65 -240 -157 223 -134 -201 -251 9 -62 -35 219 1 302 66 20 241 220 -173 -105 -32
7566 -32 42 -271 55 -135 -88 -223 -41 -99 -76 -103 -85 -55 294 23 -65 255 -288 103 0 73 -266 -59 -70 11
7590 11 -87 181 -81 71 -94 184 65 -47 174 66 217 184 162 -58 -133 209 236 -168 133 101 -164 348
7612 348 94 101 -59 -76 -117 -174 179 140 -14 285 211 131 205 -157 123 -108 -128 54 -101 -360 111 90 -56 -132
7636 -132 142 244 249 53 -193 -275 160 -196 7 118 -367 -199 -10 -256 -191 364 -36 302 180 -24 39 103
7658 103 -17 173 -179 108 -261 156 -108 102 -117 125 -65 -79 161 -87 -251 5 140 -75 -39 39 -46
7679 -46 27 227 -48 338 -165 4 117 109 125 352 92 -8 296 -119 178 -99 -53 176 21 -247 27 -30
7701 -30 337 -127 186 -162 20 195 119 -21 -290 -13 177 44 319 18 -82 -159 155 140 -14 -83 11 193
7723A93n7J39n50L63j16K0j51L49l2n8P9j98K07l02J89j82K07k40J87%N2R5k60
7746f6J89m5l65L32L3m22N13R0J74n23K05j67L4N78n24j75L85l02J52j47L41o2
7768B28m74O26j30m23L4K2J4L52k37J84n45L78l45J99P4j10L16l06O9K2K67j86
7790B9m2R0O2K0l19K87K4k82M95l99j73K58k95J78K29q0l83L20l3J02j4o5m13
7813d04J65L93p8o4J38l32j50L84k12K23k09K79j40k51L8K54l03K50q7O4J82m5
7835I5k09J51L8j56J51j30J76j48k6j37N8M08j80j04J50k07l7K31J56p1m00J40
7857e1j51L09k44K83j97j8J49r6j79K58r7K77m31M6j02J53p9R7J44j31j86M42
7879A96m0j26P8J83J4l69J68j35j28o3J86l5Q5k68M7J11P8L5k58K43N4j70J23
$$ plain form
7723 193 136 275 -275 88 -28 -8 -159 190 158 100 179 -19 188 -114 75 -107 100 -140 47 47 99 194 -66
7746 -66 123 78 -287 45 78 -344 169 259 433 -90 115 -52 -18 560 36 -139 246 -56 96 -51 290 228
7768 228 -246 380 250 -173 -139 -117 -103 249 12 196 -349 29 -316 -117 -43 -153 163 -143 -74 -52 215 29
7790 29 -13 77 139 159 -160 127 151 -131 364 -35 -208 50 -245 -67 162 82 -301 19 -14 88 74 9 -404
7813 -404 -239 154 76 12 150 -182 -332 52 -160 63 -146 133 -7 -258 -220 34 -269 -19 -106 -42 140 95
7835 95 -114 37 75 -81 70 -60 116 -32 -58 -195 -137 271 91 -13 137 -70 -107 124 280 209 -191 -51
7857 -51 -202 107 -137 146 -51 -69 80 -16 -195 63 -34 243 -188 -142 -244 -91 -170 -73 71 -60 -246 196
7879 196 156 30 108 291 305 -64 104 -31 -159 -222 -36 -71 14 -254 -207 -96 -18 17 -241 2 56 -114 9
7902IL52m77K71k64j69L78k49j83K80j39J23J96l26J07K15o8J28j00J41o7k86
7923a28J91k47N98l72m8L1N5M8j45l44M67l90K89J18j01l6j24l4J71J59R3k77
7945b6p3L27k99J1o8k55M79l2j95R4l2K36k8n06L21l1J50j45j08r2K65r8M8J81
7969A24P3k0j31k71K30j88M8p4M11j10k27K37n2j08j4J80M5j89K73m75L05j28
7991f1j72L01p7L27k05j08q4J07Q3O4l26K48p3k31J49j52K67Q2J77l85j20J39
8013e0j17R8o1M14j89O7n26L44k03K62J95o2m9l36J52J05k7p1P6j24O0M4o9l9
8037a06J92o2Q7j23n7k5K74k24J04J71k00k08p5J53j0N0L74m56K76J06l05J16
8059E2j69K2J25k09J86K62l8j31j28j94J27L16k69J73K8l04j0N2l4L80P7m18m8
$$ plain form
7902 9 361 -116 155 -109 -278 100 -149 -332 -52 -191 -68 128 -198 -91 124 56 184 84 225 158 -128
7923 -128 63 -184 414 42 -6 25 80 128 -17 -361 106 -284 5 123 22 -14 -138 -172 -1 158 251 -26
7945 -26 -99 228 -71 -60 -128 -383 96 64 -131 -37 -69 167 139 -367 -46 -77 73 -72 -180 -272 -7 -105 -57 124
7969 124 197 177 46 -225 5 -183 -135 -209 202 92 -135 102 50 -58 -72 108 153 -36 237 -238 67 -61
7991 -61 -233 68 -9 318 113 5 -79 28 111 175 -151 97 24 -207 -58 -210 57 139 316 -69 -189 -50
8013 -50 -167 -69 -130 284 95 162 -364 -20 -223 39 234 172 123 -213 -61 44 17 -54 22 -102 -42 2 -67 -106
8037 -106 86 24 111 -12 -69 -94 180 -44 60 231 31 -177 -252 -99 -109 -59 315 -141 135 241 -64 52
8059 52 -117 -95 30 -179 7 269 231 100 -28 -222 -95 221 -48 125 153 -151 -161 -109 -143 237 314 -104 -152
8082a52N61m69J37j70j90K29K01k84K19n1K48k56k78N04k79J64j55j6R0j77q2
8103b06K65j82J15k28M75k45j04j5J31J82l77M28m54K12j53J35N4J07Pl61Q8N11
8125C85m50q3j57K58k6K51m01L77j2K53n31L7J15n2K73j09l96J56Q0L16k79j3
8147hN6k99J67K62k07m2P3J10r5j76M39n25N75o17L79j9p5R5o5k8j51J0p1L1M28
8172B47l62K90l16K31j4k80J44j25K58J88m76J00K67k61J66j61M34j99l02
$$ plain form
8082 -152 409 -60 77 -93 -283 -54 147 -137 82 31 279 23 -255 249 -30 134 -21 -37 53 -124 -206
8103 -206 59 -123 -8 -236 239 -6 -110 -125 6 188 -189 239 -215 -3 -156 -21 33 140 147 -214 -126 385
8125 385 -65 -148 -305 -47 -73 178 -223 154 142 395 -136 -99 16 -36 237 128 -268 -112 -32 284 5 -8
8147 -8 48 -251 -84 178 -29 -71 2 112 17 -159 280 -245 330 -287 92 73 -2 93 28 0 -151 -141 -212 -181 247
8172 247 -115 175 -141 90 76 -204 -60 -185 73 261 -215 -115 152 -109 57 -104 330 131 -171
8191a71
$$ Imaginary data points
##PAGE= N=2
##DATA TABLE= (X++(I..I)), XYDATA
0@%%%%%%Qj6J6j6K4l2M0m8N6p2Q8j00J16j37J62j90K18k54K92l34L82m33M91n56
30b95O29p08P92q85R90j105J229j367J519j685J867k067K290k536K809l115L457
47A819l846M292m808N414o135P011q106R519j1419J4130j8345K5874m3456J59938
61A31882J25283j48802P0702M4802l1172l5718L6346k1679k5591k0153K414J6875
73A45189M211n8255j4979K0247k8806k7073M9956j1355p3688K532L7026l3163
85A1842r266L1036j8475l4532J0005j463L146K9755j3971l8607K1737J3076k7990
98b3707K5016L7750m2129k8291L8918N113k3268K2326J5078k3344j3228l996R600
111d162L6497r038n2161J6832L7081m2549j7642O1048m75n9212O097K8129j3823
$$ plain form
0 0 0 0 0 0 0 0 8 -8 8 -8 16 -16 24 -24 32 -40 48 -52 64 -73 89 -101 117 -137 155 -179 203 -230 261 -295
30 -295 334 -374 418 -467 523 -582 647 -720 799 -886 981 -1086 1204 -1332 1477 -1638 1819
47 1819 -2027 2265 -2543 2871 -3264 3747 -4359 5160 -6259 7871 -10474 15400 -28056 131882
61 131882 257165 108363 179065 223867 192695 156977 193323 171644 146053 125900 128314 145189
73 145189 149400 91145 76166 96413 67607 40534 90490 79135 5447 7979 45005 11842
85 11842 2576 33612 15137 -19395 -9390 -10853 -7707 22048 8077 -30530 -8793 4283 -23707
98 -23707 1309 39059 -3070 -31361 7557 12670 -10598 11728 26806 3462 -9766 -13762 -4162
111 -4162 32335 23297 -28864 -12032 25049 -17500 -35142 25906 25431 -33781 -27684 445 -13378
124a3378N585J7763j9233j2461Q307l962J2176K0129k0775j2053K2988j4139j8393
137b7446M5441J7965n0492m749L4448j2739p927K9085l436k3090O401j715j862
150a16K7036j086k8341J1571Q884k6963J5986M0159k6316l2728K4137J0588j6778
163F033J1621J0951j0792j595r504j1954L1537J9058l9350j1357K8697j3517j9857
176a0029L1210O487l3688l19J0199j7213N346K0511j4651j7439K67p308Q231J7765
190f31j8604j6424K0782p593k8451K6805K8868l1268j6159K1715m941p108K2891
203a0118L185j5598K755j289k910K3278M689k1118J0192J2120k5544K959L9171
216B1772o965k9463Q794P716q067J0252N428j2535M074r63k0505J1535K5321j7433
$$ plain form
124 -13378 -7793 9970 -9263 -21724 -13417 -17379 -5203 14926 -5849 -17902 5086 -9053 -27446
137 -27446 17995 35960 -14532 -19281 15167 2428 -5499 23586 20150 -2940 3461 1746 -116
150 -116 26920 25834 -2507 9064 17948 -9015 6971 47130 20814 -11914 12223 22811 6033
163 6033 17654 28605 17813 16218 6714 -5240 26297 45355 6005 -5352 23345 9828 -10029
176 -10029 21181 27668 -6020 -6339 3860 -13353 -8007 12504 -2147 -19586 -19319 -26627 -18396 -631
190 -631 -19235 -35659 -14877 -22470 -50921 -24116 4752 -26516 -42675 -20960 -25901 -33009 -10118
203 -10118 -6933 -22531 -19776 -21065 -23975 -697 3992 -17126 -6934 5186 -20358 -17399 21772
216 21772 14807 -14656 -5862 1854 -6213 4039 9467 -3068 1006 43 -20462 -8927 16394 -1039
230a039j5984J3987j0249j2953K6132P501k7889J198J3755j5160j908J9414o98
243c893q281k319j1019O114K5152q413j9529J6918L637k5169J1741K7619j4797
256b239j4324J2691n273q847J7173N447j0685j06o257p776J9018Q371k1476K862
270a1421J4885j9955r000K7177M092j8624K374J74r336J3577J0603j3421l27O613
284b589j3583K714J8973o820o697J3133j0817j6650K3841J7194k1471n060J2805
297D973p568l592J2797n43j177M227j5405n817K4214L240j9293Q265O458k0863
311a0084L751K3513q168j2623J0184m164j0557J1566O293n568L738o130j5046
324a3295J4846J5965j6320l652J3937j1930j1444J8569N285j2523N222K87j5337
$$ plain form
230 -1039 -17023 -3036 -13285 -26238 -106 7395 -20494 -19296 -5541 -20701 -22609 -3195 -3893
243 -3893 -12174 -14493 -25512 -19398 5754 -2659 -22188 -5270 -1633 -26802 -15061 12558 -2239
256 -2239 -16563 -3872 -9145 -17992 -819 4628 -6057 -6163 -12420 -20196 -1178 7193 -14283 -11421
270 -11421 3464 -16491 -25491 1686 5778 -12846 -10472 -10298 -19634 -6057 4546 -8875 -9202 -2589
284 -2589 -16172 -13458 5515 -1305 -8002 5131 -5686 -22336 1505 18699 -2772 -7832 4973
297 4973 -2595 -6187 6610 6067 4890 9117 -6288 -12105 12109 15349 -3944 4321 10779 -10084
311 -10084 -6333 17180 9012 -3611 6573 2409 -8148 3418 9711 4143 7881 1751 -13295
324 -13295 1551 17516 1196 -2456 11481 -449 -11893 6676 11961 -562 4660 4947 -10390
337a0390O947J5171o515l657K018j1981J703J6251q111q805J5729m448k4494J1655
351h927K0421j0587q315N016p019k113J0731l229k924Q551r884j3136J5729Q115
365B429j3086N353O644j9391j983K2260k207j1443P070j850q704P756N089m410
379f473P369j017j7732O105J7813p969m642J1232r435j1777J6483O812j2467M323
393a375N806j3084j858J1582j95J496J856j5635k030J9815l363j3784J2997M570
407F798j9781R87J6366l424k775M685r488m469J2945M97m760P933m443j2318J0928
422c19Q430j0928N206J1551j5626q362J7341L969p209M669j921q370O796N665
436A0892n733N978L951j4476n49J3576m891l026J2583q528j6478J1627J1495j0272
$$ plain form
337 -10390 -3443 11728 5213 1556 3574 -8407 -6704 9547 1436 -7369 8360 3912 -20582 -8927
351 -8927 11494 907 -7408 -2392 -9411 -11524 -793 -4022 -6946 1605 -8279 -21415 -5686 2429
365 2429 -10657 -5304 1340 -18051 -20034 2226 19 -11424 -4354 -6204 -14908 -7152 -2063 -6473
379 -6473 896 -121 -17853 -11748 6065 -1904 -6546 4686 -4749 -16526 -43 6769 -5698 -1375
393 -1375 4431 -8653 -10511 1071 876 2372 4228 -11407 -13437 6378 3015 -10769 2228 6798
407 6798 -12983 -11996 4370 946 -1829 2856 -6632 -11101 1844 2341 -2419 5514 1071 -11247 -319
422 -319 8111 -2817 2389 13940 -1686 -10048 7293 11262 4053 8722 6801 -1569 5227 10892
436 10892 5159 11137 15088 612 63 13639 8748 5722 18305 9777 -6701 4926 16421 6149
450F149q16N695q242k768N134l092M466P646j4601j0898J5562M132j2256O699
464B810N207j4278k023J2051m170j870Q276p099r576P341L374k405O786l719j3695
479a2990P790R494j0847J170J2739j0425j2213J0286L836m510N366j680j2054
492a4038L581O229m874L618L967j3076k081J1540o009n206J3970j637j7991K864
506a9143J2192l257r98L302p429O0O290m935J403J2722o529j2340Q863O367o314
521i746O963O311j2724k369J2494j347l585Q689j470p584L969J039r77J0435N01
536A0599j5200L498J1343p028j145J1573n444j0539P292L435n176O751K617r559
550C017r36N308k998N499O111j2321l946J2146l111q328J1124N156j3563j684
$$ plain form
450 6149 5333 11028 2786 18 5152 2060 6526 14172 -429 -11327 4235 8367 -3889 2810
464 2810 8017 -6261 -8284 3767 -403 -2273 6003 -1096 -10672 -3331 43 -2362 4424 705 -12990
479 -12990 -5200 4294 -6553 -5383 7356 -3069 -15282 -4996 -1160 -5670 -304 -1984 -14038
492 -14038 -10457 -4228 -9102 -5484 -1517 -14593 -16674 -5134 -11143 -16349 -2379 -4016 -22007 -19143
506 -19143 -6951 -10208 -11206 -7904 -15333 -15273 -8983 -13918 -12515 207 -6322 -18662 -9799 -3432 -9746
521 -9746 -2783 3528 -9196 -11565 929 -418 -4003 4686 3216 -4368 -399 640 -337 10098 10599
536 10599 -4601 -1103 10240 3212 2067 13640 8196 -2343 4949 8384 3208 9959 12576 3017
550 3017 2081 7389 4391 9890 16001 3680 -266 11880 8769 441 11565 16721 3158 1474
564A474O560j706K976M247r179l576P450l095l103R701k638j0608N064K297q154
579b290O706R141j2203p514Q483J206m056N384j807n814L370j273m756R567M670
594H814j3015j671Q700n043j202J0681l758j1127N747L531n404M170M304o566
608a839j607K189n319M963J0276r755r067R882J003q262O802N996r402j432M642
623i30m126K555Q455n474o354M545j352j040Q900j002j0211N928M534r821K576
638b817J2530n677r047M228J007j125N898r80p330L753Q29o576O206P103r034
653a032k940O692n141l506J1913P34j1478K258M286l245L156M092n097R2L601
668D385o464O34J2164k995r150N136J916n993O537O324q747j745N576m215j341
$$ plain form
564 1474 8034 6328 9304 13551 4372 796 8246 5151 2048 11749 9111 -1497 3567 5864 -2290
579 -2290 4416 13557 1354 -6160 2323 3529 -527 4857 3050 -2764 606 -667 -5423 4144 8814
594 8814 -4201 -5872 2828 -2215 -3417 7264 3506 -7621 -1874 1657 -3747 423 4727 -1839
608 -1839 -3446 -1257 -6576 -1613 8663 -1092 -10159 -277 726 -7536 -734 5262 -4140 -5572 -930
623 -930 -5056 -2501 5954 480 -5874 -1329 -2681 -3721 5179 4177 -6034 -106 4428 -5393 -2817
638 -2817 9713 4036 -5011 -783 224 -901 4997 4017 -3313 440 1269 -5307 899 8002 -1032
653 -1032 -3972 2720 -2421 -5927 5986 6720 -4758 -2500 1786 -1459 1697 5789 692 784 4385
668 4385 -2079 -1445 10719 7724 -1426 3710 5626 -367 6170 12494 3747 2002 7578 3363 2022
683B022P838j063m915J937l384k582J0219J239j1152J938P192p760j555J0535
697A0509j548o507K624r00k766P699K104o635K030J577n258M880P908p259k685
712E773Q281m490o400J0069M845q466j333L183l768L058M773o185j519M419o225
727F015k913Q901q67p584K760m47q180M899P817p708n490M703k615k887M578m47
743E35l399K901l463o530P794O207q407k201N490m446j898P750n67n197L333n19
759b617m875N156L974l789N28J011o426K777R633n422n233P143j054p307N575
774i26N491n119m44J863n183J974O699l146k890L642l483k887P600J045o592M535
790B179K413r145J720R478k382m487K462k087r41N773o23l661M765m61p642M080
$$ plain form
683 2022 9860 8797 3882 5819 2435 -147 10072 11311 159 2097 9289 1529 -26 10509
697 10509 8961 2454 5078 4178 1412 9111 11215 4580 6610 8187 2929 7809 15717 8458 5773
712 5773 14054 9564 3164 13233 18078 9612 8279 11462 7694 10752 15525 9340 7821 12240 6015
727 6015 3102 12003 11136 3552 6312 5865 -2315 2584 10401 2693 -2797 1906 -709 -3596 982 535
743 535 -2864 37 -3426 -9956 -2162 4045 -4362 -6563 -1073 -5519 -7417 333 -234 -5431 -2098 -2617
759 -2617 -7492 -2336 1638 -2151 -1623 -612 -7038 -4261 5372 -50 -5283 1860 806 -6501 -926
774 -926 4565 -554 -998 865 -4318 -2344 4355 1209 -1681 1961 -1522 -4409 3191 4236 -2356 2179
790 2179 4592 -4553 -2833 6645 4263 -224 2238 151 -790 4983 4360 699 5464 5003 -2639 1441
806A441P140m867j196L982m824k263P676P88n211K430Q95m938L114K871l033J924
822E929J517p993O0R125j722o698M290k06o429L326M012m333l34K231n249j794
838d268N604r40k175K207m954l848P120J695p743K565L965o901k469O791K37k861
854e975K061l102l094N632J791m617L155J177o410K353N517l334o77N150m263
869d636n207O909L419m316J176O31l875K942K971l711J416M369n824l492P614
884C86P92m452L765P10o688K721N433l160j075L230k828j705L676n36l18M767
900D718l683o113O121M868n697L06M775m772j973M859j66j971L972k125m762L741
916B098L161l007J932J096o034J260N759l539k219O160k252o202L327L380k534
$$ plain form
806 1441 8581 3714 2518 6500 1676 -587 7089 7877 2666 5096 5991 1053 4167 7038 4005 5929
822 5929 7446 -547 -487 8638 6916 218 4508 4302 -2127 1199 5211 878 544 2775 -2474 -4268
838 -4268 1336 396 -1779 428 -4526 -8374 -1254 441 -7302 -4737 -772 -7673 -10142 -3351 -3114 -5975
854 -5975 -3914 -7016 -10110 -4478 -2687 -7304 -4149 -2972 -9382 -7029 -1512 -4846 -5523 -373 -4636
869 -4636 -9843 -2934 485 -3831 -2655 -2024 -5899 -2957 14 -3697 -2281 2088 -3736 -7228 386
884 386 1178 -3274 491 1201 -5487 -2766 2667 -493 -1568 1662 -1166 -2871 805 269 -49 4718
900 4718 1035 -5078 1043 5911 214 520 5295 523 -1450 3409 3243 1272 5244 3119 -1643 2098
916 2098 5259 2252 4184 5280 -754 506 6265 2726 507 6667 4415 -1787 1540 4920 2386
931B386J882p4m926J328M498l473n13N023m327l899N309K69l861M367J770p822
947b063N16O198j906j061J833k879j618L883j470k329N790q52p793K648M948l653
963A92K48L737m940l021N565l18l155L586J58m585J114J895k585L283K115o982
979c693r57O784j966l721M667K47n212J857K387k864L064J846n384j155M971j735
995h64n60M024l203m189M885J355m973L206L597n222j541L531o9Q2K198l540k511
1012c794M497l52l402M173J339o132N86L765k879L13M940l738m848M424J595k884
1028b397J829P91l275J472J140l127K791M525n347l424N451l3k863L948M33m947
1044c033K056K537k997J481L678l442k009L003j488j02M705j970n184L615K925
$$ plain form
931 2386 4268 4194 -732 596 5094 1621 1108 6131 1804 -2095 3214 3483 -378 3989 5759 -2063
947 -2063 -1547 4651 2745 1684 3517 638 -980 2903 1433 -896 4894 4042 -3751 -1103 3845 192
963 192 440 4177 -763 -3784 1781 1463 -1692 1894 2052 -2533 -1419 476 -2109 1174 3289 -3693
979 -3693 -4650 2134 168 -3553 1114 1361 -3851 -1994 393 -2471 593 2439 -2945 -4100 871 -864
995 -864 -1424 2600 -603 -4792 93 1448 -3525 -319 3278 -1944 -3485 46 -23 59 2257 -1283 -3794
1012 -3794 703 351 -3051 1122 2461 -3671 -3085 680 -2199 -1886 3054 -684 -5532 -1108 487 -2397
1028 -2397 -568 223 -3052 -1580 -440 -3567 -776 3749 -1598 -5022 429 396 -2467 1481 1914 -3033
1044 -3033 -977 1560 -1437 44 3722 280 -1729 1274 -214 -316 4389 2419 -2765 850 3775
1059C775m460J265M001l810j714K320j472J24M231k243m544K998R89l149L034
1074A345K110n636L69L834l571j198N523j106n125J710J803j679K705J57l848
1089b607J557K684l829P17N162k639m175L821k61k687M537J141n177N65L279k550
1105d62M63L392k531j337K546k301k145N986K26n796J604K307k939R65L341l471
1121a52j893K820j409j801M061k49l761J108O12k864L418K933n782p62M656k362
1137a427k591M450L50l562J382J86j955L540J480m157K84L107l196K56M395j515
1153A027l541L512j34l467L481L302m168j284K360j337L13K600k083j470K778
1168A889j643k800M253K116m385j74J760l012Q62L980k422k879K813J44k760L282
$$ plain form
1059 3775 -685 580 4581 771 -943 1377 -95 29 4260 2017 -2527 471 1460 -1689 1345
1074 1345 3455 -2181 -1812 2022 -1549 -2747 2776 1670 -3455 -1745 58 -1621 1084 1241 -2607
1089 -2607 -1050 1634 -2195 -1478 3684 1045 -3130 691 430 -2257 2280 3421 -1756 -1191 2088 -462
1105 -462 1 3393 862 -475 2071 -230 -2375 3611 3837 -1959 -355 1952 -987 -22 3319 -152
1121 -152 -2045 775 -634 -2435 1626 1377 -2384 -1276 -664 -3528 -110 2823 -2959 -3721 935 -1427
1137 -1427 -4018 432 782 -2780 -1398 -1212 -3167 373 1853 -2304 -2020 1087 -2109 -1853 2542 1027
1153 1027 -2514 998 864 -2603 878 4180 12 -1272 1088 -249 64 2664 581 -889 1889
1168 1889 246 -2554 1699 3815 -570 -744 1016 -1996 -1134 2846 424 -2455 358 502 -2258 1024
1184A024M99k680K257m28l337K817M718m048k817M327p39k167L349P27k905J591
1200B188J131l179J843L400k490r68K165k674n42M679j664l665L219O19m215J745
1216A592L259j885j628J015k081j56M027k012l036L105l92l490K646J778l374
1231f32M72K399l856o13M810q54k998J505k98j540K469P38l340J826J636m430
1247b706J94M836j647k763K639j382k262L713J146l599J003J680l200M59K657
1262G68j290l61K207l283j510M729N75m425J785J927l017P57K582j882k65J981
1278A278k435j045L605q4k462J875l22l147K517K750l503j88L107k672k182M126
1294A218J90j895R83q73j849K684J820l203J019K185k863l29L399p27j942L028
$$ plain form
1184 1024 1523 -1157 1100 672 -2665 152 4870 822 -1995 2332 1593 -574 2775 3502 597 2188
1200 2188 3319 140 1983 5383 2893 1925 4090 1416 874 5553 3889 224 3443 4062 -153 1592
1216 1592 4851 2966 1338 2353 272 116 4143 2131 -905 2200 1808 -1682 964 2742 -632
1231 -632 -160 2239 -1617 -2230 2580 1726 -1272 233 -65 -1605 864 1602 -1738 88 1724 -2706
1247 -2706 -2512 2324 677 -2086 553 -829 -3091 622 1768 -1831 -828 852 -2348 -1889 768
1262 768 -522 -883 1324 -1959 -3469 1260 1835 -2590 -805 1122 -1895 -1138 1444 -438 -703 1278
1278 1278 -1157 -2202 1403 1319 -1143 732 410 -2737 -220 2530 -973 -1161 1946 -726 -2908 1218
1294 1218 1408 -487 496 -377 -2226 458 2278 -925 94 2279 -584 -913 2486 1759 -183 2845
1310B845j063l174L014K320k577l11J854k515M14K480k065o47L018k122l649L768
1326A590J665l228L62J081k344n6K570k029j239K454j760j979K505K80j798J795
1342a31P5m103J808L810k739j696L432j379k005K463J08r94J833l72l381J960
1358a311K915k432p04K630k816r71L773j377k230K635M23l681O53K628j457j09
1374a431P39k475J46K960j608j811L053n32l122J800J771k169J197J467k980l32
1390c327L352o89j145J527p63j535K543m9k283K666J439m340P1L645j341j420
1406a649K111j075j957K279M91k051J562R70k734L46J893q70P7J688k432j851
1422c202M083m8l040K245J231k618J26J845j452R32J948l004j212L123J5j789
$$ plain form
1310 2845 1782 -1392 1622 3942 1365 1054 2908 393 807 3287 1222 575 3593 1471 -2178 1590
1326 1590 3255 27 389 1470 -874 -930 1640 -389 -1628 826 -934 -2913 -408 -128 -1926 -131
1342 -131 -56 -4159 -2351 1459 -1280 -2976 456 -923 -2928 -465 -357 -1351 482 110 -3271 -1311
1358 -1311 1604 -828 -1532 1098 -1718 -2689 1084 -293 -2523 112 535 -3146 -2493 135 -1322 -1431
1374 -1431 -692 -3167 -3021 -61 -1669 -3480 -427 -959 -4081 -2281 -510 -2679 -1482 -15 -2995 -3327
1390 -3327 25 -664 -1809 -282 -1045 -2580 -37 -86 -2369 297 1736 -2604 -2533 1112 -229 -1649
1406 -1649 462 -613 -2570 -291 200 -1851 -289 681 -2053 -1707 186 -684 -607 1081 -1351 -3202
1422 -3202 881 833 -2207 38 1269 -1349 -1223 622 -830 102 2050 -954 -2166 957 972 -817
1438h17J967j62k904J846J402k393N81K359k215j935K798J50j515J696j030k139
1454b311K334Q22k964J838J970l350r88K927r03n55K047o92k649K202J129j974
1470a117J449N36j869J71J956k035K4K996k040k632K687J002k494J072J741k757
1486a310K8J848k141K86K164j652j841J980J69j708K611j53l023J288K004k225
1502a675j80K980j723j117J384k88o19K082l62k563J570J216j842R11J896k367
1518f97o92K411j467q40K685O8k674O58J197j232J021J244k531J35K059j672o34
1535i61K832l91k484J161O84j485J513J637k966N7K013j123q34K499q05j919J810
1552A238l14j834K731Q36l273L24K280j536o70J816o22j126J245n45j554K182
$$ plain form
1438 -817 1150 988 -1916 -70 1332 -1061 -480 1879 -336 -2271 527 677 -838 858 -172 -2311
1454 -2311 23 845 -2119 -281 1689 -1661 -2649 278 -625 -1180 867 175 -2474 -272 857 -1117
1470 -1117 332 868 -1001 -830 1126 -909 -885 2111 71 -2561 126 1128 -1366 -294 1447 -1310
1486 -1310 -1282 566 -1575 -1289 875 -777 -2618 -638 -469 -2177 434 281 -2742 -1454 550 -1675
1502 -1675 -1855 1125 -598 -1715 -331 -619 -1238 844 482 -2081 -511 705 -1137 -226 1670 -697
1518 -697 -1389 1022 -445 -1285 1400 1468 -1206 -548 649 -583 438 1682 -849 -714 1345 -327 -961
1535 -961 1871 1480 -1004 157 841 -644 869 2506 -460 -403 1610 487 -347 2152 1347 -572 1238
1552 1238 924 -910 1821 2657 -616 -292 1988 452 -218 1598 976 -150 1095 550 -1004 1178
1568A178P15k416L47J325j683N29J969k209p80K072p20j646J924J072k127L30
1584a20N24j444J160J768k330r15K369j173j378K209K41k145J105P48k366J205
1600e42K333k148j345J858l44p91J270j26j654K105j05k533J659J969k719l93
1616a506J443n63n29J732n68j643J465K55j544R32J322j651N02P88j742L6K770
1633A499j425j892K104J17j766J618O73j636M80J176j929MK697j605j295J721
1649E41l44j244J957p6k062J055J644k590j2K399m54j333J099j099m86J995m39
1666E51j499J483N02k476J245J549j580k97J486j003j115K521L9k464Q75J071
1682H88j661J234P14j499L14J288j903m21K306k39k260J172P89k153J542R44k054
$$ plain form
1568 1178 1893 -523 -176 1149 -534 -5 1964 -245 -1025 1047 327 -1319 605 1677 -450 -120
1584 -120 404 -1040 120 1888 -442 -1357 1012 -161 -1539 670 911 -1234 -129 619 -1747 -542
1600 -542 1791 -357 -1702 156 -188 -979 291 165 -1489 616 511 -2022 -363 1606 -1113 -1506
1616 -1506 -63 -626 -1155 577 9 -1634 -169 86 -1458 -526 796 -855 -353 435 -1307 -1271 1499
1633 1499 74 -1818 286 403 -1363 255 928 -708 -228 948 -981 -977 1720 115 -1180 541
1649 541 197 -1047 910 834 -1228 -173 1471 -1119 -1131 1268 814 -519 580 -519 -1005 990 551
1666 551 -948 535 1037 -1439 -194 1355 -225 -522 964 -39 -1154 1367 1406 -1058 -183 888
1682 888 -773 461 1175 -324 -10 1278 -625 -1046 1260 1021 -1239 -67 722 -1431 111 1055 -999
1699i99O36J207j637n08K175q03o79J014o82j630K018J335k772M80J567j226l50
1716h54J298k53j024J347q85j572K231N46j586J67J061j671K80J919j623o82J686
1733C85q67j501K110M44j733O62m6q49J024R30j401l06J847j484r03J609K55j482
1751a306J215L33j593M86J785j655l11J351r55n45J622n00r34J562k65j866J134
1768d42J876j816k01J288j093j16J361r95r40J717k90j849J271Q27j076M54P88
1785G64j862K46J833q17j112J314l52j164R38Q66j016L94M33j731M85K172j468
1802g7o23J348n79j021J316O49j556J039Q83j807k2K045r46k59O26n57n00J244
1820A203j28j573J902K75k213L72J534q93l17J131j334l52J648l31j500P43P00
$$ plain form
1699 -999 -363 844 -793 -1301 874 71 -608 406 -276 -1906 112 1447 -1325 -845 722 -504 -854
1716 -854 444 191 -833 514 -371 -1943 288 834 -752 -585 476 -1195 -915 1004 -619 -1301 385
1733 385 -482 -1983 127 571 -1162 -500 -546 -1395 -371 559 -842 -1148 699 -785 -1688 -79 176 -1306
1751 -1306 -91 242 -1351 -865 920 -735 -1046 305 -650 -1195 427 -73 -1007 555 290 -1576 -442
1768 -442 1434 -382 -583 705 -388 -504 857 -138 -1078 639 349 -1500 -229 598 -478 -24 764
1785 764 -1098 -852 981 164 -948 366 14 -1150 -212 654 -362 32 465 -1266 -781 1391 -77
1802 -77 -700 648 69 -952 364 1013 -543 496 1379 -428 -450 1595 649 390 1016 459 -41 1203
1820 1203 1075 -498 1404 1679 -534 -162 1372 479 162 1293 -41 -393 1255 924 -576 167 867
1837H67j432P05P63j600Q40Q28j518m70J913k83j386J108%j151Q39N56p82J34
1855f9J085j327o00J340J46o94J128o49j249J446O96j461K91J471j572j50R50
1872G82n08k29J276j231j219J703M36j383M72P50j142m80J448j073k86J793j107
1889Bj149J563O18j065J98Q55j643L57K043j966J18R89n71r15R45L24n32P43l9
1908H75j418Q52J248j163J55R72r49n55J074k34m11J341j56k038J084J355j441
1925E91j28J046r70j60J110r28j30J304o04j314J012L94q71J39P42j285J10J207
1943A265r10r63J353Qj716Q97L46r38Q66M0j244L13J295r35n05J312r77j90O03
1962h0r1q76J076N86j415J19R53k52m81Q05n35p31J016k00j094J262N50j723L58
$$ plain form
1837 867 -565 140 903 -697 143 971 -547 -1017 896 613 -773 335 335 -816 23 579 -203 -69
1855 -69 1016 -311 -911 429 575 -119 1009 360 -889 557 1253 -208 83 1554 -18 -168 782
1872 782 274 45 1321 90 -1129 574 1010 -373 99 849 -293 -773 675 -398 -684 1109 2
1889 2 -1147 416 1034 -31 167 1022 -621 -264 1779 -187 -69 920 349 -566 379 703 171 914 875
1908 875 -543 309 1557 394 549 1521 572 17 1091 857 446 1787 1631 -407 677 2032 591
1925 591 463 1509 539 379 1489 561 431 1735 1131 -183 829 1223 352 491 1233 -52 58 1265
1943 1265 355 -608 745 753 -963 -66 280 -658 208 248 -996 -683 612 -323 -828 484 -493 -683 -80
1962 -80 -171 -1047 29 615 -800 -681 272 20 -461 344 -191 -922 94 -106 -1200 62 612 -1111 -753
1981g53P92p02P9J203j350n73J096l2q18J047M9j192O22M5o21L60J219j365m37
2000a331J141K81j357J059J26q89R15J31j000R23R37j148K7J085o68n71J470o06
2018E25r61J262P8j007P81O21n81p21Q97n26J72R26j039o35J329j3j679J629J77
2037A235j140K47Q11r01K5J283q07p88M83P6n54Q53n80n49O24N16j367N17J497
2056A481j191o86Q14J49o43O37O6r89Q04J22j158M01J081r84l87P98n55l88J112
2075D84k06j179Q39O97j109J67N34n57m64P78p75o3J290m00r75N77M10q81O21
2094b12N91j145K06J001j048l75J002M1q69O55p2o10J306r48p83P4J531q85o24
2113a164J211M3n37O64m02j550J673K89j475M78N12l37l55J437n66q88J760j256
$$ plain form
1981 -753 39 -663 -584 619 -731 -1304 -208 -240 -1058 -11 38 -1154 -532 -487 -1108 -748 471 -894 -1331
2000 -1331 -190 91 -1266 -207 -81 -970 -55 76 -924 -1 936 -212 -185 900 232 -339 1131 525
2018 525 -436 826 904 -103 678 1299 718 -3 894 368 540 1466 427 -208 1121 1108 -571 1058 1235
2037 1235 95 342 1153 252 277 1560 753 -35 448 524 -30 823 243 -306 318 834 -533 -16 1481
2056 1481 290 -396 418 567 -76 561 627 -362 442 564 -594 -193 888 -96 -483 315 -240 -628 484
2075 484 278 -901 -62 635 -474 -307 227 -330 -794 -16 -791 -854 436 36 -939 -362 48 -833 -212
2094 -212 379 -766 -560 441 -607 -982 20 61 -808 -153 -225 -835 471 -477 -1260 -1186 345 -540 -1164
2113 -1164 47 90 -447 217 -185 -1735 -62 227 -1248 -770 -258 -595 -950 487 -79 -967 793 -463
2131d63j234J409O83j312M77N34p76M48P11q63N8O32k82p70R99k08n45L98L72
2150B68p07N13N49p08o67J326m74p49R63k30n12O29k40o41O98P35j312k7R14m09
2170h1o19J074m38o05R31j00r49N27J282j330R3N97o69M1O23k56o98Q19j33j203
2190a094J649K75q37J50K62o27J40O85m08o23O12K46n30M14Q2n69M95K89j053
2209d42J54Q58k01q17R55m80m25O99l45o86Q56J08n94K05L98m27l92L73l00k26
2229g29J032p2j009R76K98j237M67P08q14M7L70p10K22Q35k58r91R39k20m02N53
2249EQ1l95J01N69q49o1O76k03l73P55n30l24L13M42r74M93O34m62n08R96k95
2270I1r18J052k21o93Q10J17q16N59K87k19l04P36p20L24O56o41m55R52M75j363
$$ plain form
2131 -463 -1697 -288 395 -917 -440 94 -682 -234 477 -386 -328 304 22 -748 251 43 -502 -104 268
2150 268 -439 74 623 -85 -752 574 100 -649 314 84 -428 201 -39 -680 18 753 -559 -586 328 -81
2170 -81 -700 374 -64 -669 262 162 -787 -260 1022 -308 -215 382 -287 -246 377 121 -577 242 109 -1094
2190 -1094 555 830 -7 143 405 -222 -82 603 195 -428 184 430 -100 314 396 -173 322 611 -442
2209 -442 -288 570 369 -448 507 27 -398 301 -44 -730 126 234 -360 -155 243 -184 -576 -203 -503 -729
2229 -729 303 231 -778 198 496 -741 -274 434 -380 -333 37 -673 -451 384 126 -865 74 -146 -548 5
2249 5 86 -309 -208 361 -488 -549 127 -76 -449 306 -224 -548 -235 207 -767 -274 360 -102 -610 386 91
2270 91 -827 225 4 -689 121 238 -578 -19 268 49 -255 481 -239 85 741 100 -355 597 1072 -291
2290b91N13O72n28m59R15o86K14N27p13m75J173k94k45K81j64m84M53Q03j060
2309A52k59R83p17l50P13K33o19L85j30r90Q13M04q30K50O09o23j38K24K09l45
2329b6K30N1n89M05L80q35K60J98m36l12R17o19m51R64j26o88N79J05o29j4K5
2350f11k86J35Q61p42l91Q46n73l47N11K09p90O00M60j324L45R03p25k31O13o1
2370e98l30P97n71J6J70L98j172N75Q32n41L80k20q5m15R00J51j026P33L64q17
2390d59M75L20m40K54K08k72k11Q78j90r30R61K68r67O10K44p73L04M44m27K0
2410C17L57M2l45L61mk75K99k6p26O19J97q71M16J3N4m91P60m81m31P59j40m60
2432e6L57L96n55P6J79l29j3O26l22p98Q24j51p07N08N76n57l04K25m26N86L32
$$ plain form
2290 -291 222 894 366 -93 822 136 350 877 164 -311 862 568 323 604 440 -44 409 1212 152
2309 152 -107 876 159 -191 522 755 136 521 391 -599 214 618 -212 38 647 24 -114 110 319 -26
2329 -26 204 255 -334 71 451 -384 -124 74 -362 -674 243 -376 -827 137 11 -677 -98 7 -622 -636 -611
2350 -611 -897 -762 99 -643 -1034 -188 -761 -1108 -597 -388 -1178 -578 -118 -1442 -1097 -194 -919 -1150 -537 -598
2370 -598 -928 -131 -702 -686 -516 -118 -1290 -715 117 -424 -44 -264 -349 -764 136 287 -739 -6 358 -459
2390 -459 16 336 -104 150 358 86 -125 753 563 -367 594 862 -105 505 749 -24 280 724 297 317
2410 317 674 716 371 732 728 453 752 726 0 619 816 -55 361 374 428 -63 697 216 -215 544 404 -56
2432 -56 301 697 142 218 397 68 55 681 359 -439 385 234 -473 35 611 54 -250 -25 -451 135 467
2453D67p96l44O14j28o48O89K26q58O54L27j010L35P18k88p05L15M90q18P93o9
2473c6n47M98K52o91KP69o32n0M51m14k8P21k24n40L43J51k66k5M66m04K0L94
2495B10m50P5L79K3p34O87m20j09K45P86p38r4L91l53K03K04J0p6j1K28m06K76
2517C26L38p01m2P19o63J26M35m35j06L79j55j49M79k92l0j80L50m25j7N30p11
2538b24K16L88k08n82J95N10m97J22L79l22J48L8l34j46M61p7n46P30K6m16J73
2559C4J66j63Q4K19l99j44K64J9m59N13k26o3L60Kl94L72J03k66k69Q16o70k49
2581c50N27j89l07M67O3n58L52J91k88l16M80l08J46J16l58k86O17K24p70J97
2601c50M15p78O33qk90k92P27n50P4M08j79k75K41L06k50K04j01m34K44L81l67
$$ plain form
2453 467 -329 -673 -59 -187 -835 -146 80 -778 -124 203 -807 -472 246 -42 -747 -432 58 -760 33 -36
2473 -36 -583 -85 167 -524 -522 247 -385 -435 16 -398 -426 295 71 -469 -126 25 -241 -266 200 -204 -184 210
2495 210 -240 -165 214 237 -497 190 -230 -339 -94 692 -46 -140 251 -102 101 305 315 239 228 456 50 326
2517 326 664 -37 -79 640 -23 103 538 103 -3 376 221 72 551 259 229 49 399 -26 -43 487 -224
2538 -224 -8 380 172 -410 -215 295 -202 -80 299 -23 125 163 -171 -317 144 67 -479 251 277 -139 34
2559 34 200 37 121 340 -59 -203 61 80 -379 134 -92 -155 205 207 -187 185 288 22 -247 569 -101 -350
2581 -350 177 -12 -319 148 211 -347 5 196 -92 -408 72 -236 -90 26 -332 -618 -1 223 -547 -350
2601 -350 65 -713 -80 -88 -378 -670 57 -493 -419 -11 -190 -465 -224 82 -168 36 -65 -499 -255 126 -241
2622b41oJ47j34j04O96l71n14N81pn36K52P5k21J89J18l78N3M99j59l79L08Q0
2644e2p92N75L01m25K00L6l17J5N65k15k60L17L59q46O60k35J79R0J42l46k87
2665c36N09L21n32J81J11j66J74j31r6L5M93p78O9N27j11k10K32j09m10N78k03
2686A48k48Q6Q58r08K65R8o72L64L23k55m25Q45l33k7J49k54j72K59M30n94j45
2707b08O09o26J88K38j25k82L22Q9j37Q5L0l31N38nj03j91L4K29m83J52J94j36
2729H1K95l2j19j29J44q9k15L69k74k08N12l16q7O3k6l0K61r3k43n9M47k74J21
2752I9K90p54L08L18k99k19M21%l02L00o8k00L2L46r3j28N6K44l60J57J47k21
2774G4j78L70j87j74N22j93j60L03kn90M24K43l90J28J74K7l12L42m08P44l61
$$ plain form
2622 -241 -247 -100 -234 -338 358 -13 -527 54 47 -489 -237 -162 -383 -194 -76 -454 -401 98 -61 -440 -132 -52
2644 -52 -844 -269 32 -393 -193 -157 -474 -459 106 -109 -369 -52 307 -539 121 -114 65 155 297 -49 -336
2665 -336 173 494 -38 143 254 88 262 131 35 70 563 -215 -146 381 270 60 292 183 -227 351 148
2686 148 -100 -14 844 -64 201 299 -373 -9 314 59 -366 479 146 119 268 14 -158 101 531 -63 -208
2707 -208 401 -225 -37 201 76 -206 116 205 68 153 183 -148 390 385 282 91 125 354 -129 23 217 81
2729 81 376 344 225 96 240 151 -64 305 31 -177 335 19 -68 -5 -31 -61 200 107 -136 -195 252 -22 99
2752 99 389 -365 -57 261 -38 -257 164 164 -138 162 94 -106 -74 272 179 51 107 351 -9 148 295 74
2774 74 -104 266 79 -95 427 234 74 377 375 -215 209 452 62 190 364 391 79 421 13 757 396
2795C96k00k12M45k4k10J37l24K13k43J88l0r3L00l59k01N08J69k06J97r3p18
2816c60N49j73k49M59k82K23m66L25J91k86L96k27l59L84j92q4j56N53n36J86
2836a04K62j29l42K46N8l88J45M94o98K96N09o81K98L1l86J68K19N9l00M2j09
2857c10R1M63k90k97R7K13l85Q9L53l32R8Q2j76n2M27k62k57L43K24j19l95N29
2879A34K04n97L10j40K9L32k04k54M9K15j54L09N5l45k2J31l20k6M16l9j6L53
2901D20n11k00L50L76l55m79Q87l06j17j35Q47m58n2M7m82K33J66j58K6K02Q4
2922C85k40o2K13l33J65r0N6J31p0l44Q2K5L18j06P8r7m18O65j46k50K91P0l82
2945e9J65O4M01p58L91R2j14O7K96o07J62m4P5k56K30mj62M60k40l62L83k30r2
$$ plain form
2795 396 196 -16 429 405 195 332 8 221 -22 166 136 43 343 -16 -217 291 460 254 451 358 -360
2816 -360 189 16 -233 226 -56 167 -299 26 217 -69 327 100 -259 125 -67 -151 -307 246 -290 -104
2836 -104 158 29 -313 -67 -9 -397 -252 242 -456 -160 349 -332 -34 -3 -389 -221 -2 57 -243 -201 -310
2857 -310 -219 244 -46 -343 -246 -33 -418 -329 24 -308 -210 -128 -304 -356 71 -191 -448 -105 119 0 -395 134
2879 134 338 -259 51 -89 -60 272 68 -186 -137 78 -76 233 288 -57 -79 52 -268 -294 122 83 67 420
2901 420 -91 -291 59 435 80 -399 488 182 65 -70 777 319 267 314 -168 65 231 73 99 301 385
2922 385 145 83 296 -37 128 38 94 225 155 -189 -107 -82 236 130 208 111 -307 358 212 -38 253 323 -59
2945 -59 106 170 571 -187 204 296 182 249 545 -62 100 56 131 -125 105 101 -61 399 159 -203 180 -50 -142
2968a42K30kl85L83j49J6J03N25j078N59j54l6K3M29k85k33M39j43k65K21j1J44
2990A89L2J48o14M88R7j47R3J29m57j57J07O5J39k09N23o47M72l56n3j12J98n
3012g7J6n6K34m77K80J52r0R4r8j31J10r7J89j11O9p7qK81j30L29m30J00K43l5
3036B80l55J49l26N45j31j03j3l9J31j35J67k28K1J1K73k14j90J91Q6mj78j9K14
3059A33l72L18J2j00L6k99L87l00K5L37R4j97J9j57j66L30r2J82j13J05oj56M3
3082F3K44j95J83k94m08K62J65QP4M2k06j04K70l43K8J41L87o05Q2L24m82L54
3104a0P2Jl79N84r8n69L43k25L07K6R2Pj47j16j54M86m61L02j92o4Q3q9M04p8
3128A25n30L0O32l22P2m29M03J43j68J70n71L36J61k21J06L9j52o2L47k89n7L60
$$ plain form
2968 -142 88 86 -299 84 -65 -49 54 579 -499 60 -94 -130 -107 322 37 -196 243 100 -165 56 45 189
2990 189 221 369 -245 243 340 193 286 415 -42 -199 -92 -27 112 -97 426 -221 251 -105 -158 -270 -72 -77
3012 -77 -61 -117 117 -360 -80 72 -18 76 -22 -153 -43 -140 49 -62 7 -70 -78 203 73 402 -28 72 315 280
3036 280 -75 74 -252 293 162 59 46 7 138 3 170 -58 -37 -26 247 33 -157 34 120 116 -62 -81 133
3059 133 -239 79 91 -9 27 -272 115 -185 -160 177 271 74 93 -64 -230 100 8 190 77 182 176 20 63
3082 63 307 112 295 1 -407 -145 20 28 102 144 -62 -166 104 -239 -211 -70 317 -288 -206 118 -364 -10
3104 -10 62 63 -316 268 170 -399 -56 -281 26 52 144 151 4 -112 -266 220 -241 61 -131 -195 -112 -201 203 125
3128 125 -405 -375 257 -65 7 -422 -19 124 -44 126 -445 -109 52 -169 -63 -24 -176 -238 109 -180 -237 123
3150A23J95o41L78R4j00K09j29Q2k77J13n6P6J72l86K10J15Lq4K66m62M24k3p4
3173B28l19J37J53J94l53J3J04k04K06Q4l85K15m4J67K48m39j90J06L16l19j7
3194i9N50m60k9J98j50J74j67L65m97K39j44l42N93j27J03j52m4R1k16K28kl09
3216a97M73j39k66Q9K09k19l0J19K37l21K04j17l09J43J3j41O5K87j31m4mK25
3238A46k33j06K67k65o5L71k69L80j82P1k05L76k55R7k73K3J40K12j15K15j8l46
3260c4K0l0M8j48P6K98k45K0K07J49l84n1J81M0k83k14L64pK55l75O8L19k4j47
3284A03N7l03O3K47J48k25K8k39R4O1l1N1k73K74j12q2j30RL91l68J65l8j45K25
3308c0p7l01L91kj61K52k58N9p9L34j90j89K12J45ok24J6K01O0k25m8J33o1L11
$$ plain form
3150 123 318 -323 55 149 49 258 129 211 -66 47 -9 67 239 -147 63 178 181 97 363 -99 325 302 228
3173 228 -91 46 199 393 40 53 157 -47 159 243 -142 73 29 196 444 5 -185 -79 237 -82 -99
3194 -99 451 -9 -38 160 10 184 17 382 -115 124 -20 -362 231 104 207 55 11 102 -114 114 112 -197
3216 -197 276 137 -129 -40 169 -50 -80 39 276 -45 159 42 -267 -124 -111 -252 -187 100 -31 -75 -79 146
3238 146 -87 -193 74 -191 -256 115 -154 226 44 115 -90 286 31 128 -145 -122 18 230 115 330 312 -34
3260 -34 -14 -44 4 -144 -68 230 -15 5 212 361 -23 -74 107 147 -136 -350 14 7 262 -113 -45 274 250 103
3284 103 160 -143 -80 167 315 90 118 -121 -27 34 3 54 -219 55 -57 -139 -269 -260 131 -237 -72 -110 -255 -30
3308 -30 -107 -408 -17 -19 -180 72 -186 -127 -206 128 -62 -251 -39 106 100 -124 -108 93 153 -72 -120 13 -48 263
3332B63K9n0k24O9l8k21L44m42K28J0J06P2l9k27J53J76p9j39K91k73j17m0J70
3355B2k25J41k14j09M96l69M6k1r1K34J75j40n3K13m80K13J41J9j51R3J57J05
3377B02m68K32j67J35k2K90o9j03m2l61J89L19k91J62RJ4lO4j36n8J38R1k34K03
3401I4j71P0K71k10q8l08M59k6j69Q8k23J18J53j1j78J8j58J9M02P6j79P0j03
3424A4Q0l14R1L09l53j19M29M8p7j1m54P93m31j84L60j084P25R6J14j27k38M77
3446A44K37j41L21o47J92k62L44l70O8K34k0q1J6o7m8K57l58p4L90L6l65r2K49
3469c7j24K57j34N3p5O0J50k27j79L86j99K31o8mn7L8j32j0N0P5K76l50L93o37
3493b64K24J17j94R2P9J17l19K92O6n76L68J26o4m1o8J4L48j87j66L61Q7m93j60
$$ plain form
3332 263 292 242 18 87 49 -172 172 -270 -42 -32 74 146 107 -120 33 209 130 -9 282 9 -108 -148 22
3355 22 -203 -62 -276 -385 111 -258 -212 -233 -324 -90 85 -55 -108 105 -375 -162 -21 -2 -153 -60 97 202
3377 202 -266 -34 -201 -66 -88 202 133 30 -12 -373 -184 135 -156 6 15 29 26 90 -46 -104 34 125 -109 94
3401 94 -77 -7 264 54 -34 -342 117 91 -78 10 -213 -95 58 47 -131 -113 -271 -252 150 226 47 117 14
3424 14 94 -220 -129 180 -173 -292 137 185 108 97 -357 436 5 -179 181 -903 -178 -82 32 -95 -333 144
3446 144 381 240 561 -86 106 -156 188 -182 -114 120 100 19 35 -32 -80 177 -181 -255 135 171 -194 -286 -37
3469 -37 -161 96 -38 15 -60 0 150 -77 -256 130 -69 162 94 90 33 71 -61 -71 -21 54 330 -20 373 -264
3493 -264 -40 77 -117 -25 54 171 -148 144 210 -366 2 128 64 23 -45 -31 317 130 -36 325 412 -81 -241
3516b41K27l0J59Ol68N66n5j24j62N4L6J01j99k73M63j06m76N08K54k56l81J5
3538b82L67k05L52l17q7J4L13m13J49M56n55oJ08J42l7K01l6j02l54J35J82k39
3560b14j46J27K96J35o6j03M5M9m21J57j7J14L7K9p2J52m5j95LJ14M40l82j49
3583a12j09J4J00P4L4K42J00l01j1j38K46P9l68J85j3k37J35J11P8m3k53K36J44
3606A93j13J39R4j95j65k06r6N66k19k11L39j23j18J37J88m25p5J41J38k10k8
3627b49M32o25L74L48k08m7J56l4j41j86J60J3j46J56J45K88n36L2K06R5m92J88
3649g1J02K27j94q0J60k97K34q5j02Q6K3PM00l55l83J79L43l44K02K16j93o9j30
3672a24J83k50J55J51j69k2K8j05Q1j05p2Q5K12ok6J49j55j08o7L97o34N06m3
$$ plain form
3516 -241 -14 -44 115 121 -247 319 264 140 -22 32 68 169 -30 -303 160 54 -422 86 340 84 -297 -282
3538 -282 85 -120 232 -85 -172 -158 155 -258 -109 347 -208 -214 -106 36 -1 200 164 62 -292 -157 25 -214
3560 -214 -360 -233 63 198 132 29 74 123 -298 -141 -158 -44 -7 22 -50 102 57 -138 -135 -21 419 37 -112
3583 -112 -221 -207 -107 -33 1 243 343 42 31 -107 139 218 -150 35 22 -215 -80 31 109 66 -187 49 193
3606 193 80 219 313 118 -47 -253 -349 217 -2 -213 126 3 -115 22 210 -215 -290 -149 -11 -221 -249
3627 -249 183 -442 -68 280 72 25 181 147 6 -180 -20 -7 -153 3 148 436 -100 -68 138 233 -259 -71
3649 -71 31 258 64 -16 144 -153 81 -4 -106 -20 3 10 410 55 -328 -149 194 -150 52 268 75 6 -124
3672 -124 59 -191 -36 115 -54 -76 -48 -153 -72 -177 -249 -164 48 42 16 165 10 -98 -165 232 -402 104 61
3695F1M4p7q5N6J75j55j36K90k10Jj65J4O27l68j74J69p7M6j15J72q1L07l73J64
3719A10k09L98j24k26K5k2L51O6n89J51j24K86K9J3k92P8L52l51R1N6J50k63R6
3742E2j50m2o2N35k68M5J70k57j92K86m88j51O53l93K5Q7O5J97J75k77l8K36j81
3765B7K5j86L3K96k9Q0J7j53m69L80J8kj36N7k9J65k95K25K68n65J81o9M76m61
3789a46j13K02J43k40P3O7o6M6k24J39R5q4J82k42N6J81k23j11l6K22p8L16m71
3812c12K19J29l00O0L79j3j28k16K78J1l10J1J33m57Q36m60j40O20l54j05J68
3833D9j55K6K36ok15j32M28m44J87j85L59J51k69j40O74n62k9m13L14K51l79M87
3855B33Q1k79j2p0R0j10j9L8L18j10m5k64l0M22j45K43l59J62j85RL36k64q3O3
$$ plain form
3695 61 105 28 -57 -1 174 19 -117 173 -37 -36 -201 -187 440 72 -102 67 -10 36 -79 93 12 319 -54 110
3719 110 -99 299 175 -51 -26 -48 303 369 -220 -69 -193 93 122 135 -157 -79 273 -78 13 69 219 -44 52
3742 52 -98 -140 -202 333 65 110 280 23 -169 117 -371 -522 131 -262 -237 -150 -85 112 287 10 -28 208 27
3765 27 52 -134 -101 195 166 246 263 110 -359 21 39 37 -99 -42 -71 94 -201 24 292 -273 -92 -161 315 -146
3789 -146 -259 -57 86 -154 -81 -14 -80 -34 -258 -119 -24 -108 74 -168 -112 69 -154 -265 -301 -79 -157 159 -312
3812 -312 -93 36 -264 -204 175 162 34 -182 96 107 -203 -192 -59 -516 320 -140 -280 340 -14 -119 49
3833 49 -106 -80 156 150 -65 -197 231 -213 -26 -211 148 299 30 -110 564 2 -27 -440 -126 125 -254 233
3855 233 314 35 23 -47 43 -67 -86 -48 270 160 115 -149 -179 243 98 341 -18 144 -41 -32 304 40 -43 20
3879B0K0N0O3k94K04K40k82j23K14m6K1o7M4r4o5J39o0l18O0J16q4K09J5J32k9
3904H5N9l7M4r1RR9j23l7K5M5m9j60J07j20J00l40L74J72Q5l68j33K16L35n11
3928b14J20Q3l96L44M1j31R9K4m5N9L15j71l29K35p9j64J86J41k55n8o7J55N54
3951D47l07n5j23l4M5L80l55N9j22O4J35j05N4J79k64L5k75J69M9j01j68J64J41
3974A2p8L37l21MP0M1J80j76n0J1j3k82L56m64O35j88no5k19J73K46k57J05j58
3998a06K02l5L9j04j34Q0K6j5J59J1k96L69J32k4m98J52J85l42K43R5l43j81O34
4021B49j57l72K57m68O15j61K54j19m03L97j18r2p8l3K4J32K34l06K41P8mj27
4043D3j4j47K2O2l4k4M57l17K7Kk45j50M16j87J18j48L3m2J08M1J8k61K29j7j84
$$ plain form
3879 20 40 90 153 -141 63 303 21 -102 112 66 87 20 64 -30 -95 44 -16 -334 -274 -158 -242 -33 -18 114 85
3904 85 144 107 151 60 69 168 45 8 33 78 29 -131 -24 -144 -44 -384 -10 162 247 -121 -254 -38 297 -214
3928 -214 -94 -11 -407 -63 -22 -153 -54 -30 -75 -16 299 128 -201 34 -45 -209 -23 118 -137 -195 -262 -107 447
3951 447 140 85 -38 -72 -27 353 -2 57 -65 -1 134 29 83 262 -2 33 -242 -73 -24 -125 -293 -129 12
3974 12 -66 271 -50 -46 24 65 245 69 19 30 17 -265 91 -373 262 74 69 4 -215 -42 204 -53 52 -106
3998 -106 96 61 100 -4 -138 -58 -32 -47 112 123 -173 196 328 304 -194 -42 143 -199 44 139 -204 -385 249
4021 249 92 -280 -23 -491 124 -37 217 98 -305 92 -26 -118 -196 -229 -205 -73 161 -145 96 174 170 43
4043 43 29 -118 -96 -34 -68 -92 365 48 75 77 -168 -318 98 -89 29 -119 -86 -128 -20 21 39 -222 7 -10 -194
4068a94L58k81J38J8j00J44J41k80p7K30%r2J32K34n53K59J08m07K16L89m24O
4090c5L1J96j60M6R9n61N27r2l00J81K33j12J17l67M09l8J6q6j24n5N1J7k47L47
4114I3k60L03m12M68k16P0l0k5K63j27P8l24L8R3j24K14J10j18J04k21j70J31
4136f2J58k03J58j30K15r6J49k65Q8j46L57l73L09j11j51J33k16qJ2Q5j7J72o4
4159foJ43m28K90J1P5j41p8R9K3j39R2l2K27m02p6L78R3K80k28l45J3K41k62L59
4184A81pq9p7M8J63m84J52K9r5j17M23k61j63M06j54m7J41kk70K3L25m15M02l0
4208H2J17p1l02q7R4M52m25JJ71%l38N5L4L2M19k34k77K82M0K63n03L90ok73K59
4233A75R1j00N5K8m14M04k17j05J47n4n8N8K99k38P5l66K41J80j2p7j61J29k14
$$ plain form
4068 -194 164 -117 21 39 -61 83 224 -56 -133 97 97 5 137 371 -182 77 185 -222 -6 383 -41 -35
4090 -35 -4 192 32 78 177 -384 143 51 -249 -68 165 53 170 -197 212 174 190 104 -20 -75 -24 -7 -254 93
4114 93 -167 136 -276 192 -24 46 16 -9 254 127 205 -119 -81 12 -112 102 212 94 198 -23 -193 -62
4136 -62 96 -107 51 -79 136 40 189 -76 12 -134 223 -150 159 48 -103 30 -186 -194 -182 -97 -114 58 -6
4159 -6 -12 131 -297 -7 4 79 -62 -140 -41 -18 -157 -65 -97 130 -272 -348 30 123 403 175 -170 -157 84 -178 181
4184 181 174 85 8 56 219 -265 -113 -84 -179 -296 127 -134 -297 109 -45 -92 49 47 -223 -200 125 -290 112 82
4208 82 199 128 -174 -261 -167 285 -140 -139 32 32 -306 -251 -217 -185 234 0 -277 5 45 308 -195 195 189 -84 175
4233 175 266 166 221 249 -165 239 22 -83 64 10 -48 10 309 71 146 -220 21 201 189 112 -49 80 -134
4256a34J59P6J20l30n2k0M13l87q2L80k07j17M13m60K04J65L59n56n7qk25M11
4278F5L7j08J40N9k45Q1J06j85J4J91l14N2L0l9k3J64j97L99l33Kk1j1l5K91k05
4303h5K46j13j12j88L36j77M9J37k37Q5Kj03q7M74l06K31O0j70K02o51L59nL5
4326a8J34j53J8j85K10o4k9j0j25Q3J93k45JL53k42l7L35k81L02j82K4k70p5M60
4350A97j48j12K22j63j53N7j10O0L84K8l70J12L13q9j75k93J72J65j13pk37N63
4372C03l15J16j02l9j51k59Q02r6o11K25L9j98K31kQ7J42j61J49j22l12K93k53
4394b34M4K78k11K1K64n37J63K64k23K84J58j44J14P3n64N37k78J78l12L11m21
4415b35O14n32J40J53j55J35k22n5L29Q9l18J8j46o8K94k8k58L74j38j1nj33J62
$$ plain form
4256 -134 25 101 221 -109 -161 -181 232 -155 -237 143 -64 -181 232 -228 -24 141 500 -56 -113 -121 -346 65
4278 65 102 -6 134 193 -52 29 135 -50 -36 155 -159 -107 -77 -116 -139 25 -172 227 -106 -104 -125 -136 -171 120 -85
4303 -85 161 48 -64 -252 84 -93 -44 93 -144 -59 -57 -160 -247 227 -79 152 212 42 244 -407 -48 -53 -18
4326 -18 116 -37 -19 -204 6 -58 -87 -97 -222 -139 54 -191 -190 163 -79 -116 219 -62 240 58 82 -188 -263 197
4350 197 49 -63 159 -4 -157 -100 -210 -150 234 262 -108 4 317 228 53 -240 -68 97 -16 -23 -260 303
4372 303 -12 104 2 -37 -188 -447 355 259 -352 -127 -88 -286 -55 -57 30 172 11 160 38 -274 19 -234
4394 -234 -190 88 -123 -102 162 -375 -212 52 -171 113 271 127 241 314 -250 287 9 187 -125 186 -235
4415 -235 379 -153 -13 140 -15 120 -102 -157 172 261 -57 -39 -185 -253 41 13 -245 129 -9 -20 -25 -158 4
4438Dk77K89Nl4j22K23K5l48L96k79J18M20k40l24J56K01Q1j35l82J88J38jj12
4461a0k26M5J20r5M18n09J95l35L03j9M0K99M8q1k36J2J78j42k66K84j79J68L5
4484D7K10l10j8q5K60j40j30P8L67%R8l84j89K33J61j55k14K09J86N1p0j21O8
4507A52j0J48l12J54J95l19o5n2J49n0lJ63j68L42R3n47M1r5L30K5k15k6K11L9
4531A80k76K29o9k47L99L1n93N17J42m2k35j83L09j49k49K44Lk7M8j79o8L79O6
4554B30m75L98L8k22l47O86l50m0M06k80m36K46M70n53k1K13j35N57j50k85J33
4575H3K8Q9l69J18J59k17O1J14k69M32l59R5l1K87n90K19L14l31N2j97P9O0J48
4598b5J21l62jK33l9R7KO6j56K33m36Q3k9n3K75R0Pl13K06J14j17j67K70m76K68
$$ plain form
4438 4 -273 16 21 -13 -135 88 113 -235 161 -118 0 420 180 -144 12 213 294 159 -223 -35 103 102 -10
4461 -10 -236 -191 -71 -166 252 -257 -62 -397 -94 -113 -73 226 274 193 -43 -31 147 5 -261 23 -156 12 47
4484 47 257 -53 -71 -156 104 -36 -166 -88 279 279 377 -7 -196 37 198 43 -171 38 224 275 205 84 152
4507 152 142 290 -22 132 327 8 -57 -109 40 -10 -13 150 -18 324 417 -130 -89 -184 146 171 -44 -70 141 180
4531 180 -96 133 64 -183 216 247 -346 171 313 271 36 -147 162 13 -236 8 11 -16 32 -147 -215 164 230
4554 230 -245 153 191 -31 -378 308 -42 -82 324 44 -392 -146 324 -229 -250 -37 -172 385 235 -50 83
4575 83 111 200 -169 -51 108 -109 -48 66 -203 229 -130 -35 -66 221 -369 -150 164 -167 -115 -312 -233 -173 -25
4598 -25 96 -266 -267 -34 -73 24 26 92 -64 169 -267 -184 -213 -266 9 99 106 -207 -1 113 -4 -171 99 -377 -109
4623a09K76j3l90L09j67M6J28Q4Q2j54R2l38K28j85M46n03J89j23J58k54M75n67
4645b90p1M38J34m38L97k82J79j19r4L1J54j82j73J58J41K0J09j05n1Q0R1J22
4667B49m19K59R1l23j35K46j90R2L23m02N1L55j54j42j68N38m45K88l6k25L87
4688B40j82j97L0L9K3K42l35M40k49l32L36l72M09k09j40J49M8o6k38L40P1l16
4710b69n3j49J84L40Q5k71K30M9m6j23L32k55J58k37k21k86K81J28J48K36k15
4731D6k31pJ04K3j1J15j90n9K08K64j91K88p9j75j41L64l08J74k67L8K15k21J00
4754E9r5Q8J19k66p6M49l22m1K37j60J78M2j26j31J53L3m33K03M03k75j23L45
4776B61l65J03R7p9O8l06L15l26K12J00m55N57R4k9l79M29j34k22K7m6K77k79
$$ plain form
4623 -109 167 154 -236 73 -94 -48 80 164 246 92 184 -154 74 -111 335 -168 21 -102 56 -198 277 -290
4645 -290 -361 77 211 -227 170 -112 67 -52 -146 -115 39 -143 -316 -158 -17 3 112 7 -44 36 127 249
4667 249 -170 89 180 -143 -278 -32 -222 -130 193 -209 -158 197 43 -99 -267 271 -174 114 78 -147 240
4688 240 58 -139 -109 -70 -47 195 -140 300 51 -281 55 -317 92 -117 -257 -108 -60 -126 -364 -24 47 -269
4710 -269 -322 -471 -287 53 138 -133 97 146 100 -23 309 54 212 -25 -246 -532 -251 -123 25 261 46
4731 46 -185 -192 -88 -65 -76 39 -151 -210 -2 262 71 359 280 105 -36 328 20 194 -73 -35 180 -41 59
4754 59 -36 52 171 -95 -171 278 -44 -85 152 -8 170 212 86 -45 108 141 -292 -89 314 39 -84 261
4776 261 -104 -1 96 17 85 -221 94 -232 -20 80 -375 182 276 247 -132 297 163 -59 -32 -78 199 -80
4798h0L18j5P7N4n23K68R1L6l11j17J75j46J87k96K49K1N11m20O1j80J42lK66
4821C65l95q1K22j14j15L3K07j6j20M18l18l94N95l50K20L43m53J09k91K37j44
4842d2J34l6k1M8j06M30o80M68j85J58N0k21n3j69K75l21L98J34kl35o5J91o4
4865a4J52n51K78j57L28P4r4J34k17K33M3j82j98K83j39p4J60J69m41ML61k26
4887g4j06P04m49o8K40k55j55Q7L29m29L68K23m06J98j94J44l04N24k50r0j13
4908g6o7j64L41k81K56J32N7J3l41L56l89OL68l80K40j48Q7l46K79K03J28j46
4930A28j00N5j59J74m8j71K11l53K41J21lj11J83j94K75j99J39P2j88P0j46k34
4952b37M32l18p0P6L55j04m0j02MJ13l17L65j27J57j05j71L57j99j73L2J68k00
$$ plain form
4798 -80 238 223 300 354 -169 99 190 226 -85 -202 -27 -173 14 -282 -33 -12 499 79 140 -40 102 99 365
4821 365 -30 -111 111 -3 -118 -85 122 106 -14 404 86 -308 287 -63 157 500 47 156 -135 102 -42
4842 -42 92 56 35 83 -23 407 -273 195 10 168 218 -3 -56 -225 50 -271 127 261 259 -76 -141 50 -14
4865 -14 138 -413 -135 -292 36 110 16 150 -67 166 209 27 -171 112 -27 -101 59 228 -213 -209 152 -74
4887 -74 -180 524 75 7 247 -8 -163 -76 253 -176 192 415 9 207 13 157 -147 377 127 37 -76
4908 -76 -143 -307 34 -247 9 141 198 211 -130 226 -163 -157 211 -169 71 -77 10 -336 -57 146 274 128
4930 128 28 83 -76 98 50 -121 90 -263 -22 99 96 -15 168 -26 249 50 189 261 73 143 -3 -237
4952 -237 195 -123 -193 -117 238 134 94 -8 -4 109 -208 157 30 187 82 -89 268 69 -104 -72 96 -104
4974a04k60N80l69J60Q1l26K84L4pr5k27N47n25r6L13J59n43M03j48k81O50k66
4996c6J70l30Q3J53l2J48j59k49L43j23J19K24m85L6J67K0Q5k64L95j6k67J16
5018I8j36J16q8K77p04N47j00L04m31R4k05J55M18o16L49j22K59k11K4J67l90
5039a95J53m75K12P5L23L47n62J87O3k06j16K49j11P0l07R4J65J61j33j90K35
5060C9j56l5N27n62L34%Q5l40J65R9j21K7M8p2k76N0K22Mj01j58l9Q5M48m03J40
5085A0K6n27K52J98j37J88O7L2j56K74N7n91M49K6k35o3L38j64j60N9N9J51j37
5108A6K08k41R4K35l35K43k91O4J71J54l21L2n5J33j54Qr8r9K0K20K12k42r2N8
5132f0r5J08j25J46k11L75j03k76K93m9k1L09l83M0K81j68q6l70L27j68J14L56
$$ plain form
4974 -104 -364 216 -153 7 88 -238 46 80 73 -22 -249 298 -227 -323 -10 149 -394 9 -139 -420 230 -36
4996 -36 134 -196 -113 40 8 156 -3 -252 91 -32 87 311 -174 -138 29 49 134 -130 265 249 -18 98
5018 98 -38 78 -10 267 -437 110 10 314 -117 -23 -228 -73 345 -271 78 -44 215 4 28 195 -195
5039 -195 -42 -517 -305 -230 93 440 -122 65 128 -78 -194 55 -56 14 -293 -199 -34 127 -6 -196 39
5060 39 -117 -152 375 -187 147 147 232 -108 57 156 35 62 110 38 -238 -188 34 38 -63 -221 -260 -175 273 -130 10
5085 10 36 -491 -239 -41 -178 10 77 109 -47 227 284 -307 142 168 -67 -130 208 44 -116 -57 2 153 16
5108 16 224 -17 77 312 -23 220 -71 -7 164 318 -3 29 -26 107 -47 -39 -137 -236 -216 4 216 -26 -118 -60
5132 -60 -155 -47 -172 -26 -237 138 35 -241 52 3 -18 291 -92 -52 229 61 -25 -395 -68 -236 -122 234
5154B34j8m43J06J25l14M08r2J45l22L45k26J55R7o8r3plj33M4K6J57j07k0m6
5178e0M42j88j55j50J17n1J8K88k13p5K58J9l58J37k6j37j93L63k11J45L5L90
5200D05j89j86M25n31K69l77K72Q4J86n86L27J28l64K03K50n31K23k53L81p6j15
5221e5L27m38J04r0J52j68J17j6k14M52j75J32QJ84m13K23Mj77L1M14p53L18N42
5244E09n89j25L47k30K7O0k30K48L4J5p1J85l6N1j27LL8K8j02k81K14k4m4K16
5268A16j42R2J62j03j16k09K69r3K86m25M21Q1n29N9K92r7J05j21K36j51J65n9
5290B39m58J98J77j69p3L81j17l24J72j48K53L9J3l82J78J5l89L13J08N4k81J24
5312g7k3m6M62l08k46N11j70j92M68m75j38J19K69l88J34RJ62k91K27Q9k18M74
$$ plain form
5154 234 216 -227 -121 4 -310 98 6 151 -171 174 -52 103 200 132 39 32 29 -104 -60 -34 123 16 -4 -50
5178 -50 392 204 49 -101 16 -35 -17 271 58 -17 241 260 -98 39 13 -124 -317 46 -165 -20 15 405
5200 405 216 30 455 -76 193 -184 88 172 358 -228 99 227 -137 66 316 -215 8 -245 136 60 -55
5221 -55 272 -166 -62 -152 0 -168 -51 -67 -281 171 -4 128 136 320 -93 130 134 -43 -12 402 -351 -33 509
5244 509 -80 -205 142 -88 -61 -1 -231 17 51 66 -5 180 144 195 68 71 109 137 35 -246 -32 -56 -100 116
5268 116 -26 66 228 125 9 -200 69 -24 262 -163 258 339 -190 -131 161 64 169 48 284 133 298 239
5290 239 -219 -21 156 -13 -86 295 178 -146 26 -122 131 170 183 -199 -21 -6 -395 -82 26 80 -201 -77
5312 -77 -100 -146 316 8 -238 273 103 -89 379 -96 -234 -115 154 -234 -100 -91 71 -220 7 96 -122 352
5334C52m74o3QJ19l2P6j1j61J74K4j9k03J29j48R4p6m8K19j03K42j92j57L7K01
5358a2m3j00J58k23K45j33J68Q0j2m99L18L21l21k47L17J0K4J12j9k79M34p1n8
5381A70k71K49j37l16N28m50J20J09K20l23P6J71j56m7J69j83L62j03k30j38J6
5402a64M16o6l8O5j15O8m21o05P91L69l35q25J076J95j485R08k78J007p82J48
5422g1j72j46N42k00k31N52l27M03J87q76j47L75P56o87n50J256p49qJ66j24l12
5443c63M01m2N6j53P2J19J4J91o35N78l92K73q5J61P8j28j3R2j80k18K53j37J33
5466G5k03L65j59Oj59j5mJ29k6L06k39l61N31k19j83oK67k38j26K23LK5P3J27
5490A92l32K06K14k54k6K3j23P6N61l96m83M72k19j68J67P9l28O79l90j26j70
$$ plain form
5334 352 -122 -185 -177 -58 -90 -14 -25 -186 -12 12 -7 -210 -81 -229 -135 -211 -259 -40 -143 99 -93 -250 -213 -12
5358 -12 -55 -155 3 -220 25 -108 60 140 128 -371 -53 268 -53 -300 17 27 51 163 144 -135 299 228 170
5381 170 -101 148 11 -305 223 -227 -107 2 222 -101 -25 146 -10 -57 112 -71 291 188 -42 -180 -164
5402 -164 252 186 148 213 98 166 -255 -860 -69 300 -35 -860 216 411 -1074 -166 -444 563 -219 -71
5422 -71 -243 -389 153 -47 -278 274 -53 350 537 -339 -486 -111 645 -42 -592 664 -85 -93 73 -51 -363
5443 -363 38 -4 52 -101 -29 90 104 295 -340 238 -154 119 34 195 273 145 132 224 44 -174 79 -58 75
5466 75 -128 237 78 84 -75 -90 -94 35 9 315 76 -285 246 27 -156 -162 105 -133 -259 -36 -33 -8 65 192
5490 192 -140 66 280 26 0 23 -100 -24 537 141 -342 130 -89 -257 -90 -11 -339 340 -50 -176 -346
5511c46N65K7m17L80l84J61J57J82q22K66M95j71N3k77J50m06K15j42K77p7P1
5532d3r3pJ57j42k37M49j63J93l3j92j06J44L81m96N75j10l02q3j24K65j56L16
$$ plain form
5511 -346 219 246 -171 209 -175 -14 143 325 -497 -231 264 93 146 -131 19 -387 -172 -314 -37 -114 -43
5532 -43 -136 -143 14 -128 -365 84 -79 114 81 -111 -217 -73 308 -188 387 277 -25 -108 -232 33 -123 193
$$ [...]
8191i6
##END NTUPLES=NMR FID
##END=
