##TITLE=1H_BAY-18K6
 CDcl3, 8 sc, 
 20.8.2019
##JCAMPDX= 6.0         $$ Bruker NMR JCAMP-DX V2.0
##DATA TYPE= NMR FID
##DATA CLASS= NTUPLES
##ORIGIN= UXNMR, Bruker Analytische Messtechnik GmbH
##OWNER= root
$$ XWIN-NMR		Version 3.5
$$ Tue Aug 20 15:07:27 2019 Russian Standard Time (UT+4h)  she@DPX200
##.OBSERVE FREQUENCY= 200.13155
##.OBSERVE NUCLEUS= ^1H
##.DELAY= (6, 6)
##.ACQUISITION MODE= SIMULTANEOUS
##.ACQUISITION SCHEME= undefined
##.AVERAGES= 8
##.DIGITISER RES= 18
##SPECTROMETER/DATA SYSTEM= spect
##.PULSE SEQUENCE= zg30
##.SOLVENT NAME= DMSO
##.SHIFT REFERENCE= (INTERNAL, DMSO, 0, 15.7039)
##AUDIT TRAIL= $$ (NUMBER, WHEN, WHO, WHERE, WHAT)
$$ ##TITLE= Audit trail, XWIN-NMR		Version 3.5
$$ ##JCAMPDX= 5.01
$$ ##ORIGIN= Bruker BioSpin GmbH
$$ ##OWNER= she
$$ F:/spectra/data/she/nmr/H-F/1/audita.txt
$$ ##AUDIT TRAIL=  $$ (NUMBER, WHEN, WHO, WHERE, WHAT)
(   1,<2019-08-20 15:06:22.96 +0400>,<she>,<DPX200>,
      <created by zg, POWCHK disabled, PULCHK disabled
       configuration hash MD5:
       00 E9 B6 7A A2 85 ED C7 34 08 36 98 17 FE 4E 26
       data hash MD5: 16K
       65 AB AF F7 E6 E3 9B 16 21 00 2A 6F FF A0 7A D6>)
$$ ##END=
$$ 
$$ hash MD5
$$ C6 34 A0 FB 31 18 B2 50 4C D8 70 DC F4 72 6E 6F
##$RELAX= 
##$RELAX= 
##$RELAX= 
##$RELAX= 
##$RELAX= 
##$RELAX= 
$$ Bruker specific parameters
$$ --------------------------
##$DU= <F:/spectra>
##$EXPNO= 1
##$NAME= <H-F>
##$PROCNO= 1
##$TYPE= <nmr>
##$USER= <she>
##$AMP= (0..31)
100 100 100 100 100 100 100 100 100 100 100 100 100 100 100 100 100 100 
100 100 100 100 100 100 100 100 100 100 100 100 100 100 
##$AQSEQ= 0
##$AQ_mod= 1
##$AUNM= <au_zg>
##$AUTOPOS= <>
##$BF1= 200.13
##$BF2= 200.13
##$BF3= 200.13
##$BF4= 200.13
##$BF5= 200.13
##$BF6= 200.13
##$BF7= 200.13
##$BF8= 200.13
##$BYTORDA= 1
##$CFDGTYP= 0
##$CFRGTYP= 5
##$CHEMSTR= <none>
##$CNST= (0..31)
1 1 145 1 1 1 1 1 1 1 1 1 1 1 1 1 1 1 1 1 1 1 1 1 1 1 1 1 1 1 1 1 
##$CPDPRG= <>
##$CPDPRG1= <>
##$CPDPRG2= <>
##$CPDPRG3= <>
##$CPDPRG4= <mlev>
##$CPDPRG5= <mlev>
##$CPDPRG6= <mlev>
##$CPDPRG7= <mlev>
##$CPDPRG8= <mlev>
##$CPDPRGB= <>
##$CPDPRGT= <>
##$D= (0..31)
0 1.2 0 0 0 0 0 0 0 0 0 0.03 0 0 0 0 0 0 0 0 0 0 0 0 0 0 0 0 0 0 0 0 
##$DATE= 1566299182
##$DBL= (0..7)
120 120 120 120 120 120 120 120 
##$DBP= (0..7)
150 150 150 150 150 150 150 150 
##$DBP07= 0
##$DBPNAM0= <>
##$DBPNAM1= <>
##$DBPNAM2= <>
##$DBPNAM3= <>
##$DBPNAM4= <>
##$DBPNAM5= <>
##$DBPNAM6= <>
##$DBPNAM7= <>
##$DBPOAL= (0..7)
0.5 0.5 0.5 0.5 0.5 0.5 0.5 0.5 
##$DBPOFFS= (0..7)
0 0 0 0 0 0 0 0 
##$DE= 6
##$DECBNUC= <off>
##$DECIM= 24
##$DECNUC= <off>
##$DECSTAT= 4
##$DIGMOD= 1
##$DIGTYP= 9
##$DL= (0..7)
0 120 120 120 120 120 120 120 
##$DP= (0..7)
150 150 150 150 150 150 150 150 
##$DP07= 0
##$DPNAME0= <>
##$DPNAME1= <>
##$DPNAME2= <>
##$DPNAME3= <>
##$DPNAME4= <>
##$DPNAME5= <>
##$DPNAME6= <>
##$DPNAME7= <>
##$DPOAL= (0..7)
0.5 0.5 0.5 0.5 0.5 0.5 0.5 0.5 
##$DPOFFS= (0..7)
0 0 0 0 0 0 0 0 
##$DQDMODE= 0
##$DR= 18
##$DS= 0
##$DSLIST= <SSSSSSSSSSSSSSS>
##$DSPFIRM= 0
$$ [...]
##$SUBNAM2= <"">
##$SUBNAM3= <"">
##$SUBNAM4= <"">
##$SUBNAM5= <"">
##$SUBNAM6= <"">
##$SUBNAM7= <"">
##$SUBNAM8= <"">
##$SUBNAM9= <"">
##$SW= 24.9336996594482
##$SWIBOX= (0..15)
0 0 2 0 0 0 0 0 0 0 0 0 0 0 0 0 
##$SW_h= 4990.01996007984
##$TD= 16384
##$TD0= 1
##$TE= 0
##$TE2= 300
##$TE3= 300
##$TEG= 300
##$TL= (0..7)
0 120 120 120 120 120 120 120 
##$TP= (0..7)
150 150 150 150 150 150 150 150 
##$TP07= 0
##$TPNAME0= <>
##$TPNAME1= <>
##$TPNAME2= <>
##$TPNAME3= <>
##$TPNAME4= <>
##$TPNAME5= <>
##$TPNAME6= <>
##$TPNAME7= <>
##$TPOAL= (0..7)
0.5 0.5 0.5 0.5 0.5 0.5 0.5 0.5 
##$TPOFFS= (0..7)
0 0 0 0 0 0 0 0 
##$TUNHIN= 0
##$TUNHOUT= 0
##$TUNXOUT= 0
##$USERA1= <user>
##$USERA2= <user>
##$USERA3= <user>
##$USERA4= <user>
##$USERA5= <user>
##$V9= 5
##$VALIST= <valist>
##$VCLIST= <CCCCCCCCCCCCCCC>
##$VD= 0
##$VDLIST= <DDDDDDDDDDDDDDD>
##$VPLIST= <PPPPPPPPPPPPPPP>
##$VTLIST= <TTTTTTTTTTTTTTT>
##$WBST= 1024
##$WBSW= 4
##$XGAIN= (0..3)
0 0 0 0 
##$XL= 0
##$YL= 0
##$YMAX_a= 863216
##$YMIN_a= -1075481
##$ZGOPTNS= <>
##$ZL1= 120
##$ZL2= 120
##$ZL3= 120
##$ZL4= 120
##$ABSF1= 10
##$ABSF2= 0
##$ABSG= 5
##$ABSL= 3
##$ALPHA= 0
##$AQORDER= 0
##$ASSFAC= 0
##$ASSFACI= 0
##$ASSFACX= 0
##$ASSWID= 0
##$AUNMP= <proc_1d>
##$AZFE= 0.1
##$AZFW= 0.1
##$BCFW= 1
##$BC_mod= 2
##$BYTORDP= 1
##$COROFFS= 0
##$CY= 11.3945322036743
##$DATMOD= 1
##$DC= 2
##$DFILT= <>
##$DTYPP= 0
##$F1P= 20.1720416913024
##$F2P= 0.152960286110954
##$FCOR= 0.5
##$FTSIZE= 0
##$FT_mod= 4
##$GAMMA= 1
##$GB= 0.15
##$INTBC= 1
##$INTSCL= 1
##$ISEN= 128
##$LB= 0.24
##$LEV0= 0
##$LPBIN= 0
##$MAXI= 10000
##$MC2= 0
##$MEAN= 0
##$ME_mod= 0
##$MI= 1.114404
##$NCOEF= 0
##$NC_proc= 0
##$NLEV= 6
##$NOISF1= 3.799351
##$NOISF2= 2.8
##$NSP= 1
##$NTH_PI= 0
##$NZP= 0
##$OFFSET= 15.70392
##$PC= 1
##$PHC0= -9214.048
##$PHC1= 16.40096
##$PH_mod= 1
##$PKNL= yes
##$PPARMOD= 0
##$PSCAL= 0
##$PSIGN= 0
##$REVERSE= no
##$SF= 200.130013532006
##$SI= 16384
##$SIGF1= 3
##$SIGF2= 2
##$SINO= 400
##$SIOLD= 16384
##$SREGLST= <1H.CDCl3>
##$SSB= 0
##$STSI= 0
##$STSR= 0
##$SW_p= 3612.71676300578
##$SYMM= 0
##$S_DEV= 0
##$TDeff= 0
##$TDoff= 0
##$TI= <>
##$TILT= no
##$TM1= 0
##$TM2= 0
##$TOPLEV= 0
##$USERP1= <user>
##$USERP2= <user>
##$USERP3= <user>
##$USERP4= <user>
##$USERP5= <user>
##$WDW= 1
##$XDIM= 8192
##$YMAX_p= 0
##$YMIN_p= 0
$$ End of Bruker specific parameters
$$ ---------------------------------
##NTUPLES= NMR FID
##VAR_NAME=  TIME,          FID/REAL,        FID/IMAG
##SYMBOL=    X,             R,               I
##VAR_TYPE=  INDEPENDENT,   DEPENDENT,       DEPENDENT
##VAR_FORM=  AFFN,          ASDF,            ASDF
##VAR_DIM=   8192,          8192,            8192
##UNITS=     SECONDS,       ARBITRARY UNITS, ARBITRARY UNITS
##FACTOR=    0.0002004,     1,               1
##FIRST=     0,             0,               0
##LAST=      1.6414764,     0,               0
##MIN=       0,             -1075481,        0
##MAX=       1.6414764,     863216,          0
$$ Real data points
##PAGE= N=1
##DATA TABLE= (X++(R..R)), XYDATA
$$ [...]
2162C47O00n11j510j76O82J209Q24o42j098o15N88R99R05q64l89o52lR91Q38N7
2182A580q58j130J39N62J221nr65j073o6M32N31Q42n47j285n41M80Q02Q98o71
2201C46r48j080M35R24O50o6j073o89O5R51P39K21r18o54m50P19J130N58p80j051
2221i71j55P50P86M01k69q33j86QJ129Q15l78q94m91K34O30P59L35j433n75J41
2241a97P84J013l27q74q39J9N66O22L49n05j340o51P97J094L22o27j388n5J93
2260a044Q88M76nj072r08L62J246P31p11n47p13P3P78J311k15n85p94m01O95J187
2280G52J90m05r45l7M07P42P41l26j196j83L30Q38K10L19j118r50M28O87O16q3
2300A017o38p65J98O03M77rp04q13j56M12O27J43l12q60l66M73P47P2j04r58k16
$$ y = [347, 947, 436, -1074, -1250, -568, 641, 1465, 823, -275, -890, -302, 697, 1602, 738, 349, -303, -306, 685, 1523, 1580, 722, -408, -269, 293, 1514, 1509, 544, -529, -595, -163, 368, 1210, 663, -622, -1163, -683, 119, 1017, 346, -602, -1682, -1247, -323, 327, 261, -812, -1501, -1436, -485, 254, 475, -443, -1097, -1547, -828, 302, 860, 80, -971, -1126, -376, 410, 811, 542, -291, -477, -469, 660, 1475, 1097, 203, -288, -54, 576, 1335, 1670, 237, -338, -197, 587, 1600, 1273, 399, -440, -421, 145, 767, 1116, 611, -729, -1380, -583, 511, 833, 206, -1182, -1237, -1044, -156, 320, 315, -757, -1665, -1303, -57, 674, -37, -584, -1297, -1224, -446, 865, 650, 65, -729, -1130, -435, 752, 942, 537, -408, -445, -38, 704, 1445, 1119, -77, -260, 70, 908, 1118, 1437, 319, -631, -203, 484, 1100, 1017, 379, -386, -188, 415, 892, 883, 179, -634, -790, -378, 249, 392, 80, -780, -1146, -673, 74, 146, 42, -916, -1132]
2321a132O31M70L45n64o71o5M7P02O50l25j61n58J84M93O74k28m48m12L74N00
2341E06N30l38m78j69L54L59N00n10m15o45M75M69K83m76k57l94L07M19N60m84
2361E96p37l81J69N41K79m76r04K27m8N13M84k22q73o01O02N85N94m78r03m09
2381a442P33Q51L25L8j197n60M99M73J153m09o48q75K58J227P98R5j250q45M78
2400b98P18R82l20n02r09j0J189O51j30q86q51j00P90P60o4p98o66k97O76O54
2420E89J55m52j128m92N01R50M65k79j416k41J76R95N68l97r37n41L4J124Q43
2439E17J4j072n49J56J155N63k36m73j074o7J222J462o81p21r10O06N07M16N06
2458A341p26o97j63P08Q80J42j300n27K24M21N12Km04o16q40J071P27L8q70p11
$$ y = [-1132, -501, -31, 314, -250, -921, -986, -939, -237, 413, 88, -73, -631, -447, 46, 720, 492, 44, -368, 6, 506, 1036, 698, 220, 51, 405, 764, 1264, 754, 339, -306, 169, 638, 921, 445, 188, -206, 101, 520, 1080, 596, -141, -522, -353, 188, 467, -9, -913, -686, -734, -221, 263, 41, -832, -1433, -831, -246, 348, -130, -1033, -1442, -709, 142, 467, 505, -692, -1252, -753, -280, 873, 464, -184, -1059, -801, 426, 1224, 1319, 69, -776, -298, 420, 1402, 1082, 580, -329, -339, 850, 1501, 1371, 485, -366, -466, 324, 1084, 1020, 222, -444, -741, -65, 589, 744, 292, -836, -1328, -827, 123, 588, 309, -1107, -1348, -1172, -177, 391, -6, -943, -1484, -1450, -326, 517, 531, -541, -1090, -934, 221, 784, 548, 75, -999, -1066, 156, 1618, 937, 216, -694, -88, 419, 835, 1341, 615, -82, -245, 463, 1343, 1485, 185, -342, -118, 303, 815, 817, 413, -203, -1043, 28, 755, 793, -77, -788]
2478g88k67O61M71M63l76j167n30R17N65Q63p90j296l16P15Q64L47l02p11m00
2497a077J28J417L91l07o48q31K50J007Q73j86j027o02J27R78Q34k59m87r74L00
2516i3N22M84O5k03p49o81Q61N91K90q58o32l97O01M64N90j34j027j043O44J080
2536C75K51n19p17p91K22Q32R33l1j003p93j1J121O15j15j102l96K65N46R60K93
2556I35r84p44k54J077O58K70l88j140R9M81O73Q41p95o55n56N64P20N79j50j065
2576A66l87K2M74K93L76q93q63J72R32K98l83nj057l3Q54L04O19q85j359K87L68
2597g00P34J79m45n23l70K49Q62O04p74k30o63O67M82K65j20m32l81k5J157J18
2617F54K84r38l78K11M20P18K84p40p05j48O71M78L02l50r36m89N92Q14M48o49
$$ y = [-788, -1055, -394, 77, 540, 164, -1003, -1533, -616, -51, 812, 22, -1274, -1590, -875, -11, 336, 34, -677, -1077, -949, 468, 859, 552, -96, -927, -677, 330, 1203, 1017, -10, -612, -485, 493, 1327, 1068, 581, -393, -93, 429, 913, 978, 775, 26, -655, 206, 797, 1087, 229, -403, -800, -199, 265, 855, 721, -306, -1349, -705, 375, 626, 107, -610, -1401, -1179, -347, 586, 555, -448, -1241, -1252, -131, 484, 369, -733, -1129, -864, -318, 642, 935, -49, -793, -1047, 30, 688, 958, 570, -570, -471, 10, 683, 1524, 729, 74, -482, 82, 802, 1381, 1231, 166, -221, -199, 275, 568, 944, 51, -812, -640, 292, 590, 207, 202, -855, -888, -34, 270, 889, 4, -1355, -1068, -700, 34, 213, -232, -755, -1125, -876, -14, 590, -184, -414, -1077, -410, 72, 337, 217, -215, -596, -621, 536, 654, 938, 0, -378, -167, 253, 971, 1255, 515, -190, -338, 333, 811, 1113, 763, -173, -662, -70, 744, 1192, 543]
2637E43n28n01j9J214M56n18j267k91L56L92P23o4j043n19j24Q83P45K8r30o30
2657a094l00R57O19J71k71p35o14Q23P53N58r96q31M9M51Q77P08n29q84o41N00
2677d29J206O95o65p39m38L19N68J089m92q79j051J92J103J068l73r88o59l79
2695h52R26J035K2r64j255j43R87Q08J90n22j342q00J159P64N06m55r00o71K88
2714a219J240R31m79j283n36L53J259Q69n09q66j053L83R83J001K12j285q70m1
2732i10J155J193j93p86j142l0P96J048K93q70j405M4P12J536J8r62q84l82L34
2751d35J246K55l87q88j117M75J141O28k82j194q89L14Q33R75k25p24j209K68
2769a215Q75J068k7r36o82o89Q26J191N60r05j026r5M94J075Q04p10q73l76L12
$$ y = [543, 15, -486, -505, 709, 1165, 647, -620, -911, -555, -163, 560, 496, -547, -1066, -1190, -307, 438, 466, -464, -1094, -1394, -437, 182, 353, 82, -653, -1267, -444, 309, 867, -129, -960, -911, -460, 417, 1125, 596, -288, -929, -429, 777, 1472, 807, 68, -370, -51, 517, 1606, 1114, 235, -816, -624, 479, 1547, 1174, 186, -473, -852, 74, 1109, 1131, 167, -1088, -1231, -244, 564, 754, 232, -1110, -1910, -751, 13, 519, 64, -836, -1507, -1219, 21, 952, 473, -810, -1346, -993, 266, 1135, 626, -240, -1293, -910, 73, 1074, 1286, 1, -869, -910, 245, 1438, 1245, 459, -683, -713, 83, 1131, 1424, 554, -851, -807, -95, 1441, 1459, 497, -387, -769, -435, 811, 1066, 679, -209, -1326, -851, 290, 918, 636, -558, -1447, -1133, -300, 675, 450, -274, -1483, -1215, -340, 728, 701, -235, -917, -1606, -780, 411, 971, 66, -960, -1055, -561, 514, 1318, 608, -265, -641, -329]
2788c29J112N54l89p37r68L52J179O89k92j049p43L27P51M07K89q31r61n0P28
2807C9R01M8r96o27l45R13O66K29o25p78p87N92O60O45p09p51k91K16J120L6K81
2828D37j048l41O0P04O10m9o94p37L04J128L63J98p31m66l03M29J325l75k58j110
2848e54j61R44N43N31m10r46l62K73P80K65l42p09m53J72O23O47k59r35l8m18
2868h09O69K12N81r29p20KO42O07m6m52p55N1K06P00L65m62k66l50r0P50L81m50
2890a63j86O4Q8J21N73K52j011j05J96K77L66Q1l07m5Q7nM13r6m72M12l18k14
2912HN49j9j45m14J39l3J55M1l59P7j96l12J82M09o5k60p5J45M8k26p1m7J75p9
2936c73K48j15j60N3N58m11j8Kn7Q6k83L52J12k31O4K14L52Oq5o21P02j94M8J86
$$ y = [-329, 783, 1337, 948, 211, -757, -405, 774, 1463, 1171, 122, -621, -294, 457, 864, 1153, 322, -639, -689, 39, 940, 988, -8, -635, -980, -67, 599, 828, 203, -575, -1362, -770, -110, 535, -174, -925, -1216, -1000, 120, 156, 437, -611, -952, -892, -188, 422, 373, -321, -1058, -754, 374, 737, 935, 204, -262, -565, -136, 1189, 814, 556, -554, -715, 229, 772, 1303, 893, -53, -415, -142, 638, 903, 561, -148, -601, -429, 194, 841, 582, -353, -391, -809, -140, 72, 653, -276, -996, -994, -352, 255, 209, -243, -998, -947, -741, -41, 324, -138, -404, -754, -844, -94, 287, -163, -349, -285, -197, -76, 497, 749, -262, -367, -171, 106, 472, 553, 246, 201, 288, 283, 696, 600, 128, 540, 222, 8, 557, 538, 393, -21, 118, 85, 240, 281, -78, -1, -197, -509, -327, 82, 17, -243, -318, -173, -125, -351, -422, -469, -294, -373, -125, -240, -400, -347, 211, -200, -218, -216, -273, -187, -470, -118, -6, -237, -173, 41, 393, 399, 314, -307, 395, 201, 249, 435]
2960D35j99n2K14K10k21j2k24M94l44k53K64j69j32K90k19L13l12L8k11K71m09
2981b28j55M66l28j68k13L01j19L70l15P4k15R4K73j14Q3k45J89j44J02K08J23
3002C9j54k99J63J20M24J56n1l64n9k67N40k0P6O5m66K55J88J93k17j46R6j12
3024A60L29J27j68p3j78j08J04P8J8n69M06k94J67k09J09j59l4m36L27N54l81
3045b30j76k88L1N28j12M8k05J24n1K9K45p5K09k12n7J5J72J26j56M41m70J15
3067E1K58P3M4l08K0L33j03j1Q1r5j49K38k82O3N36m31k23j34M29k5l92J38k24
3090a13P0R3R4k81j30N4N9qm4j65L07n69M26K18l81j51P7J88j92K92J64l2j14
3113a38L08o37R9N65m58m3M00J9j91J00L30o3j12r5J16M15k50j25R4k99J78K49
$$ y = [435, 236, 184, 398, 608, 387, 375, 151, 645, 301, 48, 312, 143, 11, 301, 82, 395, 83, 121, -90, 181, -228, -383, 83, -245, -413, -626, -325, -444, -74, -389, -315, -530, -436, -163, -277, -194, -439, -250, -394, -292, -84, 39, -115, -414, -251, -131, 293, 449, 398, 34, -25, -292, 248, 228, 304, 369, -97, 158, 346, 539, 322, 176, 272, 160, 489, 616, 448, 375, 197, 89, 193, 271, 289, -280, 126, -168, -1, -210, -101, -260, -294, -730, -403, 151, -230, -406, -694, -663, -135, -247, -199, -404, -280, -331, -302, -57, -132, 77, -135, -192, -177, -5, 121, -35, 406, -64, 51, 309, 382, 426, 118, 138, 471, 368, 357, 438, 343, 194, 432, 150, 213, 749, 318, 95, -39, 390, 365, -27, 111, -113, -43, 50, 144, -137, -267, -213, -154, -162, -206, -371, -64, -633, -207, 11, -370, -521, -444, -256, -448, -156, 8, -24, -138, 170, -467, -368, 197, -261, -304, 96, 115, -76, 24, 354, 291, 179, 84, 200, 615, 365, 240, 334, 35, 213, 462]
3135D62p4m5K6j62j34K74j52k07N07l04p1M2q1O0j97k28j31l9K99n57P6N69m20
3158d87j37P9K88k21l7J34o4J77J5N6M66l20k62O20k87j50L56M8k94L5K1N56n07
3181H5n2K37j99L43k24P0J59p7J00N1j47k93K24l44P0M72r4j0k35k67K29O4k18
3204e6j29q1J9J91J4l4m8p96O22R3J15k23j06R4k03L4N29k10K32m57J07L55nj78
3228a21M04l10j30oJ17N26k75N5l16K42j28M75q3J16m66m6M82L39n04M6o15K05
3250GK9M87Q1n79k32p0K21L25Q9l72m19k72P7P35K47j40l98m69j24O04L18k5n14
3273c94m01O0L38O26l21l64k49J27N50J95J91m75l15m4J79O69L51m23m89j57L64
3294A8O70Q9m32k48k31l2N05Q02m23q77j29N03M48J22k07n74o08L35l9P52k48
$$ y = [462, 388, 343, 369, 207, 73, 347, 195, -12, 495, 191, 120, 162, 81, 141, -56, -284, -415, -454, -155, -712, -636, -67, -487, -624, -545, -257, -478, -515, -381, -445, -268, -253, -197, 269, -51, -313, 307, 20, -130, 226, 274, -20, 15, 36, 592, 85, 33, 270, 71, 414, 190, 260, 419, 342, 442, 493, 346, 53, 277, -67, 3, 475, 381, 371, 136, -131, 98, 162, -56, -185, -266, -247, -56, -42, -76, -124, -920, -298, -205, -90, -313, -419, -325, -528, -494, 35, -175, 57, -400, -293, 62, 57, -121, 283, -27, -157, -163, -46, 480, 205, 260, -56, 186, 58, 533, 450, 566, 100, 54, 536, 875, 371, 417, -198, 7, 36, 523, 604, 25, -207, -277, -56, 269, 358, -14, -433, -705, -628, 107, 354, 214, -184, -653, -777, -173, 145, 120, -394, -795, -735, -397, 229, -92, -456, -705, -578, -28, 167, 358, -117, -432, -476, -297, 372, 723, 300, -189, -346, 18, 688, 777, 345, 97, -134, -166, 339, 1141, 718, -159, -288, 215, 663, 785, 578, 4, -604, -269, -308, 444, 196]
3315A96m47m42K15K71L61J24m59m52p7O45L5L48m81n17j16M21L96L88o46m33j48
3336h18L65P22k6n3o04L4K08M48K92j37l89m99L64K00O12j38p04j1o0O43O52o36
3358D65m87j56k10N80N74j17q03J04k05L10O00n69k33q2j21J77J75K20o05k90
3378f73K90oK85lj01m78J86L18J39L01l89p15L30L28L07K32k22n47L9K34O89m
3400E40l80l29j18K49P01K16n26m12j06J07O73l2K6o63JJ01L87K35R3p75p41N79
3422a74K66O20j24o02n73P0O66J73l57R3j047L95O4O29J85q08l53R5M20L25K43
3443B06k69p20k3M30N62J55o70q9k01K09Q22K50l8o65l03O6N35R05p55n62k03
3464c58K2O47N34R0r06k48J93L21P76m15n98k83m89O19M28L63n57n15l74o4R91
$$ y = [196, -251, -693, -478, -207, 154, 278, -181, -633, -710, -65, -30, 318, -163, -680, -796, -375, 21, 409, -237, -670, -818, -453, 269, 243, 190, -414, -380, -172, 276, 568, 431, 42, -457, -93, 107, 719, 581, -123, -134, -194, 449, 1101, 465, -22, -178, -388, 192, 766, 649, -154, -50, -255, 55, 655, 86, -147, -229, -350, -173, 2, 222, -383, -673, -383, -389, -104, -107, -208, -686, -500, -182, -43, 258, -131, -846, -516, -188, 119, 351, 129, -418, -379, -145, 544, 540, 160, -169, -287, -38, 663, 879, 353, -59, -165, -58, 615, 583, 609, -54, -53, 48, 435, 670, 763, -12, -753, -174, 92, 712, 588, -14, -587, -517, 149, 322, -35, 58, -989, -594, -530, 99, 284, -524, -877, -782, -362, -37, 206, -63, -783, -806, -376, 186, 341, -329, -418, -619, -410, 412, 662, 624, -41, -344, -278, 257, 1162, 407, -155, -358, -336, 311, 845, 935, 29, -219, -26, 295, 1071, 656, 58, -225, -714, -95, 333, 696, 139, -376, -750, -814, 177]
3485A77N54l60j074k38L01R18j3j10p86k02J21O57M12K16q27p36J39O30O91J22
3505E92o04n81k38Q38O82J08m25p43k90N55M67Q53o11q06n75J073L84K67j36r54
3525a44m96l2J301R7n3r00l45KN85O66P4n92q29n80J101O26J28n42p74m1N8J073
3547C83J37m21p33m71K99R46L45k92o60k79J3Q73K40J4p55m62O92K36N18J56l93
3568C86j181m1Q22R33R7o61n66l09N24Q44R6l69m89m92N56P73J42l30p77o04L85
3589b61M13P82l21p14l43N9M69N29q7r38n69K79L86L80K05r56qj42K96P68L06
3610E33q75m52j55M86J063j5n59m91j11L34P18M15n75m50l61K5J146J13l92m40
3630d3l91M53P48nN4n09o37j4O02N58j5m20q41QQ07M05k24jj125l05O05L35N03
$$ y = [177, 731, 371, -703, -941, -640, 278, 265, 155, -631, -833, -712, -55, 357, 573, -254, -990, -851, -221, 470, 592, -12, -593, -831, 7, 689, 797, 372, -371, -661, -106, 361, 1214, 603, -203, -778, 295, 679, 946, 810, -144, -640, -672, 629, 726, 673, -227, -572, -570, 15, 681, 755, 163, -666, -1246, -145, 481, 609, 67, -707, -748, -690, 383, 520, 99, -634, -1105, -806, 140, 485, 193, -467, -746, -733, 140, 380, 394, -361, -823, -131, 105, 623, 779, 386, -795, -836, -14, 919, 1016, 355, -211, -520, 4, 848, 944, 575, 86, -406, 150, 923, 1065, 735, -42, -646, -261, 152, 934, 613, -101, -444, -385, 84, 613, 526, -412, -981, -702, -316, 64, 269, -687, -695, -837, -541, 227, 533, -342, -794, -949, -463, 600, 585, 26, -465, -576, -242, 476, 891, 316, -134, -495, -470, 676, 789, 397, -43, -434, 19, 767, 762, 816, 307, -330, -344, 258, 816, 801, 381, -460, -452, 355, 760, 536, 535, -590, -895, -290, 45, 548]
3653E48n49o96l96M20Q28O37r51p27q5N47P03k3j41o97m88M30P20O08k93m36q86
3674i27L99O60K46L10o13n02Q6M21Q02N4l42p32j64N12M58J65l18n61r1J59M57
3695D79K11j2q47k3K64L91K97n72k50n75L07K62K76J94o23k48K80Q9K13k01k59
3716c47k21j3N16K87O2m15l22J3J50J17M37l25o4p3L8Q5L42L31n77j5k9K94K4
3739B95l2j04k75N12k28L96p0k94p4j18J58K04j3r9k90q5J39K58k49q6m17M63
3761ij94Q0J16P3m75j70L46L0L1K21q1k25m9M55k58m1J2k26j61O27Nj49P2p5j35
3786a80N46n37L84N5l79K4l2L70J63qk69j6QJ09N1J56j88n9k32L57j22R2o4j00
3810A29j23m01M09J35J72l80Qk68j00M18l54K98k52k9J37O8Jj39j27J84j11L9
$$ y = [548, -1, -697, -1093, -673, 155, 792, -159, -886, -971, -424, 279, 256, 115, -582, -1070, -640, 80, 688, 395, -41, -927, -528, 132, 378, 688, 75, -427, -341, 80, 882, 936, 594, -138, -302, 210, 668, 833, 515, -46, -137, 22, 479, 690, 678, -169, -192, 72, 463, 760, 188, -62, -637, -330, -68, 208, 402, -221, -469, -189, -100, 113, -88, -347, -568, -581, -65, 222, 284, -131, -453, -440, -290, -173, 264, -61, -125, -198, -160, -75, 267, 598, 21, 6, -23, 271, 295, 263, 159, -116, 396, 168, 564, 494, 200, 126, 8, 166, 370, 357, 258, -32, -117, 22, 280, 31, -55, -472, -9, -203, -123, -7, 66, -409, -579, -233, -203, -172, 49, -32, -257, -306, 149, -109, -150, -138, -364, -525, 102, 107, -42, 30, -45, -180, 366, -171, 213, 268, -111, -87, -119, 251, 414, 406, 137, 121, 129, 238, 289, 445, 257, 198, -34, 323, 201, 293, 229, 129, 6, -395, 14, 149, 321, -59, -51, -319, -419, -1, -355, -57, -309, -338, -201, -133, -132, -271, -398, -214, -325, -286]
3832b86R7K93k43k16J65K50j08lo0l77M35K79r1j04r4r3J72K74J84N8n79n2J53
3855E4J73q5J04J37o01N3M88K2K47j49n17J0k7M08q9l70M7k10K07j16K52k18l18
3878d98R4k6R6Q69n62k24m53L04M79Q3k09k4l07RP5J10M15k70m43j64O30J83M72
3901F39p48P7l80N92J81P2j40M1m46J41M60q4J29k54m20n3L26N34k91j90k19O6
3923C3J12J53p8j22n67JL03J62M05l22m64j27L1L69K88k65l99j92M32J33M94l56
3945B4m36l23K48P09M14m86j12o27K82P45Q5q7l88m06q0M87L59N27o02p16J71
3966b12M35M30j66j74l44j83J55N60P3k93l47m94M48M32M2j1m19l28j04R78L7
3987E15o05k68l93J5O65K28N8k93n73k87Q93M2Q1j96o34j9L86M98N01p48j35J3
$$ y = [-286, -189, 104, -139, -355, -190, 60, -48, -51, -111, -488, -53, 226, 135, 31, -63, -156, 16, 290, 474, 532, -47, -99, 54, 227, 142, 246, 383, -218, -165, 323, 345, 592, 443, -74, -64, -91, 317, 228, -142, -95, -305, -98, -214, 38, -180, -498, -404, -430, -334, 535, -27, -251, -704, -400, 79, 162, -47, -71, -378, -369, -294, -184, 231, -39, -482, -646, -16, 167, 639, -109, -32, -412, 180, 361, 433, 293, 334, -112, 29, 489, 405, 534, 280, -140, -193, 133, 667, 376, 186, -33, 33, 145, 298, 220, 98, -469, -468, -165, -3, 402, 80, -384, -511, -480, -111, 177, -88, -487, -679, -247, -114, 380, 24, -412, -735, -487, 222, 636, 150, 38, -589, -307, 438, 523, 436, 48, -358, -438, 49, 408, 935, 333, -383, -212, 223, 653, 487, 313, -31, -214, -59, 501, 574, 281, -66, -560, -112, 320, 362, 351, -68, -396, -500, 478, 515, -90, -358, -751, -736, -71, 157, 215, -78, -651, -938, -45, -3, 78, -118, -752, -771, -385, 113, 614, -134, -269, -256]
4009b56q4M95L47k32m19n79P23M14L41k80o24n1nP02M05k95p01J2j76Q55K08k14
4031E86o89k63J8O65L42k97m32m32J06K55N89j00m76n96m1M82L40R8o10k65n9
4052g79N47P08k11l20o45k23Q57J55J40l61m30j11L49O57Q4M7r67K92J84L09L99
4073F81k40n31l18L23M36M91j61n24l07q7L87M28K59q90j38m1N95J76N11p65p01
4094d16K05J16M28L45q92l24J30L4M88K44l18n21J1J75L32O18j44r49k35L84J45
4115a44K49J6J7q48R7O13L43J02n53l26J26M80N66q3p23Pk50J44P94J47q98J22
4137bj75J50L21M11k93n18k72J55Q00K72o22l44l32J59M64K35j47o62l32K6R02
4158A96J9K05m96n88M99j0N26lm90n13q5M84L25J78l35l71o5M20K23K51m26j21
$$ y = [-256, -340, 155, 502, 270, -149, -728, -5, 409, 750, 470, -154, -205, -210, 492, 897, 602, -99, -87, -263, 592, 800, 586, -103, -366, -348, 317, 659, 362, -70, -502, -396, -141, 448, 348, -128, -724, -765, -283, 57, 155, -455, -720, -779, -232, 476, 265, -55, -700, -923, -66, 89, 229, -132, -562, -673, -324, 333, 417, 464, -503, -211, -27, 282, 681, 441, -90, -408, -85, 351, 842, 681, 157, -150, -237, 150, 578, 837, -53, -191, -232, 363, 539, 1050, 285, -416, -211, -95, 333, 678, -214, -538, -408, -374, 114, 358, 40, -481, -470, -295, 37, 655, 511, -438, -673, -289, -144, 105, 121, 138, -710, -613, 0, 343, 445, -108, -434, -308, 172, 738, 655, -68, -61, -311, -167, 627, 774, -124, -2, -177, -27, 294, 705, 412, -106, -378, -223, 577, 849, 227, -117, -449, -290, 174, 409, 262, -400, -732, -706, 196, 215, 420, -76, -664, -165, -175, 351, 348, -142, -655, -740, -256, 69, 247, -88, -459, -524, -104, 119, 370, -56, -177]
4180a77l66K55N28J62m08l6j69K39N13L29j67m99l65j81N59M44J02p01l43M51
4200A70j68P98l15j69o82K18j0O92j29j44n01j22q2N38K86l44m73m51M32M87K28
4221B59k75k22j45q5L72K55j54J09o95J06O22J71K4l57n04pO16K84R3k39o92O2
4243d02K54N89L1j26n58O3J12M14J36l64q0l65R0M92L67r0o42m06K43L84K24J68
4265E34n40j37l29M05M48l21k08j01l69O33L1K69K3r62J22K37N86o4j80m82n5
4286d60j30M19K71pL1l27J37M40J50j59l95j11j97K78L87N03o89k29j28N20K9
4307C33L09m7q36Q4j0O03J64k76n79PJ76J97J47K09o58n90M14M38j9J24q13n2
4329f75J78M34J00Q4k58o75K94K03Q05j86k32n10J62K97K19l1q0o60J23N10L81
$$ y = [-177, -543, -288, 240, 402, -6, -42, -211, 28, 541, 870, 703, 204, -161, -342, 217, 661, 763, 62, -281, 170, 2, 800, 485, 316, -366, -148, -158, 534, 405, 261, -240, -362, -444, 94, 380, 36, -437, -888, -456, 31, 259, -16, -238, -383, -468, -96, 159, 5, 114, -581, -475, 147, 318, 342, -15, -519, -526, 90, 374, 467, 228, -464, -402, -148, 441, 472, 346, -212, -149, -37, 377, 513, 149, 69, -296, -206, 286, 653, 563, -79, -485, -242, 142, 366, 534, -6, -143, -472, -67, 381, 60, -148, -249, -618, 15, 46, 315, 338, -624, -502, -265, 321, 257, 77, -405, -460, -590, -171, 100, 93, 124, -203, -66, 374, 524, 365, -30, -141, -338, -60, 327, 830, 141, -88, -216, 304, 333, 642, 595, -241, -157, -167, 436, 600, 324, -255, -248, -72, 125, 272, 481, -177, -767, -353, 85, 66, 190, -623, -675, -497, -63, 37, 121, -137, -812, -518, -315, 490, 304, 72, -438, -276, 21, 240, 209, 129, -531, -408, 102, 483]
4350D83J63j22p59K90j05Q04K33p94k96l0j4N36J02o9m53k07j70R99r3j03n12
4371a17m25K11N50P1n5n35p12O96M30N01l51l09o34J86L27M97J13n19o02k94P65
4392b06L83K96n04m09j88M65M21J95k34q92L33L15L25l8K6p14Q1O87Q7M12j83
4413F58o07l63J59O42N19n15o06k92O20L2M43o0q50n83J48P61K27J14n13n57K0
4434f03N40O87J26q25m93j3M79M16O1m82m24n28J107K07N7l01o00q7M07N51M66
4455G48m24p12j02K53O89K17m76m68m07Q69K28L09m90k40m27P6P59L42q6n93m26
4476c61o4L36O34L29n33o65m0N28K81L39q80l42j00L94L73M06m57r05l0M71J75
4497a11N56j92o90o5r5N33P59j59p98o49L69L14P38J66o98p47J17P51O22j60n78
$$ y = [483, 646, 524, -235, 55, -50, 754, 987, 193, -103, -133, -147, 389, 491, 422, -31, -238, -408, 591, 498, 395, -117, -542, -331, 219, 290, 235, -300, -1012, -316, 114, 615, 264, -45, -679, -493, -166, 331, 444, -75, -677, -971, -206, 177, 473, -31, -440, -628, -163, 258, 453, 219, -673, -340, -25, 300, 262, 288, -426, -345, 342, 429, 841, 658, 51, -312, -153, 489, 1008, 493, -113, -405, 215, 247, 690, 630, -220, -803, -655, 106, 333, 447, -66, -623, -603, -63, 624, 750, -75, -568, -581, -102, 314, 375, -107, -531, -1059, 48, 255, 312, 11, -589, -676, -269, 282, 748, 324, -388, -490, -237, 452, 669, 193, -275, -682, 187, 415, 724, 234, -6, -433, -357, 402, 744, 658, 65, -361, -425, -89, 545, 874, 341, -324, -364, 164, 445, 784, -96, -438, -538, -144, 229, 635, 178, -727, -757, -286, -111, 445, 253, -437, -502, -597, -64, 695, 536, -262, -911, -542, -228, 510, 676, -22, -769, -652, 99, 721, 561, -17]
4518a7m07K67K79M66J0n07l27m53M19Q95L23p42l63l30L26K35L93J07q10l33K93
4539b76N32P03n62m45o96K00O10L83j06o35l50n7O60M61l82k42l90k80P52K5P72
4560F77n94q33P7O15L97L54o97j72q10Q16L79M68j42p18k15L57L22L92k63n21
4580a11O9j31N04N9J57n01m47J00O99L32j97j8j049Q9K38M97J00j19p61j46M88
4601a48P45k21l46m25r2R4M39K51q6m57l04L10L1M58n8l83o62L87L92L78O0k08
4623A55n78l3M36M06K64l39o83J94L67M82k6l25l50k6o0K16N03J1m88k90J09L42
4645B87M53k64k10p07J38J99P00k45n32k44r8L37L37J62n14k33nL91R6L23m67
4666i6r4l74J29P33k97K30m53k07J37J61L70l27J07l69l0N43L49K2p91J23L2K62
$$ y = [-17, -424, -157, 122, 588, 598, 91, -236, -689, -270, 625, 948, 206, -157, -487, -161, 74, 467, 574, -236, -569, -276, 256, 959, 397, -48, -744, -544, 66, 449, 343, -292, -642, -699, -39, 422, 40, -202, -592, -872, -120, -95, 677, 83, -750, -673, -58, 339, 693, -4, -176, -986, -170, 209, 677, 535, -183, -398, -41, 281, 673, 410, -111, -42, -173, 331, 390, 547, 46, -401, -301, 398, 730, 533, 515, -534, -445, -207, 290, 390, 271, -490, -636, -148, 597, 376, 30, -395, -487, -393, 46, 297, 211, -246, -550, -240, -209, 249, 191, -192, -854, -467, -75, 303, 363, 155, -423, -456, -20, 386, 650, 311, -372, -178, 189, 671, 645, 320, -30, -56, -116, 100, 603, 614, 126, -164, -55, 287, 740, 476, 266, -441, -303, -104, 596, 351, -181, -425, -523, -186, 151, 313, -201, -434, -439, -48, 48, 371, -96, -190, -564, -435, 298, 1, 231, -222, -429, -292, -131, 239, -88, 19, -350, -380, 163, 512, 534, -257, -134, -102, 160]
4688A60L94M4m35m21J87L16p2L78m03R8p96L65J51K33K39m93p5Q2J44L7j62l66
4710c95O3K90P6N6K79o29l39J98K00M52n5k56k46LL5L75J14l16p2l46M28k4M55
4733C46j90l75j73J85N42k10Q5m95P0M50J9M80j17o38j89L08M13l96o0n9l15J63
4755a56M21K96j97l5n69L0n8P04Mp38n6k72L22M67n4J18j83n21PM18L34j14m46
4778b78j90J19J98M66nk43p70N80ML56Lk33m23l0M03K58J13k60l41L46O7J58K06
4801E04l80l92P2K73J57J22r7m23K50j16K62J16k71q7J03Q9k78M2J34j08j01J63
4823C4P2J3j03N6K59n57K74O5O4j24l36n3L19O5k25N21o74r4N36l2Q1m1p23N52
4847e1K14J30J77k58l14K00q5J10J90m2m40Q0L11M9j46R6k10m66L98P9J04j32
$$ y = [160, 554, 598, 163, -258, -71, 245, 173, 551, 148, 246, -550, -185, -34, 199, 438, -55, -130, -48, 96, 133, -29, -395, -332, -42, 34, 90, 369, -260, -599, -401, -201, 251, 196, -60, -306, -303, -268, 107, 221, -95, -167, -513, -85, -109, 346, 156, -219, -392, -207, 335, 125, 210, -285, -215, 235, 254, 734, 617, -21, -210, 98, 511, 115, 55, -4, -319, -156, 265, 561, 364, 329, -240, -210, -268, 436, 440, -298, -354, -626, -304, 163, 109, 227, 44, -477, -470, -52, 282, 168, -278, -468, -349, -151, 315, 310, 67, -703, -123, -119, 237, 240, 7, -416, -446, -43, 215, 328, 68, -273, 73, 140, 298, 504, 124, -268, -196, 77, 234, 356, 259, -164, 86, -30, 232, 348, 77, -10, 93, 182, -96, -54, 80, -28, -129, 34, 106, 119, 16, 72, 331, -226, 48, 113, 177, 53, -283, -336, -17, 48, -177, 344, -330, -424, 112, 80, 161, 120, -603, -51, 163, 293, 470, 212, -102, 98, 13, 123, 313, 271, -169, -89, 222, 271, 125, 221, 11, -455, -57, 22, 126, -6]
4869fL36n07K97J07J46k23O3l85RM26k37J40m27J46J5j1M5J00l44k3J51l13J88
4892c07K18O5m3k59J86J83j40O6j32P9J02J51q3l00K09J64k69N33k69L1l61M1
4914a35K11K57k05L43l49L5j02l9J41j35M6j55L10k43L68k87R5m30K81n8K15k08
4936d4N5k25p9L41j75j14J40k89J06N51k02j8k74J74P9k8Lk23l3N02m13J12P8
4959B4j3L60n28n1M00l29L45k52L62k05M1j9J33L0k65O1K26p8N1J05l44j86P8
4982e4O1J51K19m34J93q2k99N31k19j09o1j02K76O5m31L11j63R7j85K53j63r8
5004b43K46N5j65M2k03K10J94m87P59o50n7L46m3p8J02k59K12J38R0l78K83k2
5026I2j35J77K01p6l07K83Q0N2m74L09k51l13M43j38N06l47l19Q1J96N2p1m9n
$$ y = [-6, 330, -177, 120, 227, 373, 150, 213, -172, -163, 263, 26, 166, -261, -115, -100, -111, -66, 34, -310, -333, -182, -495, -307, -89, -24, -67, -326, -140, 43, -97, -31, -163, -84, 18, 169, 86, -214, -5, 159, -110, 423, 154, 185, -176, -135, 76, 333, 128, 471, 122, 157, 55, 16, 157, 22, 68, -87, 223, -20, 348, 61, 156, -274, 7, -51, 164, -44, 11, -214, -293, 48, -127, -241, -101, -390, -284, 267, 65, 47, -227, -53, 26, -2, 1, -222, -255, 247, -166, -54, 24, 11, 371, -157, -208, 192, -137, 208, -44, 318, 113, 154, 135, 268, 298, 33, 94, 320, 242, 293, 398, 54, -132, -54, 7, 158, 377, -57, 136, 54, -245, 286, 67, -42, -103, -205, 71, 136, -295, 16, -147, -50, -235, 18, -145, -243, 3, 58, -107, -65, -268, -58, 136, -351, 408, -242, -299, 47, 4, -74, 28, -231, -19, 119, 209, -169, 114, 92, -43, 134, 335, 259, -48, 235, 315, 367, -107, 202, -49, -362, 81, -57, 449, 102, -217, -136, 60, 112, 41, -8, -13]
5049a3O2l35K46K01r8m17M0mk17L27M22k17k43Q1N9K57j37k86j5l9M04J66l33
5072h9K18j12l8J89J80l24J80k80J52jJ28n0O6r0n1K24k47M31o46J48j5L63m63
5095a27J61j6J9K70k07l46K63k73L0L56l05jj38M78l20P4k42J25K41j14K9j28
5117a71l60K78m3N17k89K01l55J26j66L30J55j55O9j38k33L07J88p0k9r1O3l20
5139a86M14j06j88J4K18k18j66O11l98j09q1R6j49K46O6O6l70K70J02K2j14l5
5161Ek40J96j6K9m4k46L08k1l3K83m77J25j9j75J50K29M6K38m03M4O7j3k2L23
5185C34j63o9k42j35J43M3O4J53J17k70M4J17K44m89Q9L36j43j51j49J13j80M44
5207B50j75J96k99rr4p1R6J36j06k04Q8K10r3m7k72L02j97JK76j79P3K80k80k82
$$ y = [-13, 49, -286, -40, 161, 63, -354, -314, -318, -535, -208, 214, -3, -246, -165, -106, 151, 14, -272, -287, -326, 78, 244, -89, 129, 17, -21, 168, 348, 24, 204, -76, 76, 75, 203, 153, 219, 129, 78, 302, 55, 486, -160, -12, -27, 336, -127, 34, 18, 37, 307, 100, -246, 17, -256, -226, 130, -175, -176, -314, 164, -156, -82, -324, -199, 42, -72, -43, -171, -531, -253, -296, 221, -68, 133, -222, -96, -262, 68, 223, 68, 137, -1, -234, 73, 261, 191, 162, 71, 134, -186, 228, 122, -66, -52, 166, -52, -218, 393, -5, -114, -195, -99, -248, -2, 64, 130, -240, 30, 132, 154, 40, 5, -235, -39, -55, -26, -70, -316, -8, -29, -62, 221, -256, -131, -150, -325, -175, 54, 100, 338, -65, -21, 46, 33, 11, 334, 171, 102, -140, -275, -132, -89, -25, 128, 245, -25, 19, 136, 380, -109, -20, 316, 173, 22, -127, -14, -194, 250, 75, 271, -28, -37, -131, -202, -106, 30, -76, -280, -192, 18, -75, -122, -394, -92, -289, -288, -12, -191, -118, 162, -118, -400]
5231d00M02k01J46J15k57J44R5j23J72j55j05M21j95j22M8J94j7j21K1p5LK20
5253B10j93q6J87J24q9k3l4J11M4p1j0l61L54l1K5j25j20l8j54L0M7L02j73r1
5277a65m1ok7J00o9J65R5k51K35n6k00K0J28J83j24l18J69O7K43p1J30k19L46
5300C34l7l87K06r3K33P5k45k24J68J1N6l3J99l39L7J74l1j97J37J59l46N0%o9
5324a62K61j34m79L56L8J38jk2k5k26J47p7J16K61m48J21K13l42P1K42k46J72
5346b6J39k87J46J60j33J05l5K1M6k06j02N4J30Nk2m1m6L55j21M3K2J07m04L2
5370e8J92q1N6k20m8o7K33nK36l65Q9k72L86o1q6k44L13j18o8J35l1J1n39M14
5394a98rMR8O0k65Q2L33J6J1K29k33k18K80Nj35k47K94j94l6K85O3j70P0j4j64
$$ y = [-400, 2, -199, -53, 62, -195, -51, 44, -79, 93, -62, -167, 254, 59, -63, -15, 179, 162, 41, 62, -13, -10, 210, 17, -69, 118, 242, 153, 130, 96, 207, 251, 180, 170, -191, 163, 132, 157, 32, -88, -126, -280, -250, -203, 99, -74, -165, -206, -212, -239, -139, -208, -43, 52, -199, 36, -20, -220, -200, -72, 111, -13, -331, -162, -95, 148, 77, 207, -12, 334, 297, -90, 116, 23, 256, 331, 86, -138, 30, 41, 97, 64, 263, -76, -39, 135, 104, -93, 44, 203, -143, -93, -93, -162, 99, -35, -514, -158, -120, 18, 17, -5, -30, -256, -109, -186, -70, 191, -257, -136, 77, -265, -194, 48, -198, -26, 113, -174, -28, 132, -1, 104, 69, 90, 136, -70, -172, -118, 12, 17, -5, -46, -92, 263, 142, 185, 207, 314, -90, -58, 134, 53, 109, -111, -159, -226, 7, 2, 238, -127, -38, -310, 76, 15, -71, -315, -2, -120, -188, -53, -84, -73, -612, -198, -207, -203, -105, -45, -310, -228, 105, 121, 132, 361, 128, -90, 190, 195, 60, -187, 107, -87, -123, 162, 225, 55, 125, 111, -53]
5419e3K65l4n5q0K21l20J10R2j73K35j08j69K24R3k60P8K8P6m41J12M49j03l94
5442b07n1rL75l7j97K54n05L28j32K10j27N2l5J00j99L05j22QJ41p08N89M6K89
5465C68l10J44j28M0q3K27J16k87n7L22M0l82K68l70L65J95p62N79k94N0q4m7
5487i0J68QP0J76l03j20k02OK16N2J40l11l1L03k36J44n4k81K20K33k67l15M83
5510Imk00L42k31r3K62K3k18J21Ok05N15j94l59M62l1q5L7Q8j59k89M62l03Q7
5534D3J83j75j55M44m05L02J60k82k1J49k7k03k46K17j57J77J41j14O5j39J12
5555F9l41L37j58K89j99k22K11j49J44M0k52K24k43J07M27l69K28J70l43Kj01
5576a29N09j48j9l32M04o7J79k54k60L83m00O44m33k44L47k01j39J90K6l7j16
$$ y = [-53, 212, 178, 123, 43, 264, -56, 54, 146, -27, 208, 100, -69, 155, 248, -12, 66, 94, 170, -271, -159, 290, 187, -207, -258, -267, 108, 71, -126, 128, -377, -49, -181, 29, -98, -46, -81, 19, -180, 125, 3, 11, 152, -556, 33, 79, 368, 58, 202, 74, 114, 31, 258, 374, 87, 30, 352, 392, 10, 278, -92, 273, 468, -294, 285, -9, 41, -43, -90, 78, 86, 156, 332, 29, -91, -293, -287, -71, -19, 121, -190, -221, 82, -154, -10, -64, -345, -125, 108, -159, -474, 9, 5, -195, 147, -84, -177, 85, 108, -110, 11, 17, -188, 327, 133, -226, 236, 205, 120, 157, 245, 86, -203, 259, -44, 43, 226, 51, -104, 340, -65, 237, 397, 115, 94, 243, 216, 13, -233, -16, -173, 4, 145, 31, 96, -43, 69, -272, 65, -93, 196, -3, -225, -14, -163, -19, 21, -231, -7, -250, -143, 284, -85, 143, 313, -30, -28, -129, 380, 232, 213, -119, 285, 218, 397, 143, -117, 266, -134, 510, 77, -167, 180, -21, -160, 30, 56, 19, -97]
5597i7K21k92M03l24QK4r6P4q0K57j11j46k04J54M61m25K45J23o52J17K6K4L59
5620F9p5o6P6l31K09K35J8k93J47J12j69J49l6l44K15p4L95k29j37N5j60L11N2
5643A29k8J12k35J25Rk47J06J77j1j13J0K28j44l7k82n2K24m5J00K1k87J31j59
5666b68K93j90M2J81j83l42N24m16K68K57m75J34r4Q8J26J22j36k29K96K07k18
5687a3j63L48o9K3k05J35J69j25R0k23P5J67R7k69l09K18J76J00r4l72K67J23
5709A46N0m6j03KO6N3k47p1L56m06K90j63K44l26j33lO7K89k59L13j55j62j01
5732b99L69j79J61r8J48l92K19k54J42L4M66m40m7J40K82k04K45j82J02N5j59
5753A09j85J70J87o2j72l45M59l23N70m39P2K43k30k20J43m0P3j53K0p2J76j1
$$ y = [-97, 124, -168, 235, -89, -81, -57, -153, -79, -159, 98, -13, -159, -363, -209, 252, -173, 72, 195, -457, -340, -314, -290, 69, -6, -72, 4, -327, -118, 117, 135, -158, -11, 101, -68, 81, 45, -299, -84, -158, 237, 8, -129, -74, -234, 77, 129, 101, 213, -22, 103, 112, -135, -29, 148, 137, 24, 34, 262, 118, 81, -201, -253, -29, -74, 26, 47, -240, -109, -268, 25, -165, -123, 58, -125, -467, 57, -359, -91, 166, -309, -175, -269, -181, -55, 67, -69, -298, -2, 205, -13, -176, 172, 103, 126, -79, 56, 225, 100, 190, -33, 42, 209, 306, 37, -272, -54, 122, 222, 128, -244, 23, 146, 196, 150, 47, 49, 115, 168, -79, -150, 206, -200, 90, -73, 171, -155, -288, -291, -224, 65, -194, 119, -36, -198, -299, 70, -109, 52, -46, 102, -290, -71, -325, -183, -149, 317, -123, -170, -30, 252, 48, 293, 111, 213, 268, 109, -76, 94, 281, 219, 47, -298, 161, -162, 408, -31, 41, 284, 54, -166, -23, -63, 10, -143, -123, -195, -19, -30]
5775c0n8p6K94k40J20k07K47o0k77K67R5l23J43Q9m0Ol60K05J25l3J93J18n37
5798c39M43P6j88L17R9k24j17J17j83J94p0j19o8k2L36k73O3J26k75J96o1j15
5820h7J98j75n8n3K48k3j09K37j44m50O09l04J79k2j21O1n05M19J20k05n9J16
5842a28N4p9J83k5j23J23N1L6N6j59J6r9L93l03l9j60J35K31n05N94J36j97k31
5865d0K33k91K61J5n2j7k1j38K29J83m59j06L33P8J61o00L11j39q9J8L78r0j09
5888D9k37p1K5nN6J19J2o1Q3M9j39K53k82j06J26J61Q8j62M7k97K94m3L01l1l68
5913a39L36k44L49k38n2j80K15L5R5K15k32j1K38l96o6K09j06N0l18M28k55L1
5935c6j02P5Q8J73j49m0j27J1j0R7l36M20j03j15K4J95Jk72J02J26m2j42K38r
$$ y = [-30, -88, -164, 130, -110, 10, -197, 50, -10, -287, -20, 75, -248, -105, -16, -56, -50, -410, -205, -80, -113, 80, 198, -339, 104, 180, -8, 309, 408, 184, 67, 184, 1, 195, 125, 6, -62, -84, 252, -21, 42, 168, -107, 89, 28, -87, 111, -64, -122, -175, 73, 50, -59, 178, 34, -416, 193, -111, 68, 46, -75, -14, -519, -100, 20, -185, -244, -128, -74, -153, 30, 5, -118, 5, 56, 92, 148, -11, 5, -94, 299, -4, -43, -203, -68, 163, -342, 252, 388, 191, -40, 193, -98, 163, 178, 126, 109, 88, -50, 179, 362, -97, -203, 130, 208, 369, -231, 80, -59, -148, -130, 248, 158, 49, -188, -259, -234, -239, -183, -64, -52, -113, -30, 19, -120, 133, -149, -255, -129, 32, 120, -42, 5, -292, 2, -41, 260, 229, -139, 197, -47, 302, 64, 12, -168, 47, 82, 177, 392, 160, 149, 387, -9, -75, 134, 28, 78, -240, 188, -67, -36, -138, -63, 25, 198, 49, 9, -118, -107, -117, -20, -356, 64, -39, -154, -130, 65, 66, -206, -104, 22, -20, -162, 76, 67]
5959F7J53p3k72L17j61j73L22j64j38M4K50j8m3j20K2j8O1j73K45j15Q7J77k8
5982B49m4j02Rj60K14k33J04j32k62K95J47n6j03J01K3j18j44J58M2r8J26o6K9
6005b1Q2k1q8j07J51m5j36K52j42J63L5j56n8P7j72N1J41L8J47j60o6N7j82K02
6029D2J04j46k35L47l13L29l1L2K22l66K38k35j1K54l15N6N1Jj63l3J73r4R1O3
6053F1r4J27j47N1J87m04L42j84J67k16J61J05j64j07j22L33j5M4K58n32K99j66
6075a6J17J23k26k1Q7l4p5k7j31K81L01j49k38L20k12J96j61j90J42L0L19m71
6097c5J46l94K94j14K6l4j99L09j05J75m25K59K84k86k42L61J35k85J25k76K89
6118Hj93J40J59j10k06K44J92j77J73j98K54l66L37j14j36J56l81M39j24q9J10
$$ y = [67, 220, 147, -125, 192, 31, -142, 180, 16, -122, -78, 172, 154, 111, -9, 13, -5, 56, -117, 128, 13, 100, 277, 249, 205, 103, 112, -48, 166, -67, 37, -95, -357, -62, 85, 29, -74, 27, 50, -68, -212, -54, -12, -110, 16, -50, -21, 61, 40, -48, -155, -4, -49, -185, 67, -75, 88, 123, -33, -91, -14, -186, -135, 6, 44, 191, 31, -35, 22, -160, 42, 146, 0, -235, 112, -201, 128, 97, 129, 351, -15, 223, -12, -23, 231, -84, -28, 23, 24, -139, -172, 1, -93, -2, 61, -33, 94, -53, -2, 185, -219, 123, -61, 106, -110, 51, 156, -8, -115, -237, 96, 81, 125, 383, -149, 150, -16, 101, 224, -2, -23, 64, 30, -45, -72, -203, 78, 379, 230, -8, 312, 100, 296, 135, -55, 87, 117, 436, -35, 111, -283, 11, -103, -77, -111, -310, -1, -106, 69, -356, -97, 187, -99, -341, 20, 155, -130, -5, -281, 8, -185, -45, 114, 4, -202, 42, 234, 57, 230, 32, 286, -80, 257, 143, 7, 163, -218, 221, 97, 8, 118]
6139A18l09K45K16l07R7l05L15N4K98l60k11K23K81n67J72L49k89R5QQ4n1j81
6161b5nj26O4K0j26L4L10j1m1O2l05j01K11k8P8K61o45O5M26m06L67N3j43m4Q5
6186C0Mq5M6l01Q2L62n9J97K2k17j52J71j82L27k24o4L10j9j17k5j08J95j48k72
6210b27K57r7q2J69l4K12j96P1m9O9j51K61k20K9j9q3Lq8l33M68j06L6Q9k80K27
6235g4j41N00m00j43L17j3j88K38Q8J1j91k7j30N09l68j69j62M75n6j5j8j53J99
6258H9m6M7j62K23j4r5R8l10L59l57J75l33N51m4o8k81j7J90j02K06l15l3K5L21
6282A07k52lJ89P4m00J68K16j73P7k8J91k96K16p6l3O0P8q0k12oK53r4L94k00
6306A70k12j41M48o8j24J73k65Q6K51r7k31l5o0K30j09N4Q0j15j96L01m35N01
$$ y = [118, -191, 54, 270, -37, 60, -245, 70, 124, 422, 62, -149, 74, 355, -212, -40, 309, 20, 115, 123, 207, 156, -25, -30, -156, -92, -72, -198, -164, 146, 135, 94, 156, -149, -250, -39, -67, 11, 272, -373, -308, 118, -288, 79, 132, -11, -55, 30, 34, -51, -5, -306, -224, 138, 79, 276, 298, 81, -71, 100, -82, 245, 21, -43, 267, 248, 131, 106, -2, 193, 45, -227, 30, -67, -149, 20, -14, 198, 2, 73, 24, 93, -58, 203, -17, 12, -7, -90, -87, -175, -508, -40, -146, -110, -21, -301, -74, -215, 285, -115, -258, 59, 46, -142, 96, 184, 195, 4, -23, -153, 356, -12, -181, -343, 132, 76, 61, 43, -110, 89, 43, 90, -72, 151, 137, 42, 140, -170, 189, -168, 7, -326, 225, 181, 113, -168, -185, 5, -97, 109, -206, -239, -214, 107, -145, -148, 41, 115, -285, -117, 99, -74, 3, -25, 166, -130, 86, 10, -23, 37, 115, 35, -177, -183, 70, -24, 370, 170, -42, -183, 265, 197, 73, 246, -19, 67, 318, 221, -10, -45, -105, 125, 16, 70, 150, 35, -161, 140, -295, 206]
6328B06N1l01R5k24K70J5m26J04K02k69L88l32O9K60j00j35J81j43Q5j29J95R9
6350A61j35K53j28Q5k39k0q8J17P9j95lJ22QJ67j06K37l01q3k9O9j50k4M6k4K33
6375E2J59j03n6K9J02l68N97q1M0L8m38l4k0J38K25k65J99j80o8k11K40k53M11
6398A53k70k07L07Q7j12K78l30J2K20J59R2n48L84m22K26r6J93k80J69K02l69
6419a52L66l70L55k97K07q4k19L17l10K36q1J59j04O0J37k28K91j69l02R4K07
6440A13j03k00K17j53l3lK71k05j49L22k69j32M2J63P7O6k16O9J45j19K30j94
6462f1l8K06j43K15l50KM8KL61k07j23P5q8o7K03o4n0O9J80p3q3j5K34j80j94
6487a41N2J58k4p9J78j54P0j69j13J20J89k01J84m49N68m56O9K53l87J10N42m32
$$ y = [206, 257, -44, 51, -173, 97, 112, -314, -210, -8, -277, 111, -221, -152, 108, 8, -127, 54, -89, -4, -133, 62, 161, 26, 279, 151, 236, -3, -23, -111, 6, 85, -110, -113, 9, 17, 184, 78, 315, 14, -69, -98, -29, -179, -203, -157, -181, 52, 211, 108, 52, 81, 183, -185, 412, 331, 371, 409, -29, -63, -83, 55, 280, 15, 214, 34, -34, -245, -5, -258, 153, -117, -324, -17, 70, -42, 236, -94, -82, 138, 297, 389, -159, 225, -197, 29, -67, 126, -154, 15, 217, -152, 214, -156, 199, -98, 109, 25, -194, 123, -187, 49, -32, 127, 23, 83, 220, -8, 283, 114, -188, -94, 113, 10, -190, 27, -126, -159, -162, 109, -96, -245, 77, -192, -324, -282, -119, -42, 24, -192, -123, 22, -97, 133, -61, -99, 107, -36, 179, -171, -169, -121, -119, 242, 35, -88, -13, -101, -168, 35, -29, -79, -10, 170, 97, 14, -1, 233, 53, -141, -89, 69, 45, -34, 144, -10, 60, -109, -222, -102, 87, -114, 70, -379, 189, -267, -198, 55, -332, -222, 320, -112]
6509a12j75J52j53K50k07m4L09J47m7k58OQ6J03J49n0j84r7K27r5j53J3K1K19
6532A07j21J92n0j49J19p6L1O7R7k50o3j34L98k77K53j53L58l76K99j17j58j9
6554b2J25K4k10L6L27m24K62Rn7j98L65m49o2J70J37ok57P5R7J72j10K5N9Q2l27
6579a57p6L91j97l3K17j72oR0k93M69n8Jk82Q5L63k26M20l16l32J24J48N6k59
6602d3P3q8K8j99K28J65j37R6l58M26l52L4J10Q1j05J03k04K69j56k77nO14l95
6625i2K37k96J33j05n8J17K63n48K77R5m9q5N0J37j56K23j11l7J60k44K89j56
6647D4K5j74J33Q3J16j31n8k0R6p2J62K7l42L24r8o3J27l59Q8M6L7J01l26J5q2
6672c01L41m7j35L2j19L59k69o6o9L85j19k51M19j69L53m18j33L34j29j91M18
$$ y = [-112, -287, -135, -288, -38, -245, -289, 20, 167, 120, -138, -132, -46, 57, 206, 156, -28, -125, 102, 7, -146, -133, -112, 107, -14, 178, 128, -21, 98, 22, 53, 120, 217, -33, -96, -230, 168, -109, 144, -9, 349, -27, 272, 155, -3, -22, 103, 127, -83, -47, 280, -144, 118, 127, 70, -128, 237, -212, -274, -104, 33, 27, -230, -155, -58, 114, 4, 29, 88, 170, -157, -233, 158, -39, -72, 145, -27, -33, 57, -236, 233, 175, 176, -106, -21, 342, 116, 536, 220, -112, 12, 160, 216, -43, 30, -58, -30, -229, -1, 164, 27, 123, -235, 191, -161, -127, -17, 64, -41, 62, -142, 127, -29, -306, -311, 303, -92, 145, -151, -18, -123, -181, -64, 199, -349, -72, 23, -26, -111, -61, 76, -80, 143, 32, -5, 155, -89, 200, 44, 69, -105, 28, 111, 227, 96, 38, 18, 114, 42, 204, 231, -111, 213, 115, 52, 179, -180, -92, -46, -9, 92, -234, -219, -301, 40, -7, -142, -110, -229, 130, -139, -205, -274, 111, -8, -259, 160, -9, 344, -74, -207, 127, -2, -193, 225]
6693B25l24K85m98K77L07j82L9kk51p0L13J3j20j13P2k13L36m2p2m4q8Q1p6K3
6717a24L05l04n1K77j11n4J27j49J91k36j34L69l61j0J78J56k96J64OLP7Q3o6
6740D0k22K51j40n6J75p2L19q7O1k16j11K03N6l01M01q5l04J06J29j3j94K30k60
6763i0MK2K80k91P2L16k48l20M11q4K76o12L95l41J96k86K72J56K45m02N9j93
6785a63L6M03m45J5J72j6J32j21k82k9M69j16j34J8M6k06L52K63o87L58q1J53
6807A37p9k10J11j4K68k66J41M5k92J41NL3j12J75j89L64q5l2k61jn2n9l2J57
6831a07j55j48M24k7j05r3J67j5L81k28k20K53j89J85j50o9K28j69L18m63J91
6852IM1j70o9K63J8j4J78m06k8O8M6j7j12L74jkn10M65k18L23j96j7K1j03L34
$$ y = [225, -99, 186, -312, -35, 272, 90, 129, 127, -124, -194, 119, 132, 12, -101, -29, -242, 94, 52, -20, -64, -152, -71, -147, -124, 181, -123, -174, 103, -8, -62, 65, -84, 107, -129, -263, 106, -255, -265, -87, 69, -227, -63, -57, -54, 23, 106, 40, -182, 69, -71, -127, 48, -24, 295, 208, 269, 53, -58, 145, 201, -100, 301, 216, -88, 18, 147, 134, -60, 170, -90, -86, -64, 216, -75, -3, 313, 65, -255, 156, 72, 348, -264, 131, -210, -14, -300, -28, 128, 373, -29, 30, -163, -127, 276, -169, -154, 18, 2, 134, 13, -269, -298, 171, 55, -79, -61, -15, -221, 131, 394, -293, 65, -16, 137, 58, -152, -41, -55, 213, -53, 88, 133, -159, -18, -13, 20, -92, 83, -106, 258, 173, 141, -120, -121, -173, -232, -264, -107, -262, -410, 14, -13, -118, -211, -44, -59, 322, 94, -126, 127, -62, 123, -27, -96, 132, -37, 281, -182, 9, 50, -120, -189, 74, 92, 78, 256, -150, -178, -110, -64, -81, -193, 181, 180, 178, -332, 133, -85, 238, 42, 25, 46, -57, 277]
6877B77l90K87Q3j56Qk98K49rj32L56n26M58l44L40k48k42M69J8l37L4O2K41l17
6900a17K75J85l30N2K02l95K28m9j17L65m88L63p9j16l0l5j97K98j39K26k0K53
6922C35m90J75O7k5k17M94k76p4J4r6j85L26j7J92m3m50J2N37k01k89M13j87j75
6945a60K27j60J94l43J07l2K92k25%R5j57J09L4Q0l54L38l0r4J68l34M7K4L98
6968B24Km68K23kj3r9K37j18n4j96K63L30k90n0J34m0J65j38p7kJ02k43P5p8J0
6993a03J15p1M2rJ26j83L06Nl61m3K32n4n9K6j5K70K7m17P5M9l38M77J41l45P3
7018c4lj11K08Q3M9J16m74L29n31L56L5l09K81k85K53r7J78P2j63nJ08N1j30K5
7042Bk2J55j93j17j33M69l22K20R5k88o0M31k36J26O9j40j33JL8O5j0j38j91L31
$$ y = [277, -113, 174, 257, 101, 109, -189, 60, 51, -81, 275, -251, 207, -137, 203, -45, -287, 182, 200, -137, -103, -41, 200, -117, 158, 343, 13, 65, 267, -128, 100, 51, -66, 299, -189, 174, 95, -21, -51, -86, -283, 15, -124, 102, 82, 335, -155, 20, 87, 62, -155, 339, 63, -11, 3, -93, -278, 48, 31, 223, 180, -270, -258, 279, 78, -211, 202, 15, -160, 67, -93, 101, -242, -135, -167, 125, -100, -100, -5, -162, -53, -19, 61, -293, 45, 15, -79, 89, -245, -198, -174, 224, 226, -242, -19, -21, -34, -133, 104, -14, -68, -264, -1, 329, 39, -11, 123, 83, 248, 110, 33, 31, 133, -110, -35, -113, -103, 12, -59, -17, -26, 100, -83, 223, 228, -133, -176, 56, 2, -57, -31, -46, 224, 251, -166, -91, -42, -380, 97, 238, -107, -34, -37, -148, 60, 143, 192, 308, -166, 163, -368, -12, 23, -286, -5, -290, -37, -134, 44, 116, -47, -52, 56, 107, -23, 2, -20, 135, -58, -175, -308, 161, -161, 59, 154, -134, -194, 237, 1, 127, 196, 56, -77, -76, -38, 27, 17, -121, -312, 19]
7066A9K17k73N4j84J43J0J68k71J10j11J80k09K62J36j27n6N2j25k83K74q2j44
7088b40J4L39p5K02q2P4k66n8j40M19K09m69R5J74J85r3k78nj55L74k32N2L1k25
7112a50o5K25R6j06K44o08O21k69j20P8J27K92o30J14K33n2k44J51%n9J07j44
7134a59R4j5L7P7M0Mk30J54J12R1n60M75j45J97r7J87l21J74k4j21N3P2l46O32
7158C81k43M1j37o7J81k06K60J1L0r2j93K02j27jN9l42J92j08J78j8mJJ79n4l00
7183a77k1L54Jm97K78J83O6r0j14q5o0K5J43mk18K10n1N9j21o1K75j08K0J87O4
7208B58j74j08Q3%O8k60M66k98j69J11n8l21M83rn8q3J68k42K91J4m21P9p6K47
7232ik46M45J48o63J83o4o5L13pj85M32m10j76K22K66j51q3J99k20Q9j26J28j24
$$ y = [19, 236, -37, 17, -167, -24, -14, 154, -117, -7, -118, 62, -147, 115, 251, 124, 68, 120, -5, -288, -14, -96, -240, -226, 113, 38, 240, 158, 232, -34, -92, -232, 187, 396, -73, 22, 196, 381, 288, 10, 5, -150, 224, -8, 44, 75, -150, -215, 10, 106, 0, 244, -364, 257, -12, -132, -54, 73, 365, -265, -151, 82, 30, -214, -63, -63, -122, -15, -159, -65, -80, -43, 34, 74, 78, -152, 2, 114, 205, -355, 120, -25, 172, 75, 262, -59, 115, 91, -30, 23, 95, -251, 381, 138, 179, 42, -25, 156, -50, 210, 221, 251, 159, -34, 168, 41, 40, 99, -243, -51, -159, 19, 1, -3, -2, 177, 123, -177, -198, 156, 157, -340, -62, 121, 187, 97, -17, -102, -162, -137, 6, 2, -216, -6, -57, 2, -119, -180, 95, -13, 7, 194, 258, 84, -24, 59, 59, 127, -133, 333, 35, -134, -23, -81, -402, 81, 72, 14, -69, 99, -143, 148, 162, -259, -180, -256, -9, -255, 190, 338, -325, -142, -206, -271, 42, 35, -150, 282, -128, -304, -82, 184, 33, -50, 149, -71, 18, -108, 20, -104]
7255a04K23QJ8R3n0k31J14l50M23k62L0J14L81m77J9K40l85j05O90m21M27l86
7277In2n9o4K34n7j10J20R6m09J35J61J96j97j70O2J74K84n61m7L86m17j26O51
7300B39l34k1L29k19k48J43m7LK65J04l69pJ0N12l32n9K86k18J95k02L4l66K52
7323e0M1j27N2J93m5lq9j46lM32l64J02R2K2j88O4L12p41L81L9J77k20j4M8P5
7348D0k18Q5J90j07L0N8N6j10k40K31k69J3M69k97L30m38K97l0j39j13N36j03
7370B71n10J82J36J21j60L41o2Kl77J97k4J13k62n4J01j14N6J61oj77J35j30J67
7393A07L8q7J3m6J26l09N8P7M4L0j32J93j3l85N64k59k3L4o8K65l16o4K53k34
7417a34M5J2q9J94M6k16J97m8P6m0j02Rk3J85j96K16J53k66J78k46K37o0l56L00
$$ y = [-104, 119, 127, 145, 238, 188, -43, 71, -279, 144, -118, -88, 26, 407, -70, -51, 189, -196, -301, 389, -32, 395, 9, -43, -102, -166, 68, 11, -99, 21, 117, -292, -157, 4, 200, 3, -167, -105, 69, 353, -208, -255, 131, -286, -412, 239, -95, -116, 213, -6, -254, -111, -158, -155, 110, 214, -155, -162, -152, 360, 28, -31, 255, 37, 232, 30, 64, -302, -50, -9, -136, -84, 109, 64, 61, -28, -174, -177, 255, -109, -7, 85, 107, -81, -17, 295, -446, -65, -26, 151, -69, -83, -35, 40, -178, -93, 97, -10, 20, 78, 134, 24, -216, 15, -254, -241, 228, -69, 261, -177, 120, 90, -49, -162, 374, 271, -239, -57, 79, 200, 40, 381, 319, 321, -56, 141, 117, 230, -32, -86, 15, -99, -43, 118, 112, -65, 70, -60, 107, 145, 58, 71, 25, 151, -158, -100, -23, 21, 51, -81, 112, 99, -286, 278, 19, -4, 30, -38, 227, -89, -153, 100, -134, -89, -77, -166, 28, 74, -142, 55, 7, 83, 43, -59, -50, -73, 112, -84, 132, 285, 19, 197, -49, 188, 128, -228, 72]
7441G2N1j62j03K78j49M3J53K1m8o21O32k51j99KN1K36P4J23l56Q3N4M2p4k5j43
7466b16K27j16j35K32O8m8o3J26j73q8L2J01K51j75K28m46J53L76k84J42k83J49
7488E8l0j8qJ74k20J77Q3j1k90j33K14l8K21n03L74j81K4N02l98k09L38k28K20
7511A18J0m02K99m8K91l03m2j7q6L29j69j58O9J37K02l17l6K06l5j09j20M09k22
7534FJ85m34M08k46j38L63J12k04n8J23R6k52K6K6j2R0j63P1l35K90J03q2j01
7557a26J87N1N7j81L9j00K02n50M09N5k40L76k53L26l39J94k05J55k22N2K00k58
7579a71M05l16j07R8J44n0N1r1L0n0K34n63N03N0j08j06j45L91j59j0K5k34m8
7602b27L71J92n61L36j16J70r4k4j53J18J39l6K07j96K71k72Q7k10j54K07j28
$$ y = [72, 123, -39, -142, 136, -13, 30, 183, 204, 156, -465, 167, -84, -283, -281, -230, 6, 80, 203, -153, -70, -16, 26, -48, -73, -216, 11, -105, -240, -8, 60, 12, -51, 75, -98, -186, -154, -53, 198, 23, 251, -195, -42, 334, 50, 192, -91, 58, 28, 10, 2, 176, -44, 133, 216, 205, -85, -218, -4, -42, 179, -324, 50, -131, -107, 395, -3, -212, 126, -102, 118, 128, -274, 25, -23, 268, -35, -77, -94, -180, 149, -20, -178, -109, 28, 230, -87, -123, 83, 48, -61, -181, 228, 6, 191, -243, 165, -81, -219, 144, 256, 52, -6, 117, 213, -39, -13, 13, 1, 91, -72, -1, -336, -46, 57, -25, -126, 61, 112, 169, -12, 27, -73, 129, -421, -12, 43, -197, 179, -74, 252, -87, 107, -98, 57, -165, -113, 87, -171, 234, -82, -189, -91, 53, 3, 54, -37, -7, -57, 177, -386, 117, 167, 59, -47, -192, 199, 40, 30, 55, -179, -227, 144, 336, -225, 111, -5, 165, 71, 47, -106, 12, 151, 115, 322, 126, 397, 125, 212, 2, -152, 55, -73]
7623g3N3n0p7J92k46K79j23k03L9J61j28N5J58j33J53r7pk40L66j75J37k9O3k41
7647a66J74j24j21K90k30L27n4K44m1m29J44K32l64J09j49K11J59m2Kj90J21k78
7669a75Q1rJ43q6j85K14j17n0J35L9J23j41J28O7l39k53L87K21k75J78l71L39
7691E4J28n83M46N3k02J58n0j88L75k14p7L6M03k88N4J51k05j87R6J58n2j60k
7714i6k55N24R4l15J02k47L06J42o03M9J45K82k96N7L20k98L0K52m39M39m14j0
7736b31O8k1mJ65j82J85m0j76L03k49M3J72j21J40j24J7j02O01n98L5j36L24o0
7759IJ0L5J19l53N34m9j44K7n7l67L51k36m6L55j86O2k02K81k7k78l6L29r4K0
7783E7k16J55J16Jqj89j01L54j0j79P0j2p5J54jj0l92N0R6K8Rj91K73K8K7k90
$$ y = [-73, -20, -70, -147, 45, -201, 78, -45, -248, -209, -48, -176, -121, 37, -96, 57, -40, -47, -287, 79, -96, 41, 12, 75, -166, 8, -116, -237, 53, -177, 150, 96, 340, 299, -130, 14, 246, -118, -9, -158, 53, 212, 170, 172, -18, 103, -175, -94, -103, 40, -46, -231, -17, -134, -184, -49, -10, 113, -28, 100, 167, -172, -425, -38, 183, -92, 86, -285, 54, 182, -401, 45, 98, -104, 54, 4, -184, 191, -23, -100, -64, 339, 51, 105, 256, 51, -136, -40, 118, 66, -94, -96, -351, 173, 267, -48, 54, -193, 113, 255, -348, -299, -154, 128, -168, -111, 209, -89, -59, 193, -246, 193, -221, -231, -163, -184, -188, -23, -205, -20, -60, -236, 67, -182, -139, 33, -88, 52, -72, -55, -157, 444, -154, -119, -255, 69, 9, 19, 54, 173, -180, 354, 305, 161, 188, 131, -236, 115, -121, -167, 188, 2, 64, -138, 143, 116, -162, -198, 131, 37, 57, -159, -4, 112, 113, 105, -84, -185, 169, 159, -20, 50, 38, -37, 117, 116, 106, -286, -236, -140, -112, -103, -294, -21, 7, 34, -256]
7809b56L27N2k28QK80j82j61K82Jj19K9k5K0k47O4KJ34P8L9j4n7j92O4k31L67
7834C5j24J58m66K28M71k77K55K3l86K24j92j20L2j3K07k14K82Km1k03J47mj13
7857h9p7J43j80L04j21Q4j3k75L70j30l74M59k81K87J69j3k12n0Q8k16j30K28
7879b9j49L89m19M66l24k0J22J73M5l40P8r3M00l9j98k41Q3j08J12L79J1l46r7
7902a45L49P3l51l03J74R3L3K10m48K11L05pj99m1K43k19p9r3J23M05k80j7L5
7925G2J27j80N6rn7K7J90n24M69k02l68P13k02J18n34L59J0m2J13j41J09k23Q6
7948c3Nn8q2J35j34QJ90j6q2N1K2j63j7N2j0q0J92l8j67J76J80K0j81L31k50j3
7974C8n23K11M78p2J6k79J68Q4l59K51p4j96K68k12N01k31N7O7J02j60j54K66
$$ y = [-256, 71, 123, -105, -97, 183, 1, -160, 122, 123, 4, 33, 8, 28, -219, -155, -153, -19, 59, 98, 84, 27, -165, -101, -332, 35, -89, 69, -397, -169, 302, 25, 280, 303, -83, 141, -51, -171, -139, -152, 55, -159, 123, 125, 84, -119, 28, 24, -89, -166, -23, -203, 101, -20, 64, 51, -224, 146, 16, -358, 101, -180, 107, 276, 263, 51, 1, 89, -127, -257, -29, -178, 211, -208, 258, -66, -86, 36, 209, 254, -86, -8, -101, 299, 260, 62, -179, -96, -204, -92, 287, 298, -48, -145, 204, 277, -74, -377, -203, -110, -77, 133, -315, -104, 201, 194, -5, -46, 197, -22, -101, -194, -71, 334, 54, 37, 72, 199, 19, 75, 66, 9, 36, 226, -298, 171, -31, -399, 314, 112, 230, -304, 55, 65, 23, 136, -5, 104, -119, -33, -28, -86, -168, -33, -167, -159, 31, 15, -67, -16, 6, -157, -174, -122, -132, -212, -20, -58, -225, -49, 131, 151, -30, 301, 51, 38, -485, -274, 204, 132, 148, -131, 37, 121, -238, 13, -61, -257, 11, -201, 300, 69, 126, 193, 295, 135, -19, 247]
7996B47m36N37n08K84K3l00J28K01j07M5k24j9K86l80M19k64j66M70j25j11K98
8017B98l57J96j1q7j70J02J07k1j74J94j55r9L14j29J14j1Jj13p8J05j92o5R5
8040a36L79l66J27j59j3L74N1j94l54n4L58m4J13j44Q5j56J04l2q4M48n25J60
8062f2j98Q8J93K69k71r1O8J0q1n2N29k10j23N9j2k87K8J33m52M57k03L15l71
8085b64J60j61L15N0k24K03R6n17J71P9NK36k40n7J93K83m92K24k97J88K04J38
8107B93j98J6j98J48k77L6L33k02l8O4j59J43J86J26l38K24l8J15l35K51m81L03
8129b6O2j99L42k37Q6j3p4K85k61J53m24K25%O7R2j52K4Q2n5j36k22N51j84N2
8153C8Jm2r9K37l29K08j00l8J05m8j16K65O3l60R3K87k0j75K11k29K19l07L3K10
$$ y = [247, -189, 348, -160, 124, 147, -153, -25, 176, 69, 114, -110, -129, 157, -223, 196, -68, -234, 236, 111, 0, 298, -59, 137, 126, 39, -131, -29, 78, 57, -117, 77, -78, -177, 137, 8, 122, 111, 112, -1, -79, 26, -166, -231, -136, 243, -123, 4, -155, -168, 206, 257, 63, -291, -345, 13, -31, 82, -62, 23, -133, -29, -61, -145, 303, -222, -62, -260, -172, 21, 290, 19, -72, -4, 6, -75, -127, 402, 192, 69, 128, 116, -171, -143, -10, -462, -5, -208, 107, -264, -104, -265, 50, 100, -124, 79, 175, -342, -171, -92, -87, 149, -91, -148, 45, 328, -164, 60, -237, -49, 155, 293, 95, 111, -87, 61, -216, -180, 153, -49, -87, -23, -182, -39, 147, 273, -65, 159, 121, 236, -99, 152, -329, -26, 36, -163, 179, -58, 28, 15, -59, 226, -35, 118, -306, -81, -81, -14, 78, -74, -50, 32, -23, -159, -381, 170, -14, 38, 39, -3, -102, 135, -194, 14, -86, -124, -19, -67, -183, 82, 145, -215, -122, 165, 145, -30, 181, -48, 171, -136, -103, 107]
8177A07l67K81l09N26K0j71k19J35L0j35P8P0j20J79
$$ y = [107, -260, 21, -288, 238, 258, 87, -132, 3, 33, -102, -24, 46, -74, 105]
8191A05
$$ Imaginary data points
##PAGE= N=2
##DATA TABLE= (X++(I..I)), XYDATA
0@%%%Qj6QqJ9j9K4l2M0n7O8p6J02j26J40j68K02k34K72l12L58m17M74n34O10o92
29c66P77q77R83j096J231j373J525j701J888k091K317k563K837l145L481l856
45b029M284m761N306n941O677p551Q612r919J1587j3796J6854k1395K8832m3041
59b6281P9475l32464p96211Q02814Q85659j62384m89706K0580j09751m01602K21222
70c08649R10723J79495r26651o60661M44136O48092P8251j63403j05801l11468
80b15936l02299K93407O61636J31689n26827m65026K6860L13411L45450J73984
90D36349k26809m98884j94382L47781M36138P3470k20189k85301k18029N5900
100b93956M14171L59368j72485n09971k31082K31841L58693J76027q2282k99765
$$ y = [0, 0, 0, 0, 8, -8, 0, -8, 11, -8, 16, -16, 24, -33, 35, -41, 61, -65, 75, -93, 109, -125, 147, -165, 193, -224, 250, -284, 326, -366, 411, -466, 517, -579, 652, -721, 804, -897, 991, -1100, 1217, -1346, 1491, -1654, 1827, -2029, 2255, -2506, 2800, -3141, 3536, -4015, 4597, -5322, 6265, -7531, 9323, -12072, 16760, -26281, 53194, -279270, -1075481, -272667, 612992, 450608, -39098, -18518, -128269, -529871, -308649, 602074, 781569, -145082, -805743, -361607, 286485, 364736, 201333, 95532, -215936, -518235, -224828, 436808, 568497, 41670, -423356, -396496, -83085, 262365, 436349, 209540, -289344, -483726, -135945, 300193, 373663, 153474, -131827, -349856, -293956, 120215, 479583, 307098, -202873, -433955, -202114, 156579, 332606, 250324, -49441]
110d9441k96566L4537L75517L02840q9155l41584k52569L5633K92876K94691j9874
121B86905l30542k55376P6536K37992J55127L4945j02574k58242j74787K00228
131a29788L75973N9017k97094k23414M5407J21756R7767J26359J8042k40949k46419
142b93343J08257L27960J17664j67926j80375n5367K0511J06145J78537N8859
152B20922j89384k37168l035K19082J90710j0360j75419j75177j9346J52513J72096
163A45434L1550j17942j62182q3207Q3001K09205J19972j30920k35870n8998J46248
174e3709J43736L1752l3187r2019j47910m0465J91401K21189m6692k52351j29512
185b07767J00038J46386O7905J0789o5381j61884r9370J34995K42025M7713j93494
$$ y = [-49441, -346007, -311470, 64047, 366887, 277732, -63852, -316421, -280788, 12088, 306779, 286905, -43637, -299013, -222477, 15515, 170642, 205587, 103013, -155229, -330016, -129788, 246185, 305202, 8108, -215306, -169899, -48143, 49624, 175983, 194025, -46924, -293343, -185086, 142874, 260538, 92612, -87763, -143130, -122619, -16474, 162063, 220922, 31538, -205630, -208665, 10417, 201127, 190767, 15348, -159829, -179175, -26662, 145434, 176984, 59042, -103140, -186347, -103346, 105859, 225831, 94911, -140959, -199957, -53709, 90027, 121779, 88592, -3427, -151337, -191802, -401, 220788, 174096, -78255, -207767, -107729, 38657, 106562, 117351, 51970, -109914, -209284, -74289, 167736, 215449, 21955]
196B1955j86647K611J32657J32597N8383o6772j73946j20534Q9768K21904J06567
207B18543j18431k01422q2992R2165J72804J04712o1479j81456j25005O1595J82099
218F1133J15703n1902j57908j23068J5545J51652J53468p674j71747j55114K2989
229a46923J57979J27168o377j17602j36325l9857J14755J72417M3717j39263j67318
240a37629k1964J23083J37004L9203q3970j42643p4704Q1486J65909P7481q9933
251G3323j56340o9095P2411J44432Q7585n5471j51619r6000N8985J49597Q8082
262A45890m8137j29957r4194K5532J26584J10167j9452j30450j08364J7307J16797
273A1723J03562j035j05507j13262j0909J01909J12540J5558q9897j11576l3822
$$ y = [21955, -164692, -162081, -29424, 103173, 161556, 94784, -79162, -199696, -109928, 111976, 218543, 100112, -101310, -184302, -92137, 80667, 185379, 123900, -57556, -182561, -120966, 61133, 176836, 124934, -32974, -156042, -140497, 11155, 164623, 156949, -14798, -169912, -146923, 11056, 138224, 131847, 14245, -122080, -161937, -47182, 125235, 168952, 29689, -137629, -159593, -36510, 100494, 139697, 55727, -86916, -161620, -80134, 85775, 163256, 73323, -83017, -152112, -79701, 64731, 152316, 96845, -54774, -150774, -91789, 57808, 145890, 97753, -32204, -126398, -100866, 25718, 135885, 116433, -14017, -122381, -105074, 11723, 115285, 114250, 8743, -104519, -115428, -13519, 99021, 114579, 24682, -86894, -120716]
284a20716P9188J22495M1488q6029j22168l1410P4538R8758M2422m1677j01065
295d4176p6318L7485J26963P7184n6137j17145n5164M0931Q6943O9508m811r1375
307f112r8576P145J12312R2830k0895r5759p3478K285P2075Q7057K2519p5647
319B5756j02307j9859Q0397R2902J9689o3236q7962l7620N0640R8119M7888n3993
331E0414j00850m5931M7019R0560N0865l2148q9614o4655K3072R1731P1206k0791
343G0878r1517p2913J5155Q5134P3073n556p6504p7780r262P2629Q9883J7375
355I0595p7820r3817j2575P7047Q3410J4821n6301p7583l5846M4578R4679M9894
367A01082n3788j00374l8862N4188Q4397L7975l0635p5574n9742J7763Q9925P0672
$$ y = [-120716, -41528, 80967, 122455, 36426, -85742, -117152, -42614, 56144, 98566, 56889, -44176, -120494, -83009, 43954, 121138, 65001, -52144, -107308, -66377, 20566, 90074, 85263, -6112, -104688, -97543, 14769, 107599, 86704, -9055, -82533, -80248, -8173, 78884, 101403, 25756, -76551, -96410, -16013, 76889, 96578, 33342, -54620, -92240, -41600, 56519, 104407, 50414, -50436, -96367, -49348, 41212, 92077, 59929, -29685, -94340, -71268, 20463, 91669, 70878, -20639, -93552, -78397, 6737, 79810, 74254, -2250, -80030, -89292, -16663, 73220, 90595, 12775, -81042, -93617, -16570, 66840, 81661, 25360, -52223, -88069, -43491, 51188, 101082, 47294, -53080, -91942, -37754, 46643, 84618, 53983, -21591, -81333, -63570, 26355, 97027]
379I7027k6547r2274o0728K2593P5389O2044l225p1527p8076m021P8308P8896
391G7859j143p2361p0829j0434N6116P7550K6923n8938r0323k6078O4396Q2491
403E5229K0627n0986p1718l4421L4353P9577N1599l6560r0353m7310M2718Q1485
415C4240M0303k8724o6387n0522J1059P1108O6566r477p9580o3738J6168P1463
427A2479N4946m308n5440o2548j3145N8398P5410J2174o5001o9738o481N2413
439a0841N8978J8997l6632o7668l6713L9924P9210L0696m7517o9329k3438L1425
451c2908N4567L7566j4257o4578n3762K0357P3925M4452k7369n9589l5075R561
463d7110M5595N0443M971n5321n9747L847N9309M6990l742m0279m2904j5221L4193
$$ y = [97027, 70480, -21794, -82522, -59929, 15460, 77504, 74279, 2752, -75324, -79345, -1037, 77859, 76716, 4355, -66474, -76908, -20792, 56758, 83681, 24743, -65580, -91658, -27262, 55229, 75856, 24870, -46848, -81269, -46916, 32661, 84260, 47700, -42653, -89963, -47245, 34240, 74543, 45819, -20568, -71090, -60031, 11077, 77643, 68166, -11414, -75152, -58984, 12479, 67425, 63117, 7677, -54871, -68016, -9618, 65792, 77966, 12965, -56773, -63254, -10841, 48137, 67134, 30502, -37166, -73879, -33955, 45255, 75951, 28434, -40895, -64333, -32908, 21659, 59225, 44968, -19610, -73372, -53015, 20910, 65362, 37993, -21596, -56671, -47110, -1515, 48928, 53899, -1422, -61169, -57322, 1987, 48977, 45235, 4956, -37948, -53169, -18976]
476a8976N9756K1201m6239n8456o081M0710L8904J3133j5524m1555l6958J6107
488c3978O2621L3946l4095n4021j3767K2549K8320K2901M717l4024m8237k055
500d5123N3126M2021j6533m4323k2311N165K1344K9165J4556k4639m5382j2710
512d5644L4950L8485L828k5702k8160j2720J3061L4414K2749j6614l9019j7445
524c7817J8407K9495J6936n483k5079k7295J92L3232L2559n441l4806k3389P446
537b1043K3267J9886O300j4383l0447j7450K2450M1777J0428l2431l2557P03K0688
550b812J7254J0189k048k5685l1146O666M3895K5569k4747l7191p214J4887J4711
563B328J4378Q764k0033l7532o979L8868L4326j0824l2682j6879K459J3823K3176
$$ y = [-18976, 40780, 61981, 15742, -42714, -48795, -8085, 30819, 43952, 28428, -13127, -50085, -33978, 28643, 62589, 28494, -25527, -39294, -16745, 11575, 34476, 39193, 5169, -43068, -45123, 8003, 50024, 33491, -10832, -33143, -27978, -6634, 22531, 37087, 12448, -32934, -45644, -10694, 27791, 31619, 5917, -22243, -34963, -21902, 12512, 35261, 18647, -20372, -37817, -19410, 10085, 27021, 21538, -3541, -30836, -30644, 2588, 35147, 29706, -5100, -28489, -21043, 2224, 22110, 28410, 14027, -16420, -33870, -11420, 30357, 40785, 8354, -24203, -23500, -2812, 14442, 24631, 22583, -3102, -34248, -27582, 16313, 41882, 17135, -20056, -27270, -12383, 2328, 16706, 25470, 5437, -32095, -39074, -206, 34120, 23296, -9386, -26265, -23806, -9983, 13193]
576A3193J6761j6500l9040j4752K8625L5836N452k1079k5647j2451J1348L1265
588A3011K2422j3334l6839j9063J6393L2155J8341q707k8763k5602N109L4520
600I643K7282q979l2419k2020M420K4372K5736L471k5717l2404m429K8995L1036
613B8987P51k5842k5850o224J7608K7197J4172j7482l4397j5766K1097L3614J1135
626B9000j8532k7936j2730J0442K5859K0946o371l2449k3807J1563L3801J8950
638B8736j1530k4875j6808K484K1501K5291K848k6643k7835L126K7637K0724j943
651B2713j7789j9546p169J5263K6794R225j9340k6099n233J5600K0145R578r538
664A4604k2589j5435R528K5123J3540j0344k1646j3694M176J8974J8164k191k2347
$$ y = [13193, 29954, 13454, -25586, -40338, -11713, 24123, 29575, 8496, -17151, -29602, -18254, 13011, 35433, 22099, -14740, -33803, -17410, 14745, 33086, 24379, -4384, -29986, -24877, 9643, 36925, 27946, -4473, -26493, -22073, 2299, 28035, 31506, 5789, -26615, -31044, -2049, 28987, 29738, 3896, -21954, -28178, -10570, 16627, 30799, 13317, -21080, -36846, -15749, 17865, 29000, 10468, -17468, -30198, -19756, 6103, 27049, 20678, -11771, -35578, -24015, 9786, 28736, 17206, -7669, -24477, -21993, -492, 24799, 27647, 1004, -26831, -23705, 3932, 24656, 22713, 4924, -14622, -21791, -6528, 20266, 29491, 10151, -15948, -21181, -5581, 14564, 24142, 14604, -7985, -23420, -13892, 11231, 24771, 14427, -7219, -20913, -16737, 2237, 20401, 18210, -4137]
677d137j9118L085J9768J6424N68j6138k0184m155J7436K1436L174j6074j8039
690a5954n166J0789J9828J1189j1080k2837r101J2936J8487Q784n121j5468j5685
703a8399J273K2051J9478n867k2303j2151M401J2727J4391P119j2700k5653p442
716b3075K2345K3676k045j7340j3908n462N215J9585J7357j0530l0435j3539J8666
729i490K2958M866r069j4697j5271p09K1693K3400n239k7516j7226P774J9643
742A117J4978O55j5620k2058m984K0791K4440K391j9596k0426m910J4549K4099
755A5426J0828j5882k6849q931J7536K3258R757j0615k3071j5295Q741K7712J8256
768C0871j1944k7843j4916R960K3293J6220m750k2929k0829K898K4162K1154k570
$$ y = [-4137, -23255, -20170, -402, 16022, 16590, 452, -19732, -23887, -6451, 14985, 18159, 2085, -15954, -21120, -10331, 9497, 20686, 9606, -13231, -22332, -9396, 9091, 17875, 12754, -2714, -18399, -17126, 4925, 24403, 18536, -3767, -15918, -11517, 1210, 15601, 22720, 10020, -15633, -23075, -730, 22946, 20901, 3561, -10347, -15809, -10594, 8991, 26348, 15818, -14617, -28156, -9490, 13468, 18334, 9265, -5432, -20703, -21412, 281, 23681, 18442, -9074, -26300, -18526, 1117, 16095, 16750, 1130, -20928, -25912, -5121, 19319, 21710, 2114, -18312, -23222, -8673, 15426, 26254, 10372, -16477, -25408, -7872, 15386, 25143, 14528, -8543, -23838, -15097, 12615, 30871, 18927, -8916, -23832, -13872, 9421, 25641, 20891, -2038, -22867, -19969, 4193, 25347, 22777]
781B2777k3820k2329J167K1992K1182M80j9783k2097m474J7313K3910P263j8042
794E539k6166p088J8150K4427O394j4566k1136j0622J0306K4191J4698j0985k5717
807a2575j3288J1553K2985J3488p268k0114j6350M364K2862J8551m727k1945j7010
820a9474L063K0094J8303l03j9145j9428q13J7501J9676L001j6705k0917n041
833b0188J6192K0755M705j5070j9662o366J0913J9296J0421j0459k2490j1720
845b3673J2103K0858Q133q600j6809j1962K951J8706J7587m850k2307j4574P423
858a5014J7599J1694q07j3207j6970l701J7846K1297j06j9296j5133J073J2117
871b608J4596P509r943k0983r117J5284K2343L881j4051j5581n990O945J6621
$$ y = [22777, -1043, -23372, -22205, -213, 20969, 21449, 1666, -20431, -24905, -7592, 16318, 23581, 5539, -20627, -27715, -9565, 14862, 21256, 6690, -14446, -25068, -14762, 9429, 24127, 13142, -12575, -25863, -14310, 8675, 22163, 14895, -5219, -21569, -17205, 5657, 24208, 19481, -2464, -19474, -16411, 3683, 21986, 21683, 2538, -16890, -17703, -202, 19474, 22475, 5770, -15147, -20188, -3996, 16759, 21464, 6394, -13268, -19634, -8721, 10575, 20996, 10537, -11953, -23673, -11570, 9288, 17421, 8821, -7988, -19950, -16999, 1707, 19294, 14444, -7863, -22437, -15014, 2585, 14279, 13472, 265, -16705, -20406, -2560, 18737, 18631, -665, -15798, -14725, -2608, 11988, 19497, 9554, -11429, -20546, -5262, 17081, 20962, 6911, -8670, -14660, -7715, 8906]
884H906J2722p291k1369j3131R933K0272R429p090j6734j2678K573J7071J6063
897A8676k542k0023j5811L195J6709J5083j26j5766j7150k538J5824J8218L255
910A7004j5072j8198m181J3081J8577O787j1333j9366q230J1198J9674R725r392
923A0274j9019j0980Q338J9321J2275n980j8323j3607M781J8159J4913k685j8302
936h35j5703K505J7329J5314l37j5901j6240k600J4740J7507L548j4790j8372
949a3835m152J3116J6997N344j0841j7486p952R378J7220R220q686j8207r817
962a9701P707J6615J1003n815j6048j2152L582J6267J3963k796j5885j3126J693
975a4693J4573J4093N10j3100j4829k041J3313J6281K243j2042j4333l179R294
$$ y = [8906, 21628, 14337, -7032, -20163, -10230, 10042, 19471, 12381, -4353, -17031, -14458, 2613, 18676, 16134, -3889, -19700, -16505, 204, 15287, 15161, -605, -17755, -20293, -4469, 13749, 17004, 1932, -16266, -20447, -7366, 11211, 17998, 6665, -12701, -20931, -9733, 9941, 19666, 10274, -8745, -19725, -11387, 7934, 20209, 14229, -4094, -17701, -12920, 5239, 20152, 17467, -835, -16538, -14033, 3296, 18610, 18273, 2372, -13868, -16468, -1728, 15779, 19327, 4537, -13835, -17987, -4871, 12126, 17470, 6629, -10857, -18809, -9431, 7789, 17009, 8323, -9884, -19701, -11994, 4621, 15624, 9809, -6239, -18391, -14809, 1458, 15421, 12625, -3260, -16386, -14693, -120, 13973, 14483, 1383, -13446, -15487, -2174, 14107, 16350, 4308, -10025, -13204, -3910]
988c910J4873O324q674j5658o985Q765J4626O731o902j3217q101M054J3060R887
1002A4873l939j3385j0230L032J1374R430l61j1101j1278j054J0797J1504N70
1015A0232r577j1099k596P803J1557M397p963j2191m296P308J1769M560n531j0406
1029f033o060M357J1579P352n105j0674n578M121R291O540j868q490p484J569
1043f483Q989P680j536p790p033O36O980O612J033o471o895j503M748O630L189
1058H786n236q028k646M921O313J950k995n793m209P49P531N724l117q746l927
1073h723L924N773K486m14m629o247m19P902P389l231q057k523K967L256L638
1088C092K118l444p586q93P842O341k563n550j679N70J090L886M075k772p297
$$ y = [-3910, 10963, 17287, 8613, -7045, -14030, -5265, 9361, 16092, 9190, -4027, -12128, -8074, 4986, 14873, 10934, -2451, -12681, -9649, 1725, 11155, 10794, -307, -11585, -12639, -1842, 9662, 10232, 655, -10444, -13040, -5237, 6320, 10717, 2754, -9437, -13733, -6425, 5344, 9904, 4373, -6033, -12093, -7736, 3843, 11195, 6090, -4584, -10162, -6041, 3250, 9790, 7922, -568, -8052, -6483, 2506, 10186, 8650, 860, -6173, -5537, 1443, 8055, 9088, 2617, -4278, -5781, -1033, 5597, 8786, 3550, -4478, -7124, -2203, 4110, 6060, 3065, -2728, -6937, -6188, 1343, 7067, 3950, -4796, -8723, -4799, 974, 3460, 3046, -1583, -7830, -8249, -347, 7042, 3811, -4246, -6769, -3802, -546, 3092, 5210, 1766, -5820, -6713, 1129, 7470, 4907, -643, -2322, -1752, -662, 3224, 7299, 4527, -2770]
1103b770k226O054M957q95k829k511k097K24M210M581k226o240l195K935M109
1118B081K279j434m430l494J127M391L186j714l812l696K96L898M560m69n687
1133b918l595K244M407J309L0j342l571k618M182O304p13n494k141K194K051M55
1149G84K512N92n082l860M142O541k87n078j223J623j040O82M702J385o577n006
1165e190M612N661q68l727l64m47k407J721N541R00p436m190L698N097p65k341
1181e05j92j763k238J585O276J64o195l080K609L584N37p06p15j980j777K677
1197a719L879P28l299k876N15L130K362J84j871k076p23J271K683J824r12l929
1213h29j851K988M110J30l599j538L80M03P17K392Q68m416l651K564M987j36m221
$$ y = [-2770, -4996, 1058, 6015, 5120, 2291, -220, -2317, -2093, 2117, 6698, 4472, -1768, -4963, -2028, 2081, 4360, 2926, -1504, -4998, -3871, 520, 3706, 1992, -1820, -5516, -5220, -1322, 3238, 2769, -2918, -6513, -4269, 138, 1447, 1477, 135, -3436, -6054, -1872, 4432, 3719, -1775, -3916, -1722, 329, 784, 3296, 3888, -1194, -5054, -912, 5629, 5342, 264, -959, 664, -376, 306, 5008, 6393, -184, -5190, -578, 5083, 4215, 488, 124, -323, -2730, -1009, 4532, 5432, -2004, -6194, -2496, 2601, 1836, -505, -697, -2460, -4698, -3113, 3163, 3327, -2868, -5948, -3339, 245, 782, 76, -639, -2619, -4396, -1719, 2160, 2888, -411, -3287, -2772, 358, 2720, 2904, 1033, -1043, -1766, -495, 2188, 4012, 3100, -829, -2680, 308, 4418, 4548, 949, -589, -209, 194, 911, 3303, 4171, -245, -3896, -1332, 3655, 3519, -702]
1230g02p90Q37o80l11L466J061m336l722K686L999j085k057K12J00k358J197M083
1247A600N83m404k279K762K439p52o0Q40j581k878K714M733j103m121j066L001
1263D28R64k34R77L57l328j441L491L704j716l761n08J845O50K29J157j053l138
1280a377r23L540K546j726k871o89j55J307J662L84j814l361Q5K675J759N8j441
1297c41k695j087J682L899L67k662k264k09J359K014K261n86l980k449K753M525
1313B587J279l010k669m69P99K709K915m1m143l561J765M948J918j370l584k074
1329b001M19K852L379k97l348l410m69L178L600J97l728l590l47L328K865L83
1345C011j829m317k051K425M426K080l035m702r88K365L539J437o56m484k778
$$ y = [-702, -1492, -655, -1335, -1646, 1820, 2881, -1455, -5177, -2491, 1508, 423, -1634, -1422, -1322, -3680, -2483, 1600, 2183, -2221, -4500, -1738, 701, -51, -111, 729, -852, -3730, -1016, 3717, 2614, -1507, -2573, 428, 1392, 1158, 2135, 2492, -836, -2277, 1214, 4918, 3202, -559, -1067, 778, 1428, 1657, 2814, 1761, -1377, -2300, 1240, 3786, 2060, -811, -1500, -1655, -348, 1314, 1698, -116, -3477, -3392, -717, 1042, 1100, -341, -3036, -4123, -2441, 1458, 1825, -837, -3101, -3310, -1951, 63, 2324, 1738, -2242, -4691, -1938, 2587, 3866, 856, -1813, -2282, -1483, 1226, 4141, 4100, -43, -3604, -1839, 3109, 5027, 3657, 73, -2001, -1582, 1270, 4649, 4352, 1004, -2406, -2875, 303, 3903, 4100, 372, -3218, -3565, -237, 2628, 3011, 1182, -3135, -5186, -2761, 1665, 3745, 710, -3992, -4980, -2615, 924, 2361, 1705, -2779, -5557]
1360e557J950M429K863j896m271k078J177M045L469p23m303l466J661M577K750
1375D627j052l241k721l17L790L967K93n074l330J064L538K846K27l102l751j241
1391c477L356M643J89m383l556p1K768L021J516k740m896j754L940M121J43k663
1407A57l610j042J348M508K397k563n186j683L328L933J155j352l339l009J214
1422c744N149K938j835m432k009K156K866K486m4l001l609m0M676L525j176l715
1438A91k161J05K284L643J150l381m357o14L902K900J30k874k863j208J899L389
1454B135J974l257l790j111J976L201J632j581l641k143J418L700J679j282k474
1469a564k037q6K888L037J18l687k686J249L003J399P33j138l060j583K820M126
$$ y = [-5557, -3607, 822, 3685, 1789, -2482, -4560, -3383, 662, 4131, 3408, -895, -4361, -2700, 1877, 4627, 3575, 334, -2387, -2704, 1086, 5053, 5346, 272, -3058, -1994, 1544, 4390, 4617, 1515, -2236, -3477, -121, 4522, 4711, 328, -3228, -3299, -531, 2490, 4006, 1266, -3630, -5384, -1444, 2677, 2820, 157, -3453, -4495, -3147, 1361, 3758, 1195, -3991, -5674, -2346, 1587, 2742, 1390, -1949, -4958, -3744, 1405, 4343, 2508, -1924, -3933, -1777, 1089, 3575, 3531, 530, -3079, -3119, 1557, 5082, 3906, 191, -1970, -1865, 419, 4062, 5212, 1831, -2526, -3140, 762, 3662, 3792, 918, -1945, -3153, -1254, 2135, 4109, 852, -2938, -4049, -2073, 1128, 2760, 1179, -2462, -4605, -3187, 513, 2192, 910, -1564, -3601, -3687, -799, 2238, 2356, -1331, -4017, -2768, 235, 1634, 2367, 1229, -1831, -3414, -594, 3532]
1485C532J86l533j824N20P41J724K319K40m206k903K349M390L91k084k040p49
1501i47n30J916K946K38l535l724J178L556J837j337k115j756r28J833L254J059
1517B945l584l292N8K568K611P87k096l060j227J971L611J192j746l526j206J469
1533b525L985K332k100l807j560J695L634K189r08l918k278J198M380K531j733
1548C115l641k045J005K961L354k31m342l562Q38M309K527j357k361l018q98K593
1564g53N061K9m354m170L70L557K626L44k389l165k320K632M711J694l813m410
1580d350o69L048L312J557j710l872k524K390M819J969j877m011j937J506L690
1595A341K742n07m459k939R46M218L160p22l493l044J53L782L154j83l637k830
$$ y = [3532, 3718, 185, -1639, -1119, -378, 1346, 3665, 3905, -301, -3204, -855, 3535, 3926, 1842, -198, -947, -1477, 439, 3385, 3623, 88, -3636, -2458, 1098, 2935, 1598, -517, -2273, -3201, -1368, 1886, 2945, -639, -3931, -3873, -1305, 1306, 2093, -3, -3063, -4290, -2319, 1292, 2484, 738, -2788, -3994, -2525, 1460, 3792, 1692, -2115, -3675, -1980, 1654, 3843, 2935, -983, -3261, -2063, 2317, 4848, 3115, -526, -2571, -1566, 1395, 4749, 4518, 176, -3386, -2548, 1761, 4288, 2931, 570, -2448, -3346, -753, 4308, 4337, -17, -4187, -3817, -260, 2366, 2710, 321, -2844, -5164, -2532, 2179, 3873, 60, -4350, -5019, -1971, 1341, 2898, 1188, -2684, -5208, -2818, 2001, 3970, 2093, -1918, -3855, -2349, 1341, 4083, 3576, -883, -3822, -2876, 1342, 4502, 3780, 287, -2757, -2604, 1178, 4332, 4149, 512, -2318]
1611b318n08K971L214P48k838l642j215K795L599N68k177l364j710J753L301J929
1627C106j514l734k249J681L271J992j191l173k343O96L266K699o88k790k784
1642c755l3L112L129L88l089k572k72K561L097N58j741k798j563J927L832J051
1658C832j832k933j321J159K746K422j122l159k097J055K694J617n1k366l154
1673b510K2K418L141j01k771k839l43K167K478J159k136l354j614K426L043J462
1689B648k145l078j362J315L169K188j678k956j871J287L009J863k66k685k773
1704c335N50L053K378j64k478k028j7J611L250Q77k574l173k48K578K598Q25k035
1721A668k225j178J131L192R67j681l363r87J413K519R03j194j901j919R93K126
$$ y = [-2318, -2826, 145, 3359, 4107, 1269, -2373, -3588, -793, 2806, 3374, 1197, -2167, -3877, -2124, 1177, 3106, 1592, -2142, -4391, -2710, 561, 2553, 1362, -1811, -4154, -3458, -192, 2507, 1819, -971, -3755, -3788, -676, 2453, 2841, -248, -2820, -3092, -531, 2566, 3124, 1383, -1415, -2978, -1051, 2781, 3832, 2000, -933, -2254, -1095, 1651, 4073, 2951, -208, -2305, -1250, 1444, 3061, 3010, 644, -2510, -2488, -70, 3071, 2970, 199, -2640, -2983, -816, 1662, 2821, 685, -2669, -4283, -1857, 1186, 2648, 503, -2575, -3937, -2622, 547, 2735, 1057, -1899, -3770, -2483, 526, 2389, 2123, -562, -3335, -2785, 268, 2646, 2482, 4, -2024, -2041, -430, 2820, 3697, 1123, -2050, -2298, 280, 2878, 3703, 1668, -557, -1735, -604, 2588, 3555, 1874, -1489, -2476, -1063, 1456, 2359, 1165, -736, -2655, -1662, 464]
1737D64J980j157k331k101R42K168J477p04k019j627L48J849J611K62j822j689
1753b349j13J955J822K0k013j146N63R01J463J270j646j613n04J244K300k49j215
1770F90r85j76P20J536O71r23k010p87J913J196K49j427p82m17J10J693P71j092
1788I50j972q96J699J283j05q45j202n11N62Q47R73m69j854j047J316J703K35
1805F67q40j266m19J95J544J640j036j528j171J035K143P51n32j481j304L78J962
1822G38J652m18j989j436M84K273J043l35j458j411k24J740J521M14j943k098
1838a447J23J507J869L2j346k189p49J193K351R46j632k483r40J111K272J264
1854A882r89k470j409M96K270J813m21k511j918O80K577J951l29k304j765k3K341
$$ y = [464, 2444, 1287, -1044, -3145, -2203, -35, 1442, 738, -1281, -2908, -2560, -711, 900, 1162, -660, -2349, -2462, -507, 1315, 1335, -678, -1824, -1261, -360, 1103, 2373, 727, -886, -1390, -146, 2154, 1905, 690, -295, -471, 249, 1785, 2456, 1533, -477, -1264, 649, 1845, 2094, 667, -115, -532, -422, 1271, 2042, 950, -1022, -1918, -219, 1064, 959, 114, -1088, -1599, -1037, -190, 783, 314, -1540, -2587, -1271, 432, 667, -173, -1439, -1858, -1663, -119, 1521, 485, -1043, -2214, -1179, 964, 1715, 1183, -298, -1602, -1224, 738, 2390, 1972, -17, -1453, -969, 1304, 2347, 2012, 554, -857, -1081, 659, 2180, 2594, 651, -1447, -1324, 183, 2052, 2084, 738, -1451, -2200, -1007, 1344, 2290, 658, -1825, -2765, -1654, 618, 1882, 893, -1577, -2986, -2490, -220, 1593, 1172, -1339, -3257, -2577, 0, 1951, 1622, -682, -2447, -2470, -129]
1871a29K647J70k499k331k8K161K152L97j650j964j029J462K880J499k050k653
1887i65j006J632K366J129r26k849k008J228K688J788p96k591k184M24K127K118
1903B175K79k810k521M8K605K033j06k065k176o14J902K919N08k098l105l68J791
1920a603K970N42r98k395k067J582L648J387j683k641j779K036K499J451m49k637
1936a37k491M64L512K553q36l047k070N37K013K795M1k471l419M4K647K913J67
1953C215k467l125m81J945L071Q34j788l309j534J844L293J263j773l076j562
1968c650J298K915J755o90l090k626J213L209K515p47l238k283N36K678K813K9
1984B637k373l054r4K648L093O17k773k391p93J923L047J328j830k870j334J509
$$ y = [-129, 2518, 2688, 189, -2142, -2170, -9, 2143, 2540, 890, -1074, -2103, -641, 2239, 3738, 1688, -965, -1971, -339, 2027, 3156, 2230, -619, -2627, -1399, 1289, 3077, 2281, -310, -2494, -2070, 57, 2175, 2454, -356, -2877, -2829, -224, 1809, 1703, -362, -2538, -3152, -1250, 1669, 2177, 79, -3026, -3394, -1603, 1367, 1909, 911, -1484, -3551, -1969, 1679, 3066, 1383, -1258, -3037, -1001, 1498, 2949, 2500, -137, -2628, -2164, 1348, 3901, 3065, 18, -2052, -1515, 498, 3293, 3334, 863, -2556, -2512, 135, 3048, 3215, 748, -2377, -2858, -913, 2158, 2992, 1204, -2105, -3639, -1795, 1498, 2761, 988, -2088, -3650, -2352, 563, 2318, 1628, -1462, -4088, -2875, 334, 2849, 2102, -1136, -3419, -2883, -205, 2608, 2637, 264, -2790, -2884, -236, 2857, 3474, 701, -1690, -2483, -560, 2487, 3815, 1985, -885, -2219, -710]
2000g10L014J127j630k596j390J297K209J929q54k986k125R41K603J647o41k489
2016f54j665l78J951K896k64k478k329K82K014J876L21k038j371j039J442K284
2032H50J046j752k667q0J596K001Q35j047j974j063R96K636R58q34k363p48R71
2049f39K133J134p81j849j498Q67K118J002n99k175j003N64J779R42m33j810j104
2066a352P93J000J335q28j304j272P4J353J522J3k095j111j12J396J660j35j593
2083f56j406M2J597J408j74j172j330j91J081J979K66j234j775L4J356J636J67
2100A628p85j760l29J026J943O92j307j998k03J035J536M58m54j679j144Q27J878
2117A364Q57j036j694r00Q71R84J113l64j726j301M58J573R04j78j419j282J6
$$ y = [-710, 2304, 3431, 1801, -795, -2185, -888, 1321, 3250, 2396, -590, -2715, -1774, 829, 2476, 1835, -654, -2319, -2697, -746, 2150, 1886, -592, -2921, -2639, -625, 1251, 1572, -466, -1837, -2876, -1434, 850, 1896, 144, -2523, -2603, -1007, 994, 1829, 782, -1192, -2255, -1259, 1377, 2335, 1501, -862, -1610, -639, 1494, 2628, 1847, -2, -1500, -633, 1485, 2487, 1888, -287, -1290, -726, 1053, 1995, 1562, -248, -1352, -559, 441, 1776, 948, -356, -1628, -1554, -201, 1321, 1334, -761, -1872, -1984, -588, 1072, 937, -656, -2062, -2020, -423, 985, 811, -361, -1691, -1882, -801, 1178, 1444, 210, -1565, -1531, -175, 1461, 1628, 843, -917, -1246, -220, 1723, 2415, 1108, -890, -1093, -58, 1478, 1936, 1482, -197, -1341, -514, 1364, 2221, 1185, -509, -1409, -538, 446, 1559, 1195, -531, -1832, -1374, 199, 1103, 925, -494, -1776, -1760]
2134a760J181J296J64j283j512m4J372J351Q7j029j222k71O81J343O74o46j617
2151a235m02O08J751M36j59j412o24K98J276J274k58j183j052L70J138Q47o7r47
2169F59j109kR48J076J3r74r15o90O39J175L47m03j403n80M01R20J011p02j248
2188h37p54L85M97Q21N06j565p31qJ095Q99J56p52q05l24Q10P73P36p19q20n54
2208a191O90J247R6k63q42l62K99R55R63k34j219p24J73J501K01j49o66r06K5
2227d06Q43R16Q3p31j430K56M67P63J68m82j268k63L19J124L94o90r91o89N55
2246a062M11J039N2q88j008j26J116J028Q3j152n60l35P67J126K31n61j122l19
2264a280P31J282N39o03r50m36O59P25Q75q46m24q77O00P47P36kj179p03N1O22
$$ y = [-1760, -579, 717, 881, -402, -1914, -1958, -586, 765, 852, -177, -1399, -1670, -989, 354, 1028, 382, -1235, -1637, -1029, 722, 1158, 999, -413, -1037, -739, 537, 1811, 1553, 370, -682, -312, 826, 1673, 1606, 659, -450, -452, 496, 1572, 1585, 611, -304, -994, -355, 820, 1167, 764, -639, -1219, -818, 102, 1113, 411, -837, -1591, -1206, -709, 112, 618, -947, -1678, -1686, -591, 308, 464, -288, -1093, -1417, -607, 166, 902, 183, -637, -1191, -501, 746, 842, 579, -263, -625, -326, 629, 1592, 1358, 139, -585, -412, 1089, 1290, 1141, 475, -431, -406, 437, 1353, 1436, 705, -725, -469, -2, 761, 929, 447, -821, -1084, -765, 359, 753, 63, -928, -1617, -1062, -651, 388, 440, -448, -1456, -1582, -466, 562, 645, -507, -1067, -1402, -635, 491, 722, 161, -961, -1280, -549, 733, 1272, 669, -281, -717, -58, 667, 1542, 696, 272, -605, -5, 742, 1478, 1476, 297, -406, -355, 267]
2284B67P56J51n23j374k0P61N75O27j159p69k93M57Q10R2j35j320n36J149N94
2303A10J23m73o91n47K23R58Q82o83p85n02L60J084N09l00n21o40L11P11M08L66
2323I03p63p03L39Q21L02p9l79j84k72K70P24K18m69o92l51Q35K29O4k68k41m79
2344a75L27L16J27o52l98m33Q91N72k88k36o80k27M93L64j63j55m51j79L72N00
2364g5K71n94m21l05O33P13N1n78m27R4M48Q08j35l13r39n9J151M71L34p52k83
2385I3m61M75J043K34n96j086k6O61J120r0n28r18m87P29J009J78n77j225o06
2404a058M38J179L67n21j235l75J80J368L22k93j101p09J99R66O79k59n88p77
2422a218k3J058Q30j93o69q49J15P00O62M21p90m92n81Q83R98O11r53j078j42
$$ y = [267, 1023, 1174, 651, -723, -743, 18, 593, 1220, 61, -708, -1001, -544, 266, 358, 223, -1097, -1633, -484, 110, 233, -240, -931, -1478, -1255, -297, 585, -98, -883, -1385, -1025, 59, 568, 268, -253, -893, -582, 129, 537, 903, 140, -563, -224, 597, 899, 820, 441, 257, -15, 255, 979, 1197, 728, 36, -315, 520, 749, 813, 545, 304, -175, 152, 468, 595, -57, -455, -888, 3, 575, 287, 51, -629, -856, -363, 1, -162, -317, -768, -947, -575, -75, 196, -398, -819, -1124, -491, 222, 273, -305, -732, -638, -190, 618, 483, 170, -769, -828, 323, 794, 1128, 376, 93, -368, 107, 1150, 1384, 788, -298, -324, 337, 1457, 1367, 839, -79, -566, 163, 1172, 1350, 773, -452, -1058, -620, 559, 926, 405, -830, -1205, -1025, 343, 665, 372, -729, -1438, -1239, -273, 406, 147, -441, -1218, -1241, -183, 647, 454, -215, -1064, -949, -249, 413, 834, 44, -448, -1029, -146, 852, 1463, 510, -568, -710]
2441g10J216N60K67j67j283k31K95J098K61n17j067k11N45P74R0l31p25r23L79
2460f80J040O70m80j453j63L83O98L23o2q38r85L33J185M56m91o17o58kJ050O80
2480C89J95r70q62J10Q25R75J6r14m83K52K85J053K25m14j332J21Q05P53N47q36
2500G40j112k09Q49R04J1o31o68k61O14Q91O0m62j205l07P47N7O64m04q46j37
2520g05j88J244L06k99j041o81M69P07K11K39p60o15k32N71J339j93n35r03q0
2539a146M64J072O25o25j123l34P30J381J08o11q92m86R81O13O25k08r91q13O52
2558B2R81K05q6r82o94K87R62M54j51o20n79j50L08P64j72o59p51pN18P97K32
2579F79m35r52q02O77R28K58k77q66k88L82O24P44j41q92r54M82O13J000o37m76
$$ y = [-710, 506, 1066, 1333, 1166, -117, -348, -53, 1045, 1306, 789, -278, -489, 56, 830, 920, 589, -136, -1059, -680, 360, 1030, 550, -903, -1066, -683, 15, 338, 276, -562, -1547, -1214, -29, 427, -64, -681, -1339, -1341, -291, 389, 584, -386, -1248, -1138, -313, 662, 678, -236, -719, -467, -182, 871, 1096, 682, -650, -529, 276, 1029, 1576, 740, -372, -581, 268, 1172, 1183, 552, -116, -377, 237, 1128, 1188, 726, -479, -786, -39, 18, 682, 278, -568, -705, -893, 351, 657, 358, -683, -1364, -895, -188, 23, 262, -498, -1113, -1345, -774, 565, 372, -163, -1066, -1146, -682, 390, 1015, 390, -733, -1067, -337, 1044, 1152, 541, -351, -837, 144, 757, 1382, 1174, 183, -630, 22, 1003, 1208, 1122, 140, -554, -267, 695, 1149, 998, 378, -201, -351, -43, 721, 549, -110, -861, -868, -350, 447, 679, 244, -708, -1510, -833, 95, 353, 76, -790, -1078, -696, -72, 672, 531, -361, -1315, -833, -220, 780, 143, -333]
2599c33l55J80M04O75K92o80l53l13Q94M68j12k6n17o69K99J081L72o76o96m72
2619e37L28O67N56l84o94k80J4O06K35R4r97k82k34O20N92J9j125r1l18P82R22
2640D93k58r31l65J19N19R89m51k61o21l42Q17M96N72k79j138j3K72Q39O08m07
2660F58o25p12N64N86Q27j99r16p40K16Q71R31j11j119r29N49N66R88l87l97q89
2680b68n55O06R50M81j040j158n41J112P87K39n19j172n32N00J323N91o29j174
2698i99p12N77J414M99m66q62q20L04Q94R90j07j364l82o5R71J149K09j190j099
2717a059o9J451R94K19r99j009m62J038J188L64q25j287o80P39J883L34j095j004
2735b79n84K42J354M89l66j204j323Q89P08J122l52p92r74k18J141R95k6j248
$$ y = [-333, -688, -508, -104, 571, 863, 183, -170, -483, 411, 879, 767, 741, 224, -445, -146, 935, 1307, 631, -65, -537, -209, 458, 1014, 630, -64, -344, -330, 276, 511, 605, -392, -674, -908, -288, 304, 323, -802, -893, -1211, -429, 493, 235, -696, -1061, -942, -423, 566, 115, -146, -767, -1109, -292, 204, 776, 497, -641, -654, -382, 457, 1065, 658, 33, -679, -115, 471, 1298, 1099, 183, -557, -341, 530, 1461, 1350, 231, -698, -149, 417, 1405, 1018, 621, -268, -823, -217, 733, 1214, 174, -984, -1525, -413, 374, 613, 94, -1078, -1610, -1110, 213, 804, 175, -999, -1711, -1134, 280, 779, 313, -549, -1369, -1065, -171, 819, 712, -652, -1034, -1099, -128, 1021, 1230, 40, -1059, -1128, 323, 1317, 1536, 537, -472, -934, 104, 1292, 1656, 831, -456, -1136, -397, 1486, 1820, 725, -279, -863, -621, 733, 1222, 856, -348, -1671, -782, -74, 1048, 696, -96, -1070, -1288, -147, 848, 822, -426]
2753d26o84j92N08J545J71q91r51o85Q37J396M28n33j234o31P24J051N86l88q51
2772b20n16M21Q88O37k29n12q99j76J164Q86o4j390o32K41O16J123j98o93j041
2791e94l45J016N09O31j124o49m59J038N45J83m20r60p36Q38Q35K88l54j039k96
2810a093o0J211L93J58r39n15L8M26J166o8p18q81j6J078O29K36q76o23j74Q27
2830A99Q50M44j063n15j36K04P16K31K06j200l76K72R84Qq1o14p89R8P84N94P8
2851H94p82p00n0M71P59k89k92q54k38P18Q42m12k7q00m69N67M17Q24q41k75j10
2872f47N2N11P06o13k44n95M78M61M29k65k00k28j37M53O31Ll62r39M92L74L67
2893G27mk24n08R9J61M5J76j53r3k25K56j20M54k18n78j12K07N4l43J30j9PR8
$$ y = [-426, -1110, -1302, -794, 751, 922, 31, -920, -1605, -768, 628, 1056, 523, -711, -1342, -618, 433, 1019, 631, -220, -736, -315, 573, 1210, 981, 469, -430, -606, 558, 1444, 1380, -10, -642, -401, 215, 1338, 1140, 447, -594, -939, 77, 586, 1217, 93, -556, -1015, 23, 568, 751, 331, -629, -1365, -527, 308, 596, 242, -797, -1093, -1153, 58, 451, 609, -330, -845, -807, -381, 785, 717, -1, -882, -898, 180, 809, 1045, 169, -454, -628, 199, 1049, 1493, 430, -85, -221, -17, 699, 930, 1136, -64, -440, -168, 816, 824, 743, 129, -660, -562, 222, 816, 894, 112, -588, -638, -167, 592, 303, 11, -843, -1081, -363, 479, 67, 40, -760, -1229, -662, -245, 579, -262, -537, -647, -595, -84, 622, 9, -235, -830, -352, 109, 538, 273, 73, -155, -292, 161, 792, 795, 433, -506, -14, 360, 727, 723, 499, -9, 90, 251, 296, 472, 319, 226, 1, 257, 137, 591, 373, -205, -317, -110, -56, -399, -269, -288, -281, -183]
2916a83k93N42J8p83L33R6k72K40K22l51L64j65J12j50R7l1Q4q7J40L0J21M2L53
2939D79l21o3n5K32J48N1k67K30J44m38L31J51k56k4Q8j1n6j5J9j56k99J89M1
2962A42Q5j58r0m78K84R5k41L15l78o5K19Q8n7K86m63K58m19J71K53l33L87m16
2984e15L79l3J37k64K82l9o0K5K64o8l79K54Jj63K75J84P8L2l78QK40L67l02L00
3008F25m02K9n8J81R0k70k89J34k7K22J30k37m02k59L85K65r2j80J76m83pJ91
3030b78J30R6l65J64k45K63N4ol23L3J99L16J11k61j04q3K00m5L24J5Lk40L9J25
3054A22p6M64k86oq7k39N55m6J19n5n37M92j34K4Q3k50r2j3J79J32p7k61j57L33
3078A87l07J66k34l60K00K1L1n9R2l82K21K11k48L90m13m8J62J39j37J83J84q9
$$ y = [-183, -476, 66, 84, -699, -366, -270, -542, -302, -80, -431, -67, -232, -120, -270, -173, -204, -120, -207, -67, -37, 84, 126, 479, 158, 95, 40, 272, 420, 471, 204, 434, 578, 140, 471, 622, 366, 342, 430, 419, 363, 348, 367, 211, -88, 101, 142, 227, 69, -21, -499, -215, -120, -361, -46, -424, -489, -270, -182, -239, 47, -416, -158, -577, -406, -153, -486, -99, -515, -136, -169, -32, -296, -14, -53, -113, -88, 176, 108, -271, -17, -16, -179, 96, 280, 358, 390, 12, 20, 260, 627, 325, 625, 223, 252, 194, 375, 465, 195, -94, 40, 13, 235, 365, 128, -274, -533, -148, 117, 25, -155, 21, -462, -469, -278, -148, -52, -417, -253, -498, -235, -181, -187, -510, -477, -278, 38, 149, -112, -216, -299, -99, -144, 180, 195, 198, -42, -3, 122, 46, 510, 224, 218, 131, -108, 447, 401, 520, 465, -72, 420, 286, 310, 393, 143, 51, 38, 217, 349, 272, 11, -146, 187, -120, 46, -188, -548, -348, -327, -296, -355, -263, -645, -424, -213, -461, -71, -484, -532, -370, -231, -368, -185, -1, -90]
3100i0k06K64L10n4k9j25L2J35k82R2K94N6k89J89N9J26J04m22K12k18M47l36
3122B69K23j86j47J8l1K0k50J28J39n17L19k46J41j1P1j25k95M20k78j51J84k3
3144c28m9P0QJ35K2n14L39O9K50l3n0j80N9M39L6k1k35j86L87K21m08L59k57K0
3168A53m5J57J73k16p9k04J78K71O3n1Q4l00k15L33J4J25l53l79K78K61l02K80
3190B26k85j20j07n9Q5K43o2j30r1M8k39L58j67J96l2Q1k31M5K77m19r8K11J94
3213g6L41J68k26l93l61R00Rk6k86J9M6J18K36Ql35R3l20K99J60R6j83j63j06
3236A8j75N18m7j03r7m29k9O16L19o69n6n90K70M76M83m96o56N8J31L90K91k04
3258A9n16k47K13L06M13K0n44j71k36N39O12J00k48o88j02M81L96N69k04j038
$$ y = [-90, -296, -32, 278, 224, 195, 70, 102, 237, -45, 47, 341, 397, 108, 297, 356, 482, 586, 164, 376, 158, 605, 269, 492, 306, 159, 177, 146, 166, -84, 44, 183, -334, -15, -261, -120, -131, -60, -185, -480, -60, -338, -489, -305, -328, -377, -307, -299, -164, -142, -656, -317, -248, 2, -31, -81, -261, -202, 237, 273, 252, 17, -169, 218, 439, 31, 390, 133, 153, 108, 265, 438, 222, 143, -61, 117, 388, 451, 400, 484, 184, -31, 302, 316, 441, 88, -291, -13, 248, -54, 226, -59, -179, -286, -345, -260, -17, -79, -209, -300, -252, -491, -133, -300, -104, -136, -55, -286, -241, 36, -383, -481, -270, -76, 265, 433, 207, -186, -547, 353, 362, 336, 50, 69, 115, 233, 469, 477, 142, 235, -85, 214, 374, 470, 287, 124, 18, -157, 361, 314, 211, 114, -315, -344, 272, 591, -78, -134, -724, -454, 22, 505, 9, -647, -589, -458, -68, 223, 19, -497, -744, -531, -225, 188, 208, -336, -507, -743, -204, 408, 508, 260, -428, -530, -49, 347, 916, 712, -326]
3278c26J18J47M63K70j42m56j8m9M17K55l42j31m48k1O48M10k82o87j36J75L54
3299B19L53r4o98k54l75Q90J48L1k56n40k60L35O65L48q46n49K92K21L67K31l24
3320i6q15J34M15M73K30j52n39l75N57M27J46K23l83n13n0O11L97q4k77p69L44
3341i6N43J91O7n44j95K24J06O6L03m86n40k12M16L17L34j3j046J45K25J56J75
3362A36n3q62L57o0M01P4j74k44j4O2J80K10j01k72k45J31L44M17k98nl06k8N34
3385A84N22l38j32m31Q3N87kl3k48m55J53N81K09k05m16j06j09L46M11Q7o09l13
3407b34J0M85K51k3p05j52j1L94L7L1l94p75K68L72P42p8n21k70k53N91K93ON6
3430A20n57k57L83J44M01j29k89l09M29K96K61J6n11n29M80L98N99j06p19k21
$$ y = [-326, -208, -61, 402, 672, 530, 74, 56, 7, 424, 679, 337, 206, -242, -263, 385, 795, 513, -174, -310, -135, 219, 572, 478, -220, -474, -849, 41, 189, 220, -36, -576, -836, -501, 164, 512, -334, -883, -591, -370, -3, 228, -96, -911, -777, -362, 111, 341, 189, -350, -725, -168, 259, 405, 628, 245, -268, -318, 293, 690, 606, 329, -440, -96, 447, 638, 705, 161, -34, 190, 296, 362, 665, 179, -361, -573, -157, 160, 494, 481, -565, -420, -195, -39, 136, 83, -779, -422, -482, -81, -7, -181, -425, -439, -377, -197, 13, -88, -360, -605, -474, -130, 287, -11, -16, -322, -350, 184, 706, 368, 236, -195, -112, 475, 473, 440, 192, -263, -110, 471, 680, 475, 59, -47, -156, 190, 601, 688, 79, -234, -224, 261, 512, 489, -216, -368, -379, 15, 52, 83, -311, -1086, -818, -446, 296, 218, -303, -573, -826, -235, 58, 64, 120, -437, -694, -311, -167, 234, 105, -184, -493, -64, 232, 493, 509, -2, -531, -51, 347, 946, 840, 121, -100]
3450a00M6J59K65L37m86n0o75M13Q16q5l73n66k58N53N25M71n19n90o23M81M45
3471A86M20j39q26m33J0N75Q06j61r91k78k36Q58O94L7o56q07k5M78R20o8m44
3492h0p57o6P03P09K01k95q11m02O15N22P13j33j038n16K38Q94P25l97r08k35
3512c18J20N31M97r2p27n39m35Q32P58K7m53n29o47M00J386J08p48r20n42N48
3532g43J252J88o45o60j85K08M34O70j74m96j088N91M97Q42m76n83m56j4Q38P30
3552G30l5l38j041N0O11M83M58p62k71m53O04P10J83l31m17o65K89O20L04m7j026
3573c44j93J08O33N00k52n74p08L82M23P63R0j100n38k28N35R50j02k58o90m06
3593a009M48P11K01k71m79m94K91M29P71k99o30m38M30O55L75o5q28k84L15M66
$$ y = [-100, -54, 105, 370, 707, 221, 171, -504, -91, 725, 640, 267, -299, -557, -4, 521, 992, 473, -117, -740, -259, 186, 606, 467, -359, -792, -782, -207, 599, 438, -553, -831, -1067, -209, 485, 522, -134, -941, -966, -488, 432, 364, -80, -837, -903, -200, 509, 710, 415, -396, -798, -183, 339, 1052, 919, -119, -635, -397, 497, 1222, 825, -83, -318, -198, 333, 830, 738, 11, -528, -963, -131, 627, 654, 201, -328, -975, -575, 811, 919, 171, -749, -1291, -743, 509, 697, 52, -608, -793, -585, -151, 519, 345, -151, -1239, -648, -151, 691, 215, -368, -824, -838, 0, 730, 695, 357, -684, -634, -23, 460, 918, 156, -115, -568, 36, 746, 929, 598, 181, -484, -195, 425, 729, 682, -344, -537, -429, 204, 704, 452, -122, -830, -448, -25, 738, 828, -272, -810, -1038, -503, 447, 345, 87, -603, -1009, -561, 150, 351, 80, -399, -893, -602, -173, 598, 299, -331, -769, -339, 316, 691, 626, -202, -486, -171, 295]
3613B95P03n10M1j205K54J000L27j51m43r00L29M78N45j69m82n53N9O84O00M4
3633I46q90l85l79M40N97J84l17q38o23J086N35L11p77m20o43M73R31K54k28q40
3653e83l70M54M40O19k5o21m50k40O89N35L88m60p81k83N91M13O22p09m89k28
3673d88N09L55L05J15q36m47L26P19L07l07o68j64Q6L55K14J1o78k84R1L7O25
3694A83L35o88k51l39M33Q51k38k48m26k41L83K06J37o7r54M74N7K72L41k21j84
3715a85r2l69N71K52J91n25l6O4J58O52j4j78m59Q6j93P42K9n46P3k62J71M45
3737E75k82m4k00m12R7O38j61P2j31l57K01j2J85q9n5m11J11J09j30M69j13n81
3759e21j83J17P08%l32m21J61L26L00J89m25j7j68k8M04J8j25K9J0R4M0J83k32
$$ y = [295, 998, 488, 529, -676, -422, 578, 905, 754, 311, -589, -260, 218, 763, 594, 112, -441, -382, 302, 902, 946, 56, -329, -708, -268, 329, 513, 196, -642, -1265, -179, 356, 667, -110, -530, -1173, -700, 231, 485, 257, -583, -953, -499, -59, 560, 535, -86, -536, -776, -87, 448, 836, 376, -405, -688, -97, 316, 938, 229, -260, -488, 21, 376, 681, 796, -40, -487, -161, 558, 865, 558, -110, -274, -188, 167, 381, 392, -286, -570, -479, -442, 183, 518, -170, -421, -760, -327, 524, 286, 38, -388, -629, -246, -40, 97, 30, -924, -450, -393, -121, 220, -1, -185, -277, -646, -75, 177, 368, -157, -193, -129, 29, 681, 667, 489, 30, 116, -77, 665, 694, 148, 221, -41, 130, 575, 293, 249, 49, -363, -266, 372, 211, 283, 152, -205, -4, -16, 169, 80, 25, -386, -275, -166, -296, 173, 60, -521, -704, -587, 121, 121, -211, -632, -471, -145, 155, 344, -81, -98, -266, -294, 110, 128, 3, 32, 42, 136, 176, 359, 127]
3782A27m6P8p5k66P39k23N7k72k82L45J99m2M8m86j55O18j26p6j01l12K6J96L72
3805C43m8k97j14o0j98j39L75K01k84Q4m02K58K17J52j08k1o1P2j99J90j3j75
3827b27Q0r4M54Lq3j37J91j89M60p9Om38j36p5K87P26j8l08l43k01L36k46K60
3850B29%l17o9K65j39M42k14k41j86k16N21N0j36o4j63j52R8L69N0m60q1k04K05
3873d13K92pk9l00N5k07Q28l9j45j56j55L33J19r7L4J40m62K9M65l5K11o02O9
3896g2q4K56M81K6n29l78M9K95M05k7j26k58l04L54L10k16k44k60J53Q9M40j09
3918B51j78l64l34N64m41R02l75m69k66J72M25J03K44o19k95L83Q5K25M08r09
3938d88j77K53N74J61Q0l25l88J23L52M33k27n5m90J76J44M50J87m07l61m41M44
$$ y = [127, 81, 159, 84, -182, 557, 334, 391, 119, -163, 182, 381, 339, 387, -99, -254, 364, 238, 162, 61, -251, -225, -29, 343, 295, -2, -116, -176, -374, -513, -138, 63, -221, -137, -539, -281, -64, 88, -20, -41, -102, -30, -229, -39, -52, -227, -147, -241, 213, 216, 133, -4, 187, -2, 458, 379, 385, -53, -189, -264, 23, 749, 731, 423, 80, -121, 215, -31, 229, 229, -88, -157, 108, -31, 411, 197, -44, -230, -446, 75, 125, -11, -75, -238, -390, -292, 77, 127, -333, -414, -618, -413, -121, -128, -157, -457, -402, -609, 219, 180, 35, -121, -276, 57, 176, 79, 113, 253, -209, -180, 285, 250, 461, -141, -72, -156, 100, 581, 607, 78, -300, -251, 44, 449, 422, 296, 38, -266, 88, 398, 182, -62, -322, -169, -80, 360, 251, 73, -291, -625, -61, -502, 400, 25, -444, -710, -538, -113, -10, 234, -385, -680, -297, -212, 13, 421, -488, -665, -412, 162, 323, 403, 78, -310, -187, 165, 598, 371, 316, -174, 2, 146, 596, 783, 376, 15, -426, 18]
3959A8N76K39j38q02k26l7P08O99n66o17l06J64L03K95J17q07q0j15M87M97J5
3980D24p30n79K32L14O35j53k20l74j50N77L35M04p05m34l25O67K84J92L45j178
4000d39K59J35M17K69n92O2j72j43N97K07j4n23m69K52M58J32J27p31l09L75R1
4021a1M29o0l94k76r3M81p0N9j85l84p9O51p2J64l03k51j75Q5N30K62l10n27k85
4044h14N26N11L2l20m38L5k3O07M94m76k32j49k07P08N10k06n57j53j61R32Q9
4065G08q8j56p67O4P84J26Q0p42n12J88N45L54j69l04n61j46N20N93kn50n00m4
4087e79OQ89K56p41j15k60k38R48k00K41o27l70M05L29M39Rl84o74J19L86M35
4108B74J74k53q92J93L95P29J5l71n40p7M74L62K37k89l15j78mN69K98j38p20
$$ y = [18, 594, 833, 695, -107, -333, -370, 338, 1037, 471, -146, -452, -288, 15, 310, 427, -380, -460, -575, -88, 409, 424, -306, -885, -653, -339, 296, 143, -77, -451, -601, -24, 311, 715, 10, -424, -749, -82, 202, 394, 739, -439, -180, -45, 372, 641, 49, 111, -61, -204, 393, 600, 586, 63, -406, -154, 304, 436, 563, -168, -477, -102, -11, 418, 358, -36, -312, -405, 76, 6, 65, -120, -504, -583, 68, -4, 160, -143, -394, -569, -484, 46, 308, -2, -529, -814, -288, 223, 255, -65, -503, -468, -491, 116, 610, 134, -98, -247, -454, 254, 764, 558, 1, -152, -313, 619, 708, 620, 464, -303, -239, 545, 671, 751, 9, -503, -315, 230, 584, 415, 111, -450, -596, -76, 517, 515, -35, -535, -579, -573, 316, 572, -169, -284, -544, -782, 166, -34, 207, -420, -790, -385, -56, 383, 392, 8, -666, -547, -161, 274, 448, 195, -697, -504, -109, 620, 635, 264, -276, -353, 121, 483, 720, 431, 116, -62, -66, 503, 801, 663, -57]
4129e7m97K70M00K19K1l21m61M34J47K51j64l91m73R2N42J07kk47k16r2K40M57
4151B59P8m43k60k38L72N32j35l08n5k12O3N84R5m2n65k24K84M27L91M3r94J85
4173a63J20K03O06m02m05j12L7K88L44j0n10k32m4K31O77j21l88l71l27N32P43
4194F96j00n22l81k97J4O94K81k47l50k75J71L27K11j99n50k68P05L1L02k9j7
4215A97j002K62P00K08J47l55m75K2l4R12o1l68l95m0L74L75p7l2o57R1J99M50
4237D41L52m34m94l37M81L70p9R1m10j21k67L73K78j17n8j27k84K8M22J51l63
4258a04k22n42O32M33J47m51l05j74J57M36K80l00p6m91K11R2Q05k57m79J12l03
4279c99M01L66K43p78j02K60J49L84K15o52l8k11L74L97j0m31K4n16L05M77j24
$$ y = [-57, -554, -284, 116, 335, 356, 35, -426, 8, 155, 406, 242, -149, -622, -530, 12, 119, 117, -130, -346, -438, -198, 259, 337, -106, -366, -604, -232, 300, 165, -143, -198, -410, -347, 237, 332, 290, -275, -499, -215, 212, 603, 646, -348, -163, -43, 160, 766, 364, -41, -153, -116, 172, 516, 506, -4, -236, -280, -49, 628, 507, 119, -252, -579, -47, 696, 596, 74, -307, -604, -590, 104, 385, 138, -212, -487, -316, 11, 222, 23, -527, -795, -90, -59, 243, 214, 197, -805, -543, 157, 365, 512, 157, -318, -296, -330, 582, 521, 153, -242, -282, 92, 467, 390, 358, -299, -208, -9, 441, 793, 359, -135, -472, 9, 379, 300, 391, -19, -140, -407, -34, 244, 127, 69, -58, -342, -314, 108, 259, -104, -326, -868, -236, 197, 344, -107, -412, -586, -429, 7, 287, -13, -89, -580, -369, -277, 528, 271, -208, -96, -399, 2, 368, 611, -167, -269, -9, 140, 524, 739, 87, 49, -162, 212, 609, 599, 168, 192, -324, -19, 458, 334]
4300C34k28m48mK96L27K33k30o23j82J45L13J48K4m52m17L16M08L47j49m70j24
4321d36r8K26M37M23m69n63q3O05m9M30j61o81J83Q4M73M43m25n68k30K15P42
4342D98J07k12j87n64J93M98M39n67l58n01M37P78J87j93n28m97L96K54L97l75
4362B02l29l79J65L70M59k37k91n76J07M65L56Mk81o83N5L81O64p7k91m04L4j37
4384d23M73O44q79J09n34P73j87M16j49m73k12M48K68N31l97l00o89K05Q37L84
4404H45P0p12n98K76M46R8J53p31k10o1L46P97j60n43o11K12kP27M2n19n59j65
4426h59P57P07k06j20p13l71L42O55K74k34n83l96N19L01M43j38m89n50K43P63
4446C45L11q0n30m20k05R12O02k97n57o00L35O48L96j44q13l95k61Q42O03N0q78
$$ y = [334, 106, -342, -346, -50, 277, 510, 280, -343, -525, -380, -67, 81, 105, -347, -764, -448, -40, 307, 158, -312, -436, -534, -308, 129, 552, 83, -480, -563, 42, -7, 423, 262, -419, -236, -152, 321, 764, 339, -229, -459, -244, 498, 605, 393, 206, -358, -165, 333, 772, 205, -153, -654, -217, 561, 748, 555, 27, -470, -74, 180, 577, 202, -127, -506, -341, 29, 488, 251, -40, -616, -509, -44, 312, 316, 35, -648, -593, -212, 452, 375, 84, -320, -286, -423, 50, 694, -185, -76, -610, 163, -24, 392, 243, -230, -442, 6, 274, 805, 408, 108, -581, -376, 461, 845, 915, 203, -395, -119, 327, 425, 578, -153, -363, -424, -78, 719, 559, 16, -595, -383, -385, 342, 384, -135, -694, -859, -102, 605, 399, 279, -434, -805, -463, 192, 466, 232, -351, -747, -228, 73, 516, 378, -111, -661, -418, 345, 656, 576, 46, -374, -579, 333, 935, 638, 81, -519, -184, 464, 860, 716, -97, -492, -753, 89, 692, 742, -136]
4467a36l52pK22Q77N4k82m76p67O01N46M44p01n42k01L66j49J036l74n86m08J92
4488f43N64L05K35p38m68n9N49M63L51m26p82K20N96N57K72n96o63m41O63M54
4508D13N22o92l43k08L48M99M9L6q01k94J68N06M83k08l46m94l27R06P10l57n72
4529bl74N1K67L75K6l26r62L92M77P04k77l86m95k76M38M19M89p93m54n3N16P00
4551D56J17k84p15j34K99M91N09l34n84m54N03L11K43o1m24k70j5N77M99l27l36
4572F7l55j17N26K44R3k17n75m68P50O07k68jo30l11M73M53l5j51m87k30k04R77
4594A41L5M7l60o24M6O06N48k71n64m24L58J76P83J11n55n63J01n9J026j23k15
4615B20o44Q4J36N73K00n04K3o53L06O72K03j98k08m44L01l9O09j41m95m45r1
$$ y = [-136, -488, -495, -273, 604, 658, 376, -100, -867, -266, 280, 724, 23, -519, -720, -354, -503, 533, 159, -427, -835, -643, -79, 226, 461, -277, -745, -804, -255, 208, 559, 133, -649, -429, 167, 724, 996, 400, -263, -704, -41, 413, 935, 243, -100, -308, 40, 539, 588, 624, -177, -471, -303, 203, 686, 478, 132, -362, -689, 217, 927, 570, -2, -376, -325, -58, 317, 343, 17, -945, -553, -76, 628, 351, -35, -530, -806, -368, 51, 540, -253, -707, -760, -244, 456, 573, 289, -426, -560, -261, 230, 739, 405, -179, -633, -130, 181, 424, 363, -61, -331, -346, 231, 730, 403, 67, -288, -405, 121, 365, 458, 241, -334, -802, -52, 555, 287, 286, -344, -655, -182, 271, 236, 85, -402, -632, -836, 141, 176, 223, -137, -761, -715, -109, 439, 168, -396, -820, -462, -286, 497, 608, 53, -510, -409, -468, 558, 435, 220, -424, -340, -204, 369, 569, 65, 88, -565, -259, 413, 616, 418, 210, -234, 67, 28, 637, 496, 1, -444, -535]
4636e35M51K43o1O5m63n19O04M95J01l72j78n56L34P27J5j29k39p23M20N02J23
4657C05j47n12j00o4N49K44K8m92l68o4N62K24J45j98k27N5k1L89n0J86n57K6
4679h7J47K05K23k97k05n7q0M66J73n48p1p6J50K90N9l9M3o62R1RN27O7o25l9
4703c36m07L19O03J35n49n11K64J35N62J03k23m59K66j43L37J05j28l05k3L2K02
4724b1K54P0j09n67J64N16m76L92p7l28L79R6K69l00j24p2j40J15J81J9k20m6
4746b5j35M32K33r9m54j34k26M48J17j33j2l50k73L88K89J16l12k5l67J28L97
4767Cl0j47l6k81K09J71M05ll48l22O1RN87K31m30k75L13n3K36K33k3n19l85L74
4791b0J80K71k04j18p5K03j49J91J8m29RN0K94J24p2k03j70j9J48K71j78j12k61
$$ y = [-535, -84, 159, 98, 163, -300, -819, -215, 280, 381, 9, -169, -725, -391, 336, 351, 222, -17, -740, -320, 182, 305, 158, -354, -454, -518, 31, 275, 303, -189, -557, -621, -59, 165, 310, 112, -115, -60, -81, 308, 258, 444, -113, -87, 60, 265, 488, 191, -14, -71, -151, 315, 488, -60, -131, -207, -57, 233, 292, 253, 296, -366, -275, -266, 261, 328, -297, -336, -743, -424, 179, 314, -235, -746, -482, -347, 215, 318, 95, -364, -98, -241, 96, 201, 73, -232, -255, -223, -21, 233, 303, 194, -373, -209, 307, -169, 223, 146, -182, 197, 293, 562, 262, 138, 66, -74, 41, 222, 241, 21, -25, -160, 272, 505, 406, -48, -182, -408, 40, 157, 24, 12, -338, -611, -223, 66, 182, -130, -155, -522, -394, 3, -27, -174, -210, -491, -282, -111, 294, 291, -57, -379, -318, -309, 278, 509, 79, -196, 117, 64, 300, 533, 510, -9, -394, -20, 160, 431, 227, 109, 34, 237, 88, 279, 297, -132, -123, -73, 221, 345, 273, 70, -100, -119, 29, 300, 122, 10, -251]
4814b51n7J81J76J97j25o46J85O56l79K64k38o5j36J84K34l9k04p3P9J2J4J83
4836A52l2k75K44l07K83J84k91j54J16L09j04PL33k73l0q9L7J09j71l5P4j57K32
4859A62J5n0r2k16j36O01l94Q5j56MkM4O5R2J24m39M0J22J72j38n2k3n6L55k57
4884a30j3P0j40L54n8j81K87J25k62K75l03NJ19k47J42L9J29j21k9K73j60L0k01
4907CL27m55N00m19J45q6K26n7P9m26J28J9j14K2J65J50k43j4p7LJ13k7l31K09
4931a60R3j52M1J44k04J63n8N3j56K78l77L52Lq4L28l13q7J92M01p0m39L81k44
4954H5q6K21M3N2k02k57M71l21N2p7K40P4l11J20p9j39M6J17k85L52k59j6O2K35
4978A38l21n4n0q8K91j40J48oj96R7K5l3M25l14j00m8L47k73J52mm3jK10j00j59
$$ y = [-251, -308, -127, 49, 246, 121, -525, -340, 316, -63, 201, -37, -102, -238, -54, 180, 141, -63, -136, -57, -45, -31, 152, 120, -155, 89, -218, 65, 249, -42, -196, -80, 229, 125, 132, 465, 192, 162, 73, 110, 219, 48, 13, 87, -70, 162, 177, 127, 35, -181, -317, 284, -110, -25, -181, -177, -179, -135, -70, 22, 146, -293, -253, -131, 41, -97, -149, -172, -228, 127, -130, -143, -73, -213, 141, 83, -98, 189, 314, 52, 327, 24, 29, 148, -99, 43, 82, 211, 90, 61, 334, 174, 204, 3, 330, -125, 375, -44, 101, 15, 241, 184, 263, -163, -35, -16, -130, -108, 57, 207, -36, -50, -127, -124, -11, -38, -369, -160, -67, -219, -178, -34, -238, -75, -133, -80, -236, 42, -335, 17, 20, -64, 264, -49, -136, 56, 457, 387, -52, 329, 85, -1, 220, 263, 315, 113, -144, 327, 6, 58, -19, 221, 295, -16, 104, 25, -114, -68, 49, -236, 116, -143, -159, -97, 138, -183, -237, -287, -375, -84, -224, -76, -82, -278, -181, -156, -189, 236, -78, -178, -226, 121, -152, 0, -4, -47, -48, 162, 62, -97]
5003i7J38J43j29J37j65j65M41k15j81L20m36N15l27K40j52J75j17L70m66j76
5023a47K63K49n1l84M6K59k31m38L29q7M20K1l85J69J7j94J5L25o17k45P24k42
$$ y = [-97, 41, 184, 55, 192, 27, -138, 303, 88, -93, 227, -209, 306, -21, 219, 67, 242, 125, 495, 29, -147, 116, 365, 314, -70, -24, 235, 4, -434, -105, -192, 228, 249, -136, 33, 50, -144, -129, 196, -421, -666, 58, -184]
$$ [...]
8191A06
##END NTUPLES=NMR FID
##END=
