##TITLE=1H_BAU-j-XR
 CDCl3, 8 sc, 
 18.12.2019
##JCAMPDX= 6.0         $$ Bruker NMR JCAMP-DX V2.0
##DATA TYPE= NMR FID
##DATA CLASS= NTUPLES
##ORIGIN= UXNMR, Bruker Analytische Messtechnik GmbH
##OWNER= root
$$ XWIN-NMR		Version 3.5
$$ Wed Dec 18 15:33:53 2019 Russian Standard Time (UT+4h)  she@DPX200
##.OBSERVE FREQUENCY= 200.1315
##.OBSERVE NUCLEUS= ^1H
##.DELAY= (6, 6)
##.ACQUISITION MODE= SIMULTANEOUS
##.ACQUISITION SCHEME= undefined
##.AVERAGES= 8
##.DIGITISER RES= 18
##SPECTROMETER/DATA SYSTEM= spect
##.PULSE SEQUENCE= zg30
##.SOLVENT NAME= CDCl3
##.SHIFT REFERENCE= (INTERNAL, CDCl3, 0, 15.7039)
##AUDIT TRAIL= $$ (NUMBER, WHEN, WHO, WHERE, WHAT)
$$ ##TITLE= Audit trail, XWIN-NMR		Version 3.5
$$ ##JCAMPDX= 5.01
$$ ##ORIGIN= Bruker BioSpin GmbH
$$ ##OWNER= she
$$ F:/spectra/data/she/nmr/H-F/1/audita.txt
$$ ##AUDIT TRAIL=  $$ (NUMBER, WHEN, WHO, WHERE, WHAT)
(   1,<2019-12-18 15:32:50.65 +0400>,<she>,<DPX200>,
      <created by zg, POWCHK disabled, PULCHK disabled
       configuration hash MD5:
       00 E9 B6 7A A2 85 ED C7 34 08 36 98 17 FE 4E 26
       data hash MD5: 16K
       D2 2B 81 CC 92 23 30 D1 A7 06 AE A8 DD 3E 06 86>)
$$ ##END=
$$ 
$$ hash MD5
$$ 87 45 23 9A B8 EA 18 0B 12 9A 9D 27 0A 02 89 5B
##$RELAX= 
##$RELAX= 
##$RELAX= 
##$RELAX= 
##$RELAX= 
##$RELAX= 
$$ Bruker specific parameters
$$ --------------------------
##$DU= <F:/spectra>
##$EXPNO= 1
##$NAME= <H-F>
##$PROCNO= 1
##$TYPE= <nmr>
##$USER= <she>
##$AMP= (0..31)
100 100 100 100 100 100 100 100 100 100 100 100 100 100 100 100 100 100 
100 100 100 100 100 100 100 100 100 100 100 100 100 100 
##$AQSEQ= 0
##$AQ_mod= 1
##$AUNM= <au_zg>
##$AUTOPOS= <>
##$BF1= 200.13
##$BF2= 200.13
##$BF3= 200.13
##$BF4= 200.13
##$BF5= 200.13
##$BF6= 200.13
##$BF7= 200.13
##$BF8= 200.13
##$BYTORDA= 1
##$CFDGTYP= 0
##$CFRGTYP= 5
##$CHEMSTR= <none>
##$CNST= (0..31)
1 1 145 1 1 1 1 1 1 1 1 1 1 1 1 1 1 1 1 1 1 1 1 1 1 1 1 1 1 1 1 1 
##$CPDPRG= <>
##$CPDPRG1= <>
##$CPDPRG2= <>
##$CPDPRG3= <>
##$CPDPRG4= <mlev>
##$CPDPRG5= <mlev>
##$CPDPRG6= <mlev>
##$CPDPRG7= <mlev>
##$CPDPRG8= <mlev>
##$CPDPRGB= <>
##$CPDPRGT= <>
##$D= (0..31)
0 1.2 0 0 0 0 0 0 0 0.06 0 0.03 0 0 0 0 0.0002 0 0 0 0 0 0 0 0 0 0 0 0 
0 0 0 
##$DATE= 1576668770
##$DBL= (0..7)
120 120 120 120 120 120 120 120 
##$DBP= (0..7)
150 150 150 150 150 150 150 150 
##$DBP07= 0
##$DBPNAM0= <>
##$DBPNAM1= <>
##$DBPNAM2= <>
##$DBPNAM3= <>
##$DBPNAM4= <>
##$DBPNAM5= <>
##$DBPNAM6= <>
##$DBPNAM7= <>
##$DBPOAL= (0..7)
0.5 0.5 0.5 0.5 0.5 0.5 0.5 0.5 
##$DBPOFFS= (0..7)
0 0 0 0 0 0 0 0 
##$DE= 6
##$DECBNUC= <off>
##$DECIM= 24
##$DECNUC= <off>
##$DECSTAT= 4
##$DIGMOD= 1
##$DIGTYP= 9
##$DL= (0..7)
0 120 120 120 120 120 120 120 
##$DP= (0..7)
150 150 150 150 150 150 150 150 
##$DP07= 0
##$DPNAME0= <>
##$DPNAME1= <>
##$DPNAME2= <>
##$DPNAME3= <>
##$DPNAME4= <>
##$DPNAME5= <>
##$DPNAME6= <>
##$DPNAME7= <>
##$DPOAL= (0..7)
0.5 0.5 0.5 0.5 0.5 0.5 0.5 0.5 
##$DPOFFS= (0..7)
0 0 0 0 0 0 0 0 
##$DQDMODE= 0
##$DR= 18
##$DS= 0
##$DSLIST= <SSSSSSSSSSSSSSS>
$$ [...]
##$SUBNAM2= <"">
##$SUBNAM3= <"">
##$SUBNAM4= <"">
##$SUBNAM5= <"">
##$SUBNAM6= <"">
##$SUBNAM7= <"">
##$SUBNAM8= <"">
##$SUBNAM9= <"">
##$SW= 24.9337058887773
##$SWIBOX= (0..15)
0 0 2 0 0 0 0 0 0 0 0 0 0 0 0 0 
##$SW_h= 4990.01996007984
##$TD= 16384
##$TD0= 1
##$TE= 0
##$TE2= 300
##$TE3= 300
##$TEG= 300
##$TL= (0..7)
0 120 120 120 120 120 120 120 
##$TP= (0..7)
150 150 150 150 150 150 150 150 
##$TP07= 0
##$TPNAME0= <>
##$TPNAME1= <>
##$TPNAME2= <>
##$TPNAME3= <>
##$TPNAME4= <>
##$TPNAME5= <>
##$TPNAME6= <>
##$TPNAME7= <>
##$TPOAL= (0..7)
0.5 0.5 0.5 0.5 0.5 0.5 0.5 0.5 
##$TPOFFS= (0..7)
0 0 0 0 0 0 0 0 
##$TUNHIN= 0
##$TUNHOUT= 0
##$TUNXOUT= 0
##$USERA1= <user>
##$USERA2= <user>
##$USERA3= <user>
##$USERA4= <user>
##$USERA5= <user>
##$V9= 5
##$VALIST= <valist>
##$VCLIST= <CCCCCCCCCCCCCCC>
##$VD= 0
##$VDLIST= <DDDDDDDDDDDDDDD>
##$VPLIST= <PPPPPPPPPPPPPPP>
##$VTLIST= <TTTTTTTTTTTTTTT>
##$WBST= 1024
##$WBSW= 4
##$XGAIN= (0..3)
0 0 0 0 
##$XL= 0
##$YL= 0
##$YMAX_a= 455527
##$YMIN_a= -310302
##$ZGOPTNS= <>
##$ZL1= 120
##$ZL2= 120
##$ZL3= 120
##$ZL4= 120
##$ABSF1= 10
##$ABSF2= 0
##$ABSG= 5
##$ABSL= 3
##$ALPHA= 0
##$AQORDER= 0
##$ASSFAC= 0
##$ASSFACI= 0
##$ASSFACX= 0
##$ASSWID= 0
##$AUNMP= <proc_1d>
##$AZFE= 0.1
##$AZFW= 0.1
##$BCFW= 1
##$BC_mod= 2
##$BYTORDP= 1
##$COROFFS= 0
##$CY= 11.3945322036743
##$DATMOD= 1
##$DC= 2
##$DFILT= <>
##$DTYPP= 0
##$F1P= 16.9975609425685
##$F2P= -3.02152046262296
##$FCOR= 0.5
##$FTSIZE= 0
##$FT_mod= 4
##$GAMMA= 1
##$GB= 0.15
##$INTBC= 1
##$INTSCL= 1
##$ISEN= 128
##$LB= 0.24
##$LEV0= 0
##$LPBIN= 0
##$MAXI= 10000
##$MC2= 0
##$MEAN= 0
##$ME_mod= 0
##$MI= 1.114404
##$NCOEF= 0
##$NC_proc= 0
##$NLEV= 6
##$NOISF1= 3.799351
##$NOISF2= 2.8
##$NSP= 1
##$NTH_PI= 0
##$NZP= 0
##$OFFSET= 15.70392
##$PC= 1
##$PHC0= -10142.88
##$PHC1= 10.40082
##$PH_mod= 1
##$PKNL= yes
##$PPARMOD= 0
##$PSCAL= 0
##$PSIGN= 0
##$REVERSE= no
##$SF= 200.130013532006
##$SI= 16384
##$SIGF1= 3
##$SIGF2= 2
##$SINO= 400
##$SIOLD= 16384
##$SREGLST= <1H.CDCl3>
##$SSB= 0
##$STSI= 0
##$STSR= 0
##$SW_p= 3612.71676300578
##$SYMM= 0
##$S_DEV= 0
##$TDeff= 0
##$TDoff= 0
##$TI= <>
##$TILT= no
##$TM1= 0
##$TM2= 0
##$TOPLEV= 0
##$USERP1= <user>
##$USERP2= <user>
##$USERP3= <user>
##$USERP4= <user>
##$USERP5= <user>
##$WDW= 1
##$XDIM= 8192
##$YMAX_p= 0
##$YMIN_p= 0
$$ End of Bruker specific parameters
$$ ---------------------------------
##NTUPLES= NMR FID
##VAR_NAME=  TIME,          FID/REAL,        FID/IMAG
##SYMBOL=    X,             R,               I
##VAR_TYPE=  INDEPENDENT,   DEPENDENT,       DEPENDENT
##VAR_FORM=  AFFN,          ASDF,            ASDF
##VAR_DIM=   8192,          8192,            8192
##UNITS=     SECONDS,       ARBITRARY UNITS, ARBITRARY UNITS
##FACTOR=    0.0002004,     1,               1
##FIRST=     0,             0,               0
##LAST=      1.6414764,     0,               0
##MIN=       0,             -310302,         0
##MAX=       1.6414764,     455527,          0
$$ Real data points
##PAGE= N=1
##DATA TABLE= (X++(R..R)), XYDATA
$$ [...]
$$ plain form
1896 40 -142 -126 -22 15 -71 216 168 -194 28 -99 53 126 -86 184 112 136 -133 166 -14 117 190 111 -151
1919 -151 28 -26 114 -42 2 -152 -216 -191 -40 111 -18 -163 -26 -85 -19 -158 48 -101 -299 -139 255 70
1941 70 172 245 91 248 350 -42 -196 -71 -127 -43 -4 -243 -48 113 108 -150 85 -47 -29 17 -11 190 287 45
1965 45 -114 -178 214 -176 37 28 505 -134 -81 31 -496 -299 -36 -96 -114 -16 -291 134 -174 252 -439 -100 -117
1988 -117 121 -170 -223 -38 -192 -130 15 -188 -68 -79 134 106 -38 100 45 -122 -162 -160 139 249 -254 155 -80
2011 -80 -96 101 78 84 68 78 17 -180 223 80 59 224 192 79 247 -77 -269 -103 -78 -150 -36 340 -94 14
2035 14 72 41 35 84 -132 36 98 46 -211 34 -240 40 80 -49 73 260 280 -120 356 167 -32 305 20
2058 20 24 240 -163 89 41 199 -50 131 6 -165 -235 150 -28 -32 -64 -122 36 164 83 11 -125 205 257 64
$$ packed form
1896D0j82J6J04L7q6K87m8l62K22j27J52P3k12K70p2K4k69K99j80J31P3p9k62
1919a51J79n4J40j56M4j54o4K5J51J51j29j45J37n9O6j39K06j49j98J60L94j85
1941G0J02P3j54J57J02l92j54J25n6Q4L9k39J95J61nk58K35j32J8M6k8K01R7k42
1965D5j59o4L92l90K13rM77o39N3J12n27J97K63o0j8R8k75M25l08M26o91L39j7
1988a17K38k91n3J85j54O2J45k03J20j1K13k8j44J38n5j67m0KK99J10n03M09k35
2011h0j6J97k3Oj6J0o1j97M03j43k1J65l2j13J68l24j92J66K5p2J14L76m34J08
2035A4N8l1oM9k16J68O2n2k57K45k74K80M0j29J22J87K0m00M76j89j99L37k85
2058B0MK16m03K52m8J58k49J81j25j71p0L85j78ml2n8J58J28q1p2j36L30N2j93
$$ plain form
2082 64 301 69 267 219 237 19 14 -63 60 218 140 -104 244 261 199 -57 -43 50 47 213 -266 131 201 76 177
2107 177 150 266 -47 -223 -80 -243 -36 -6 5 50 -73 105 -18 147 90 -225 180 -13 -46 64 135 -93
2129 -93 -95 52 -381 336 -114 -87 -119 41 182 -156 -89 -82 0 18 178 77 257 -110 77 -24 -72 -322 28 350
2153 350 -39 179 -239 73 174 229 134 186 -11 -249 -80 242 -152 73 370 -41 -241 111 -11 -37 -63 158
2175 158 251 -215 13 60 165 128 13 -144 -71 448 -208 -102 133 278 -83 -87 -90 312 -16 0 -51 39 -48 72
2199 72 -144 219 90 -104 -141 383 115 -107 -131 -118 116 269 -17 -140 204 -21 58 12 -149 -151 -319 -273 57
2222 57 -75 -214 -131 -427 -209 -81 -47 104 -81 180 -29 139 -135 85 249 12 70 -185 152 160 32 -216
2244 -216 140 145 96 68 -71 192 25 123 298 -3 -240 125 -80 -200 84 -199 425 30 160 -125 -15 -255
$$ packed form
2082F4K37k32J98m8J8k18np7J23J58p8k44L48J7o2k56J4R3lJ66m79L97P0j25J01
2107A77k7J16l13j76J43j63K07L0J1M5j23J78j23J65n7l15M05j93l3J10P1k28
2129i3kJ47m33P17m50K7l2J60J41l38O7PQ2J8J60j01J80l67J87j01m8k50L50L22
2153C50l89K18m18L12J01N5r5N2j97k38J69L22l94K25K97m11k00L52j22k6k6K21
2175A58R3m66K28M7J05l7j15j57P3N19o56J06K35J45l61mlM02l28J6n1R0q7J20
2199G2k16L63j29j94l7N24k68k22k4J3K34J53k86j23L44k25P9m6j61kj68M6L30
2222E7j32j39Q3k96K18J28L4J51j85K61k09J68k74K20J64k37N8k55L37Qj28k48
2244b16L56Nm9k8j39K63j67R8J75l01k37L65k05j20K84k83O24l95J30k85J10k40
$$ plain form
2266 -255 -73 -205 -19 -192 51 123 -263 175 153 -131 179 -3 -64 121 -268 -48 130 50 -219 -351 186
2287 186 6 165 -37 18 55 -475 -223 -48 11 -15 -40 55 -21 -290 -252 165 152 298 -25 43 115 -591 -50 -115
2311 -115 -249 292 -158 35 -211 53 -6 301 -44 -86 -214 -39 -47 33 68 -149 -56 -114 -41 103 -43 227 -224
2334 -224 29 -86 -521 -90 94 349 -223 269 -267 -377 -395 73 -26 -61 -2 -43 98 -191 123 -24 -192 168
2356 168 -175 71 176 -157 -104 -10 -223 -99 209 -74 75 -29 169 -16 203 62 -125 -38 46 -100 162
2377 162 251 371 -211 -120 -292 116 -88 -251 31 -38 210 81 23 -62 -292 138 79 -121 39 25 129 -45
2399 -45 65 -12 -137 -90 -8 92 -80 157 34 181 -128 -297 -228 -181 -75 115 38 -6 -122 -247 -20 97 200
2422 200 -270 190 74 -6 43 30 101 121 186 8 -33 -162 0 80 -238 133 150 -54 224 -85 39 -107 -35
$$ packed form
2266b55J82j32J86j73K43P2l86M38k2k84L10j82o1J85l89K20J78q0k69j32N37
2287A86j80J59k02N5L7n30K52J75N9k6k5R5p6k69L8M17j3J46l23O8P2p06N41o5
2311a15j34N41m50J93k46K64n9L07l45m2j28J75qQ0L5k17R3n8P3J44j46K70m51
2334b24K53j15m35M31J84K55n72M92n36j10j8M68r9l5N9m1J41k89L14j47j68L60
2356A68l43K46J05l33N3R4k13J24L08k83J49j04J98j85K19j41j87Q7Q4j46K62
2377A62Q9J20n82R1j72M08k04j63K82o9K48j29n8q5k30M30n9k00J60j4J04j74
2399d5J10p7j25M7Q2J00j72K37j23J47l09j69O9M7J06J90p7m4j16j25K27J17J03
2422B00m70M60j16q0M9j3P1K0O5j78m1j29J62Q0l18L71J7k04K78l09J24j46P2
$$ plain form
2445 -35 -88 -218 73 -214 -109 184 -29 -187 44 38 -125 -189 78 132 216 40 295 141 269 13 89 -191 -69
2468 -69 -9 158 145 -232 -18 34 68 19 291 -36 165 91 -151 -55 36 46 119 -119 -31 7 247 13 -71 66 -354
2493 -354 47 -370 126 163 -175 5 230 149 -344 -184 -23 -63 82 -26 -249 -70 30 -19 74 11 -208 101
2515 101 -136 -45 -175 -95 -79 38 -33 111 -194 -274 55 114 102 -116 136 -268 114 -181 -30 -35 -131 44 -74
2538 -74 81 58 -74 -209 -170 58 -97 179 -221 141 43 -3 -272 -188 95 229 -18 142 -101 -95 45 -31 -236
2561 -236 84 198 -324 142 -168 -295 -387 22 124 159 213 -64 43 -2 -67 -67 -122 324 -162 205 27 85 19
2584 19 197 61 60 65 237 -198 19 -198 15 257 148 -188 -109 123 209 163 -102 288 -119 -18 -146 18 40
2607 40 -301 -121 25 -81 212 -141 -116 -295 37 -111 -97 44 -95 -121 186 -124 -41 -53 46 112 -67 124 -386
$$ packed form
2445c5n3j30K91k87J05K93k13j58K31oj63o4K67N4Q4j76K55j54J28k56P6k80J22
2468f9O0J67j3l77K14N2L4m9K72l27K01p4k42R6R1J0P3k38Q8L8K40k34q4J37m20
2493c54M01m17M96L7l38J80K25q1m93J60J61m0J45j08k23J79J00m9R3o3k19L09
2515A01k37R1j30Q0J6J17p1J44l05q0L29N9j2k18K52m04L82k95J51nr6J75j18
2538g4J55k3j32j35L9K28j55K76m00L62r8m6k69Q4K83J34k47J60k43OJ40p6k05
2561b36L20J14n22M66l10j27r2M09J02L5N4k77J07m5o5%n5M46m86L67j78N8o6
2584A9J78j36jNJ72m35K17k17K13K42j09l36P9K32Q6m6k65L90m07J01j28J64K2
2607D0l41J80J46j06K93l53K5j79L32j48J4J41j39k6L07l10Q3j2R9O6j79J91n10
$$ plain form
2630 -386 -127 169 -173 15 216 264 48 -327 75 -4 126 85 52 -96 -3 87 -26 32 303 42 -290 48
2652 48 76 -160 242 88 165 -180 -4 -21 -153 -71 16 -31 83 131 66 -112 -23 -109 -81 -57 -302 211 106 146 114
2677 114 -9 14 46 -26 -210 -104 176 -181 -169 -127 238 96 68 100 -130 -78 27 138 -8 -62 -41 -43 -7 115
2701 115 30 -51 -193 162 71 39 170 118 264 20 215 -74 -225 84 121 357 281 -170 86 -7 365 -197 -157
2724 -157 35 269 -170 92 262 91 13 -158 258 62 125 246 28 2 205 -149 181 -132 44 -145 -104
2745 -104 -30 -209 -164 -90 213 10 207 -4 77 71 426 -178 109 -60 39 34 -97 93 -148 70 -241 80 22
2768 22 120 5 -157 -187 104 74 193 125 34 -158 -70 151 327 140 16 57 30 331 -146 126 -103 -140 46
2791 46 195 -174 227 -249 18 -174 76 255 -238 -252 45 -76 -44 -47 -2 176 305 47 -161 145 358 -150
$$ packed form
2630c86K59K96l42J88K01M8k16l75M02p9J30m1l3j48R3R0j13N8K71k61l32L38
2652D8K8k36M02j54P7l45J76j7j32Q2Q7m7J14M8o5j78Q9q6K8K4k45N13j05M0l2
2677A14j23K3L2p2j84J06K80l57J2M2L65j42k8L2k30N2J05J11j46n4K1kL6J22
2701A15q5q1j42L55r1l2J31n2J46k44J95k89j51L09L7K36p6m51K56r3L72n62M0
2724a57J92K34m39K62J70j71p8j71M16j96O3J21k18k6K03l54L30l13J76j89M1
2745a04P4j79M5P4L03k03J97k11Q1oL55o04K87j69R9nj31J90k41K18l11L21n8
2768B2R8j15j62l0K91l0J19o8r1j92Q8K21J76j87j24M1k7L01m77K72k29l7J86
2791D6J49l69M01m76K67j92K50J79m93j4K97j21L2lM5J78J29k58k08L06K13n08
$$ plain form
2813 -150 8 -184 -63 -103 -112 67 -122 -58 236 -72 -300 -135 104 89 9 -104 -194 52 -231 -34 294 -107
2835 -107 179 -73 -57 -58 156 -205 295 -8 2 178 -203 -197 104 -148 177 -27 -133 -71 213 -134 -16 270
2857 270 -177 68 68 107 -222 -237 -132 99 -83 -52 -181 130 238 -51 -100 166 -386 -474 210 248 164 -33 -9
2880 -9 -226 -95 -51 -65 269 -74 216 -125 11 39 -69 170 195 318 63 173 185 -135 -63 -70 -149 219 -115 -157
2904 -157 111 -222 123 -77 -1 236 -456 29 -172 6 -118 -98 -319 -57 -69 -220 102 -87 -72 -1 -52 17
2926 17 -448 -169 -14 48 -48 4 -176 81 -56 113 -43 -194 136 41 -82 -173 -32 -19 34 126 -115 -126 -22
2949 -22 -140 65 49 -81 159 185 58 -65 -136 -132 151 252 -159 -255 -122 -26 -151 -147 61 -64 -172 -52 359
2972 359 -126 102 -7 -67 324 209 143 69 -20 -166 145 268 259 323 61 -66 165 -7 110 -148 49 126 51
$$ packed form
2813a50J58j92J21m0rJ79j89O4K94l08k28J65K39j5q0j13r0K46k83J97L28m01
2835a07K86k52J6jK14l61N00l03J0J76l81OL01k52L25k04j06O2K84l47J18K86
2857B70m47K45%L9l29j5J05K31j82L1j29L11J08k89m9K66n52q8O84L8q4j97K4
2880ik17J31M4j4L34l43K90l41J36K8j08K39K5J23k55J10J2l20P2pp9L68l34m2
2904a57K68l33L45k00P6K37o92M85k01J78j24K0k21K62j2j51L22j89J5P1n1O9
2926A7m65K79J55O2r6N2j80K57j37J69j56j51L30r5j23r1J41J3N3R2k41j1J04
2949b2j18K05j6j30K40K6j27j23p1MK83J01m11r6J33R6j25MK08j25j08J20M11
2972C59m85K28j09o0L91j15o6p4q9j46L11J23rO4k62j27K31j72J17k58J97P7p5
$$ plain form
2995 51 -29 163 -296 248 -136 -74 32 -196 109 -143 -22 0 -113 95 145 -176 -290 -180 112 54 5 -319
3017 -319 157 208 214 -126 48 -110 145 47 -236 109 114 -121 26 -312 222 -62 39 11 -512 -308 -140 55
3039 55 -1 -127 -107 172 2 -34 131 -74 26 -141 163 3 -30 -309 -73 -228 189 -123 -299 -26 144 49
3061 49 -117 -234 -259 172 6 -76 -387 209 456 -41 144 156 228 -23 -155 144 308 -245 230 -2 301 23
3083 23 -64 90 468 240 30 -283 217 -53 36 -177 82 54 -19 363 94 45 14 164 262 119 -95 -18 -69
3106 -69 142 -287 -58 61 148 58 220 291 5 180 -156 12 11 -309 210 -15 -89 372 78 -135 -216 -131 135
3129 135 -52 182 310 162 -5 10 -185 -76 -126 -198 -147 -201 28 160 69 93 75 -58 261 101 -283 -218 -60
3152 -60 326 -123 120 127 -221 219 86 83 46 -15 338 -253 -182 24 -79 209 164 -65 -148 12 -246 -311 -146 224
$$ packed form
2995E1q0J92m59N44l84O2J06k28L05k52J21K2j13K08N0l21j14J10K92n8m9l24
3017c19M76N1Ol40J74j58K55r8k83L45Nk35J47l38N34k84J01k8n23K04J68J95
3039E5n6j26K0K79j70l6J65k05J00j67L04j60l3k79K36j55M17l12j76K73J70r5
3061D9j66j17k5M31j66q2l11N96K47m97J85J2P2k51j32K99J64n53M75k32L03k78
3083B3q7J54L78k28k10l13N00k70Q9k13K59k8p3L82k69m9l1J50R8j43k14P7n1
3106f9K11m29K29J19Q7r0J62P1k86J75l36J68jl20N19k25p4M61k94k13q1Q5K66
3129A35j87K34J28j48j67J5j95J09n0p2N1n4K29J32r1K4j8j33L19j60l84O5J58
3152f0L86m49K43Pl48M40j33ll7o1L53n91P1K06j03K88m5k29q3J60k58o5J65L70
$$ plain form
3176 224 79 -13 -311 433 32 77 49 -101 160 125 222 -266 -227 110 121 31 37 -128 -36 84 -201 74 20 -15
3200 -15 34 246 -88 -86 -1 -199 -179 140 262 -47 -186 69 20 15 222 -20 286 87 -116 -162 -263 97 349
3223 349 -81 -257 -241 100 321 -140 66 73 -4 71 -182 -162 82 -177 18 -263 282 -95 -53 -10 45 36 139 84
3247 84 -63 85 -225 290 -24 -41 -207 38 -10 -43 104 -459 -50 -155 -15 -299 -17 59 13 224 -396 -29
3269 -29 -74 176 166 232 -204 -92 43 193 106 -140 101 46 274 86 0 -172 159 -56 -187 -228 143 116 -60
3292 -60 -41 -29 -143 251 154 -72 -24 -187 45 -171 29 15 -151 -126 56 -261 -242 -2 339 -148 39 -148 -148
3315 -148 21 -245 -309 -104 310 -252 161 -252 -62 -123 15 -35 -41 -15 -47 99 -42 -29 64 0 62 -18 36 -142
3339 -142 -215 -280 425 -44 -85 -73 197 -243 -179 97 -117 233 -113 -22 59 148 -15 60 243 -74 -234 22 288
$$ packed form
3176B24j45r2k98P44m01M5k8j50K61l5R7m88L9L37J1r0Oj65R2J20k85K75n4l5
3200a5M9K12l34KQ5j98K0L19J22l09j39K55m9nK07k42L06j99k03m6j01L60K52
3223C49m30j76J6L41K21m61K06Pp7P5k53K0K44k59J95k81N45l77M2M3N5rJ03n5
3247H4j47J48l10N15l14j7j66K45m8l3J47n63M09j05J40k84K82P6m6K11o20L67
3269b9m5K50j0O6m36J12J35J50q7k46K41n5K28j88q6j72L31k15j31m1L71k7j76
3292f0J9J2j14L94r7k26M8j63K32k16K00j4j66K5J82l17J9K40L41m87J87j87%
3315a48J69k66o4K05M14n62M13m13J90o1J38n0oK6l2J46j41J3R3o4O2q0N4j78
3339a42p3o5P05m69m1J2K70m40O4K76k14L50l46R1Q1Q9j63P5J83l17j60K56K66
$$ plain form
3362 288 383 215 -233 297 -46 196 127 -221 -163 211 1 -93 112 -37 -31 39 45 -177 -116 -66 317 -232 -184 -148
3386 -148 -104 -88 320 -68 58 -152 204 -101 -142 -90 -50 106 11 118 90 -128 5 119 -42 -209 28 88 -208
3409 -208 83 -65 -10 -172 260 -73 95 -77 -23 256 76 -72 32 -40 -39 -251 -129 162 -21 243 207 171
3431 171 -105 -133 261 -9 -9 30 -58 -61 5 -86 202 14 -44 -61 -99 122 -11 98 -93 -353 282 144 128 -237
3455 -237 -428 4 -76 -154 68 17 -136 245 -225 -244 88 46 264 174 -35 254 502 98 146 -120 -143 53 96
3478 96 10 161 -43 60 69 -126 -361 67 -5 167 -107 -155 -2 -223 -8 181 307 -14 -162 1 -1 193 -211
3501 -211 79 -168 98 -143 -75 188 -389 -9 90 133 303 317 -179 178 -140 158 -10 8 93 -23 -67 -57 -143
3524 -143 84 265 -31 -125 56 -145 -327 -105 -65 65 172 290 -243 -12 -132 -30 146 255 28 -339 -286
$$ packed form
3362B88R5j68m48N30l43K42o9l48N8L74k10r4K05j49OP0Ok22O1N0L83n49M8L6
3386a48M4J6M08l88J26k10L56l05m1N2M0J56r5J07k8k18J33J14j61j67K37O0k96
3409b08K91j48N5j62M32l33J68j72N4K79j80j48J04p2Jk12J22K91j83K64l6l6
3431A71k76k8L94k70%L9q8lO6r1K88j88n8j7l8K21j33J09j91k60O35j38j6l65
3455b37j91M32q0p8K22n1j53L81m70j9L32m2K18r0k09K89K48m04M8k66k3J96M3
3478I6q6J51k04J03Rj95k35M28p2J72k74m8J53k21K15J89J26l21j48J63kJ94m04
3501b11K90k47K66k41O8K63n77L80R9M3J70J4m96L57l18K98j68J8Q5j16m4J0q6
3524a43K27J81k96r4J81k01j82K22M0J30J07J18n33K31j20J02J76J09k27l67N3
$$ plain form
3545 -286 56 -15 -43 22 -107 -4 -115 274 -98 13 88 -49 47 -233 283 59 -21 24 -7 27 119 -37 -148
3568 -148 71 45 57 265 260 -45 -22 -118 39 -399 117 182 -78 87 -331 -255 -5 44 -125 174 79 110 28 160
3592 160 252 118 70 405 -234 -22 207 -87 -125 163 54 31 -37 43 122 -51 -160 -78 30 192 18 168 -13
3615 -13 49 53 51 141 -143 -46 -102 -220 -273 -32 235 -21 44 -211 245 194 142 90 -35 -4 -18 -154 155 59 -145 90
3641 90 -349 41 -281 -18 -82 -287 231 97 21 261 12 209 -264 213 112 -126 131 -260 -80 -49 -21 129
3663 129 -165 -96 37 193 88 -92 -52 -102 -157 -211 -4 205 157 344 -199 41 -132 279 -81 131 103 282
3685 282 -123 -48 -159 -121 -9 47 -22 12 -21 -203 350 -271 101 63 -111 48 -57 -419 120 -24 -154 42
3707 42 273 224 -72 -180 -68 140 -427 97 290 50 62 91 212 -45 -285 20 15 24 14 -89 -199 -55 -164
$$ packed form
3545b86L42p1k8O5j29J03j11L89l72J11P5j37R6k80N16k24q0M5l1L4R2j56j11
3568a48K19k6J2K08nl05K3r6J57m38N16O5k60J65m18P6K50M9j69K99r5L1q2J32
3592A60R2j34m8L35o39K12K29k94l8K88j09k3o8Q0P9j73j09Q2J08J62j74J50j81
3615a3O2MkR0k84R7n6j18n3K41K67k56O5k55M56n1n2n2j25L1j4j36L09r6k04K35
3641I0m39L90l22K63o4k05N18j34p6K40k49J97m73M77j01k38K57l91J80L1K8J50
3663A29k94O9J33J56j05j80M0n0n5n4K07K09m8J87n43K40j73M11l60K12k8J79
3685B82m05P5j11L8J12N6o9L4l3j82N53o21L72l8j74J59j05l62N39j44j30J96
3707D2K31m9k96j08J12K08n67N24J93k40J2K9J21k57k40L05nRj0j03j10J44j09
$$ plain form
3730 -164 -46 -19 -58 -161 -45 156 65 5 15 65 157 64 174 -279 -293 50 -29 101 1 119 160 260 63 147
3754 147 -15 -78 41 6 34 -68 42 -183 -156 -17 -181 125 -26 -2 -63 -149 -210 -120 -34 62 319 -86 -24 -52
3778 -52 134 31 168 211 120 -193 -72 42 75 109 49 91 34 -250 10 -196 33 -203 329 27 177 161 337
3801 337 -165 228 -382 -120 89 -131 -383 -86 339 -263 -59 -31 260 -90 164 -135 166 -128 -51 -76 87
3822 87 -29 43 118 -57 -177 -83 -89 -66 262 144 -237 -378 397 -212 -4 4 -260 -260 141 -89 13 -95 -57 3
3846 3 36 0 41 -189 -208 38 46 -207 -270 -68 120 201 67 -68 -174 -258 -107 -122 47 -109 52 -439 -22 -26 88
3871 88 -35 -13 67 -32 372 402 -76 -178 38 -12 36 -215 -43 486 -301 -84 125 266 193 -32 214 -58 -42
3894 -42 108 416 25 -59 103 -8 -199 -53 -34 -92 115 4 -82 238 57 -44 -88 310 205 70 -283 155
$$ packed form
3730a64J18K7l9j03J16K01r1o0J0N0R2r3J10m53j4L43p9J30j00J18M1J00j97Q4
3754A47j62o3J19l5K8j02J10k25K7J39j64L06j51K4o1q6o1R0Q6R6K57m05O2k8
3778e2J86j03J37M3r1l13J21J14L3L4o0M2n7k84K60k06K29k36N32l02J50j6J76
3801C37n02L93o10K62K09k20k52K97M25o02K04K8K91l50K54k99L01k94P7k5J63
3822H7j16P2P5j75j20R4oK3L28j18l81j41P75o09K08Qk64%M01k30J02j08L8O0
3846CL3l6M1k30j9K46Qk53o3K02J88Q1j34j35j06q4J51j5J69j56J61m91M17mJ14
3871H8j23K2Q0r9M04L0m78j02K16n0M8k51J72N29p87K17K09J41p3k25K46k72J6
3894d2J50L08l91q4J62j11j91J46J9n8K07j11q6L20j81j01m4L98j05j35l53M38
$$ plain form
3916 155 -43 -557 -169 240 500 4 11 4 -44 -18 11 30 -300 119 19 69 15 22 114 359 105 -257 181 -239
3940 -239 -43 95 47 106 -60 -411 -127 -158 -202 -125 104 107 24 -99 -49 118 4 99 -1 9 16 61 -196 255 -225
3965 -225 -162 -83 -211 88 -78 -186 -157 184 -217 -45 142 -215 72 -108 -242 -23 -5 -209 -181 76 -204 -53
3987 -53 106 -123 -200 169 -449 200 -94 -71 -157 -91 -57 -60 -284 -110 -87 234 -54 106 -112 109 -189 -50 -323
4010 -323 -239 -40 -186 -127 -42 -60 -250 -120 247 -24 79 -572 27 196 228 350 11 221 285 28 -106 186
4032 186 -247 70 53 -39 -110 -40 -225 -154 -17 -35 11 167 -280 -27 -21 -17 -142 -249 110 16 198 -243 81 -153
4056 -153 -184 18 42 -12 -258 -150 167 -177 50 82 71 24 -212 17 43 112 167 -275 18 169 -214 -312 183
4079 183 -143 57 139 39 32 -277 109 135 89 106 183 48 -99 -1 -166 149 92 267 219 87 50 -221 -171 1
$$ packed form
3916A55j98n14L88M09K60m96Ppm8K6K9J9l30M19j00N0n4PR2K45k54l62M38m20
3940b39J96J38m8N9j66l51K84l1m4P7K29Lq3j23N0J67j14R5j00J0PM5k57M51m80
3965b25O3P9j28K99j66j08K9L41m01J72J87l57K87j80j34K19J8k04K8K57k80J51
3987e3J59k29p7L69o18O49k94K3q6O6L4lk24J74K3L21k88J60k18K21k98J39k73
4010c23Q4J99j46N9Q5j8j90J30L67k71J03o51N99J69L2J22l39K10O4k57j34K92
4032A86m33L17j7r2p1P0j85P1J37j8M6J56m47K53OMj25j07L59r4J82m41L24k34
4056a53l1K02K4n4k46J08L17l44K27L2j1m7k36K29K6O9N5m42K93J51l83r8M95
4079A83l26K00Q2j00pl09L86K6m6J7P7j35j47R8j65L15n7J75m8j32l7k71N0J72
$$ plain form
4103 1 -80 -43 -131 -75 -36 -150 -168 95 -171 -137 -76 -17 -93 -57 -83 -204 -265 64 -54 186 71 3 2 125 138 125 -24
4130 -24 -127 122 -127 39 83 214 184 47 -271 -118 -29 -47 -359 -240 -56 -94 -155 66 -108 -212 173 61
4152 61 98 209 -165 -19 340 -57 -184 -22 -40 -28 -35 -202 135 -36 -100 131 127 -96 -292 239 -355 -95 -102 58
4176 58 -3 -114 -35 31 99 253 -49 -222 -111 -43 -76 -37 244 -271 -34 -79 201 207 342 -292 -8 3 40 -64
4200 -64 11 -22 -28 62 -46 35 267 190 -19 -55 -67 237 200 38 -4 57 49 104 -112 -35 22 -190 -18 -93 76 202
4226 202 -256 29 118 -20 104 -41 1 106 -15 103 108 -84 88 163 119 30 226 301 140 229 -101 -13 -69 -136
4250 -136 117 69 -41 -103 -120 -22 -267 91 -85 130 -137 98 97 68 43 -93 -55 16 107 -265 128 -89 -295 231
4274 231 -11 -137 149 -20 184 -247 157 122 111 -2 -33 53 -35 315 114 32 -53 -215 36 -104 -239 -202 -22
$$ packed form
4103Aq1L7q8N6L9j14j8K63k66L4O1N9p6L6k6j21o1L29j18K40j15o8jJ23J3j3j49
4130b4j03K49k49J66M4J31l0j37l18J53Q9j8l12J19J84l8o1K21j74j04L85j12
4152F1L7J11l74J46L59l97j27J62j8J2pj67L37j71o4K31mk23j96N31n94K60pJ60
4176E8o1j11P9O6O8J54l02j73J11O8l3L9K81n15K37m5K80OJ35o34K84J1L7j04
4200f4P5l3oR0j08Q1K32p7k09l6j2L04l7j62m2O1qN5k16P7N7k12J72p5J69J26
4226B02m58K85Q9j38J24j45M2J05j21J18Nj92J72P5m4q9J96P5j61Q9l30Q8n6o7
4250a36K53m8j10o2j7R8k45L58j76K15k67K35jk9k5j36L8P1R1l72L93k17k06N26
4274B31k42j26K86j69K04m31M04l5j1j13l1Q6q8L50k01q2q5j62K51j40j35L7J80
$$ plain form
4297 -22 130 -111 37 -69 -89 -226 -348 197 -164 158 1 -276 -96 -53 -166 71 51 184 0 -246 -228 184
4319 184 70 -312 -175 96 -270 -205 89 -116 -33 -78 -287 -293 -155 -88 -351 -162 119 -47 37 -175 -28 -9 -49
4342 -49 -118 161 -146 -180 -274 268 171 -228 140 93 24 -206 128 265 -369 -193 133 62 -135 184 -231 -439 132
4365 132 -370 -88 -2 -147 -111 66 -156 213 261 51 -23 42 319 120 -71 -60 250 -40 111 218 130 62 -61
4388 -61 -66 -386 -94 -338 -140 153 -399 23 -89 -89 -396 117 -253 52 22 85 110 23 293 -101 -107 -87 -103 121
4412 121 99 232 -197 -107 1 58 2 53 25 72 103 -253 -299 -426 48 85 -106 357 191 57 91 -150 -19 140
4436 140 -133 62 174 -10 -7 -27 -105 48 22 -186 42 -146 -308 9 -51 152 -41 -161 24 153 223 -92
4458 -92 294 -390 227 110 0 -116 177 -108 -10 -33 162 -147 -97 -5 184 -26 44 46 7 54 -299 -76 135
$$ packed form
4297b2J52k41J48j06k0j37j22N45l61L22j57k77J80M3j13K37k0J33j84k46J8M12
4319A84j14l82J37K71l66O5K94k05Q3m5k09oJ38O7k63J89K81j66Q4k12J47J9m0
4342d9o9K79l07l4r4N42r7l99L68m7o9k30L34J37o34J76L26p1j97L19m15k08N71
4365A32n02K82Q6j45L6J77k22L69M8k10p4O5K77j99j91J1L10k90J51J07q8o8j23
4388f1nl20K92k44J98K93n52M22j12%l07N13l70L05l0O3K5q7K70l94oK0j6K24
4412A21k2J33m29R0J08N7n6N1k8M7L1l56m6j27M74L7j91M63j66j34L4k41J31J59
4436A40k73J95J12j84Lk0p8J53k6k08K28j88j62L17o0K03j93j20J85J29P0l15
4458i2L86o84O17j17j10j16K93k85R8k3J95l09N0R2J89k10P0Kl9M7l53K23K11
$$ plain form
4481 135 3 -23 57 -34 3 -341 248 -21 -260 25 185 92 2 -29 102 12 -154 105 100 -31 260 25 -243
4504 -243 55 -18 114 -27 117 -98 -2 200 -222 119 176 110 -99 187 105 -102 36 -254 334 344 158 -156
4526 -156 -268 249 -60 -58 -68 -255 -30 -22 -108 0 -37 -178 -60 -175 -155 3 30 -254 -129 -9 106 -131 129
4549 129 -182 -184 -84 214 -21 -118 52 43 -131 -144 -26 140 22 58 164 40 143 125 -7 -300 -142 43 19
4572 19 -322 111 -24 -52 -174 -55 299 441 47 -68 186 20 -78 -88 -474 -259 112 210 163 -20 -169 71
4594 71 242 141 -91 -52 83 -116 2 15 171 156 -63 -230 257 -87 295 71 -172 -18 13 -277 51 77
4616 77 -87 94 -76 17 203 70 -215 -219 -101 75 -164 -17 -94 -184 98 119 -25 -117 -108 97 7 -160 -10 -161
4640 -161 136 -72 202 38 -207 310 -172 -30 147 -74 44 288 160 92 -144 -124 -77 -79 -262 -72 199 -63
$$ packed form
4481A35j32k6Q0r1L7l44N89k69k39K85J60r3r0l1J31r0j66K59nj31K91k35k68
4504b43K98p3J32j41J44k15R6K02m22L41N7o6k09K86q2k07J38k90N88J0j86l14
4526a56j12N17l09Kj0j87K25Qq6J08l7j41J18j15K0J58K7k84J25J20J15k37K60
4549A29l11kJ00K98k35r7J70rj74j3J18J66j18L6J06j24J03j8j32k93J58J85k4
4572A9l41M33j35k8j22J19L54J42l94j15K54j66r8j0l86K15L71R8m7j83j49K40
4594G1J71j01k32L9J35j99J18J3J56j5k19j67M87l44L82k24k43J54L1k90L28K6
4616G7j64J81j70R3J86j33k85mJ18J76k39J47p7r0K82K1j44r2RK05r0j67J50j51
4640a61K97k08K74j64k45N17m82J42J77k21J18K44j28o8k36K0M7kj83J90K71k62
$$ plain form
4662 -63 73 48 -196 -77 203 16 -312 17 -40 104 -232 128 -63 -83 402 -1 1 -152 -78 118 167 147 168
4685 168 -264 -263 308 42 7 -52 -245 111 -96 -288 -395 76 -142 12 74 -9 -64 22 -199 -137 -273 261 108
4708 108 201 -62 -259 369 59 -92 -65 13 190 -219 32 93 263 -148 161 -223 254 -65 -82 -72 269 98
4730 98 -145 -76 -96 186 187 -85 -238 99 7 -222 216 193 369 130 -7 252 182 -3 165 -157 -11 237 -83
4753 -83 -78 226 -238 11 0 22 -246 -94 17 133 -260 -131 182 -43 -98 -185 -139 152 -71 -316 70 -81 131
4776 131 28 45 62 -63 -204 -169 28 -156 132 56 179 -262 -263 -450 302 5 263 26 -139 -142 -272 14 -173
4799 -173 -15 261 -47 -54 -136 -168 -57 143 20 143 162 96 118 -116 77 130 -107 -293 111 311 -240 95 138
4822 138 94 -316 -197 17 143 267 -451 -278 208 -10 117 47 -331 290 -7 -87 -130 18 -12 -199 262 -43
$$ packed form
4662f3J36k5k44J19K80j87l28L29n7J44l36L60j91k0M85m03Kj53P4J96M9k0K1
4685A68m32JN71k66l5n9j93L56k07j92j07M71k18J54O2q3n5Q6k21O2j36N34j53
4708A08R3k63j97O28l10j51K7P8J77m09K51O1J70m11L09l84M77l19j7J0L41j71
4730I8k43O9k0K82Jk72j53L37r2k29M38k3J76k39j37K59p0j85J68l22J46K48l20
4753h3NL04m64K49j1K2k68J52J11J16l93J29L13k25n5q7M6K91k23k45L86j51K12
4776A31j03J7J7j25j41L5J97j84K88p6J23m41jj87P52k97K58k37j65lj30K86j87
4799a73J58K76l08pq2l2J11K00j23J23J9o6K2k34J93N3k37j86M04K00n51L35M3
4822A38m4m10J19K14J26J24p18J73M86k18J27p0l78O21k97q0m3J48l0j87M61l05
$$ plain form
4844 -43 124 238 64 88 292 -127 201 -325 -151 -136 97 22 -164 -104 207 -51 -72 173 186 -42 68 53 201
4867 201 86 6 90 30 75 107 165 -86 -5 -22 -189 -75 -60 138 296 -16 -348 36 -11 -121 36 157 312
4890 312 -3 -212 29 -236 -11 57 107 237 -169 9 -138 176 -179 217 27 138 227 103 5 17 73 -268
4912 -268 10 -298 158 75 -141 -26 -33 102 55 -193 68 -71 -173 162 -73 -14 104 -187 92 228 -157 187
4934 187 101 203 191 77 92 -127 55 -293 -286 56 131 136 4 -372 -38 203 -266 123 -109 4 172 26 -72
4957 -72 153 95 -17 -74 -146 -370 -63 84 -12 -103 -22 -131 123 -260 296 186 -150 -203 27 -22 12 81 30 -80
4981 -80 -41 -3 -105 59 -119 109 -144 41 63 127 202 239 27 27 276 17 -180 -187 84 -58 -221 154 125 282
5005 282 87 55 110 -157 0 -16 -1 127 -273 294 149 -79 -37 -45 -108 -352 -128 166 -68 165 -59 -211 118
$$ packed form
4844d3J67J14j74K4K04m19L28n26J74J5K33p5j86O0L11k58k1K45J3k28J10j5J48
4867B01j15q0Q4o0M5L2N8k51Q1j7j67J14J5J98J58l12l32L84m7j10J57J21J55
4890C12l15k09K41k65K25O8N0J30m06J78j47L14l55L96j90J11Q9j24r8J2N6l41
4912b68K78l08M56q3k16J15pJ35m7k48K61j39j02L35k35N9J18k91K79J36l85L44
4934A87q6J02j2j14J5k19J82l48PL42P5Nj32l76L34K41m69L89k32J13J68j46r8
4957g2K25n8j12n7p2k24L07J47r6r1Q1j09K54l83N56j10l36n3K30m9L4O9n1j10
4981h0L9L8j02J64j78K28k53J85K2O4P5L7k12%K49k59j97pK71j42j63L75k9J57
5005B82j95l2N5k67J57j6J5J28m00N67j45k28M2qo3k44K24K94k34K33k24j52L29
$$ plain form
5028 118 78 6 37 95 -71 -353 -28 -99 -46 -108 107 118 21 -215 -123 26 348 269 -92 228 -155 187 -143 79
5052 79 61 -108 -61 -79 -50 84 37 123 -448 -215 167 -62 -190 -60 62 -126 -59 119 -111 24 -133 -49 160
5075 160 -166 -48 -298 65 175 -58 -69 -7 14 -196 -113 76 55 182 -50 25 -90 161 297 60 253 -28
5097 -28 293 -263 -112 78 -120 353 -203 82 -33 12 144 -154 -144 123 104 -113 -125 -287 39 10 47 66 106
5120 106 -34 -82 317 -136 -155 241 207 181 160 -329 -48 -53 -72 300 -151 109 -4 -149 -114 -99 130 162 -179 -74
5144 -74 60 286 270 295 113 119 75 -232 -393 -46 91 -204 -72 -206 -38 -406 23 -60 -65 38 -67 184 -100
5167 -100 14 -69 -251 37 -5 -26 -62 -175 -189 -100 101 130 177 58 136 -1 -63 17 135 119 -367 -50 60 44
5191 44 151 46 -123 124 10 231 2 336 131 -49 -20 -91 122 225 67 -166 -106 -173 -245 48 90 247
$$ packed form
5028A18m0p2L1N8j66k82L25p1N3o2K15J1r7k36R2J49L22p9l61L20l83L42l30K22
5052G9j8j69M7j8K9J34m7Q6n71K33L82k29j28J30J22j88O7J78k30J35j57Q4K09
5075A60l26J18k50L63J10k33j1O2K1k10Q3J89k1J27k32P5j15K51J36k37J93k81
5097b8L21n56J51J90j98M73n56K85j15M5J32k98J0K67j9k17j2j62L26k9L7J9M0
5120A06j40m8L99m53j9L96l4k6k1m89K81nj9L72m51K60j13j45L5J5K29L2l41J05
5144g4J34K26j6K5j82Om4l07j61L47J37k95J32j34J68l68M29q3nJ03j05K51k84
5167a00J14q3j82K88m2k1l6j13j4Q9K01K9M7j19P8j37o2Q0J18j6m86L17J10j6
5191D4J07j05j69K47j14K21k29L34k05j80K9p1K13J03j58k33O0o7p2K93M2J57
$$ plain form
5213 247 -2 -219 37 432 85 326 78 418 -47 -239 -39 176 -142 -104 6 293 -186 -165 350 260 94
5234 94 38 88 28 -163 158 43 -81 108 -67 6 -42 -4 240 193 -17 -53 179 -171 138 28 141 29 -401
5257 -401 -209 217 198 -12 -133 -113 157 113 -249 30 9 118 89 -113 -119 -102 -159 98 172 95 -64 -149 217 53
5281 53 -182 25 -86 32 -62 -55 -352 -67 90 -94 -123 -159 194 13 -161 -125 -64 -260 123 -121 258 188 103
5304 103 -208 -34 -95 -90 -188 -181 211 10 238 -49 0 -145 -8 -22 -283 -244 80 57 -317 354 77 6 -180 122
5328 122 -193 -266 51 -256 62 -169 74 31 -14 -334 -199 200 -30 -150 -108 67 65 152 18 76 20 182 -36
5351 -36 -214 -199 91 -48 -34 29 -85 42 -14 22 203 129 124 -61 -73 -155 46 160 -257 198 181 -63 -144 -116 202
5376 202 -158 -106 -51 -139 -72 -340 -143 -41 107 -35 236 96 115 -191 101 -34 48 124 -91 107 -99 42
$$ packed form
5213B47k49k17K56L95l47K41k48L40m65j92K00K15l18L8J10K87m79K1N15r0j66
5234I4n6N0o0j91L21j15j24J89j75P3m8L8K44m7k10l6K32l50L09j10J13j12m30
5257d01J92M26j9k10j21K0K70m4l62K79k1J09k9k02oJ7n7K57P4p7j59q5L66j64
5281E3k35K07j11J18r4Pk97K85J57j84k9l6L53j81j74L6O1j96L83k44L79p0q5
5304A03l11J74o1Nr8PL92k01K28k87M9j45J37j4k61L9L24k3l74O71k77p1j86L02
5328A22l15p3L17l07L18k31K43m3m5l20J35L99k30j20M2J75kQ7j34N8n6J62k18
5351c6j78J5K90j39J4O3j14J27n6L6J81p4nj85j2q2K01J14m17M55j7k44q1K8L18
5376B02l60N2N5q8O7k68J97J02J48j42K71j40J9l06K92j35Q2P6k15J98k06J41
$$ plain form
5398 42 153 362 -166 -47 125 -168 -4 -77 78 81 -82 54 170 -107 89 -271 -77 199 133 -33 -165 27
5420 27 -167 -182 171 43 -274 -292 -124 -6 -162 -124 129 -135 -70 -11 -57 47 -82 -110 -74 -153 -47 -426 -24
5443 -24 66 -78 -23 -276 -1 53 -74 -273 -215 66 -185 -238 -285 33 236 -189 146 119 -42 -195 -92 -155 -232
5466 -232 -58 -19 -113 -28 38 101 -110 120 -286 -133 223 -221 322 -132 -137 79 30 54 -222 -101 332 -256 -229
5489 -229 80 197 -5 68 127 49 -125 -147 -254 80 -99 -75 -68 119 -205 -126 13 -243 -81 -124 -184 328 112
5512 112 -341 -68 14 -111 -64 -94 4 -75 -76 121 138 423 31 -73 -152 -1 220 48 -106 36 125 196 -531 -74
5536 -74 -34 -135 -188 111 -39 95 323 -345 -201 41 -80 70 293 -82 -269 -134 172 -94 48 229 227 -34
5558 -34 61 476 -116 202 -66 -160 -398 294 -73 342 -101 -27 191 18 274 59 87 -116 -211 26 -31 -70 -7
$$ packed form
5398D2J11K09n28J19J72k93J64p3J55Lj63J36J16k77J96l60J94K76o6j66j32J92
5420B7j94j5L53j28l17j8J68J18j56L8K53k64O5N9m6J04j29k8L6p9J06l79M02
5443b4R0j44N5k53K75N4j27j99N8K81k51n3m7L18K03m25L35k7j61j53J03o3p7
5466b32J74L9r4Q5O6O3k11K30m06J53L56m44N43m54nK16m9K4k76J21M33n88K7
5489b29L09J17k02P3N9p8j74k2j07L34j79K4PJ87l24P9J39k56J62m3o0N12k16
5512A12m53K73Q2j25M7l0R8p9jJ97J7K85l92j04p9J51K21j72j54J42Q9P1p27M57
5536g4M0j01n3K99j50J34K28o68J44K42j21J50K23l75j87J35L06k66J42J81kk61
5558c4R5M15n92L18k68r4k38O92l67M15m43P4K18j73K56k15K8k03r5K37n7l9O3
$$ plain form
5581 -7 154 -398 -76 -99 250 -59 90 -2 102 -1 72 210 149 220 -168 44 109 89 -123 82 -41 52 177
5604 177 521 71 -82 53 -307 -230 -49 71 81 21 135 190 285 225 126 -25 125 177 35 247 183 -161 132
5627 132 189 -75 183 29 -38 112 126 -278 -1 102 -47 -74 251 -249 141 -10 20 -83 -6 -55 19 139 51
5650 51 -135 -100 189 0 -81 -61 207 111 175 41 179 176 -149 -180 -287 -196 -37 78 32 -86 94 185 174 -82
5674 -82 283 2 -238 -70 262 134 33 -201 -147 62 -148 -307 91 -122 -74 180 -128 -50 5 65 -81 -68
5696 -68 185 18 -41 -87 36 -330 -5 -108 -139 -220 155 -166 301 136 -27 -121 105 72 -136 -39 98 -199 -299
5719 -299 33 -202 98 44 85 -199 -364 -50 138 -220 -161 -88 270 51 -64 137 -82 71 -186 22 -41 -47
5741 -47 67 107 -102 268 -65 -73 155 -87 -10 -97 -20 178 -111 106 -135 142 -179 114 228 -35 -27 -187 70
$$ packed form
5581gJ61n52L22k3L49l09J49r2J04j03P3J38o1P1l88K12O5k0k12K05j23R3J25
5604A77L44m50j53J35l60P7J81J20J0o0J14N5R5o0r9j51J50N2j42K12o4l44K93
5627A32N7k64K58j54o7J50J4m04K77J03j49k7L25n00L90j51L0j03P7m9P4J20q8
5650E1j86L5K89j89q1K0K68r6O4j34J38ll25l1j07R1J59J15m6j18J80R1j1k56
5674h2L65k81k40J68L32j28j01k34N4K09k10j59L98k13M8K54l08P8N5O0j46J3
5696f8K53j67n9m6J23l66L25j03l1q1L75l21M67j65j63r4K26l3k08R7J37k97j00
5719b99L32k35L00n4M1k84j65L14J88l58N9P3L58k19j15K01k19J53k57K08o3o
5741d7J14M0k09L70l33qK28k42P7q7P7J98k89K17k41K77l21K93J14k63Qj60K57
$$ plain form
5764 70 -26 -44 326 195 -147 103 63 82 -108 389 19 146 -48 61 -95 -97 -226 -2 388 81 -95 -22 147
5787 147 -2 -16 -61 -152 146 -254 -32 150 168 150 161 111 -124 -207 -9 -143 -130 -336 74 33 -87 242 68
5810 68 -24 -48 -44 26 -23 -193 -178 183 -17 -379 -149 -176 101 3 -22 67 -209 -118 -87 39 156 134 -260 232 -93
5835 -93 -16 -93 139 -127 392 -49 511 -20 -281 62 70 -23 -132 -181 110 82 -291 -127 44 161 -185 -228 -270
5858 -270 74 -83 -35 -7 78 -349 -13 -100 180 -136 -211 -27 -259 -298 -137 -129 33 -202 306 -410 -46 75 -248
5881 -248 -255 -104 319 -23 -196 -171 71 -385 64 -57 350 -174 7 366 194 -100 78 -371 21 -82 -132
5902 -132 381 -143 -98 -187 315 126 271 10 270 -80 91 13 -140 -56 72 475 -204 -20 -280 -151 84
5923 84 -109 -93 57 304 -263 -50 -97 -39 152 1 -6 -104 110 247 -52 -40 407 -55 -117 -230 363 97 390
$$ packed form
5764G0r6j8L70j31l42K50m0J9j90M97l70J27j94J09j56kj29K24L90l07j76P3J69
5787A47j49j4m5r1K98m00K22J82J8j8J1n0k35q3J98j34J3k06M10m1j20L29j74
5810F8r2k4MP0m9j70J5L61k00l62K30k7K77r8k5Q9k76R1L1J26J17k2l94M92l25
5835i3P7p7K32k66N19m41N60n31k61L43Qr3j09m9K91k8l73J64J71J17l46m3m2
5858b70L44j57M8K8Q5m27L36q7K80l16p5J84k32l9J61QJ62k35N08p16L64J21l23
5881b48pJ51M23l42j73K5K42m56M49j21M07n24J81L59j72k94J78m49L92j03n0
5902a32N13n24M5q9N02j89J45k61K60l50J71p8j53Q4J28M03o79J84k60J29K35
5923H4j93J6J50K47n67K13m7N8J91j51pr8K14J37k99J2M47m62o2j13N93k66K93
$$ plain form
5946 390 60 -157 -208 89 86 -71 -18 -262 159 -47 174 36 343 -168 -173 257 -261 182 96 -172 -43 -44 85
5969 85 127 277 311 -177 222 83 -64 -99 -43 89 -193 -158 -208 -55 -95 -229 59 59 -381 138 90 -105 149 -33
5993 -33 104 -29 192 86 63 -55 32 2 217 -366 267 -8 108 387 -90 -150 87 98 -52 136 65 213
6015 213 -128 -255 252 -68 -307 -164 -174 -192 -26 -92 -87 -60 57 452 148 -90 129 32 220 -189 30 -57 -184
6038 -184 313 172 -58 57 165 98 -98 -193 -33 -15 -61 -121 357 -261 -299 -172 -68 105 -16 184 13 36
6060 36 20 -129 213 -277 -225 32 -118 93 -165 -275 -136 156 -39 -49 -189 -71 -370 20 -125 26 -47 40
6082 40 32 151 112 -101 -133 -33 -327 146 -97 254 -146 -222 224 4 -390 -169 -104 -35 -159 -177 375 19 -174
6105 -174 -177 -301 115 -29 87 -163 376 208 -11 198 -46 -28 186 110 -422 -217 -17 -169 63 8 -70 4
$$ packed form
5946C90l30k17n1K97lj57N3k44M21k06K21j38L07n11nM30n18M43q6k68J29jJ29
5969H5M2J50L4m88L99j39j47l5N6J32k82L5n0J53m0j34K88%m40N19m8j95K54j82
5993c3J37j33K21j06k3j18Q7l0K15n83O33k75J16K79m77o0K37J1j50J88p1J48
6015B13l41j27N07l20k39J43j0j8J66o6NK7J17L95l04k38K19r7J88m09K19q7j27
6038a84M97j41k30J15J08o7j96r5J60J8m6o0M78o18l8J27J04J73j21K00j71K3
6060C6j6j49L42m90N2K57j50K11k58j10J39K92j95j0j40J18k99L90j45J51p3Q7
6082D0qJ19l9k13l2J00k94M73k43L51m00p6M46k20l94K21O5O9j24j8N52l56j93
6105a74lj24M16j44J16k50N39j68k19K09k44J8K14p6n32K05K00j52K32n5p8P4
$$ plain form
6127 4 -165 128 217 -12 -146 -204 -81 16 -32 36 204 -443 -62 21 -233 228 42 82 127 -191 -170 -201 15 -239
6151 -239 -92 3 -73 131 2 -76 78 7 -356 -105 297 25 -244 -196 -305 -101 -111 -78 49 -157 -89 178 -61
6174 -61 135 -66 30 108 -145 -109 -75 -207 -151 -80 12 -200 -55 417 195 -79 -151 -320 -5 88 38 452 186 -182
6198 -182 177 -137 196 57 -49 -126 -48 249 38 -139 2 -8 65 -37 -64 77 118 35 -162 86 117 -71 59
6221 59 49 120 28 43 124 199 -5 75 -238 119 20 288 -78 64 -168 -41 -91 -27 153 -366 255 -80 -159 -1
6245 -1 -106 62 140 -120 -11 142 -7 -363 126 81 -127 -313 -91 22 28 279 158 -107 205 46 -191 83
6267 83 226 -325 -99 16 14 82 29 -44 55 133 166 1 97 162 204 232 177 -276 -234 -36 -60 118 52 -326 -48 -120
6293 -120 -350 71 243 289 111 -43 102 -3 -222 -87 147 188 184 -107 19 14 6 44 -99 -210 268 56 197
$$ packed form
6127Dj69K93Q9k29j34n8J23R7m8O8J68o47L81Q3k54M61j86M0M5l18K1l1K16k54
6151b39J47R5p6K04j29p8J54p1l63K51M02k72k69M8j09K04j0L3J27k06O8K67k39
6174f1J96k01R6P8k53L6L4j32N6P1R2k12J45M72k22k74p2j69L15R3n0M14k66l68
6198a82L59l14L33j39j06p7P8K97k11j77J41j0P3j02k7J41M1q3j97K48L1j88J30
6221E9j0P1r2J5Q1P5k04Q0l13L57r9K68l66J42k32J27n0O4J80n19O21l35p9J58
6245aj05J68P8k60J09J53j49l56M89m5k08j86K22J13OK51j21k65L12j59k37K74
6267H3J43n51K26J15kO8n3p3R9P8L3j65R6O5M2K8n5m53M2J98k4J78o6l78K78p2
6293a20k30M21J72M6j78j54J45j05k19J35K34M1mk91J26nqL8j43j11M78k12J41
$$ plain form
6316 197 265 -59 360 319 -234 228 -26 94 -71 107 193 -154 265 107 250 291 -277 15 209 7 -53 241
6338 241 63 398 -50 35 238 5 144 -6 -86 148 -39 -57 60 -203 -201 35 -21 11 -126 43 158 -12
6360 -12 29 -193 -42 49 216 -28 -318 -276 281 -74 -14 -307 -268 123 58 -106 -7 -129 34 -207 -232 -4 -117
6383 -117 -88 19 -87 177 -99 -252 -125 116 -92 3 -257 -162 53 107 16 21 -92 -115 246 -177 -235 -506 138
6406 138 -216 -271 127 80 -16 -216 -120 -9 -40 -199 -126 32 31 -121 -252 39 108 -84 123 -65 161 178 -120
6429 -120 168 -263 -9 -161 -141 52 -11 -23 -104 -240 -26 -192 -181 123 -29 -181 -122 -116 152 -9 -207 -189 144
6452 144 -6 251 519 -4 5 -15 78 -102 -14 87 73 225 -53 224 -275 110 -84 -127 8 -62 -39 181 56
6475 56 -2 357 -89 301 -226 -146 -94 49 -272 73 29 67 174 -5 53 -45 -95 51 -155 158 -150 284 42
$$ packed form
6316A97O8l24M19m1n53M62k54J20j65J78Q6l47M19j58J43M1n68K92J94k02o0K94
6338B41j78L35m48Q5K03k33J39j50q0K34j87j8J17k63KK36n6L2j37J69J15j70
6360a2M1k22J51R1J67k44k90M2N57l55O0k93L9L91o5j64R9j22J63k41k5K28j13
6383a17K9J07j06K64k76j53J27K41k08R5k60R5K15N4r1Nj13k3L61m23n8k71O44
6406A38l54n5L98m7r6k00R6J11l1j59P3J58jj52j31K91O9j92K07j88K26J7k98
6429a20K88m31K54j52K0J93o3j2q1j36K14j66J1L04j52j52N9OK68j61j98J8L33
6452A44j50K57K68n23Rk0R3j80Q8J01j4J52k78K77m99L85j94m3J35p0K3K20j25
6475E6n8L59m46L90n27Q0N2J43l21L45m4L8J07j79N8r8n0J46k06L13l08M34k42
$$ plain form
6498 42 45 302 -6 -201 -118 163 47 59 0 49 -201 -7 -18 -80 76 157 -44 -82 -191 85 -78 -223 78 -111
6522 -111 12 126 -10 -67 24 29 -58 174 -15 270 -181 -101 -108 -39 -59 -67 82 -103 30 340 57 -89 -56 -280
6546 -280 45 -80 156 302 198 67 209 197 56 -109 -121 -81 61 -149 -239 6 -33 -81 -75 126 -214 69 -44
6569 -44 1 -86 154 -76 84 167 260 -258 160 73 -38 32 153 102 120 189 3 286 358 41 -129 48 73 194
6593 194 29 -346 -124 -58 186 -121 -163 -116 97 -214 205 55 -220 -121 -217 -197 158 302 95 -132 -176 -246 181
6616 181 -272 -107 143 454 -20 153 118 208 -178 35 60 -42 351 51 165 -25 -212 -3 -28 -10 -37 -15
6638 -15 -325 -237 0 79 -138 -217 165 25 208 394 -163 -39 -29 4 -345 -202 -18 -56 -187 66 -134 167
6660 167 -205 -307 -153 -210 227 42 -35 28 40 26 -47 165 190 -37 61 -44 -75 -150 209 -54 -250 112 191 -73
$$ packed form
6498D2LK57l08j95Q3K81j16J2n9M9k50J94j1o2J56Q1k01l8j09K76j63j45L01j89
6522a11J23J14j36n7R1Nq7K32j89K85m51Q0pO9k0qJ49j85J33L10k83j46L3k24
6546b80L25j25K36J46j04j31J42j2j41j65j2M0J42k10r0K45l9m8OK01l40K83j13
6569d4M5q7K40k30J60Q3R3n18M18q7j11P0J21n1J8O9j86K83P2l17j70J77K5J21
6593A94j65l75K22O6K44l07m2M7K13l11M19j50k75R9r6K0L55J44k07k27m4p0M27
6616A81m53J65K50L11m74J73l5R0l86K13K5j02L93l00J14j90j87K09k5J8k7K2
6638a5l10Q8K37P9k17p9L82j40J83J86n57J24J0L3l49J43J84l8j31K53k00L01
6660A67l72j02J54n7M37j85p7O3J2j4p3K12K5k27R8j05l1p5L59k63j96L62P9k64
$$ plain form
6684 -73 -86 -20 -67 168 39 80 127 143 -61 15 212 14 126 90 80 304 36 -33 89 -127 -120 -76 45 -84 -35
6709 -35 -68 105 -14 153 -3 -47 -106 -271 -31 -23 71 -91 190 -15 -161 65 176 -9 190 153 -76 92 -33
6732 -33 126 60 127 -74 219 -22 -163 106 -38 -70 -305 65 111 -19 416 46 158 -126 -183 -298 -34 231
6754 231 22 -137 126 -300 -79 -267 -172 -43 -92 -123 458 199 192 357 211 -103 -133 -30 175 -68 18 -34 -136
6777 -136 83 147 -175 19 1 -2 -112 -63 224 -342 155 93 42 -66 -55 116 -109 -37 -66 106 -51 260 -90
6800 -90 -265 58 152 -99 -15 88 7 75 -246 -51 153 181 -117 -139 30 -247 152 210 62 -38 62 139 -224
6823 -224 58 -381 -57 3 29 159 -247 21 -7 -72 89 -132 -153 -110 -176 11 180 -188 120 38 -176 148 -214
6846 -214 177 -54 -23 268 13 56 14 92 50 5 -14 39 -122 88 143 135 -67 -60 -54 -114 205 109 130 415 -245 179
$$ packed form
6684g3j3O6m7K35j29M1M7J6k04P6J97j98J12l6j0K24k68o9J22k16PM4J21j29M9
6709c5l3J73j19J67j56m4n9j65K40QR4j62K81k05j46K26J11j85J99l7k29J68j25
6732c3J59o6O7k01K93k41j41K69j44l2k35L70M6j30M35l70J12k84n7j15K64K65
6754B31k09j59K63m26K21j88R5J29m9l1N81k59pJ65j46l14l0J03K05k43Q6n2j02
6777a36K19O4l22J94j8lj10M9K87n66M97o2n1j08J1J71k25P2k9J72j57L11l50
6800i0j75L23R4k51Q4J03q1O8l21J95K04K8k98k2J69k77L99N8j48j00J00P7l63
6823b24K82m39L24O0K6J30m06K68k8o5J61k21k1M3o6J87J69l68L08q2k14L24l62
6846b14L91k31L1K91k55M3m2P8m2m5j9N3j61K10N5qk02POo0L19r6K1K85o60M24
$$ plain form
6872 179 -26 -363 198 -132 -116 98 -265 121 -215 189 100 -280 -36 291 193 -221 -8 -40 286 47 -136
6893 -136 146 -129 -153 -261 10 85 -247 90 288 148 72 -12 -183 -33 38 -6 64 21 113 55 165 -65 -108 -128
6917 -128 -10 -182 245 -33 -198 -76 90 216 -140 -155 -10 -85 98 -161 115 11 12 103 -230 37 -103 1
6939 1 22 94 152 158 127 -115 8 298 78 -79 2 -190 18 165 -53 44 -113 19 -165 -77 107 -28 190 153
6963 153 91 -67 122 -91 -7 72 180 -83 136 9 68 77 -252 27 -228 -144 -169 -50 5 -247 -27 -6 -71 61
6987 61 -113 -2 -235 224 -239 -45 8 -149 171 18 32 77 28 210 -124 357 319 18 -321 130 -198 -194 -82
7010 -82 2 -345 -138 41 304 103 105 -96 -122 -96 -18 -57 146 -78 -191 -62 -48 -217 217 18 -11 43 113 -218
7034 -218 -25 93 19 29 -193 93 333 119 340 -66 -75 -141 -185 68 197 138 -119 -188 51 23 -103 -317 -156
$$ packed form
6872A79k05l37N61l30J6K14l63L86l36M04q9l80K44L27r8m14K13l2L26k39j83
6893a36K82k75k4j08K71P5l32L37J98j40p6q4j71J50P1m4P0m3R2n8J10k30m3k0
6917a28J18j72M27k78j65J22J66J26l56j5J45p5J83k59K76j04JR1l33K67j40J04
6939AK1P2N8Ol1k42J23K90k20j57Q1j92K08J47k18R7j57J32j84Q8J84j35K18l7
6963A53o2j58J89k13Q4P9J08k63K19j27N9Rl29K79k55Q4k5J19N5k52K20K1o5J32
6987F1j74J11k33M59m63J94N3j57L20j53J4M5m9J82l34M81l8l01l39M51l28MJ12
7010h2Q4l47K07J79K63k01Kk01k6K6P8l9K03k24j13J29J4j69M34j99k9N4P0l31
7034b18J93J18p4J0k22K86K40k14K21m06ro6m4K53J29n9k57o9K39k8j26k14J61
$$ plain form
7057 -156 19 86 -220 58 328 -27 10 -303 -95 -46 314 88 80 249 -82 -86 110 -124 79 101 -125 -261 -218
7080 -218 73 -93 -4 -84 -90 207 -260 -237 240 63 174 99 270 168 -52 -228 129 198 -322 -110 -7 106
7102 106 -122 -8 -349 -173 -10 118 -146 -5 123 -36 -153 6 22 261 -153 17 -48 -131 268 -35 -243
7123 -243 -231 200 -151 -102 -80 98 -91 283 -63 109 23 61 -12 -27 196 44 243 35 -161 -257 10 -100 41
7146 41 -167 -301 -179 -189 -143 168 -221 170 182 -280 -89 -65 42 -25 346 -172 71 -164 -114 -129 49 -21 -171
7169 -171 -58 -319 157 -196 -50 -190 -27 -92 -221 -199 -62 -120 -36 136 117 93 132 -108 -58 252 176 118 -291
7192 -291 -27 56 -161 -79 20 -106 127 14 12 7 66 14 57 56 187 -11 103 -156 -68 -175 -150 185 53 -102 -255
7217 -255 -153 278 103 92 1 164 372 112 210 -175 -50 -185 143 -375 283 -93 136 -112 38 229 -26
$$ packed form
7057a56J75O7l06K78K70l55L7l13K08M9L60k26qJ69l31mJ96k34K03K2k26j36M3
7080b18K91j66Q9q0oK97m67K3M77j77J11p5J71j02k20j76L57O9n20K12J03J13
7102A06k28J14l41J76J63J28k64J41J28j59j17J59J6K39m14J70o5q3L99l03k08
7123b43J2M31l51M9K2J78j89L74l46J72q6L8p3j5K23j52J99k08j96r6K67j10J41
7146D1k08j34J22j0M6L11l89L91J2m62J91K4J07o7L71n18K43k35N0j5J78p0j50
7169a71J13k61M76l53J46j40J63o5j29K2J37n8Q4J72j9k4L9k40N0L10p6n8m09
7192b91K64Q3k17Q2R9j26K33j13knN9n2M3jJ31j98J14k59Q8j07K5L35j32j55j53
7217b55J02M31j75j1r1J63K08k60R8l85J25j35L28n18O58l76K29k48J50J91k55
$$ plain form
7238 -26 21 15 107 -25 -2 -99 -147 -98 171 106 228 -110 75 -205 -175 73 51 114 -56 78 83 93 29 78 -15 -29 -326
7265 -326 -162 80 -99 84 -25 -9 12 109 209 140 78 -80 155 133 -211 38 -66 199 -60 120 -33 45
7287 45 260 31 109 -301 134 36 266 -6 193 -29 -54 326 51 302 -181 58 -41 33 165 -44 -277 292
7309 292 88 -132 242 -30 4 -21 170 -292 -144 166 63 -127 -212 43 -280 128 81 -112 116 -15 477
7330 477 -48 164 191 104 -164 -174 -74 90 -128 -378 136 285 42 218 127 -49 -128 111 105 -181 -72 -172
7352 -172 159 -16 -31 -24 -16 94 -315 160 -252 57 32 -275 -117 -384 7 -128 -122 138 -214 66 -200 -182 -7
7375 -7 32 153 58 125 11 218 -301 -186 -204 -37 -146 33 50 82 -130 -85 83 -186 229 258 -208 206 150 129
7399 129 310 -111 -411 117 10 -110 -212 46 15 -235 256 -150 35 -27 -47 93 -109 118 154 125 -95 57
$$ packed form
7238b6M7oR2j32K3r7m8M9K69o5J22l38J85k80L0K48k2O3j70J34NJ0o4M9r3j4k97
7265c26J64K42j79J83j09J6K1R7J00o9o2j58K35k2l44K49j04K65k59J80j53P8
7287D5K15k29P8m10M35r8K30k72J99k22k5L80k75K51m83K39r9P4J32k09k33N69
7309B92k04k20L74k72L4k5J91m62J48L10j03j90q5K55l23M08m7j93K28j31M92
7330D77n25K12K7q7k68j0J00J64k18k50N14J49k43J76r1j76p9K39ok86J09j00
7352a72L31j75j5PQJ10m09M75m12L09k5l07J58k67L91j35OK60l52K80k66J8J75
7375gL9J21r5O7j14K07n19J15j8J67j09J79J7L2k12M5J68k69M15K9m66M14n6k1
7399A29J81m21l00N28j07j20j02K58l1k50M91m06J85o2k0J40k02K27L6k9k20J52
$$ plain form
7421 57 -197 -182 -18 263 -86 93 123 177 72 47 -498 -169 -43 194 43 -229 -52 -152 -98 56 83 93 196
7444 196 149 78 -122 -145 -40 130 -194 -227 38 72 -12 -2 -218 68 176 15 40 -293 38 361 68 230 -132
7467 -132 85 -147 -226 153 181 147 5 55 73 -79 76 -52 18 88 -77 -130 71 78 47 88 91 129 -157 -62 -42 46
7493 46 -201 -104 295 -227 -117 15 2 100 150 -188 -153 -306 129 79 15 44 359 -97 -354 33 93 12 183 28
7517 28 256 310 10 217 9 -118 93 80 -3 -205 159 369 6 -135 58 -116 -182 -179 141 -123 -63 101 -92
7540 -92 331 -172 174 -127 6 -154 142 -126 229 364 -112 348 -108 73 128 267 -288 -154 50 -176 201
7561 201 102 -228 45 25 -163 104 -41 -69 -15 -149 -233 193 106 -40 57 -313 10 33 29 -280 25 39 -214 268
7585 268 -154 301 -192 -254 113 -13 79 -193 -246 58 -58 -122 97 257 128 -36 -47 -20 -130 -40 12 -157 88
$$ packed form
7421E7k54J5J64K81l49J79L0N4j05k5n45L29J26K37j51k72J77j00N4J54K7J0J03
7444A96m7p1k00k3J05J70l24l3K65L4q4J0k16K86J08j61K5l33L31L23k93J62l62
7467a32K17k32p9L79K8l4j42N0J8j52J55j28P0P0j65n3K01Pl1M1LL8k86R5K0Q8
7493D6k47R7L99n22J10J32j3R8N0l38L5j53M35n0o4K9L15m56k57L87O0q1J71j55
7517B8K28N4l00K07k08j27K11j3q3k02L64K10l63j41J93j74o6LL20k64O0J64j93
7540i2M23n03L46l01J33j60K96k68L55J35m76M60m56J81N5J39n55J34K04k26L77
7561B01r9l30K73k0j88K67j45k8N4j34q4M26q7j46R7l70L23K3ml09L05J4k53M82
7585B68m22M55m93o2L67j26R2k72n3L04j16o4K19J60j29j64j1K7j10R0N2j69K45
$$ plain form
7608 88 -64 47 -129 -84 255 146 213 -40 -31 -176 -310 -129 -166 79 0 149 -186 96 -60 -32 -47 -11 69 -16
7632 -16 404 172 -5 244 69 82 -191 266 -7 -53 -331 -144 66 -78 179 -146 -36 174 69 -199 -150
7653 -150 -40 216 35 -48 -48 -20 7 199 258 -245 143 32 -138 -22 50 -249 -89 -139 90 -82 274 429 200
7676 200 282 36 18 125 102 -27 -11 31 -178 -236 -93 -491 109 253 353 143 74 218 9 288 200 -83 -30
7699 -30 184 46 31 181 -135 -135 -11 213 -110 -435 -258 -36 164 -52 -104 171 204 65 255 -190 128 -99
7721 -99 -183 -359 -127 167 -169 69 -348 21 -31 166 142 99 45 172 96 230 265 -319 -243 116 8 57 112 140
7745 140 119 65 -169 -235 278 -155 299 83 110 33 -71 -125 -103 18 1 113 -518 309 83 166 117 -39 -81 -38
7769 -38 68 222 300 101 164 226 -224 124 113 -11 12 -198 -174 -192 290 68 -33 91 -147 -98 51 -314 -24
$$ packed form
7608H8j52J11j76M5L39j09O7k53Rj45j34J81l7K45p9J49l35K82j56K8j5L6Q0q5
7632a6M20k32j77K49j75J3k73M57k73m6k78J87K10j44K57l25J10K10j05k68M9
7653a50J10K56j81q3%K8K7J92N9n03L88j11j70J16P2k99J60n0K29j72L56J55k29
7676B00Q2k46j8J07k3j29J6M2k09n8J43l98O00J44J00k10o9J44k09K79q8k83N3
7699c0K14j38j5J50l16%J24K24l23l25J77K22K00k16n2K75L3j39J90m45L18k27
7721i9q4j76K32K94l36K38m17L69n2J97k4m3n4J27p6J34L5n84P6L59j08M9N5K8
7745A40k1n4k34o6N13m33M54k16K7p7j04n4K2J21j7J12o31Q27k26Q3m9j56m2M3
7769c8J06J54P8j99O3O2m50L48j1j24K3k10K4j8M82k22j01J24k38M9J49l65K90
$$ plain form
7792 -24 -212 256 -64 16 203 322 1 -27 350 -17 96 -90 -20 136 192 43 -254 -132 218 -34 177 -24
7814 -24 -69 155 -174 -22 95 -106 53 -159 90 119 -170 112 25 120 -28 -77 251 -27 -216 12 -23 62 143
7837 143 48 -10 -90 -291 -15 14 37 5 -208 180 -67 58 7 181 -297 -43 242 454 -39 -152 128 -541
7859 -541 -104 -163 -122 400 119 -219 95 155 335 77 145 197 90 -11 316 35 87 99 -57 -6 177 -202 -163
7882 -163 108 -23 -82 208 -19 50 -216 -453 -187 40 -119 -55 -155 -147 -219 -151 143 35 32 -292 118 184 306
7905 306 153 70 50 -232 59 10 216 89 -71 284 -126 -205 -31 9 66 -238 191 70 -134 -34 163 -178
7927 -178 25 115 26 59 -163 251 185 -110 317 -187 -8 -162 -103 -241 -29 136 -300 -46 -16 183 230 55
7949 55 57 -105 72 186 86 -20 -112 -63 -87 -100 59 -36 -158 32 238 -56 310 144 -25 16 222 211 -195
$$ packed form
7792b4j88M68l20Q0J87J19l21k8L77l67J13j86P0J56N6j49k97J22L50k52K11k01
7814b4m5K24l29J52J17k01J59k12K49K9k89K82q7R5j48m9L28k78j89K28l5Q5Q1
7837A43r5n8q0k01K76K9K3l2k13L88k47J25n1J74m78K54K85K12m93j13K80o69
7859e41M37n9M1N22k81l38L14O0J80k58O8N2j07j01L27k81N2J2j56N1J83l79L9
7882a63K71j31n9K90k27O9k66k37K66K27j59O4j00Qp2O8K94j08ll24M10O6J22
7905C06j53q3k0k82K91m9K06j27j60L55m10p9J74M0N7l04M29j21k04J00J97l41
7927a78K03R0q9L3k22M14o6k95M27n04J79j54N9j38K12J65m36K54L0J99M7j75
7949E5Kj62J77J14j00j06r2M9k4j3J59r5j22J90K06k94L66j66j69M1K06j1m06
$$ plain form
7972 -195 -410 62 36 15 146 -18 17 -198 -206 385 141 55 393 214 -184 209 27 -109 235 144 284 -60
7994 -60 -4 -105 -57 -33 165 242 -10 -260 -69 -115 -79 -33 105 221 -197 126 -162 -65 -111 -43 -77 -118 193 -62
8018 -62 -66 -118 -41 79 -43 166 -48 -84 -27 -160 91 116 -263 111 74 47 -195 27 -55 91 11 -92 8 -7
8042 -7 -297 64 13 470 327 -109 42 32 -5 -103 -158 77 -149 61 194 5 113 289 -23 80 179 30 72
8065 72 222 -208 217 -222 193 -83 -66 -98 -1 341 1 -1 218 90 82 -385 -264 55 -110 72 -92 280 -240
8088 -240 201 -102 -152 5 -7 -60 -22 160 -170 -64 -45 56 21 -65 309 66 -175 374 -42 -3 103 108 -122
8111 -122 19 261 36 277 -322 -163 -102 219 -108 150 200 166 -152 -83 -188 110 -211 -91 225 70 -4 89
8133 89 -184 -45 258 67 -150 58 92 -149 -157 -22 -211 34 134 0 338 -36 -21 442 -45 -59 210 -22
$$ packed form
7972a95k15M72k6k1J31j64L5k15qN91k44q6L38j79l98L93j82j36L44r1J40l44
7994f0N6j01M8K4J98P7k52k50J91m6L6M6J38J16m18L23k88R7m6O8l4m1L11k55
8018f2mn2P7J20j22K09k14l6N7j33K51K5l79L74l7k7k42K22q2J46q0j03J00j5
8042gk90L61n1M57j43m36J51j0l7r8n5K35k26K10J33j89J08J76l12J03R9j49M2
8065G2J50m30M25m39M15k76J7l2R7L42l40kK19j28qm67J21L19j65J82j64L72n20
8088b40M41l03n0J57j2n3L8J82l30J06J9J01l5q6L74k43k41N49m16L9J06Nk30
8111a22J41K42k25K41n99J59O1L21l27K58N0l4l18O9j05K98l21J20L16j55p4R3
8133H9k73J39L03j91k17K08L4k41qJ35j89K45J00j34L38l74J5M63m87j4K69k32
$$ plain form
8155 -22 81 53 81 -251 4 -93 91 206 59 -89 134 -33 73 71 -21 -348 2 174 -345 -89 14 150
8177 150 102 -257 146 -116 -158 -222 -127 -55 102 -21 -56 -89 229 153
$$ packed form
8155b2J03k8K8l32K55r7J84J15j47j48K23j67J06kr2l27L50J72n19K56J03J36
8177A50m8l59M03k62m2o4R5P2J57j23l5l3L18p6
8191A53
$$ Imaginary data points
##PAGE= N=2
##DATA TABLE= (X++(I..I)), XYDATA
$$ plain form
0 0 0 0 0 -8 8 -4 8 -8 16 -16 24 -32 39 -40 50 -64 79 -88 104 -127 147 -168 197 -227 263 -299 339 -387
28 -387 439 -495 555 -626 702 -784 875 -974 1083 -1202 1335 -1480 1639 -1813 2008 -2223
44 -2223 2464 -2733 3036 -3387 3788 -4252 4804 -5471 6290 -7328 8696 -10585 13370 -17903
58 -17903 26555 -48969 225263 455527 -74467 -86357 244687 282207 -44532 -14625 247362
69 247362 214204 -56291 140 221764 154932 -79766 4366 220244 139625 -93618 -35051
80 -35051 149438 83947 -94007 -35188 94806 19246 -105817 -22424 101089 36274 -87966
91 -87966 -53430 43314 14985 -74381 -40171 55856 12721 -118697 -93014 52554 32788 -134726
103 -134726 -121494 77999 101215 -104785 -161931 35269 123494 -46813 -143670 -899 81231
$$ packed form
0@%%%qJ6j2J2j6K4l2M0n6P1p9R0j14J43j67J92k31K74l15L65m24M90n62O38p26
28c87Q26r34J050j181J328j486J659j849K057k285K537k815L119l452L821m231
44b223M687n197N769o423P175q040R056j0275J1761j3618J6024j9281K3955l1273
58a7903M4458p5524K74232K30264n29994j1890L31044L7520l26739K9907K61987
69B47362l3158k70495N6431K21624o6832k34698Q4132K15878q0619k33243N8567
80c5051J84489o5491j77954N8819J29994p5560j25063Q3393J23513o4815j24240
91h7966L4536R6744k8329q9366L4210R6027m3135j31418K5683J45568j9766j67514
103a34726J3232J99493K3216k06000n7146J97200Q8225j70307r6857J42771Q2130
$$ plain form
114 81231 -47119 -96156 47707 67298 -114892 -132916 78289 116474 -81180 -108459 83954
125 83954 97931 -92078 -102535 74017 81082 -69637 -55779 77491 32927 -110471 -56394
136 -56394 96882 48513 -97738 -47326 89552 33325 -95305 -28681 95090 17270 -116534
147 -116534 -52245 80927 39916 -78559 -61839 27402 15846 -58169 -52122 14781 23320 -26706
159 -26706 -36682 -1921 -9599 -57323 -46786 20794 26012 -49977 -78767 -13242 25878 -27840 -67938
172 -67938 -17646 21810 -26051 -59249 -3017 28256 -37386 -68987 1948 26967 -53463 -70457
184 -70457 28559 51234 -53576 -82768 15029 40300 -48503 -54332 46546 50949 -59073 -72190
196 -72190 32283 48959 -42958 -50261 37669 37663 -46628 -40603 42309 33303 -43263 -29907 43789
$$ packed form
114H1231j28350m9037J43863J9591j82190j8024K11205L8185j97654k7279J92413
125H3954J3977j90009j0457J76552P065j50719J3858J33270m4564j43398N4077
136e6394J53276m8369j46251N0412J36878n6227j28630O6624J23771p7820j33804
147a16534O4289J33172m1011j18475J6720Q9241j1556p4015O047O6903Q539n0026
159b6706r976L4761p678m7724J0537O7580N218p5989k8790O5525L9120n3718m0098
172f7938N0292L9456m7861l3198N6232L1273o5642l1601P0935K5019q0430j6994
184g0457R9016K2675j04810k9192R7797K5271q8803n829J00878M403j10022j3117
196g2190J04473J6676r1917p303Q7930oq4291O025Q2912r006p6566J3356P3696
$$ plain form
209 43789 29672 -35865 -18447 44137 27372 -32930 -23850 25522 20509 -13236 1469 32909
221 32909 10604 -29241 -13382 30330 27200 -8586 -9509 20862 21235 -11907 -17813 15634 26411
234 26411 -4426 -17493 12725 25104 -8187 -19856 18665 30747 -15464 -34109 15087 43025
246 43025 -2210 -32752 5676 28078 -15321 -35193 14760 38089 -10113 -33052 10094 21298
258 21298 -26333 -29604 26232 29196 -29402 -35977 18814 22566 -30429 -32214 19427 20971 -29748
271 -29748 -32370 14508 18488 -22757 -23812 9818 2166 -31114 -14455 24802 7887 -34173 -22087
284 -22087 15197 5285 -27959 -17683 17731 14831 -18558 -25289 -118 10566 -5637 -10494 3795
297 3795 4457 -11635 -8173 11635 7526 -14230 -9332 14859 12818 -13309 -13351 16673 24173 -6697
$$ packed form
209D3789j4117o5537J7418O2584j6765o0302R080M9372n013l3745J4705L1440
221C2909k2305l9845J5859M3712l130l5786r23L0371L73l3142n906L3447J0777
234B6411l0837j3067L0218J2379l3291j1669L8521J2082m6211j8645M9196K7938
246D3025m5235l0542L8428K2402m3399j9872M9953K3329m8202k2939M3146J1204
258B1298m7631l271N5836K964n8598o575N4791L752n2995j785N1641J544n0719
271b9748k622M6878L980m1245j055L3630p652l3280J6659L9257j6915m2060J2086
284b2087L7284r912l3244J0276L5414k900l3389o731K5171J0684j6203m857J4289
297C795O62j6092L462J9808m109k1756M898K4191k041k6127m2L0024P500l0870
$$ plain form
311 -6697 -23807 3353 25661 6158 -12131 5927 18028 -3732 -12548 12135 17085 -6951 -5723
324 -5723 21063 15093 -18380 -14890 22672 25887 -10694 -20863 11179 23628 -4552 -16277 7690
337 7690 16057 -7552 -11751 10013 8603 -11643 -3390 17203 1870 -24363 -9750 20639 12775
350 12775 -17170 -16503 8690 11616 -10967 -16829 3120 11736 -4235 -11768 -1366 -375 -8467 -1730
364 -1730 8494 -3720 -18073 -5844 12540 4635 -15063 -12942 6426 9612 -9352 -17435 191
377 191 13542 -621 -14674 -5672 3874 -3060 -4163 4241 222 -11623 -5748 8623 2780 -12883
391 -12883 -9516 9610 10103 -11240 -17587 3253 15180 -2656 -15499 -2521 7169 -3102 -7350
404 -7350 3179 1973 -9219 -3965 7853 63 -13389 -4984 11491 6022 -12762 -13353 6033 11699
$$ packed form
311f697j7110K7160K2308j9503j8289J8058J2101k1760q816K4683M950k4036J228
324e723K6786n970l3473L490L7562L215l6581j0169L2042J2449k8180j1725K3967
337G690Q367k3609m199K1764j410k0246Q253K0593j5333k6233J4613L0389p864
350A2775k9945O67K5193K926k2583n862J9949Q616j5971p533J0402R91q092O737
364a730J0224j2214j4353J2229J8384p905j9698K121J9368L186j8964q083J7626
377A91J3351j4163j4053R002R546o934j103Q404m019j1845N875J4371n843j5663
391a2883L367J9126M93k1343o347K0840J1927j7836j2843J2978R690j0271m248
404g350J0529j206j1192N254J1818p790j3452Q405J6475n469j8784n91J9386N666
$$ plain form
418 11699 -4679 -12402 682 7062 -2977 -6245 2324 1812 -4897 -738 5601 -2192 -9356 291
432 291 10872 3212 -9561 -6473 6221 8291 -3651 -8432 2416 8408 -174 -5974 585 3958
446 3958 -37 200 2741 -428 -3773 1341 7036 2130 -6283 -4192 5805 7409 -3159 -7214 3287
461 3287 9337 -911 -7933 -121 6494 454 -1934 2471 1518 -3843 -1040 5375 1829 -5421 -2268
476 -2268 6688 5436 -5048 -5876 4387 6859 -2938 -5548 3429 6117 -698 -1996 3216 1484 -3013
491 -3013 312 5584 1928 -3001 672 5577 2400 -3879 -1946 5136 5271 -938 -1726 3055 3785 -890
507 -890 -1324 1953 2397 -105 1144 3018 939 -1982 -944 2277 1868 -1454 -1053 2929 3736 -1343 -3551
524 -3551 559 3007 -1222 -2567 1938 2236 -1894 -2592 1495 662 -3400 -3069 2556 2811 -2132 -2891 988
$$ packed form
418A1699j6378p723J3084O380j0039l268Q569n12o709M159O339p793p164R647
432B91J0581p660j2773L088J2694K070j1942m781J0848N992q582n800O559L373
446C958l995K37K541l169l345N114N695m906q413K091R997J604j0568m055J0501
461C287O050j0248p022P812O615o040k388M405r53n361K803O415l546p250L153
476b268Q956j252j0484q28J0263K472r797k610Q977K688o815j298N212j732m497
491c013L325N272l656m929L673M905l177o279J933P082J35o209p88M781P30m675
507h90m34L277M44k502J249J874k079k921J038L221m09l322M01L982Q07n079k208
524c551M110K448m229j345M505K98m130o98M087q33m062L31N625K55m943p59L879
$$ plain form
541 988 1676 -3357 -2886 2306 2518 -1545 -993 2633 -44 -3707 -658 3695 1587 -2522 -142 3854
557 3854 1971 -1777 -1246 2080 1640 -121 1176 2742 1387 391 1617 1223 -790 -238 3114 4643
573 4643 1611 -402 -24 1935 2123 18 47 2512 4161 1712 -1295 -551 1068 1562 1303 139 506
590 506 251 993 2090 648 -2851 -2169 1892 3150 -1947 -2814 2553 3758 -2027 -4344 -501 1650
606 1650 456 800 1238 -1458 -2602 365 1630 -1504 -2902 1535 4690 542 -4339 -1828 3405 2213
622 2213 -1954 -1190 1860 1499 1704 2381 -105 -2501 856 4287 1346 -1417 1458 4673 2637 -967
638 -967 -2263 150 3682 4442 2347 -680 124 2132 2677 293 -922 1402 4380 2769 -985 -848
654 -848 1494 1969 1201 458 -1536 -803 3611 4640 -1486 -4271 292 2718 -670 -2406 944 2471
$$ packed form
541I88O88n033M71N192K12m063N52L626k677l663L049M353k108m109K380L996
557C854j883l748N31L326m40j761J297J566j355r96J226l94k013N52L352J529
573D643l032k013L78J959J88k105K9K465J649k449l007P44J619M94k59j164L67
590E06k55P42J097j442l499O82M061J258n097q67N367J205n785k317L843K151
606A650j194L44M38k696j144K967J265l134j398M437L155m148m881K511N233j192
622B213m167P64L050l61K05O77k486k396L357L431k941k763K875L215k036l604
638i67j296K413L532P60k095l027Q04K008N45k384j215K324K978j611l754J37
654h48K342M75p68p43j994P33M414J029o126k785M563K426l388j736L350J527
$$ plain form
670 2471 960 -1123 -2267 -2614 -1086 1982 2666 -1219 -4151 -1102 2618 -577 -5237 -2096 2955 987
686 987 -3076 -1895 104 -931 -609 159 -2931 -4109 591 4118 -349 -4773 -2666 785 -686 -2906
702 -2906 -1696 852 1238 -713 -2483 -3143 -2469 -245 1864 -142 -3760 -2519 1500 414 -3860 -2775
718 -2775 399 196 -1111 -1049 -1827 -1981 323 631 -3179 -4513 -266 2568 555 -2577 -2249 -999 -817
735 -817 -1577 -1472 -459 384 703 401 -2067 -4191 -462 3374 788 -3568 -1257 2834 527 -2070 -309
752 -309 995 -749 -399 2075 450 -1278 985 3009 -246 -3352 -1057 3506 3178 -214 -935 924
768 924 650 -1144 -125 1841 718 416 1808 628 -2829 -1525 2818 2269 -1329 -1586 1314 1078 -34
785 -34 181 -403 -1069 -379 42 -411 -577 795 1321 -747 -2705 -2073 11 1055 224 226 -659 -1628 -1759 -99
$$ packed form
670B471j511k083j144l47J528L068O84l885k932L049L720l195m660L141N051j968
686I87m063J181J999j035L22P68l090j178M700L527m467m424K107L451j471k220
702b906J210K548L86j951j770o60O74K224K109k006l618J241M019j086m274J085
718b775L174k03j307O2p78j54K304L08l810j334M247K834k013l132L28J250J82
735h17p60J05J013Q43L19l02k468k124L729L836k586m356K311M091k307k597J761
752c09J304j744L50K474j625j728K263K024l255l106K295M563l28l392p21J859
768I24k74j794J019J966j123l02J392j180l457J304M343n49l598k57K900k36j112
785c4K15n84o66O90M21m53j66J372N26k068j958O32K084J044q31Kq85r69j31J660
$$ plain form
805 -99 -10 -1801 24 2088 -349 -2900 -970 1791 89 -1668 -265 704 -952 -287 1662 1046 -1724
822 -1724 -1690 1098 1110 -975 46 2765 1714 -1770 -1564 1162 1704 251 1449 2506 251 -1412 806
839 806 2110 430 129 1853 1919 -205 76 1031 1264 395 364 747 378 57 1318 1550 166 -807 -594
858 -594 435 407 720 1010 519 -826 -821 -456 -1306 -372 1075 1096 -1038 -1729 -87 -166 -1028 -408 382 -913
878 -913 -1642 22 462 -599 -1674 -224 253 -1860 -2107 560 1858 -614 -1900 -492 -311 -1369 -357
895 -357 1531 364 -1574 -1037 304 -554 -1456 -134 1990 410 -1679 -1321 927 736 -305 46 430
912 430 -376 -511 1154 525 -725 -243 971 153 -1270 -344 779 1196 586 -1124 -1240 -542 922 1010
930 1010 -60 -386 316 179 -946 -976 -125 669 355 -613 -513 -687 -854 248 862 -1079 -2126 -105
$$ packed form
805i9Q9j791J825K064k437k551J930K761j702j757J403R69j656O65J949o16k770
822a724L4K788J2k085J021K719j051l484K06K726N42j453J198J057k255j663K218
839H06J304j680l01J724O6k124K81R55K33q69l1L83l69l21J261K32j384r73K13
858e94J029k8L13K90m91j345NL65q50R34J447K1k134o91J642p9q62O20P90j295
878i13p29J664M40j061j075J450M77k113k47K667J298k472j286J408J81j058J012
895c57J888j167j938N37J341q58r02J322K124j580k089L58K248j91j041L51L84
912D30q06j35J665o29j250M82J214q18j423R26J123M17o10j710j16O98J464Q8
930A010j070l26P02j37j125l0Q51P94l14r68J00j74j67J102O14j941j047K021
$$ plain form
948 -105 1480 -329 -1736 -120 801 -753 -1889 -687 617 342 146 35 -515 -1266 -225 1397 823
965 823 -1200 -822 909 1014 -1388 -1183 1329 1223 -423 -1004 168 183 670 914 231 -713 -315 1047
983 1047 982 308 -201 170 516 89 -539 -2 989 2102 430 -633 -557 547 1211 644 -284 -97 816
1002 816 676 -515 292 503 349 571 412 -572 -1046 975 1990 89 -1841 -619 666 458 -346 -156
1020 -156 413 192 -443 -449 -53 -242 -226 741 229 -1690 -1328 1160 1411 -831 -1243 3 832 -630 -739
1039 -739 466 74 -141 -316 -644 -601 -166 625 235 -351 -1170 -714 771 661 -340 -769 405 155 -704
1058 -704 -590 -393 428 686 -193 -921 -567 609 457 171 54 -198 -608 215 630 -419 -598 462 760
1077 760 -250 -1007 98 1249 613 -298 -712 77 468 -134 252 520 155 -452 242 706 -755 -393 1041
$$ packed form
948a05J585j809j407J616R21j554j136J202J304k75j96j11n50p51J041J622n74
965H23k023L78J731J05k402K05K512j06j646n81J172J5M87K44o83r44L98J362
983A047o5o74n09L71L46m27o28N37R91J113j672j063P6J104O64n67r28J87R13
1002H16j40j191Q07K11j54K22j59r84m74K021J015j901j930J222J285k08q04J90
1020a56N69k21o35oL96j89J6R67n12j919L62K488K51k242m12J246Q29j462j09
1039g39J205l92k15j75l28M3M35P91l90n86q19M56J485j10j001m29J174k50q59
1058g04J14J97Q21K58q79p28L54J176j52k86j17k52m10Q23M15j049j79J060K98
1077G60j010p57J105J151o36r11m14P89L91o02L86K68l65o07O94M64j461L62J434
$$ plain form
1096 1041 1183 -750 -880 527 1061 108 -398 21 204 -80 -71 324 618 300 -98 203 21 -521 -128 793
1116 793 634 -510 -475 319 704 210 -215 256 237 174 -81 -291 447 174 282 -253 -144 -52 -159 497 517
1137 517 -79 -505 178 287 94 -300 154 352 317 -449 -298 403 290 -270 66 435 -250 -733 380 773
1157 773 -33 -405 -180 270 -157 -241 -5 440 -74 -778 -495 286 173 -312 61 346 -585 -711 77 263
1177 263 -242 -406 -189 437 -300 -201 -220 220 -355 -578 103 -139 9 -156 156 78 -253 -518 256 288 194 -409
1199 -409 -77 -223 -404 -111 -8 91 315 -8 -570 104 323 -324 -14 351 116 -515 -61 699 123 -326
1219 -326 -133 355 403 -270 23 731 547 -228 -55 314 162 7 357 817 -157 -495 -98 328 -743 -521
1239 -521 192 440 -62 -680 -201 340 132 -271 43 223 187 -147 151 188 -392 -221 184 234 -495 -277 237
$$ packed form
1096A041J42j933j30J407N34r53n06M19J83k84RL95K94l18l98L01j82n42L93R21
1116G93j59j144L5P94L85m94m25M71j9o3k55k10P38k73J08n35J09R2j07O56K0
1137E17n96m26O83J09j93l94M54J98l5p66J51P01j13n60L36L69o85m83J113L93
1157G73q06l72K25M50m27q4K36M45n14p04K83P81j13m85L73K85r31j26P88J86
1177B63n05j64K17O26p37R9j9M40n75k23O81k42J48j65L12p8l31k65P74L2r4o03
1199d09L32j46j81K93J03R9K24l23n62O74K19o47L10L65k35o31M54P60n76m49
1219c26J93M88M8o73K93P08j84p75J73L69j52j55L50M60r74l38L97M26j071K22
1239e21P13K48n02o18M79N41k08m03L14J80l6l34K98L7n80J71M05N0p29K18N14
$$ plain form
1260 237 386 -225 -437 -561 176 277 -579 -326 35 74 -196 -290 -20 82 -143 76 298 -291 -270 226 454
1281 454 39 -462 -284 486 759 -540 -76 399 329 -377 -107 208 37 -249 311 89 -418 -110 357 607
1301 607 -34 -169 178 510 240 -224 -525 486 28 -313 287 641 210 249 233 -9 -316 91 493 53
1321 53 -516 -169 -303 218 -184 -603 -293 500 334 -4 -187 -9 -19 155 -21 -19 10 78 214 -254 -327 -75
1343 -75 387 502 283 -309 -430 446 -11 -230 -616 406 255 155 -76 -128 -172 -95 -48 158 -232 13 442
1364 442 290 -294 -418 -305 643 414 -264 -166 224 357 -145 -78 -97 -40 -41 228 -30 94 260 260 -222 -58 -280
1387 -280 199 300 201 53 -287 213 287 -225 -236 136 47 53 -125 -114 -387 -251 110 54 -8 -174 314 338 167
1410 167 -261 -65 134 120 -339 -363 -51 20 -332 -389 255 -136 -62 -157 145 -141 -110 41 -44 -54 -565 -184 158
$$ packed form
1260B37J49o11k12j24P37J01q56K53L61L9k70r4K70J02k25K19K22n89K1M96K28
1281D54m15n01J78P70K73j299M64M75p0p06K70L15j71k86N60k22n07L08M67K50
1301F07o41j35L47L32k70m64l01J011m58l41O00L54m31L9j6k42l07M07M02m40
1321E3n69L47j34N21m02m19L10P93j66l38j83J78j0J74j76KK9O8J36m68p3K52
1343g5M62J15k19n92j21Q76m57k19l86J022j51j00k31n2m4P7M7K06l90K45M29
1364D42j52n84j24J13R48k29o78R8L90J33n02O7j9N7jK69k58J24J66%m82J64k22
1387b80M79J01r9j48l40N00P4n12j1L72q9Oj78J1k73J36L61n6o2j66M88K4j71
1410A67m28J96J99j4m59k4L12P1l52n7O44l91P4r5L02k86L1J51q5j0n11L81L42
$$ plain form
1433 158 121 -139 -161 -21 -38 -469 -107 -221 349 -261 -110 28 36 41 -78 -49 174 -99 -201 47 -141 -425 -167
1456 -167 25 29 -19 139 -9 151 -40 -105 -291 -11 -184 -69 31 439 -347 -296 121 -67 110 124 164 406
1478 406 203 19 172 84 169 -102 378 392 119 72 214 126 -133 -71 -12 171 -140 70 627 269 -59 215
1500 215 -52 -72 -255 151 363 -274 -206 -14 -78 -112 138 20 197 273 -178 -72 246 -2 304 5 289 -152
1522 -152 -169 225 -64 -185 31 105 321 62 202 -145 -35 60 -217 -238 14 47 174 -48 -196 -292 -117 -431
1544 -431 34 -114 63 7 -103 -42 -317 -294 155 190 -345 -38 25 -185 -160 -402 -241 274 -78 7 -158 -49
1566 -49 -176 288 68 -192 25 3 -79 -183 229 -436 -58 31 -196 -41 -177 -177 -40 -413 -228 -24 5 235
1588 235 -170 -157 -81 161 279 -96 -184 -84 -107 -130 289 31 -17 181 228 -183 -286 214 31 88 -306 -142 -19
$$ packed form
1433A58l7k60k2J40j7m31L62j14N70o10J51J38QNj19K9K23k73j02K48j88k84K58
1456a67J92Mm8J58j48J60j91o5j86K80j73J15J00M08p86N1M17j88J77J4M0K42
1478D06k03j84J53q8Q5k71M80J4k73m7J42q8k59O2N9J83l11K10N57l58l28K74
1500B15k67k0j83M06K12o37O8J92o4l4K50j18J77P6m51J06L18k48L06k99K84m41
1522a52j7L94k89j21K16P4K16k59J40l47J10R5k77k1K52L3J27k22j48r6J75l14
1544d31M65j48J77n6j10O1k75K3M49L5n35L07O3k10K5k42J61N15l52Q5j65J09
1566d9j27M64k20k60K17k2q2j04M12o65L78Q9k27J55j36%J37l73J85K04K9K30
1588B35m05J3P6K42J18l75q8J00k3k3M19k58m8J98M7m11j03N00j83N7l94J64J23
$$ plain form
1611 -19 79 -216 -47 -300 47 -46 70 39 -171 -186 453 75 -365 -34 93 -207 221 -204 -116 240 -247 61
1633 61 16 46 369 248 -43 36 111 -24 197 -47 -75 121 187 -53 189 -191 -64 155 -64 -115 -8 -197 -97
1656 -97 -178 -180 16 -159 -73 191 379 29 -203 21 235 -267 -194 315 201 -396 -146 120 136 -63 -78 -38 -140
1679 -140 -78 32 -8 185 -354 -97 -28 61 31 188 -103 146 69 15 49 -57 -137 129 33 -300 -345 -79 141 -189
1703 -189 -168 128 25 -118 -4 -152 24 22 113 133 -12 153 104 256 -120 -118 -188 -44 57 110 29 -83 -53 -171
1727 -171 35 -155 190 319 205 118 -2 -5 -248 -98 -177 59 -99 -4 256 -44 115 -28 320 -55 -201 -148
1749 -148 141 316 -338 -135 79 150 -111 213 63 244 82 -131 -125 -22 18 204 391 408 -107 119 185 99
1771 99 137 177 231 2 344 125 -95 9 64 -32 269 91 56 -117 -158 182 -40 -221 225 -8 -23 31 -160
$$ packed form
1611a9R8k95J69k53L47r3J16l1k10j5O39l78m40L31J27l00M28m25Q8L56m87L08
1633F1m5L0L23j21k91P9P5j35K21k44k8J96O6k40K42l80J27K19k19n1J07j89J00
1656i7q1kJ96j75Q6K64J88l50k32K24K14n02P3N09j14n97K50K66J6j99j5M0j02
1679a40O2J10m0J93n39K57O9Q9l0J57k91K49p7n4L4j06q0K66r6l33m5K66K20l30
1703a89K1K96j03j43J14j48J76kR1K0j45J65m9J52l76Kp0J44J01N3q1j12L0j18
1727a71K06j90L45J29j14q7j20lk43J50p9K36j58R5K60l00J59j43L48l75j46N3
1749a48K89J75o54K03K14P1k61L24j50J81j62k13OJ03M0J86J87J7n15K26O6q6
1771I9L8M0N4k29L42k19k20J04N5r6L01j78l5j73m1L40k22j81M46k33j5N4j91
$$ plain form
1794 -160 290 -342 -147 -146 266 -244 -155 -297 -184 -2 171 -132 7 266 -122 74 -51 -193 -229 29 -416
1815 -416 236 35 -82 -113 -220 -253 -322 -148 -130 144 31 -1 -76 89 91 -92 56 -93 -142 -157 -98 208 -81 14
1839 14 237 -99 -39 -6 -349 -132 -284 -25 165 -126 -70 -15 -77 80 -41 277 -243 91 -227 -151 91 114 -19
1862 -19 -168 -45 -43 72 39 129 -88 233 251 -236 -235 -25 111 -174 -4 233 -140 88 -15 -120 -156 -59 -142 100
1886 100 193 -234 -41 27 -69 135 -72 9 85 -230 -17 74 92 203 114 -134 -123 -122 -145 186 -33 39 -98 -137 46
1911 46 -47 71 -48 285 -59 -87 126 44 27 59 1 44 273 -230 -99 -64 -9 334 63 167 -128 6 -23 1
1935 1 -169 54 -75 -204 -79 460 5 24 87 -123 11 9 119 99 202 -47 -19 -63 -100 187 -31 -23 83 87 -224
1960 -224 -108 -22 -108 26 -205 -305 -19 7 -224 68 -126 -102 -179 159 113 -216 -12 -216 -229 -315 205 216 -147
$$ packed form
1794a60M50o32J95JM12n10Q9j42J13J82J73l03J39K59l88J96j25j42l6K58m45
1815d16O52k01j17l1j07l3o9J74J8K74j13l2p5J65Kj83J48j49m9j5N9L06k89R5
1839A4K23l36O0L3l43K17j52K59J90k91N6N5o2J57j21L18n20L34l18P6K42K3j33
1862a9j49J23KJ15l3R0k17L21J8m87JK10J36k85J70K37l73K28j03j05l6R7q3K42
1886A00R3m27J93O8r6K04k07Q1P6l15K13R1J8J11q9k48J1Jk3L31k19P2j37l9J83
1911D6r3J18j19L33l44k8K13q2j7L2n8M3K29n03J31L5N5L43k71J04k95J34k9K4
1935Aj70K23j29j29J25N39m55J9O3k10J34kJ10k0J03k49K8m4l7K87k18QJ06Ml11
1960b24J16Q6q6J34k31j00K86K6k31K92j94K4p7L38m6l29K04k04j3q6N20J1l63
$$ plain form
1983 -147 306 -124 9 -42 167 -172 49 128 -141 88 85 169 -171 -256 79 320 223 -43 -211 244 -106 -229
2005 -229 -213 184 70 -163 -33 -47 45 63 -97 226 151 181 85 -238 168 303 -70 237 9 -27 -96 239 -13
2028 -13 -115 -109 -34 71 -69 56 98 48 232 -281 140 -91 -97 89 -149 -380 245 343 77 358 -88 169 171 -241
2052 -241 -24 60 339 -60 -124 -70 62 141 -26 -144 17 -118 232 -270 19 -95 112 157 78 -142 124 -4
2074 -4 -402 86 223 54 19 31 343 65 35 73 97 128 -97 -82 -98 -40 -139 18 326 -252 -259 -89 167 27 -98
2099 -98 52 19 -175 67 -37 -186 -89 203 136 -64 16 -138 -175 320 -32 74 -106 83 321 249 163 179 80
2122 80 -25 -93 -119 -93 284 24 72 109 93 486 71 -99 -4 -52 -101 40 -63 -108 8 63 -214 96 -319 -210
2146 -210 -109 -36 31 76 265 215 -117 124 90 84 236 -276 -119 62 -31 -48 22 -143 -246 -58 92 203 -92
$$ packed form
1983a47M53m30J33n1K09l39K21P9k69K29lQ4l40q5L35K41r7k66j68M55l50j23
2005b29J6L97j14k33J30j4R2J8j60L23p5L0r6l23M06J35l73L07k28l6o9L35k52
2028a3j02OP5J05j40J25M2n0J84n13M21k31oJ86k38k31O25R8k66K81m46K57Km12
2052b41K17Q4K79l99o4N4J32P9j67j18J61j35L50n02K89j14K07M5p9k20K66j28
2074dl98M88J37j69l5J2L12k78l0L8K4L1k25J5j6N8r9J57L08n78pJ70K56j40j25
2099i8J50l3j94K42j04j49R7K92o7k00Q0j54l7M95l52J06j80J89K38p2q6J6r9
2122H0j05o8k6K6L77k60M8L7j6L93m15j70R5m8m9J41j03m5J16N5k77L10m15J09
2146b10J01P3O7M5J89n0l32K41l4oJ52n12J57J81r3j7P0j65j03J88J50J11k95
$$ plain form
2169 -92 -51 -213 26 12 37 14 -4 118 -102 -125 85 360 24 41 -308 -111 129 85 -36 -231 85 -228 307
2192 307 98 -122 276 -87 51 65 0 218 -22 69 97 -55 -94 -92 39 -48 208 -74 -131 -113 0 -25 -144 110
2216 110 359 -94 88 -136 -374 180 174 -271 -14 -305 -9 -119 -100 -168 -110 56 100 58 214 -67 -17 -194 36
2239 36 -114 -57 -132 -146 126 71 -113 10 76 17 453 -166 -168 -134 -80 -83 -104 194 -98 -451 333 178 30 310 -51
2264 -51 -169 -144 -40 243 -122 138 35 92 -247 -117 98 -253 -119 -53 -155 16 332 0 10 6 1 188 283
2287 283 108 57 -37 -150 8 187 -112 52 309 -130 -79 -63 382 32 -5 -215 426 -233 6 27 -121 -97
2309 -97 -24 -37 132 -78 -55 71 207 137 96 -20 103 152 -80 -51 -238 -169 52 -214 -94 37 -58 132 28
2332 28 9 61 12 -284 -46 -52 274 217 -182 37 -96 -223 44 -222 14 33 -87 -148 -496 121 72 -210 349
$$ packed form
2169i2M1j62K39j4K5k3j8J22k20k3K10K75l36J7l49J97K40m4j21j95L16l13N35
2192C07k09k20L98l63J38J4o5K18k40R1K8j52l9KJ31q7K56k82n7J8J13k5j19K54
2216A10K49m53J82k24k38N54om45K57k91K96j10J9o8N8J66M4m2J56k81N0j77K30
2239C6j50N7p5j4K72n5j84J23O6n9M36o19kL4N4lk1K98k92l53P84j55j48K80l61
2264e1j18K5J04K83l65K60j03N7l39J30K15l51J34O6j02J71L16l32J0mnJ87R5
2287B83j75n1r4j13J58J79k99J64K57m39N1J6M45l50l7k10O41o59K39K1j48K4
2309i7P3j3J69k10K3J26J36p0m1j16J23M9k32K9j87O9K21k66J20J31r5J90j04
2332B8j9N2m9k96K38oL26n7l99K19j33j27K67k66K36J9j20o1l48O17m9k82N59
$$ plain form
2355 349 -70 177 278 45 196 15 170 -256 -132 -122 23 -174 198 178 53 -18 -101 133 -82 19 11 -188
2377 -188 26 63 -237 151 -86 -97 -151 -153 -364 75 -65 178 117 62 -197 -222 -216 -17 142 -194 68 -162 206
2400 206 200 48 105 -361 156 399 -17 -137 96 211 10 157 -52 202 -101 -186 101 25 404 -252 -254 49
2422 49 -75 65 -138 54 -259 -174 182 6 242 119 74 -270 -45 -81 -185 210 -243 85 -7 195 158 221
2444 221 -192 -37 -39 -86 144 -312 -334 227 204 37 -132 -17 65 -5 -223 -100 84 69 -251 -76 -108 89 143
2467 143 13 310 80 119 215 88 261 117 83 -85 -185 -185 -84 -8 108 -186 80 122 -202 -29 -198 -47
2489 -47 87 104 186 86 -322 54 0 -81 -99 118 -39 203 -137 80 -76 -66 36 -223 64 -143 103 217
2511 217 54 -168 101 7 281 114 -111 -83 -66 -104 26 253 93 79 145 172 -197 96 -103 184 89 -338 81
$$ packed form
2355C49m19K47J01k33J51j81J55m26J24J0J45j97L72k0j25p1q3K34k15J01qj99
2377a88K14L7l00L88k37j1n4kk11M39j40K43o1n5k59k5OJ99J59l36K62k30L68
2400B06oj52N7m66N17K43m16j20K33J15k01J47k09K54l03q5K87p6L79o56kL03
2422D9j24J40k03J92l13Q5L56j76K36j23m5l44K25l6j04L95m53L28r2K02l7O3
2444B21m13J55km7K30m56k2N61k3j67j69J15Q2p0k18J23J84j5l20J75l2J97N4
2467A43j30K97k30L9R6j27J73j44l4j68j00%J01P6J16k94K66M2l24J73j69J51
2489d7J34J7Q2j00m08L76n4q1j8K17j57K42l40K17j56J0J02k59K87k07K46J14
2511B17j63k22K69r4K74j67k25K8J7l8J30K27j60j4O6K7l69K93j99K87r5m27M19
$$ plain form
2534 81 66 114 83 15 55 -13 88 30 101 -100 -27 -7 -28 149 45 220 -39 37 53 193 -4 93 -62 143 -85
2559 -85 125 -50 118 -76 193 -283 -116 153 -64 112 22 -283 35 -22 123 -244 101 -177 8 8 -58 -257
2581 -257 -197 -247 -113 255 54 -88 89 77 48 0 155 -167 -38 189 127 153 57 178 85 198 -179 92 -58
2604 -58 180 139 133 10 -239 -88 -193 327 -150 237 -143 6 166 -61 136 142 -8 232 -93 72 122 40 8
2627 8 104 341 304 66 -272 206 -87 63 -321 -32 -287 -61 233 413 92 90 73 -214 39 54 194 16 354
2650 354 -104 -144 -51 39 204 76 -174 -7 157 143 -253 87 0 17 -6 -253 -108 277 -117 32 21 127 226
2673 226 -117 -199 140 -111 301 37 121 63 119 -48 -172 -212 -195 91 143 47 -403 29 -35 125 118 118 105 -88 1
2698 1 -42 193 109 -8 -21 47 318 64 -60 -168 -63 -40 42 99 -66 107 -292 -191 -228 -364 -139 156 -6
$$ packed form
2534H1j5M8l1o8M0o8J01n8P1k01P3K0k1J77j04J75k59P6J6J40j97R7j55K05k28
2559h5K10j75J68j94K69m76J67K69k17J76r0l05L18n7J45l67L45k78J85%o6j99
2581b57O0n0J34L68k01j42J77j2k9m8J55l22J29K27o2K6r6J21r3J13l77K71j50
2604e8K38m1oj23k49J51j05N20m77L87l80J49J60k27J97Oj50K40l25J65N0q2l2
2627HR6K37l7k38l38M78k93J50l84K89k55K26K94J80l21kj7k87K53J5J40j78L38
2650C54m58m0R3R0J65j28k50J67J64j4l96L40q7J7k3k47J45L85l94J49j1J06R9
2673B26l43q2L39k51M12k64Q4n8N6j67j24m0J7K86N2r6m50M32o4J60p%j3j93Q9
2698Am3K35q4j17j3O8K71k54j24j08J05K3Q2N7j65J73l99J01l7j36K25K95j62
$$ plain form
2721 -6 -156 -44 -276 -43 207 28 38 22 -112 156 35 240 236 -69 33 214 181 -5 -107 -2 -61 -153 -21
2744 -21 150 107 -10 -75 -122 109 264 33 57 -42 -69 -75 -18 -144 147 -171 184 -159 -63 152 131 -2 -109 -46
2768 -46 -35 -272 -374 -19 248 -119 179 -84 -28 -32 -12 -1 37 6 -139 -128 208 73 41 -2 312 -93 -179 107
2792 107 -48 296 -89 38 -151 60 -158 85 -171 -182 220 131 -59 17 23 168 180 -115 133 105 85 133 -54
2815 -54 -287 158 -278 75 35 -18 -15 -2 -39 -73 57 291 122 256 -291 -156 128 140 3 153 120 -49 96
2838 96 221 -10 -5 103 -48 -33 -172 209 88 154 -130 -64 -35 -168 -364 59 -54 61 -65 -40 -63 -92 -392
2861 -392 -135 7 -254 -113 35 -115 -105 -111 -127 -124 73 154 54 250 2 -101 -148 -173 184 128 92 -130 301 -97
2885 -97 -112 -59 21 38 100 -17 344 135 35 -53 57 -319 127 253 207 247 201 134 170 -138 146 -77 -78 35 155
$$ packed form
2721fj50J12k32K33K50j79J0j6j34K68j21K05ml05J02J81l3j86j02J05n9r2J32
2744b1J71m3j17o5m7K31J55k31K4r9k7oN7j26K91l18L55l43R6K15k1j33j07O3
2768d6J1k37j02L55K67l67K98k63N6mK0J1L8l1j45J1L36j35l2m3L14m05q6K86
2792A07j55L44l85J27j89K11k18K43k56j1M02q9j90P6OJ45J2k95K48k8k0M8j87
2815e4k33M45m36L53m0n3LJ3l7l4J30K34j69J34n47J35K84J2j37J50l3j69J45
2838I6J25k31NJ08j51J5j39L81j21O6k84O6K9j33j96M23j13J15j26K5k3k9l00
2861c92K57J42k61J41J48j50J0oj6LJ97Q1j00J96k48j03m7k5L57n6l6k22M31l98
2885i7j5N3Q0J7O2j17L61k09j00q8J10l76M46J26m6M0m6o7L6l08K84k23jJ13J20
$$ plain form
2910 155 33 -5 117 236 -310 -247 216 -38 267 -16 48 18 320 -100 -128 -11 205 -92 146 -231 59 18
2932 18 29 -106 -34 78 156 58 -59 135 -62 -287 -133 115 48 -94 81 52 135 -282 100 112 59 -14 -8 278
2956 278 -39 -142 -20 -186 -238 -71 -138 343 2 105 230 114 104 -7 -309 -137 53 -139 83 75 -279 182
2978 182 73 -89 81 -32 101 14 145 169 58 -246 118 27 93 -114 -220 -179 196 -181 55 39 29 -54 48
3001 48 136 -128 -29 -119 -256 -55 271 -176 -185 39 -150 -136 -16 40 -121 -209 113 98 -94 -195 -32 267 279 -17
3025 -17 68 -97 73 -533 -85 -66 113 -273 71 -90 -98 126 -149 -88 -142 101 107 33 -255 -52 38 148 -275 -23
3049 -23 107 317 -60 103 143 -25 275 -37 85 -23 41 -47 72 104 11 144 3 99 -376 -162 173 -259
3071 -259 236 -222 495 -182 -257 -160 -53 83 2 -17 -67 92 -222 4 6 -74 40 -47 -106 78 133 91 -259 136
$$ packed form
2910A55j22l8J22J19n46O3M63k54L05k83O4l0L02m20k8J17K16k97K38l77K90m1
2932A8J1j35P2J12P8r8j17J94j97k25J54K48o7j42J75k9Q3m17L82J2n3p3OK86
2956B78l17j03J22j66n2J67o7M81l41J03J25j16j0j11l02J72J90j92K22ql54M61
2978A82j09j62J70j13J33q7J31K4j11l04L64r1O6k07j06M1L75l77K36j6j0q3J02
3001D8Q8k64R9r0j37K01L26m47rK24j89J4J20N6j61q8L22j5j92j01J63K99J2k96
3025a7Q5j65J70o06M48J9J79l86L44j61qK24k75O1n4K43Op4k88K03R0J10m23K52
3049b3J30K10l77J63M0j68L00l12J22j08O4q8J19L2r3J33j41R6m75K14L35m32
3071b59M95m58P17o77p5R7J07J36q1j9n0J59l14K26Kq0J14q7n9J84N5m2l50L95
$$ plain form
3095 136 122 1 80 56 -205 59 -89 293 -79 365 293 -348 -220 -38 166 114 44 -157 -176 102 214 136 61
3118 61 75 207 196 -5 174 -196 -23 -89 3 -48 -282 73 -3 97 103 263 197 -273 52 373 48 115 171 -188
3142 -188 -93 -214 22 -102 -264 -35 -53 45 -151 201 105 -5 -98 71 280 195 147 -64 -215 178 18 109 177
3165 177 -41 166 -26 -233 -160 -183 129 69 -127 -63 3 -110 -72 -288 -369 201 -91 -191 -338 -96 216 227 -10
3188 -10 -165 97 98 118 265 -31 -11 220 223 51 -4 215 -80 -168 -79 15 83 118 -117 -94 9 -64 -112 265 47
3213 47 70 36 26 41 -222 54 -10 -237 -231 -138 -6 90 182 -258 191 252 -35 209 -59 4 -17 77 -83 -33 -57 99
3239 99 99 -148 -17 77 32 5 -122 156 -179 -53 -185 12 -278 -234 115 200 -249 -304 30 -112 -9 -67 -182
3262 -182 -47 -22 5 85 -67 180 -307 -143 92 -70 -77 123 89 0 -336 7 43 211 33 -54 159 70 -40
$$ packed form
3095A36j4j21P9k4k61K64j48L82l72M44p2o41J28J82K04n2p0k01j9K78J12p8p5
3118F1J4J32j1k01J79l70J73o6R2n1k34L55p6J00OJ60o6m70L25L21l25O7N6l59
3142a88R5j21K36j24j62K29j8R8j96L52r6j10r3J69K09q5m8k11j51L93j60R1O8
3165A77k18K07j92k07P3k3L12o0j96O4O6j13L8k16q1N70k92j00j47K42L12J1k37
3188a0j55K62JK0J47k96K0K31Lj72n5K19k95q8Q9R4O8L5k35K3J03p3m8L77k18
3213D7K3l4j0J5k63K76o4k27OR3J32R6R2m40M49O1k87K44k68O3k1R4j60N0k4J56
3239I9%k47J31R4m5k7j27K78l35J26j32J97k90M4L49Q5m49n5L34j42J03n8j15
3262a82J35K5K7Q0j52K47m87J64K35j62pK00l4q9l36L43L6J68j78q7K13q9j10
$$ plain form
3285 -40 216 -79 -3 -71 104 -48 163 -216 -17 192 -133 -241 153 86 -111 183 98 312 14 185 -36 29
3307 29 -157 37 86 -56 -73 -180 56 -35 -161 142 122 58 -205 -164 -9 -16 16 16 -333 -252 107 20 210 -84 92
3332 92 59 -47 59 -26 55 -208 -32 71 -93 57 -16 -9 14 135 -181 69 -235 -216 151 137 -51 153 123 62
3356 62 9 -89 -268 65 -198 -101 -82 -28 98 -145 -229 92 -163 -256 207 97 210 253 347 251 -69 -183 133 114
3380 114 160 20 -151 146 272 55 -10 -31 298 -230 124 -318 -35 -126 113 245 214 114 42 101 -235 266
3402 266 192 94 -170 -163 40 304 134 48 -80 -223 54 160 -1 -148 149 94 106 -13 -349 -66 -204 112
3424 112 -181 -160 125 -155 1 6 -179 -227 273 -30 -284 59 -71 73 425 -265 93 262 132 -47 202
3445 202 -215 281 -320 84 -148 76 257 153 4 150 238 96 -77 -65 -58 180 -106 -169 -12 -59 204 -9
$$ packed form
3285d0K56k95P6o8J75j52K11l79J99K09l25j08L94o7j97K94q5K14k98J71k21O5
3307B9j86J94M9j42j7j07K36r1j26L03k0o4k63M1J55pL2%l49Q1L59q7J90k94J76
3332I2l3j06J06q5Q1k63J76J03j64J50p3PK3J21l16K50l04J9L67j4j88K04l0o1
3356F2n3r8j79L33k63R7J9N4J26k43q4L21k55r3M63j10J13M3R4r6l20j14L16j9
3380A14M6j40j71K97J26k17o5k1L29n28L54m42K83r1K39J32l1j00p2N9l36N01
3402B66p4r8k64PK03K64j70q6j28j43K77J06j61j47K97n5J2j19l36K83j38L16
3424A12k93K1K85k80J56Nj85m8N00l03k54L43j30J44L52o90L58J69j30j79K49
3445B02m17M96o01M04k32K24J81j04j49J46Q8j42j73J2PK38k86o3J57m7K63k13
$$ plain form
3467 -9 58 97 -21 -224 65 -38 -30 171 200 19 206 -181 -82 -87 -84 -53 -183 152 26 64 -55 -240 39 41 0 149
3493 149 207 -9 248 273 -79 199 40 -107 137 24 50 -224 62 171 115 -18 -27 -126 82 -266 -418 100
3515 100 62 188 -84 -91 -231 -92 -294 -57 219 32 165 101 -192 100 -87 87 -32 -206 -195 56 325 178
3537 178 -138 -378 -167 -62 -18 114 -39 82 47 -30 198 -75 -126 307 -194 284 151 170 -226 78 -136 -239
3559 -239 170 -399 132 147 74 -95 54 -85 5 331 56 -76 213 42 -143 29 37 -41 -429 182 -11 226
3581 226 300 -25 -57 -199 -38 64 -47 -59 -287 -105 -106 91 116 -93 -9 39 -123 -247 -115 -20 -275 -323 33
3604 33 151 114 145 193 -137 377 208 -58 98 67 111 -211 -184 148 -50 -195 -332 -76 46 16 -113 347 -71
3627 -71 133 225 -16 355 -204 122 102 -110 -218 -156 40 328 287 92 295 -143 74 -215 5 247 284 161
$$ packed form
3467iO7L9j18k03K89j03QK01K9j81J87l87R9nLL1j30L35j26L8j19j85K79Km1J49
3493A49N8k16K57K5l52K78j59j47K44j13K6k74K86J09n6j33rr9K08l48j52N18
3515A00l8J26k72pj40J39k02K37K76j87J33o4k93K92j87J74j19j74J1K51K69j47
3537A78l16k40K11J05M4J32j53J21l5p7K28k73n1M33n01M78j33J9l96L04k14j03
3559b39M09n69N31J5p3j69J49j39R0L26k75j32K89j71j85J72Qp8l88O11j93K37
3581B26P4l25l2j42J61J02j11j2k28J82jJ97K5k09Q4M8j62j24J32R5k55m8L56
3604C3J18l7L1M8l30N14j69k66J56l1M4l22K7L32j98j45j37K56J22l0j29M60m18
3627g1K04R2k41L71n59L26k0k12j08O2J96K88m1j95K03m38K17k89K20K42L7j23
$$ plain form
3649 161 -208 77 4 3 -50 -100 54 -41 154 -52 -265 -66 242 -158 85 252 230 -34 -54 -37 13 112 -198 43
3673 43 39 -220 -77 115 236 -127 40 -10 63 76 -153 -58 -99 -143 113 -314 305 -128 135 125 -14 259 -140
3696 -140 244 -82 -263 -63 -103 125 103 192 32 -189 151 -137 100 33 216 -55 167 89 115 -200 68 -58
3718 -58 -43 69 -78 324 -78 -16 216 70 -189 225 -39 -38 -180 -91 -135 222 83 81 326 185 293 -63 262
3741 262 -8 -19 148 -26 -252 108 -176 131 5 75 66 137 258 93 -246 69 266 222 146 -67 158 -38
3763 -38 -292 17 106 179 30 -60 -91 97 210 86 189 -63 -105 -148 -409 69 -125 -24 82 169 181 57 171
3786 171 -104 -212 59 -75 -54 -126 -185 -183 -33 -69 44 240 -377 104 -54 73 -346 81 -224 277 185 -85
3808 -85 -103 -44 -58 -49 -17 -132 265 103 29 123 208 122 330 41 -6 218 -219 37 -14 -37 32 21 -154 16 -208
$$ packed form
3649A61l69K85p3jn3n0J54r5J95k06k13J99L08m00K43J67k2k64k0J7N0R9l10K41
3673D3mk59J43J92J21l63J67n0P3J3k29R5m1m4K56m27O19m33K63j0j39K73l99
3696a40L84l26j81K00m0K28k2Q9j60k21L40k88K37o7J83k71K22p8K6l15K68j26
3718e8J5J12j47M02m02O2K32j46k59M14k64Jj42Q9m4L57j39kK45j41J08l56L25
3741B62k70j1J67j74k26L60k84L07j26P0rP1J21j65l39L15J97m4p6k13K25j96
3763c8k54L09Q9P3j49r0l1J88J13j24J03k52m2m3k61M78j94J01J06Q7J2j24J14
3786A71k75j08K71j34K1p2n9KJ50l6J13J96o17M81j58J27m19M27l05N01r2k70
3808h5j8N9j4RL2j15L97j62p4R4Q5q6K08k89m7K24m37K56n1k3O9j1j75J70k24
$$ plain form
3833 -208 156 -240 255 -128 -293 100 -308 26 -82 -17 -127 -35 31 111 261 72 -149 118 -238 -162 -111 22
3855 22 -96 -55 -120 -144 9 55 4 -275 40 152 138 -215 384 180 251 -354 -129 7 19 17 -183 -305 148 104
3879 104 -141 -170 -13 116 183 -89 51 379 114 -138 -1 -83 -145 -258 -68 -95 5 -54 -88 -61 -184 -51 130
3902 130 110 -144 151 99 259 -100 19 -174 -12 110 140 -9 250 -31 -153 79 -3 -243 66 -315 57
3923 57 47 3 48 -14 -119 138 14 41 -2 266 -238 -481 221 -61 285 183 -364 105 -130 -147 15 -27 -46
3946 -46 50 -151 84 -245 123 -112 -136 144 66 -178 -65 148 -20 -22 -90 -33 -132 86 53 -268 -186 -156 -80 76
3970 76 240 -279 46 -1 -173 83 -302 -85 121 98 -76 -65 -11 23 -109 93 -48 5 -36 -246 -101 54 -163
3993 -163 122 147 -387 -189 -107 148 -7 -18 -9 -70 -33 0 24 3 -94 39 380 95 20 -183 -300 -93 -1 -287
$$ packed form
3833b08L64l96M95l83j65L93m08L34j08O5j10R2O6Q0J50j89k21K67l56P6N1J33
3855B2j18M1o5k4J53M6n1k79L15J12j4l53N99k04P1o05K25J36J2kk00j22M53m4
3879A04k45k9J57J29O7k72J40L28k65k52J37q2o2j13J90k7J00n9l4K7j23J33J81
3902A30k0k54K95n2J60l59J19j93J62J22L0j49K59k81j22K32q2k40L09l81L72
3923E7j0m4M5o2j05K57j24K7m3K68n04k43P02k82L46j02n47M69k35j7J62m2j9
3946d6R6k01K35l29L68k35k4K80p8k44J13K13j68ko8N7r9K18l3l21Q2L0P6J56
3970G6J64n19L25m7j72K56l85K17K06k3j74J1N4L4j32K02j41N3m1k10J45J55k17
3993a63K85K5n34J98Q2K55j55j1Ro1L7L3K4k1r7J33L41k85p5k03j17K07R2k86
$$ plain form
4017 -287 -73 41 -75 66 -276 -264 60 80 168 -197 -4 -18 -2 142 -4 -27 83 37 -129 161 -105 -10 112
4040 112 172 -104 -191 2 -98 11 321 42 -229 84 -9 58 -198 118 -121 159 145 -67 -242 -96 -25 277
4062 277 104 -62 -71 -79 93 271 -88 -127 -183 -44 66 86 -51 -298 -218 165 -115 -102 37 279 -51 -45 -3 82
4086 82 219 -1 232 -57 211 82 -18 -91 -48 -218 258 -210 -80 137 -306 49 -92 -162 -130 192 170 -52
4108 -52 10 -316 -193 16 -334 -150 113 358 1 156 -12 -138 80 -50 -18 161 -24 59 -75 -97 -58 -29
4130 -29 -16 477 -49 -175 0 -15 56 -168 319 213 -120 60 -246 168 48 -270 -215 -9 64 -212 66 -267
4152 -267 186 -11 163 -265 191 -39 -264 135 60 151 -146 116 -35 -22 -214 150 22 212 6 -58 271
4173 271 23 -129 115 -18 -142 95 -128 -14 -29 -73 -433 99 165 84 59 -10 -67 -125 -180 -172 -42 -5 -226 27
$$ packed form
4017b87K14J14j16J41l42J2L24K0Q8l65J93j4J6J44j46k3J10m6j66K90k66R5J22
4040A12O0k76q7J93j00J09L10k79k71L13r3O7k56L16k39K80j4k12j75J46P1L02
4062B77j73j66rqJ72J78l59l9n6J39J10K0j37k47Q0L83k80J3J39K42l30OM2Q5
4086H2J37k20K33k89K68j29j00p3M3j70M76m68J30K17m43L55j41p0L2L22k2k22
4108e2O2l26J23K09l50J84K63K45l57J55j68j26K18j30L2J79j85Q3j34k2L9K9
4130b9J3M93n26j26J75j5P1k24M87j06l33J80l06M14j20l18N5K06P3k76K78l33
4152b67M53j97J74m28M56k30k25L99p5R1k97K62j51J3j92L64j28J90k06o4L29
4173B71k48j52K44j33j24K37k23J14j5m4l60N32O6q1k5o9n7n8n5QJ30L7k21K53
$$ plain form
4197 27 -288 83 155 194 -193 -18 234 -53 -184 -17 43 -148 335 285 -120 232 -33 -40 180 201 156 27 -135
4220 -135 -180 121 -141 57 -51 19 177 -101 -124 -67 257 50 -36 -7 69 -237 -175 49 104 49 247 161 -128 -47
4244 -47 48 -26 107 -238 -104 75 28 -14 -322 -109 -172 -380 53 -77 -56 -21 -143 38 82 -173 139 107 -14
4267 -14 6 267 -98 216 290 -103 15 287 5 166 -218 355 46 116 155 54 13 -341 -102 42 38 -359 106
4290 106 -68 77 -274 139 213 -125 2 -194 -340 277 -165 -72 -93 27 32 -263 177 6 65 42 -126 -53 -158
4313 -158 54 416 224 -97 -74 -111 285 166 154 45 -22 -61 89 -11 -265 -137 80 213 -105 232 124 72
4335 72 -82 -1 -50 273 -6 -49 171 -69 -106 14 -67 -89 -185 213 47 -278 -290 69 -231 -34 -45 30 -104 83
4359 83 101 112 -207 -62 228 152 112 -127 -178 147 12 -22 -230 97 -64 80 -21 88 165 -53 -323 107 -247
$$ packed form
4197B7l15L71P2L9l87J75K52k87j31J67O0j91M83n0m05L52k65pK20K1m5j29j62
4220a35m5L01k62J98j08P0J58k78k3N7L24k07q6K9P6l06O2K24N5n5J98q6k89Q1
4244d7R5p4J33l45J34J79m7m2l08K13o3k08M33j30K1L5j22J81M4k55L12l2j21
4267a4K0K61l65L14P4l93J18K72k82J61l84N73l09P0L9j01m1l54K39J44ml97M65
4290A06j74J45l51M13P4l38J27j96j46O17m42R3k1J20Nk95M40j71N9k3j68P3j05
4313a58K12L62j92l21K3l7L96j19j2j09o7l9J50j00k54J28K17J33l18L37j08n2
4335G2j54Q1m9L23k79m3K20k40l7J20q1k2r6L98j66l25j2L59l00J97j1P5j34J87
4359H3J8J1l19J45K90p6m0k39n1L25j35l4k08L27j61J44j01J09P7k18k70M30l54
$$ plain form
4382 -247 -5 115 -140 -177 -143 95 -49 68 195 -139 89 -273 5 83 -44 90 94 16 -303 232 -25 -187
4404 -187 -171 25 40 -127 28 10 231 -121 88 -258 26 -298 -28 112 209 -50 242 176 -47 58 361 27
4426 27 -52 289 18 -201 -223 -49 2 -50 43 118 151 -109 -119 364 13 -134 -80 303 -246 1 -34 -97 59 -16
4450 -16 -56 -68 164 -193 196 -33 46 37 -67 -389 217 242 11 112 58 -108 55 194 159 -292 -84 -108 -20 98
4474 98 -48 126 -47 63 -284 75 87 -45 -43 -54 -115 -244 103 -181 294 -47 -66 -57 46 196 -73 -10 144
4497 144 96 -92 10 3 -145 89 -311 -417 -107 178 59 80 -581 91 226 -213 8 96 231 -416 -98 173
4519 173 171 90 63 -68 221 -378 -225 -342 89 50 -58 -128 154 -48 44 24 -117 50 235 188 3 131 -229
4542 -229 -303 146 68 55 142 10 -101 -8 132 6 91 -178 257 182 -8 -289 204 -88 129 123 -261 -281 49
$$ packed form
4382b47K42J20k55l7L4K38j44J17J27l34K28l62K78P8j27J34Mp8l19N35k57j62
4404a87J6J96J5j67J55j8K21l52K09l46K84l24K70J40R7k59K92o6k23J05L03l34
4426B7p9L41k71k19k2J74N1n2R3P5L3k60j0M83l51j47N4L83n49K47l5o3J56p5
4450a6m0j2K32l57L89k29P9rj04l22O06K5k31J01n4j66J63J39l5m51K08k4Q8J18
4474I8j46J74j73J10l47L59J2j32Kj1o1j29L47k84M75l41j9RJ03J50k69O3J54
4497A44m8j88J02pj48K34m00j06L10K85j19K1o61O72J35m39K21Q8J35o47L18K71
4519A73kq1k7j31K89n99J53j17M31l9j08p0K82k02R2k0j41J67J85m7j85J28l60
4542b29p4M49p8j3Q7j32j11R3J40j26Q5k69M35p5j90k81M93k92K17ol84k0L30
$$ plain form
4565 49 336 33 -61 348 194 -163 303 -233 25 134 293 -14 -49 482 -134 -98 12 259 -14 6 -183 -368
4587 -368 -298 21 -77 -73 129 231 -87 224 -260 -259 -103 -334 32 77 218 -171 -192 -175 14 2 -313 -127 -171 61
4611 61 -15 -185 141 58 83 94 132 -51 -98 82 46 -129 -80 -118 -68 -15 150 118 -8 49 -38 -280 54 -23 2 257
4637 257 294 -22 2 -41 90 -335 43 57 268 463 19 -73 -166 -116 -218 199 -93 224 88 -107 132 -94
4659 -94 -11 -11 89 291 -49 55 -100 -50 26 -270 63 60 -75 -202 -23 -104 -208 -19 65 107 242 237 185 -134 60
4684 60 25 -98 -11 219 92 69 41 126 -84 -17 -168 48 146 120 -350 91 164 161 -48 -78 168 -46 146 48 -12
4709 -12 -16 34 -106 -75 268 56 -70 -314 217 87 -144 280 -282 -119 -74 -46 81 28 63 -144 119 21 217
4732 217 81 -78 251 144 125 -165 -146 -198 94 93 -365 93 -278 -76 13 -170 -110 -46 -17 -86 252 -26 -18 -57
$$ packed form
4565D9K87l03r4M09j54l57M66n36K58J09J59l07l5N31o16L6J10K47k73K0j89j85
4587c68P0L19r8MK02J02l18L11m84JJ56k31L66M5J41l89k1J7J89j2l15J86m4K32
4611F1p6j70L26q3K5J1L8j83m7J80l6j75M9l8N0N3J65l2j26N7q7k42L34p7K5K55
4637B57L7l16K4m3J31m25L78J4K11J95m44r2r3N0j02M17k92L17j36j95K39k26
4659i4Q3%J00K02l40J04j55N0P6k96L33lj35j27J79q1j04J89Q4M2J35nn2l19J94
4684F0l5j23Q7K30j27k3k8Q5k10O7j51K16R8k6m70M41P3lk09l0K46k14J92r8o0
4709a2mN0j40L1L43k12j26k44N31j30k31M24n62J63M5K8J27n3L5k07K63r8J96
4732B17j36j59L29j07j9k90J9n2K92jm58M58l71K02Q9j83O0O4K9o9L38k78Ql9
$$ plain form
4756 -57 -169 178 171 -20 18 171 113 69 -56 186 -184 -70 86 -181 67 -209 -237 131 -399 94 -173 -171 -23
4779 -23 0 186 -36 -45 -89 51 -196 -57 72 88 -219 -224 72 -48 260 30 233 -243 -81 -149 -132 70 3 8
4803 8 -157 101 -215 253 -435 199 -111 -135 -30 121 -44 -143 230 -95 235 -74 -92 26 -4 164 72 55 -466
4826 -466 432 229 -9 172 -171 235 42 -285 -194 -9 -42 -56 -50 102 169 256 66 151 -281 86 8 11 -75 -39
4850 -39 -35 70 87 192 -49 -237 185 -324 27 219 22 -9 -191 57 -14 -77 -30 146 71 -40 -252 -74 76
4873 76 3 222 -37 164 27 220 -194 10 169 141 -108 -20 -133 62 30 397 -169 9 -259 249 13 -177
4895 -177 -201 289 245 -96 33 -36 48 56 -167 -157 -168 48 -81 -234 -35 -42 87 11 209 314 76 -80 58 107
4919 107 14 -24 -299 52 24 -63 -291 313 -138 -6 18 -30 -192 212 -28 -61 -91 78 376 4 136 238 46
$$ packed form
4756e7j12L47pj91L8J53n8m4j25K42l70J14J56k67K48k76k8L68n30M93k67KJ48
4779b3K3J86k22rm4J40k47J39J29J6l07nK96j20L08k30K03m76J62o8J7K02o7N
4803Hj65K58l16M68o88O34l10k4J05J51j65r9L73l25L30l09j8J18l0J68r2j7n21
4826d66Q98k03k38J81l43M06j93l27R1J85l3j4OJ52O7Q7j90Q5m32L67p8Lq6L6
4850c9MJ05J7J05k41j88M22n09L51J92j97l1j82K48p1o3M7J76p5j11k12J78J50
4873G6p3K19k59K01j37J93m14K04J59k8k49Q8j13J95l2L67n66J78k68N08k36j90
4895a77k4M90m4l41J29o9Q4Qk23J0j1K16j29j53J99pJ29p6J98J05k38j56J38M9
4919A07r3l8k75L51k8q7k28O04m51J32K4m8j62M04k40l3l0J69K98l72J32J02j92
$$ plain form
4942 46 -76 236 -377 28 -91 121 159 27 -49 -143 -33 27 45 -79 121 -138 215 202 -192 219 286 -154 322
4965 322 183 134 -123 -3 36 171 145 28 -114 -67 -32 116 49 -165 17 -7 -211 99 -13 253 46 -241
4987 -241 154 75 145 307 161 -22 -61 5 484 148 85 -60 194 -73 128 89 387 177 29 39 117 8 37
5010 37 229 97 -81 -116 118 -204 161 106 13 -355 -162 -87 -113 121 -130 61 -142 159 137 -40 102 52 -133
5033 -133 -10 99 -294 -36 -241 -175 -35 -132 14 -4 106 -151 -187 16 176 -174 62 -57 30 -202 106 110
5055 110 -71 11 -54 -6 226 51 71 249 302 9 -128 -59 -227 -162 303 145 286 80 -281 143 -275 90
5077 90 35 -44 -173 -19 120 117 -202 191 173 208 113 32 -45 42 134 177 -117 -201 -131 -62 35 236 68 -379 -15 77
5103 77 129 66 51 37 49 179 -274 54 -157 265 -12 70 -290 -30 130 313 13 101 174 42 141 -54 68
$$ packed form
4942D6j22L12o13M05j19K12L8j32p6r4J10O0J8j24K00k59L53j3l94M11O7m40M76
4965C22j39m9k57J20L9J35k6j17j42M7L5J48o7k14J82k4k04L10j12K66k07k87
4987b41L95p9P0J62j46j83l9O6M79l36o3j45K54k67K01l9K98k10j48J0P8j09K9
5010C7J92j32j78l5K34l22L65n5r3l68J93P5k6K34k51J91k03L01k2j77J42n0j85
5033a33J23J09l93K58k05O6J40r7J46j8J10k57l6K03J60l50K36j19Q7k32L08M
5055A10j81Q2o5M8K32j75K0J78N3k93j37O9j68O5M65j58J41k06l61M24m18L65
5077I0n5p9j29J54J39ll19L93j8L5r5q1p7Q7R2M3k94q4P0O9R7K01j68m47L64R2
5103G7N2o3j5j4J2J30m53L28k11M22k77Q2l60K60J60J83l00Q8P3j32R9j95J22
$$ plain form
5126 68 42 -6 -323 -75 119 -21 18 -59 358 158 122 43 -211 -120 84 252 293 54 171 -153 -200 138 -317
5149 -317 66 94 25 -138 -102 281 -134 182 76 117 10 -161 -281 12 129 130 221 8 -64 -30 -4 -111 19
5172 19 78 34 195 -71 86 74 38 -22 -27 -249 175 131 113 103 49 -166 -183 -206 -480 -136 -176 -41 32 -105 -108 -338
5198 -338 27 -149 -63 104 -168 -102 -24 -39 -6 5 168 12 64 1 74 -123 -8 -261 375 98 -43 192 2
5221 2 -76 170 -10 87 -95 120 -60 109 288 -83 -190 53 5 -347 -101 168 -209 -192 -293 58 -12 209
5243 209 84 -49 -43 -51 71 149 169 -310 -98 127 -47 -52 -6 45 192 385 41 -245 181 151 39 -79 -53 167
5267 167 254 -40 96 59 -223 -131 199 -15 -59 10 -35 7 -146 122 1 -92 38 302 -322 34 36 79 -44 250
5291 250 72 -39 305 177 353 -30 66 115 62 145 49 -79 -60 216 25 -67 -170 -27 -168 100 -214 225
$$ packed form
5126F8k6m8l17K48J94j40L9p7M17k00l6p9k54R1K04J68M1k39J17l24m7L38m55
5149c17L83K8o9j63L6L83m15L16j06M1j07j71j20K93J17JR1k13p2L4K6j07J30
5172A9N9m4J61k66J57j2l6o0nk22M24m4j8j0n4k15j7k3k74L44m0J35P3j37lk30
5198c38L65j76Q6J67k72O6P8j5L3J1J63j56N2o3P3j97J15k53O36k77j41K35j90
5221Bp8K46j80R7j82K15j80J69J79l71j07K43m8l52K46K69l77J7j01L51p0K21
5243B09j25j33OqJ22P8K0m79K12K25j74nM6N1J47J93l44k86M26l0j12j18K6K20
5267A67Q7k94J36l7k82R2L30k14m4O9m5M2j53K68j21r3J30K64o24L56KM3j23K94
5291B50j78j11L44j28J76l83R6M9n3Q3r6j28J9K76j91r2j03J43j41K68l14M39
$$ plain form
5313 225 39 -357 -208 -11 -143 179 -117 7 -9 -68 172 -86 38 -58 287 -154 -99 120 -34 -183 166
5334 166 -150 61 156 -59 -45 315 -36 -40 -130 245 -141 70 89 161 95 -87 -119 24 207 -163 -160 -188 69 89
5358 89 -158 -78 283 137 154 195 87 -36 -165 -192 255 -9 -142 26 -419 6 207 -41 -155 131 215 193
5380 193 406 -107 -27 -104 -174 -164 -34 -170 -179 -206 74 -17 -385 -25 86 -42 -198 -324 -148 64 -83 255 106
5403 106 24 -62 -77 -207 -132 -101 -154 -9 -7 -111 -190 53 65 78 76 22 148 -56 -53 179 -49 265 314 -105 229 31
5429 31 6 -281 170 161 34 50 -330 146 167 -217 193 11 -134 -236 -36 -93 -77 -275 -193 46 102 341 67
5452 67 -152 72 64 42 50 -258 -300 -130 -136 109 -338 -14 133 -44 77 -63 212 -75 84 -1 58 -78 265 109
5476 109 -349 106 -227 -77 -68 301 -5 -18 21 -138 -6 -196 -2 -210 -61 347 -61 -152 252 181 28 -203
$$ packed form
5313B25j86l96J49J97j32L22k96J24j6n9K40k58J24r6L45m41N5K19j54j49L49
5334A66l16K11R5k15J4L60l51mr0L75l86K11J9P2o6j82l2J43J83l70Lk8K57K0
5358H9k47Q0L61j46J7M1j08j23j29k7M47k64j33J68m45M25K01k48j14K86Q4k2
5380A93K13n13Q0p7p0J0J30j36rk7K80r1l68L60J11j28j56j26J76K12j47L38j49
5403A06q2q6j5j30P5L1n3J45Kj04p9K43J2J3kn4J26k04LK32k28L14M9m19L34j98
5429C1k5k87M51rj27J6l80M76K1l84M10j82j45j02K00n7J6j98Q2K39N6K39k74
5452F7k19K24qk2Ql08m2J70oK45m47L24J47j77J21j40K75k87J59q5N9j36L43j56
5476A09m58M55l33J50RL69l06j3L9j59J32j90J94k08J49M08m08r1M04p1j53k31
$$ plain form
5498 -203 -151 -143 312 -120 90 87 169 250 -89 -137 289 -194 -30 78 178 95 66 -35 -88 265 -158 68 177 255
5522 255 30 -306 49 -15 182 -99 -3 -169 -134 179 -49 -160 -16 115 -163 -200 -78 206 224 58 -142 -199
5544 -199 10 82 86 67 -83 130 -60 -69 -94 -7 35 45 -156 -11 15 37 -174 -232 -127 92 20 34 -240 -270 12
5569 12 -369 -49 -183 233 122 -410 256 158 -85 -83 158 -141 -100 -131 95 138 -46 -49 60 -179 48 12 -92
5592 -92 42 -59 126 -195 35 110 64 141 31 -103 -99 -26 -96 20 50 -60 -155 -362 -62 25 -207 139 -256 182
5616 182 -96 193 185 119 135 -9 278 42 -223 -11 173 -115 190 -248 -251 4 -68 -119 -196 -81 -80 -68 -19 -194
5640 -194 -156 6 129 33 -133 -38 -47 -38 307 514 -156 128 -225 -30 -274 -125 21 55 199 209 18 29 5 135
5664 135 -119 -115 16 -188 273 61 -25 17 13 219 -64 -62 177 31 -96 -75 148 -27 -102 99 187 -75 83 -187
$$ packed form
5498b03N2QM55m32K10lQ2Q1l39m8M26m83J64J08J00q3k9j01n3L53m23K26J09P8
5522B55k25l36L55o4J97k81R6j66L5L13k28j11J44J31k78l7J22K84J8j66k00n7
5544a99K09P2Mj9j50K13j90rk5Q7M2J0k01J45K6K2k11n8J05K19p2J4k74l0K82
5569A2l81L20j34M16j11n32O66r8k43KK41k99M1l1K26M3j84lJ09k39K27l6j04
5592i2J34j01J85l21K30P5m6P7j10j34MP3p0J16L0j10r5k07L00Q7k32L46l95M38
5616A82k78K89qo6J6j44K87k36k65K12J84k88L05m38lK55p2n1p7J15JJ2M9j75
5640a94L8J62J23r6j66R5rRL45K07o70K84l53J95k44J49J46L4J44J0j91J1k4J30
5664A35k54MJ31k04M61k12q6M2mK06k83KK39j46j27K1K23j75p5K01Q8k62J58k70
$$ plain form
5688 -187 -215 -76 189 67 177 1 162 -45 53 40 238 -101 -61 32 34 229 207 2 -60 111 -122 -17 -37
5711 -37 257 102 -83 165 102 144 -194 175 0 -41 85 -166 78 199 -313 165 40 -234 -292 -123 95 -180
5733 -180 328 24 -256 100 -60 -5 -209 -208 -389 -252 -2 65 -261 -248 106 -36 -181 45 -161 -208 -202 98 -124
5756 -124 -31 -97 -39 -87 34 267 -288 -84 48 201 59 307 -339 56 -40 44 -243 -173 -315 324 -20 149
5778 149 189 408 -299 -74 49 -362 159 -13 -91 182 6 -236 225 -54 -249 358 389 168 -139 86 89 -3
5800 -3 -160 -429 63 20 -270 -19 85 2 352 -119 158 193 94 33 -131 173 -53 -143 -369 100 90 33 -165
5823 -165 160 44 -296 64 -272 -4 19 25 64 238 232 96 83 204 22 144 278 -7 226 157 21 -354 73
5846 73 223 112 -6 23 -1 449 42 216 3 124 156 172 48 125 7 -224 69 161 -244 -2 344 -11
$$ packed form
5688a87k8J39K65j22J10j76J61k07R8j3J98l39M0R3KJ95k2k05o2J71k33J05k0
5711c7K94j55j85K48o3M2l38L69j75m1J26k51K44J21n12M78j25k74n8J69K18k75
5733a80N08l04k80L56j60N5k04Jj81J37K50O7l26J3L54j42j45K26k06m7OL00k22
5756a24R3o6N8m8J21K33n55K04J32J53j42K48o46L95r6Q4k87P0j42O39l44J69
5778A49M0K19p07K25J23m11N21j72p8K73j76k42M61k79j95O07L1k21l07K25Lr2
5800cj57k69M92m3k90K51J04q3L50m71K77L5r9o1j64L04k26r0k26M69j0n7j98
5823a65L25j16l40L60l36K68K3OL9J74oj36j3J21j82J22J34k85K33o9j36l75M27
5846G3J50j11j18K9k4M50m07J74k13J21L2J6j24P7j18k31K93R2m05K42L46l55
$$ plain form
5868 -11 -49 178 -9 -118 -142 -20 21 74 -129 -131 -52 -66 196 -267 -56 -78 -113 121 70 180 70 100 -151 -88 363
5893 363 -144 13 -138 -123 -82 -108 104 -227 -18 272 -34 26 286 28 -226 -1 105 -251 141 175 282 39
5915 39 -138 -171 162 2 -84 -233 -167 -13 -328 -85 -121 73 -272 86 -150 -263 -17 -73 -54 -67 -372 -240 -71
5938 -71 -35 -60 -432 -157 40 -175 -43 7 145 2 -9 -181 -188 105 -190 -29 317 206 135 -102 189 90 -9
5961 -9 160 -28 -87 233 -157 67 223 158 -57 193 40 265 30 -10 -193 53 -156 -346 -98 154 11 14
5983 14 -122 115 -244 249 89 -115 -146 324 -236 -19 -36 33 233 38 116 -74 -49 195 -12 -158 -21 134
6005 134 -182 -123 -80 237 93 -50 25 -47 -78 -124 -165 -171 74 7 -33 -2 20 44 95 -107 114 157 100 27 -195 -91
$$ packed form
5868a1l8K27j87j09k4J22M1N3k03kP9j4K62m63K11k2l5K34n1J10j10L0k51O3M51
5893C63n07J57j51J5M1k6K12l31K09K90l06O0K60k58k54K25J06l56L92L4J07k43
5915C9j77l3L33j60q6j49O6J54l15K43l6J94l45L58k36j13K46n6J9j3l05J32J69
5938g1L6k5l72K75J97k15J32N0J38j43j1j72pK93k95J61L46j11p1k37K91r9r9
5961iJ69j88n9L20l90K24J56o5k15K50j53K25k35m0j83K46k09j90K48K52j43L
5983A4j36K37l59M93j60k04l1M70n60K17j7O9K00j95P8j90K5K44k07j46J37J55
6005A34l16N9M3L17j44j43P5p2l1m6m1oK45o7m0L1K2K4N1k02K21M3n7p3k22J04
$$ [...]
8191a28
##END NTUPLES=NMR FID
##END=
