##TITLE=1H_BAU-j-XN
 CDCl3, 8 sc, 
 18.12.2019
##JCAMPDX= 6.0         $$ Bruker NMR JCAMP-DX V2.0
##DATA TYPE= NMR FID
##DATA CLASS= NTUPLES
##ORIGIN= UXNMR, Bruker Analytische Messtechnik GmbH
##OWNER= root
$$ XWIN-NMR		Version 3.5
$$ Wed Dec 18 15:42:36 2019 Russian Standard Time (UT+4h)  she@DPX200
##.OBSERVE FREQUENCY= 200.1315
##.OBSERVE NUCLEUS= ^1H
##.DELAY= (6, 6)
##.ACQUISITION MODE= SIMULTANEOUS
##.ACQUISITION SCHEME= undefined
##.AVERAGES= 8
##.DIGITISER RES= 18
##SPECTROMETER/DATA SYSTEM= spect
##.PULSE SEQUENCE= zg30
##.SOLVENT NAME= CDCl3
##.SHIFT REFERENCE= (INTERNAL, CDCl3, 0, 15.7039)
##AUDIT TRAIL= $$ (NUMBER, WHEN, WHO, WHERE, WHAT)
$$ ##TITLE= Audit trail, XWIN-NMR		Version 3.5
$$ ##JCAMPDX= 5.01
$$ ##ORIGIN= Bruker BioSpin GmbH
$$ ##OWNER= she
$$ F:/spectra/data/she/nmr/H-F/1/audita.txt
$$ ##AUDIT TRAIL=  $$ (NUMBER, WHEN, WHO, WHERE, WHAT)
(   1,<2019-12-18 15:40:53.32 +0400>,<she>,<DPX200>,
      <created by zg, POWCHK disabled, PULCHK disabled
       configuration hash MD5:
       00 E9 B6 7A A2 85 ED C7 34 08 36 98 17 FE 4E 26
       data hash MD5: 16K
       70 B3 E3 C6 B0 ED 6E F5 3F FF 6C 77 2D E0 68 33>)
$$ ##END=
$$ 
$$ hash MD5
$$ 55 70 D5 E2 BA 9A D8 F5 02 E1 1F 02 AA B3 00 41
##$RELAX= 
##$RELAX= 
##$RELAX= 
##$RELAX= 
##$RELAX= 
##$RELAX= 
$$ Bruker specific parameters
$$ --------------------------
##$DU= <F:/spectra>
##$EXPNO= 1
##$NAME= <H-F>
##$PROCNO= 1
##$TYPE= <nmr>
##$USER= <she>
##$AMP= (0..31)
100 100 100 100 100 100 100 100 100 100 100 100 100 100 100 100 100 100 
100 100 100 100 100 100 100 100 100 100 100 100 100 100 
##$AQSEQ= 0
##$AQ_mod= 1
##$AUNM= <au_zg>
##$AUTOPOS= <>
##$BF1= 200.13
##$BF2= 200.13
##$BF3= 200.13
##$BF4= 200.13
##$BF5= 200.13
##$BF6= 200.13
##$BF7= 200.13
##$BF8= 200.13
##$BYTORDA= 1
##$CFDGTYP= 0
##$CFRGTYP= 5
##$CHEMSTR= <none>
##$CNST= (0..31)
1 1 145 1 1 1 1 1 1 1 1 1 1 1 1 1 1 1 1 1 1 1 1 1 1 1 1 1 1 1 1 1 
##$CPDPRG= <>
##$CPDPRG1= <>
##$CPDPRG2= <>
##$CPDPRG3= <>
##$CPDPRG4= <mlev>
##$CPDPRG5= <mlev>
##$CPDPRG6= <mlev>
##$CPDPRG7= <mlev>
##$CPDPRG8= <mlev>
##$CPDPRGB= <>
##$CPDPRGT= <>
##$D= (0..31)
0 1.2 0 0 0 0 0 0 0 0.06 0 0.03 0 0 0 0 0.0002 0 0 0 0 0 0 0 0 0 0 0 0 
0 0 0 
##$DATE= 1576669252
##$DBL= (0..7)
120 120 120 120 120 120 120 120 
##$DBP= (0..7)
150 150 150 150 150 150 150 150 
##$DBP07= 0
##$DBPNAM0= <>
##$DBPNAM1= <>
##$DBPNAM2= <>
##$DBPNAM3= <>
##$DBPNAM4= <>
##$DBPNAM5= <>
##$DBPNAM6= <>
##$DBPNAM7= <>
##$DBPOAL= (0..7)
0.5 0.5 0.5 0.5 0.5 0.5 0.5 0.5 
##$DBPOFFS= (0..7)
0 0 0 0 0 0 0 0 
##$DE= 6
##$DECBNUC= <off>
##$DECIM= 24
##$DECNUC= <off>
##$DECSTAT= 4
##$DIGMOD= 1
##$DIGTYP= 9
##$DL= (0..7)
0 120 120 120 120 120 120 120 
##$DP= (0..7)
150 150 150 150 150 150 150 150 
##$DP07= 0
##$DPNAME0= <>
##$DPNAME1= <>
##$DPNAME2= <>
##$DPNAME3= <>
##$DPNAME4= <>
##$DPNAME5= <>
##$DPNAME6= <>
##$DPNAME7= <>
##$DPOAL= (0..7)
0.5 0.5 0.5 0.5 0.5 0.5 0.5 0.5 
##$DPOFFS= (0..7)
0 0 0 0 0 0 0 0 
##$DQDMODE= 0
##$DR= 18
##$DS= 0
##$DSLIST= <SSSSSSSSSSSSSSS>
$$ [...]
##$SUBNAM2= <"">
##$SUBNAM3= <"">
##$SUBNAM4= <"">
##$SUBNAM5= <"">
##$SUBNAM6= <"">
##$SUBNAM7= <"">
##$SUBNAM8= <"">
##$SUBNAM9= <"">
##$SW= 24.9337058887773
##$SWIBOX= (0..15)
0 0 2 0 0 0 0 0 0 0 0 0 0 0 0 0 
##$SW_h= 4990.01996007984
##$TD= 16384
##$TD0= 1
##$TE= 0
##$TE2= 300
##$TE3= 300
##$TEG= 300
##$TL= (0..7)
0 120 120 120 120 120 120 120 
##$TP= (0..7)
150 150 150 150 150 150 150 150 
##$TP07= 0
##$TPNAME0= <>
##$TPNAME1= <>
##$TPNAME2= <>
##$TPNAME3= <>
##$TPNAME4= <>
##$TPNAME5= <>
##$TPNAME6= <>
##$TPNAME7= <>
##$TPOAL= (0..7)
0.5 0.5 0.5 0.5 0.5 0.5 0.5 0.5 
##$TPOFFS= (0..7)
0 0 0 0 0 0 0 0 
##$TUNHIN= 0
##$TUNHOUT= 0
##$TUNXOUT= 0
##$USERA1= <user>
##$USERA2= <user>
##$USERA3= <user>
##$USERA4= <user>
##$USERA5= <user>
##$V9= 5
##$VALIST= <valist>
##$VCLIST= <CCCCCCCCCCCCCCC>
##$VD= 0
##$VDLIST= <DDDDDDDDDDDDDDD>
##$VPLIST= <PPPPPPPPPPPPPPP>
##$VTLIST= <TTTTTTTTTTTTTTT>
##$WBST= 1024
##$WBSW= 4
##$XGAIN= (0..3)
0 0 0 0 
##$XL= 0
##$YL= 0
##$YMAX_a= 162317
##$YMIN_a= -125844
##$ZGOPTNS= <>
##$ZL1= 120
##$ZL2= 120
##$ZL3= 120
##$ZL4= 120
##$ABSF1= 10
##$ABSF2= 0
##$ABSG= 5
##$ABSL= 3
##$ALPHA= 0
##$AQORDER= 0
##$ASSFAC= 0
##$ASSFACI= 0
##$ASSFACX= 0
##$ASSWID= 0
##$AUNMP= <proc_1d>
##$AZFE= 0.1
##$AZFW= 0.1
##$BCFW= 1
##$BC_mod= 2
##$BYTORDP= 1
##$COROFFS= 0
##$CY= 11.3945322036743
##$DATMOD= 1
##$DC= 2
##$DFILT= <>
##$DTYPP= 0
##$F1P= 16.9975609425685
##$F2P= -3.02152046262296
##$FCOR= 0.5
##$FTSIZE= 0
##$FT_mod= 4
##$GAMMA= 1
##$GB= 0.15
##$INTBC= 1
##$INTSCL= 1
##$ISEN= 128
##$LB= 0.24
##$LEV0= 0
##$LPBIN= 0
##$MAXI= 10000
##$MC2= 0
##$MEAN= 0
##$ME_mod= 0
##$MI= 1.114404
##$NCOEF= 0
##$NC_proc= 0
##$NLEV= 6
##$NOISF1= 3.799351
##$NOISF2= 2.8
##$NSP= 1
##$NTH_PI= 0
##$NZP= 0
##$OFFSET= 15.70392
##$PC= 1
##$PHC0= -10147.93
##$PHC1= 16.80082
##$PH_mod= 1
##$PKNL= yes
##$PPARMOD= 0
##$PSCAL= 0
##$PSIGN= 0
##$REVERSE= no
##$SF= 200.130013532006
##$SI= 16384
##$SIGF1= 3
##$SIGF2= 2
##$SINO= 400
##$SIOLD= 16384
##$SREGLST= <1H.CDCl3>
##$SSB= 0
##$STSI= 0
##$STSR= 0
##$SW_p= 3612.71676300578
##$SYMM= 0
##$S_DEV= 0
##$TDeff= 0
##$TDoff= 0
##$TI= <>
##$TILT= no
##$TM1= 0
##$TM2= 0
##$TOPLEV= 0
##$USERP1= <user>
##$USERP2= <user>
##$USERP3= <user>
##$USERP4= <user>
##$USERP5= <user>
##$WDW= 1
##$XDIM= 8192
##$YMAX_p= 0
##$YMIN_p= 0
$$ End of Bruker specific parameters
$$ ---------------------------------
##NTUPLES= NMR FID
##VAR_NAME=  TIME,          FID/REAL,        FID/IMAG
##SYMBOL=    X,             R,               I
##VAR_TYPE=  INDEPENDENT,   DEPENDENT,       DEPENDENT
##VAR_FORM=  AFFN,          ASDF,            ASDF
##VAR_DIM=   8192,          8192,            8192
##UNITS=     SECONDS,       ARBITRARY UNITS, ARBITRARY UNITS
##FACTOR=    0.0002004,     1,               1
##FIRST=     0,             0,               0
##LAST=      1.6414764,     0,               0
##MIN=       0,             -125844,         0
##MAX=       1.6414764,     162317,          0
$$ Real data points
##PAGE= N=1
##DATA TABLE= (X++(R..R)), XYDATA
$$ [...]
$$ plain form
1932 340 348 387 -222 621 483 307 -77 250 542 -76 499 569 366 -500 437 863 1 -193 165 708 113
1953 113 315 15 146 -58 47 -229 305 16 51 417 162 -446 129 767 465 -730 -529 646 115 -336
1973 -336 35 -143 -462 -150 181 -442 -926 -28 238 -196 -448 -524 -378 -174 -254 -708 -744 -189 -349 -415 -192
1994 -192 -305 -507 143 -128 -1025 -418 354 -125 -755 -186 -227 -374 -187 -227 -97 -714 234 85 -533 -443 -120
2015 -120 337 219 -487 -379 376 332 -313 -340 363 -23 -80 263 422 8 -511 755 308 -590 94 527 440
2036 440 -92 299 229 -28 56 328 376 112 245 389 636 329 103 602 1130 428 -459 767 572 -59 502
2057 502 403 -21 -173 432 357 -181 -59 738 240 103 -37 402 264 8 118 -93 -117 485 343 78 25
2078 25 72 295 287 -201 -445 550 115 -175 -292 58 -178 -373 -41 333 -466 -377 389 177 -655 -211 27 196
$$ packed form
1932C40QL9o09Q43j38j76l84L27K92o18N75P0k03q66R37M26q62j94L58N43n95
1953A13K02l00J31k04J05k76N34k89L5L66k55o08N75O38l02j195K01J175n31m51
1973c36L71j78l19L12L31o23m84Q98K66m34k52p6J46K04q0m54l6N55j60o6K23
1994a92j13k02O50k71q97O07P72m79o30N69m1j47J87m0J30o17R48j49o18R0L23
2015a20M57j18p06J08P55m4o45k7P03l86n7L43J59m14n19J266m47q98O84M33q7
2036D40n32L91p0k57Q4K72M8k64J33J44K47l07k26M99N28p02q87J226j95o31N61
2057E02r9m24j52O05p5n38J22P97m98j37j40M39j38k56J10k11k4O02j42k65n3
2078B5M7K23qm88k44R95m35k90j17L50k36j95L32L74p99Q9P66k12q32M44K38J69
$$ plain form
2100 196 -518 -681 -113 125 -166 -412 -8 -302 -345 -174 -300 -219 -955 120 191 -762 -359 -62 13 -639 -210
2121 -210 7 -336 -44 -153 -107 -95 -185 -226 -141 -349 -415 -171 28 -183 -486 -9 229 -176 -441 107 -23 -667
2143 -667 -71 268 -405 -401 742 445 -689 -353 272 178 43 309 67 -115 -94 515 295 -279 -168 88 622
2164 622 13 -633 387 844 -196 -533 507 521 51 165 531 51 28 580 683 -37 -64 791 547 193
2184 193 -186 324 481 480 41 153 135 -117 22 547 330 -317 95 616 116 -466 228 508 -46 -422 507
2205 507 303 -303 120 353 77 -378 54 235 -150 -47 -143 -59 40 -313 -414 156 -171 -432 54 -58 -343
2226 -343 -241 105 -266 -567 -76 478 -455 -777 176 212 -331 -418 101 -89 -555 -532 -44 -93 -321 -41 62
2247 62 -75 -538 104 419 -117 -535 -262 -116 -307 -334 57 13 -728 19 553 -540 -482 204 516 -80 -300
$$ packed form
2100A96p14j63N68K38k91k46M04k94m3J71j26Q1p36J075P1r53M03K97P5o52M29
2121b10K17l43K92j09M6J2r0m1Q5k08o6K44J99k11l03M77K38m05k65N48j30o44
2143f67N96L39o73MJ143k97j134L36O25r4j35K66k42j82K1O09k20n74J11K56N34
2164F22o09o46J020M57j040l37J040J4m70J14L66m80k3N52J03p20k7Q55k44l54
2184A93l79N10J57jm39J12j8k52J39N25k17o47M12N21n00n82O94K80n54l76R29
2205E07k04o06M23K33k76m55M32J81l85J03r6Q4R9l53j01N70l27k61M86j12k85
2226c43J02L46l71l01M91N54r33l22R53L6n43q7N19j90m66K3M88m9k28K80J03
2247F2j37m63O42L15n36m18K73J46j91k7L91m4p41P47N34j093N8O86L12n96k20
$$ plain form
2268 -300 26 100 225 -137 -182 48 228 127 13 -201 -469 -78 241 212 -332 35 451 139 -40 -48 293 -343
2290 -343 141 552 160 -266 266 749 55 -163 646 448 319 197 89 311 259 205 230 309 -40 -286 494
2311 494 451 73 311 604 178 -189 160 470 183 -405 111 433 -138 187 405 60 -367 553 165 147 -358
2332 -358 0 123 398 -195 -41 44 219 -69 62 -58 -209 -112 420 263 -345 55 458 -162 -303 139 322
2353 322 -130 -51 -252 -8 -105 -84 -95 1 -155 142 355 194 -490 -439 189 -167 -464 -339 37 -56 -447 -48
2375 -48 161 -630 -65 215 -286 -303 -55 321 -414 -478 -458 -20 -116 -126 -242 -138 24 -526 -328 108 -573 -713
2397 -713 131 315 -702 -500 252 245 -412 -425 -159 -235 -309 284 29 50 -209 -75 -71 -150 64 -40 406 84 -478
2420 -478 -69 534 -85 -362 -46 160 -172 472 262 -105 -172 147 367 -77 -113 389 81 104 248 161 95 258
$$ packed form
2268c00L26P4J25l62m5K30J80j01j14k14k68L91L19k9n44L67M16l12j79qL41o36
2290c43M84M11l92m26N32M83o94k18Q09j98j29j22j08K22n2n4K5P9l49k46P80
2311D94m3l78K38K93m26l67L49L10k87n88N16L22n71L25K18l45m27R20l88j8n05
2332c58L58J23K75n93J54Q5J75k88J31j20j51R7N32j57o08M00M03o20j41M42J83
2353C22m52P9k01K44r7K1j1R6j56K97K13j61o84N1O28l56k97J25L76r3l91L99
2375d8K09p91N65K80n01j7K48L76p35o4K0M38r6j0j16J04J62n50J98M36o81j40
2397g13Q44J84j017K02P52po57j3K66p6p4N93k55K1k59J34Mp9K14j04M46l22n62
2420d78M09O03o19k77L16K06l32O44k10l67o7L19K20m44l6N02l08K3J44q7o6J63
$$ plain form
2442 258 364 270 400 57 328 447 67 -34 282 472 262 -209 432 393 -25 217 242 -46 -97 483 525 -46
2464 -46 140 473 181 -158 -57 628 36 -128 -303 198 -19 -10 -157 40 155 -520 -135 325 -199 -604 -259
2485 -259 184 -441 -272 155 -212 -197 -181 27 -170 -155 -113 -217 -315 -454 -252 -422 -69 -318 -270 18 -234 -327
2507 -327 -105 -417 -421 -150 175 -74 -651 -24 63 -497 -435 134 133 -502 7 324 -308 -288 -117 36 39 -107 -27
2530 -27 43 -33 -131 177 232 192 -344 194 133 120 -192 72 178 -164 227 388 -56 -107 390 89 79 3 197 272
2554 272 85 34 432 191 109 84 316 282 348 281 96 392 -98 195 416 116 -310 349 696 143 145 564 -62
2577 -62 -63 -14 404 4 -118 -5 347 80 -123 150 129 120 8 124 65 257 55 30 47 78 -264 407 312 -458
2601 -458 65 634 -71 -135 -83 -79 -219 8 49 -80 -277 -83 124 -117 -217 -571 -300 86 -295 -281 -25 -124
$$ packed form
2442B58J06r4J30l43K71J19l80j01L16J90k10m71O41l9m18K42K5k88n1N80M2n71
2464d6J86L33k92l39J01O85n92j64j75N01k17Rj47J97J15o75L85M60n24m05L45
2485b59M43o25J69M27l67J5J6K08j97J5M2j04r8j39K02j70L53k49M8K88k52r3
2507c27K22l12mK71L25k49n77O27Q7n60O2N69jo35N09L17o32K0J71J53Lj46Q0
2530b7P0p6r8L08N5m0n36N38o1j3l12K64J06l42L91J61m44n1M97l01j0p6J94P5
2554B72j87n1L98k41q2k5K32l4O6o7j85K96m90K93K21l00m26O59L47n53KM19o26
2577f2jM9M18m00j22J13L52k67k03K73k1rj12J16n9J92k02k5J7L1l42O71r5p70
2601d58N23N69p05o4N2Mj40K27M1j29j97J94K07k41j00l54K71L86l81J4K56r9
$$ plain form
2623 -124 -324 -117 189 -158 -466 -46 -35 -453 -242 263 -137 -547 -290 -76 -18 165 -62 19 -18 -266 -63
2644 -63 -94 -97 -220 -37 58 -160 41 144 77 -354 -194 335 128 -287 90 287 -305 -205 151 -522 11 91
2666 91 189 -201 -119 162 -33 -119 267 -147 15 -24 -96 -131 141 194 -180 297 191 181 -54 301 123 99 249
2689 249 546 -92 -63 119 209 45 61 587 317 249 -49 387 321 210 -308 -56 376 257 66 230 213 -8
2711 -8 -116 336 113 -102 366 64 -431 -39 388 212 -222 17 -7 -121 298 96 -125 -28 -211 13 184
2732 184 137 -137 38 75 56 -468 -182 319 -220 84 126 -116 -219 116 226 15 -158 248 30 -271 -315 -74
2754 -74 -271 -269 -184 37 -46 -210 -83 -422 -291 -184 -164 -184 -304 -673 -165 -192 -167 -330 97 8 -360 -151 413
2777 413 -33 -319 97 -153 -274 -24 -122 -191 -11 -118 -197 310 33 -243 -217 149 -197 -113 117 -31 -357 26
$$ packed form
2623a24k00K07L06l47l08M20J1m18K11N05m00m10K57K14N8J83k27Q1l7k48K03
2644f3l1lj23J83R5k18K01J03o7m31J60N29k07m15L77J97n92J00L56o73N33Q0
2666I1R8l90Q2K81j95q6L86m14J62l9p2l5K72N3l74M77j06j0k35L55j78k4J50
2689B49K97o38K9J82R0j64J6N26k70o8k98M36o6j11n18K52M32j19j91J64j7k21
2711hj08M52k23k15M68l02m95L92M27j76m34K39k4j14M19k02k21R7j83K24J71
2732A84m7k74J75L7j9n24K86N01n39L04M2k42j03L35J10k11j73M06k18l01m4K41
2754g4j97KQ5K21q3j64J27l39J31J07K0k0j20l69N08k7K5j63M27q9l68K09N64
2777D13m46k86M16k50j21K50r8o9J80j07p9N07k77k76K6L66l46Q4K30j48l26L83
$$ plain form
2799 26 406 29 -151 133 258 -286 329 67 -160 13 375 164 136 -237 -17 246 -81 -110 242 378 48
2820 48 -77 5 401 151 -269 194 149 -426 154 363 303 45 374 402 -625 254 226 120 98 94 19 252 -49
2843 -49 263 354 4 239 -81 -39 357 -102 74 224 267 -188 3 26 -133 19 223 107 -131 -2 220 238
2865 238 -73 218 26 -235 -135 -35 211 -94 91 -222 -232 189 -145 97 128 -157 -299 -106 139 -209 -117
2886 -117 239 -317 -358 -183 189 -302 -295 5 -87 -209 -158 -164 -201 26 -416 -423 -105 -73 -435 70 47 -294 -17 -106
2910 -106 67 -430 -99 -119 -316 -218 -87 -415 -253 194 -104 -124 -330 142 91 -111 -172 -184 0 -133 218 140
2932 140 -31 1 -110 442 16 -380 -127 24 -35 11 214 362 213 51 339 0 -159 231 144 91 -56 39
2954 39 196 211 353 127 100 181 -26 383 413 66 -155 322 429 38 80 135 479 -120 -15 248 147 28
$$ packed form
2799B6L80l77j80K84J25n44O15k62k27J73L62k11k8l73K20K63l27k9L52J36l30
2820D8j25Q2L96k50m20M63m5n75N80K09o0k58L29K8j027Q79k8j06k2mp5K33l01
2843d9L12R1l50K35l20M2L96m59J76J50M3m55J91K3j59J52K04j16k38J29K22J8
2865B38l11K91j92k61J00J00K46l05J85l13j0M21l34K42L1k85j42J93K45l48R2
2886a17L56n56m1J75L72m91PL00r2j22N1ol7K27m42pL18L2l62N05k3l41K77q9
2910a06J73m97L31k0j97R8J31l28J62M47k98k0k06M72n1k02o1j2J84j33L51p8
2932A40j71L2j11N52m26l96K53J51n9M6K03J48j49j62K88l39j59L90q7n3j47R5
2954C9J57J5J42k26k7Q1k07M09L0l47k21M77J07l91M2N5L44n99J05K63j01j19
$$ plain form
2976 28 271 462 -95 158 349 4 24 39 66 23 -147 6 -51 167 -221 -16 180 206 -197 46 17 -171 -274
2999 -274 126 164 -210 -15 208 125 -308 -39 -197 -257 -139 -77 -433 -306 0 -67 -79 -249 -89 -52 116 -335
3021 -335 -418 -259 -61 27 -216 -337 -268 -133 -189 49 163 -75 198 -48 -83 -32 -198 -119 -185 -98 86 -317 107
3044 107 189 224 165 -328 -242 41 112 -443 122 204 -192 7 101 93 -334 -6 -35 -261 -159 161 325 343 -195 251
3068 251 302 93 245 84 220 126 27 24 -153 -57 35 141 -230 -39 122 370 206 -219 190 375 116 -80
3090 -80 396 83 -173 231 362 4 52 238 633 35 -58 -291 16 450 -277 62 254 191 -136 234 152 -197
3112 -197 101 158 108 -60 -173 97 115 -486 90 224 -261 33 -56 -85 -81 -39 19 -40 -69 -101 44 -126 -285 -278 347
3137 347 -275 -393 -207 371 -168 -228 300 -82 -560 -143 -34 -2 47 -284 -54 -74 28 147 -461 -299 -43
$$ packed form
2976B8K43J91n57K53J91l45K0J5K7m3j70J53n7K18l88K05J96K6m03K43k9j88j03
2999b74M00L8l74J95K23q3m33K69j58o0J18O2l56J27L06o7j2j70J60L7J68m51
3021c35q3J59J98Q8k43j21O9J35n6K38J14k38K73k46l5N1j66P9o6Q7J84m03M24
3044A07Q2L5n9m93Q6K83P1n55N65Q2l96J99R4qm27L28k9k26J02L20J64J8n38M46
3068B51N1k09J52j61J36r4r9lj77R6R2J06l71J91J61K48j64m25M09J85k59j96
3090h0M76l13k56M04J31l58M8J86L95n98r3k33L07M34p27L39J92o3l27L70q2l49
3112a97K98N7n0j68j13K70J8o01N76J34m85K94q9k9MM2N8n9k9l2J45j70j59PO25
3137C47o22j18J86N78n39o0N28l82m78M17J09L2M9l31K30k0J02J19o08J62K56
$$ plain form
3158 -43 -3 -145 34 -173 -358 -206 -331 -393 68 9 -266 -80 -9 -216 -251 -85 246 -250 -20 548 -77 -303
3180 -303 -108 -125 -309 126 -52 -20 56 56 -101 126 -70 175 -116 179 159 203 231 -116 -16 -121 156 105 96 -125
3204 -125 202 14 370 -11 14 80 154 -40 -7 23 194 65 177 -19 45 176 41 -39 49 111 -31 -123 -170 275
3228 275 -77 -93 135 219 -216 -176 524 -53 55 276 139 12 -83 132 -52 -273 94 -20 -113 -106 -107 19 186
3251 186 -146 -51 167 197 -74 -174 277 -268 58 74 3 -181 -228 361 161 -108 -238 -120 -110 264 -223 -67
3273 -67 365 328 -91 22 -256 -378 -129 115 -159 -244 44 38 112 -262 188 -168 -347 -43 113 -29 -143 -16
3295 -16 -30 -76 2 -65 201 0 28 130 106 177 -109 -46 91 -102 -45 184 134 -326 -26 145 153 -233 67 207
3319 207 -231 291 -101 -235 160 -30 31 39 270 -123 27 106 -64 -15 131 -251 -74 141 286 37 19 182
$$ packed form
3158d3M0j42J79k07j85J52j25o2M61n9k75J86P1k07l5J66L31m96K30N68o25k26
3180c03J95j7j84M35j78L2P6%j57K27j96K45k91K95k0M4K8l47J00j05K77n1rk21
3204a25L27j88L56l81K5O6P4j94L3L0J71j29J12j96O4J31j35q0Q8O2j42r2m7M45
3228B75l52j6K28Q4m35M0P00n77J08K21j37j27r5K15j84k21L67j14r3PjJ26J67
3251A86l32R5K18L0k71j00M51n45L26J6p1j84m7N89k00k69j30J18J0L74m87J56
3273f7M32l7m19J13k78j22K49K44k74q5K88oP4l74M50l56j79L04J56j42j14J27
3295a6j4m6P8o7K66k01K8J02k4P1k86O3J37j93N7K29n0m60L00J71Ql86L00J40
3319B07m38N22l92j34L95j90O1QK31l93J50P9j70M9J46l82J77K15J45k49j8J63
$$ plain form
3341 182 100 -280 77 715 88 -65 88 -21 -51 423 109 344 -22 103 54 337 115 133 391 254 10
3362 10 -236 316 115 101 -250 195 108 -10 -24 123 22 -217 213 -284 23 58 -199 -223 -158 122 398 235
3384 235 -94 107 -11 216 2 -188 246 -226 -294 -92 37 -140 -139 32 -450 -411 81 -60 -183 72 54 -124
3406 -124 -683 21 42 -19 -430 50 51 -38 126 -108 -76 60 -284 -144 -211 -250 196 -135 78 213 188 -152 -167
3429 -167 -211 -103 16 -128 -218 102 -167 -151 -198 31 43 -184 136 -291 -32 168 -133 370 294 -9 -108 81
3451 81 -61 -364 -219 91 53 -172 184 252 -112 -44 16 9 142 -22 43 84 -71 -46 336 461 254 -7 35 204
3475 204 -131 86 230 -327 -130 -17 317 -176 162 58 -104 2 95 -133 155 -155 25 312 5 -16 240
3496 240 264 -116 -55 -39 -84 167 142 -14 44 164 -153 -132 -126 -239 -112 -73 163 -315 62 -52 -75 33 58 -80
$$ packed form
3341A82q2l80L57O38o27j53J53j09l0M74l14K35l66J25m9K83k22J8K58j37k44
3362A0k46N52k01j4l51M45q7j18j4J47j01k39M30m97L07L5k57k4O5K80K76j63
3384B35l29K01j18K27k14j90M34m72o8K02J29j77JJ71m82L9M92j41j23K55j8j78
3406a24n59P04K1o1m11M80Jq9J64k34L2J36l44J40o7l9M46l31K13J35k5l40j5
3429a67m4J08J19j44r0L20k69J6m7K29J2k27L20m27K59K00l01N03p6l03r9J89
3451H1j42l03J45L10l8k25L56O8l64O8O0pJ33j64O5M1j55K5L82J25k07k61M2J69
3475B04l35K17J44n57J97J13L34m93L38j04j62J06R3k28K88l10J80K87l07k1K56
3496B40K4l80O1J6m5K51k5j56N8J20l17K1Oj13J27L9K36m78L77j14k3J08K5j38
$$ plain form
3520 -80 -387 -132 94 105 -180 -189 106 58 -184 -220 12 69 -141 -25 -60 -242 -94 -13 -58 -26 -20 8 -173 -197 -153
3545 -153 31 -403 -190 323 -70 -283 -134 155 31 -117 50 -207 139 40 -109 -215 375 -72 105 235
3565 235 -109 40 -114 156 263 -145 9 -24 -266 87 367 -64 -113 -77 -217 138 -139 -81 183 80 -245
3586 -245 188 97 233 -151 237 75 -76 -28 -30 98 -151 -219 301 152 -136 -60 196 103 255 25 -79 232
3608 232 205 141 -10 -130 40 348 180 148 107 237 52 398 281 40 -31 -127 180 58 14 157 -75 -43 5
3631 5 143 124 -147 132 251 47 -180 191 -59 228 -141 204 5 116 -74 162 228 126 121 -182 -31 -2
3653 -2 -352 74 91 -212 -261 55 -54 -229 33 -61 -155 403 15 101 211 -58 -186 -325 -38 161 -101 -215
3675 -215 198 -12 9 -29 -156 -56 39 -10 -3 364 16 194 -210 -97 -7 -239 87 77 131 -164 12 -51 48 38
$$ packed form
3520h0l07K55K26J1k85rK95m8k42l6K32N7k10J16l5j82J48Q1m5L2OK8j81k4M4
3545a53J84m34K13N13l93k13J49K89j24j48J67k57L46r9j49j06N90m47J77J30
3565B35l44J49j54K70J07m08J54l3k42L53K80m31m9L6j40L55k77N8K64j03l25
3586b45M33r1J36l84L88j62j51M8kJ28k49o8N20j49k88P6K56r3J52k30j04L11
3608B32k7o4j51j20J70L08j68l2m1J30j85L46j17k41p1r6L07j22m4J43k32L2M8
3631EJ38j9k71K79J19k04k27L71k50K87l69L45j99J11j90K36O6j02nl03J51K9
3653bl50M26J7l03m9L16j09j75K62r4r4N58l88Q6J10k69j28j39K87J99k62j14
3675b15M13k10K1l8j27J00R5m9PL67l48J78m04J13R0k32L26j0N4k95J76o3R9j0
$$ plain form
3699 38 61 162 75 -174 -119 32 -20 -69 83 236 -147 -185 150 496 -245 -329 337 -83 -12 319 -73 299 -261
3722 -261 62 115 133 186 298 133 34 13 211 -77 437 487 74 -91 62 77 534 274 -145 77 313 372 21
3745 21 47 206 -80 188 8 48 127 -35 7 31 313 149 291 -267 -272 208 -31 -142 -180 -177 10 50 -349 34
3769 34 182 -2 -9 156 -36 -164 181 -91 -66 137 120 -256 -90 60 -9 2 26 -2 32 11 59 -275 73 -45
3793 -45 -174 31 -186 -194 -333 -24 -229 -84 -158 44 -30 -182 1 77 -324 -71 179 222 -218 29 -91 -488
3815 -488 -7 -299 -54 -182 -121 -51 117 -31 -119 54 128 -211 -39 53 168 89 -131 99 156 -100 38 108 273
3838 273 -88 -255 -252 -338 153 -176 -140 -62 -85 77 354 59 -211 81 122 13 79 115 -24 11 -84 216 165 120
3862 120 272 164 -343 214 94 152 -14 -79 -208 329 -125 94 66 53 -7 143 227 215 -165 -42 117 -7
$$ packed form
3699C8K3J01q7k49N5J51n2m9J52J53l83l8L35L46p41q4O66m20P1L31l92L72n60
3722b61L23N3J8N3J12j65r9k1J98k88N14N0m13j65J53J5M57k60m19K22K36N9l51
3745B1K6J59k86K68j80M0P9j62M2K4K82j64J42n58nM80k39j11l8LJ87M0l99L83
3769C4J48j84pJ65j92j28L45k72K5K03j7l76J66J50o9J1K4k8L4k1M8l34L48j18
3793d5j29K05k17qj39L09k05J45p4K02p4j52J83P6m01K53K50M3m40K47j20l97
3815d88M81k92K45j28O1P0J68j48q8J73P4l39J72R2J15p9k20K30N7k56J38P0J65
3838B73l61j67Lq6M91l29L6P8k3J62K77k95k70K92M1j09O6L6j39L5r5L00n1m5
3862A20J52j08n07N57j20N8j66o5j29N37m54K19k8j3o0J50Q4j2l80J23J59j24
$$ plain form
3884 -7 219 84 -10 -119 -10 194 127 -165 75 95 38 264 221 294 165 44 49 -58 260 -266 9 64 -237 -102
3908 -102 22 84 59 -49 78 151 39 75 121 101 53 161 352 -128 -100 -65 -199 38 -150 -7 -108 76 61
3931 61 3 -172 45 -85 223 -82 -45 -20 -11 12 75 -163 -95 -156 -147 100 -326 -326 -40 -96 -111 11 175 68 -217
3956 -217 -136 -166 35 -120 -25 14 103 -141 0 -94 112 -66 -207 414 346 -169 241 121 -3 18 35 69 -1 57
3980 57 154 -61 112 -16 541 -47 235 -44 276 407 61 150 180 -70 -127 319 15 -106 78 305 -16 -38
4002 -38 -9 178 129 82 99 77 86 -68 256 90 -115 293 123 -245 -51 -11 80 34 -6 36 -70 -83 -166 102 175
4027 175 -80 228 240 -88 -145 121 384 -282 -137 110 36 -305 34 -346 -140 128 -197 -111 -178 -27 -254 -51
4049 -51 -80 -80 -130 62 83 -235 -153 35 -261 143 187 -122 -260 188 -19 -42 141 -96 -91 -257 -67 -166 -21 -95
$$ packed form
3884gK26j35r4j09J09K04o7k92K40K0n7K26m3P3j29j21Nj07L18n26K75N5l01J35
3908a02J24O2k5j08J27P3j12L6M6k0m8J08J91m80K8L5j34K37j88J43j01J84j5
3931F1n8j75K17j30L08l05L7K5RK3O3k38O8o1RK47m26%K86n6j5J22J64j07k85
3956b17Q1l0K01j55R5L9Q9k44J41r4K06j78j41O21o8n15M10j20j24K1J7L4p0N8
3980E7R7k15J73j28N57n88K82k79L20J31l46Q9L0k50n7M46l04j21J84K27l21k2
4002c8K9J87m9m7J7k2Rj54L24j66k05M08j70l68J94M0R1m6m0M2j06j3q3K68P3
4027A75k55L08J2l28n7K66K63o66J45K47p4l41L39l80K06K68l25Q6o7J51k27K03
4049e1k9%n0J92K1l18Q2J88k96M04M4l09j38M48k07k3J83k37Nj66J90r9J45p4
$$ plain form
4073 -95 94 -285 -63 -89 219 -211 -145 -138 301 -46 -275 11 -137 -245 94 -144 -334 233 -67 -10 229 -32
4095 -32 103 -168 142 -194 -418 102 -37 139 232 -69 -63 139 155 -7 210 270 -33 158 268 -266 -42 52
4117 52 78 -50 26 50 -110 230 -199 10 143 47 35 259 67 -130 -18 -21 -19 104 297 -85 320 -54 302
4140 302 141 28 -280 181 39 -1 390 68 -374 10 190 9 -49 -269 -123 -126 36 -49 248 -68 -65 -5 -93
4163 -93 199 -1 -16 40 -110 -14 -28 -56 17 -14 201 110 -9 -161 245 -195 -209 -19 -117 105 -18 -169 -331 -81
4187 -81 195 -90 -165 -106 59 36 -118 143 100 96 156 -233 -267 -127 -67 -332 -112 -219 -184 -183 -19 38 -26 45 31 88
4213 88 -127 275 26 -161 -142 -2 148 50 -262 -73 66 -43 144 6 -257 183 -28 261 -84 143 -39
4234 -39 103 -311 150 209 114 -92 1 78 201 -57 95 51 145 -21 86 251 -51 55 -1 333 -141 -144 134
$$ packed form
4073i5J89l79K22k6L08m30O6PM39l47k29K86j48j08L39k38j90N67l00N7K39k61
4095c2J35k71L10l36k24N20j39J76R3l01OK02J6j62K17O0l03J91J10n34K24R4
4117E2K6j28P6K4j60L40m29K09J33r6j2K24j92j97J12lKJ23J93l82M05l74L56
4140C02j61j13l08M61j42m0L91l22m42L84J80j81n8k20J46lJ62q5K97l16LO0q8
4163i3K92k00j5N6j50R6j4k8P3l1K15r1j19j52M06m40j4J90r8K22j23j51j62K50
4187h1K76k85p5N9J65k3j54K61m3mO0l89l4J40O0k65K20j07L5JJ64N7o4P1j4N7
4213H8k15M02k49j87J9J40J50r8l12J89J39j09J87j38k63M40k11K89l45K27j82
4234c9J42m14M61N9r5k06R3P7J23k58J52m4R4j66J07J65l02J06n6L34m74lK78
$$ plain form
4257 134 118 -59 146 249 125 -22 366 71 431 -185 -17 90 -102 313 22 52 -49 -53 -69 -27 -144 -41
4279 -41 26 184 -17 -19 -67 -99 9 -27 -22 75 250 231 134 93 39 -251 -6 -12 99 312 -79 -46 -127 107 -161 -136
4305 -136 -333 285 -408 -68 -10 206 95 160 79 -45 -135 -55 -31 132 -158 -278 -110 85 -11 -81 -36 -408 215
4328 215 108 10 113 -1 44 -41 -2 -157 -81 313 -360 164 142 114 194 108 97 69 70 50 -164 -26 -129 60 -156
4353 -156 167 -268 74 -193 -123 80 90 -304 -294 -95 -178 -287 -42 184 113 -129 -110 179 6 -199 52 302
4375 302 38 -146 49 273 158 -127 50 -144 -198 117 -216 216 157 -75 -188 333 -11 -55 207 219 -205
4396 -205 -226 294 96 -76 -21 -1 -160 3 68 170 -54 298 87 -25 30 78 -7 368 -204 134 187 59 -212
4419 -212 206 26 -11 -148 103 -104 120 -266 81 173 -57 -64 62 128 -68 346 -228 -336 -51 195 137 47
$$ packed form
4257A34j6j77K05J03j24j47L88k95L60o16J68J07j92M15k91L0j01mj6M2j17J03
4279d1O7J58k01km8l2J08l6NR7J75j9r7m1n4k90K45oJ11K13l91L3q1K34k68K5
4305a36j97O18o93L40N8K16j11O5q1j24r0Q0K4J63k90j20J68J95r6p0M5l72O23
4328B15j07r8J03j14M5q5L9j55P6L94o73N24k2k8Q0q6j1k8Jk0k14J38j03J89k16
4353a56L23m35L42k67P0K03J0l94J0J99q3j09K45K26p1k42J9K89j73k05K51K50
4375C02k64j84J95K24j15k85J77j94n4L15l33M32n9k32j13N21l44m4K62J2m24
4396b05k1N20j98j72N5K0j59J63O5J02k24L52k11j12N5M8q5L75n72L38N3j28k71
4419b12M18j80l7j37K51k07K24l86L47R2k30pJ26O6j96M14n74j08K85K46n8r0
$$ plain form
4441 47 -58 -196 -297 135 -50 94 55 -227 -2 -20 -23 -30 -20 4 37 -24 -168 -95 -21 -76 57 73 10 -126 35
4466 35 297 121 -68 -320 50 -124 29 -94 267 -292 -166 96 72 -28 -182 92 64 -188 32 -21 -87 -10
4488 -10 -175 -134 185 204 -181 -115 210 126 95 177 -23 -279 -286 138 77 -3 135 106 -282 129 0 -191 213 95
4512 95 300 -5 175 257 -38 265 11 -41 115 175 -59 50 -145 253 101 197 -27 -82 205 189 137 260 -180
4535 -180 234 -68 -334 94 -72 187 -87 -119 156 -48 98 -171 21 -269 -145 39 239 -32 54 -73 91
4556 91 -5 166 -21 -176 -222 -313 19 -79 -202 -108 50 73 -374 -150 -299 5 -299 -217 53 42 18 -131 -12
4579 -12 -187 -289 111 12 -264 -28 -87 -200 15 -258 78 -236 27 -242 -191 58 -271 58 -56 -116 -41 -123
4601 -123 233 -12 -104 -107 -25 103 266 69 -171 10 216 1 -180 91 -346 -123 102 -36 -15 -368 -73 74
$$ packed form
4441D7j05j38j01M32j85J44l9k82K25j8lpJ0K4L3o1j44P3P4n5J33J6o3j36J61
4466C5K62j76j89k52L70j74J53j23L61n59J26K62k4j00j54K74k8k52K20n3o6P7
4488a0j65M1L19J9l85O6L25q4l1Q2k00k56pM24o1q0J38k9l88M11j29j91M04j18
4512I5K05l05J80Q2k95L03k54n2J56O0k34J09j95L98j52R6k24n5K87j6n2J23m40
4535a80M14l02k66M28j66K59k74l2K75k04J46k69J92k90J24J84K00k71Q6j27J64
4556I1r6J71j87j55m6r1L32r8j23R4J58K3m47K24j49L04l04Q2K70j1k4j49J19
4579a2j75j02M00r9k76K36n9j13K15k73L36l14K63k69N1K49l29L29j14o0P5q2
4601a23L56k45r2lQ2J28J63j97k40J81K06k15j81K71m37K23K25j38K1l53K95J47
$$ plain form
4623 74 152 -45 -128 170 226 24 133 47 134 -114 -110 -97 147 -86 -116 193 147 60 -39 311 36 -76 -19 122 -337
4648 -337 -24 -58 168 75 21 13 -8 -33 -153 236 85 -81 -47 -95 -16 -209 -22 160 229 -47 -253 101 -83 253
4672 253 18 112 234 -138 -42 -40 -57 138 -122 191 30 119 101 178 -153 96 155 -122 259 -196 -103 30 22 -165
4696 -165 -90 -171 70 208 -294 -109 -17 146 -77 -170 -143 -137 262 33 -66 -36 -281 29 266 76 -100 -125 241
4719 241 -419 -64 268 -125 -157 40 7 -290 -193 62 156 -82 29 -337 -76 39 -186 -28 48 349 80 76
4741 76 60 -60 -157 -119 95 -86 -175 314 10 -87 97 -276 -97 34 352 236 -100 170 151 182 33 322 96
4764 96 60 63 229 -10 387 67 7 292 22 -73 -163 -89 -113 1 -77 96 287 -254 162 85 -215 -55 202 71
4788 71 125 214 33 156 -250 19 -122 132 34 9 -94 48 67 -247 212 35 131 101 -211 122 -22 -247 4
$$ packed form
4623G4P8j97q3K98N6k02J09q6Q7k48MJ3K44k33l0L09m6q7r9L50k75j12N7J41m59
4648c37L13l4K26r3n4qk1k5j20L89j51j66L4m8P9j93J87J82O9k76k06L54j84L36
4672B53k35R4J22l72R6Kj7J95k60L13j61Q9j8P7l31K49N9k77L81m55R3J33qj87
4696a65P5q1K41J38n02J85R2J63k23r3K7OL99k29r9L0k45L10K37j90j76k5L66
4719B41o60L55L32l93l2J97l3k97R7K55R4k38J11l66K61J15k25J58P6L01k69m
4741G6j6j20r7L8K14j81q9M89l04r7J84l73J79J31L18j16l36K70j9L1j49K89k26
4764I6l6LJ66k39L97l20o0K85k70r5r0P4k4J14p8J73J91n41M16p7l00J60K57j31
4788G1N4Q9j81J23m06K69j41K54r8k5j03J42J9l14M59j77R6l0l12L33j44k25K51
$$ plain form
4811 4 -91 215 157 250 168 -135 8 452 54 -162 198 27 13 12 -211 -49 125 18 135 85 25 -183 0 115
4835 115 86 -103 39 -93 -48 -185 17 -95 86 -31 -104 -161 50 -17 -150 -403 81 80 9 115 -135 -78 -184
4858 -184 233 -10 -162 57 -101 -297 126 54 89 -166 -7 -248 -158 -20 32 -56 -126 -160 55 -142 93 20 -278
4881 -278 179 -49 94 -66 118 -85 -123 -71 372 53 106 185 -61 -84 46 -4 -24 -126 77 93 9 204 -57
4904 -57 -159 129 65 123 120 50 -27 229 42 -203 35 62 176 -222 -127 9 37 -14 -23 -149 -160 -224 141 -80 462
4929 462 35 67 -91 -247 12 665 330 41 -130 308 285 186 66 -133 29 -20 -115 -267 -44 -188 -33 -208
4951 -208 -130 -209 -165 -275 27 23 117 106 84 -67 142 16 5 214 -265 -15 -10 46 -203 -484 -140 95 -97 -175
4975 -175 -59 61 -3 30 -28 -205 77 51 -34 38 -287 -102 -162 3 64 -282 -57 86 -56 38 89 152 -52 -191
$$ packed form
4811Dr5L06n8R3q2l03J43M44l98k16L60j71j4jk23J62J74j07J17n0o0k08J83J15
4835A15k9j89J42j32M5j37K02j12J81j17p3n7K11o7j33k53M84jp1J06k50N7j06
4858a84M17k43j52K19j58j96M23p2L5k55J59k41R0J38N2q8p0l4K15j97K35p3k98
4881b78M57k28J43j60J84k03l8N2M43l19N3P9k46k3J30n0k0j02K03J6q4J95k61
4904e7j02K88o4N8lp0p7K56j87k45K38K7J14l98R5J36K8n1rj26j1o4L65k21N42
4929D62m27L2j58j56K59O53l35k89j71M38k3r9j20j99J62m9r5j52K23j44J55j75
4951b08P8p9M4j10L02mR4j1k2j51K09j26j1K09m79K50NN6k49k81L44K35j92p8
4975a75J16J20o4L3n8j77K82k6q5P2l25J85o0J65O1l46K25J43j42R4N1O3k04j39
$$ plain form
4999 -191 199 -103 -34 3 -68 -203 -145 -32 299 -11 -210 -13 -121 108 111 -77 3 35 44 234 -67 -87 -236 87
5023 87 -18 302 -37 -83 74 14 164 122 68 151 58 141 137 351 7 -283 102 -117 104 231 89 25 229 166
5047 166 -234 129 -35 197 -70 -27 122 -96 57 -91 100 68 74 -116 -67 75 -9 -180 -33 107 -27 313
5069 313 6 326 30 44 2 -79 -18 24 -320 -12 168 64 180 -115 -332 -202 107 -40 20 -164 -454 28
5091 28 -250 -240 -29 56 -251 -206 -131 -410 188 -283 -30 -134 123 -43 240 -260 50 -70 -174 -68 -182 16
5113 16 -261 40 -180 93 -54 -56 -129 167 -45 1 121 39 82 11 217 -347 -76 -43 23 -52 -211 140 159 76
5137 76 -59 -54 -22 37 85 -82 289 -244 183 208 -68 -228 435 178 -124 17 105 112 -113 -18 143 12 105 -157
5161 -157 64 -13 -52 368 63 105 -165 25 154 -8 165 62 139 -177 153 48 -135 54 -1 61 254 214
$$ packed form
4999a91L90l02O9L7p1j35N8J13L31l10j99J97j08K29Lj88Q0L2RJ90l01k0j49L23
5023H7j05L20l39m6J57o0J50m2n4Q3r3Q3mK14l44k90L85k19K21J27j42o4K04o3
5047A66m00L63j64K32k67M3J49k18J53j48J91l2Oj90M9J42q4j71J47J40j34L40
5069C13l07L20k96J4m2q1O1M2l44L08J80j04J16k95k17J30L09j47O0j84k90M82
5091B8k78J0K11Q5l07M5P5k79N98m71K53j04K57j66K83n00L10j20j04J06j14J98
5113A6k77L01k20K73j47kp3K96k12M6J20q2M3p1K06n64K71L3O6p5j59L51J9q3
5137G6j35NL2N9M8j67L71n33M27K5k76j60O63k57l02J41Q8Pk25R5J61j31R3k62
5161a57K21p7l9M20l05M2k70J90J29j62J73j03P7l16L30j05j83J89n5O2J93m0
$$ plain form
5183 214 120 161 127 -3 43 1 186 50 175 135 79 38 -132 -35 25 -160 71 159 -193 -198 29 -78 6 -133 39
5208 39 57 167 167 -14 109 -183 -114 122 131 163 174 -17 146 17 112 56 27 156 -172 -90 181 120 -314 -177 -161
5233 -161 -12 -87 -156 -5 11 5 -205 83 -150 -84 293 146 -91 -135 -61 -228 114 -148 -170 -148 4 45 -53 145
5257 145 61 -17 222 88 -80 1 4 17 -114 32 -65 -45 -33 151 -201 284 -231 53 380 82 -153 173 191
5280 191 103 154 5 -149 -158 110 42 70 -107 269 -162 36 242 71 103 -103 145 211 98 236 277 151 136
5303 136 83 237 -105 102 -203 -85 66 -248 -258 -115 173 -56 -201 -149 127 -113 175 -42 17 -37 191 -275
5325 -275 39 37 65 188 16 214 225 -231 50 -41 2 115 17 197 -113 81 -72 -44 72 -7 129 28 39
5348 39 -373 35 -84 70 -123 -114 -41 56 231 -146 36 122 -60 151 -345 -154 46 262 -55 38 7 5 -234
$$ packed form
5183B14r4M1l4j30M6m2J85j36J25m0n6m1j70R7O0j85K31Q8l52nK27j07Q4j39J72
5208C9J8J10%j81J23k92O9K36RL2J1j91J63j29R5n6k9J29l28Q2K71o1m34J37J6
5233a61J49p5o9J51J6ok10K88k33O6L77j47k37m4P4j67L42k62k2K2J52M1r8J98
5257A45q4p8K39j34j68Q1LJ3j31J46r7K0J2J84l52M85n15K84L27k98k35L26J8
5280A91q8N1j49j54rK68o8K8j77L76m31J98K06j71L2k06K48O6j13J38M1j26j5
5303A36n3J54l42K07l05J18J51l14j0J43K88k29j45N2K76k40K88k17N9n4K28m66
5325b75L14kK8J23j72J98J1m56K81r1M3J13r8J80l10J94j53K8J16p9J36j01J1
5348C9m12M08j19J54j93RP3R7J75l77J82Q6j82K11m96J91K00K16l17R3l1kk39
$$ plain form
5371 -234 -204 26 -21 -419 73 -81 -249 145 133 -31 -153 122 -112 48 -40 -11 85 -225 154 -167 -133 177
5393 177 244 32 222 -36 398 23 -188 209 13 199 83 -174 -239 225 63 -29 261 11 -92 343 -93
5414 -93 187 159 190 -118 -138 -126 -114 28 -96 140 -98 -120 264 103 -247 -179 -54 319 236 47 -306 -251 130
5437 130 -223 -71 88 -279 -110 254 -207 3 12 88 -104 -254 -188 -68 -144 244 313 110 -101 81 -153 -221
5459 -221 90 -118 -56 -54 192 -227 376 124 -324 111 91 82 207 96 -185 46 138 -141 -225 -206 49 43 212 -292
5483 -292 -95 212 34 81 -284 103 -170 145 -34 -268 192 -23 42 -147 -95 -38 -185 -123 -105 -124 -233 51
5505 51 -121 -212 271 107 -95 -201 61 282 -7 68 -220 299 248 57 109 -218 154 102 99 -89 137 170 102
5528 102 28 -156 -188 -49 -443 105 218 -155 117 60 -177 144 93 -123 -26 143 16 -46 -150 46 181 115
$$ packed form
5371b34L0K30m7l98M92j54j68L94j2j64j22K75k34J60q8K9R6l10L79l21L4L10
5393A77O7k12J90k58M34l75k11L97j96J86j16k57o5M64j62r2K90k50j03M35m36
5414i3K80k8L1l08k0J2J2J42j24K36k38k2L84j61l50O8J25L73q3j89l53N5L81
5437A30l53J52J59l67J69L64m61K10RP6j92j50O6J20p6L88O9k03k11J82k34o8
5459b21L11k08O2KK46m19O03k52m48M35k0rJ25j11k81K31R2k79q4J9K55oJ69n04
5483b92J97L07j78M7l65L87k73L15j79k34M60k15O5j89N2N7j47O2J8j9j09K84
5505E1j72r1M83j64k02j06K62K21k89P5k88N19n1j91N2l27L72n2lj88K26L3o8
5528A02p4j84l2J39l94N48J13l73K72n7k37L21n1k16R7J69j27o2j04J96J35o6
$$ plain form
5550 115 60 -3 80 4 92 -120 358 -33 73 -116 -36 -181 69 182 115 168 200 43 89 -125 33 -69 -97 -4
5574 -4 49 -174 70 -141 184 -5 348 -81 -138 194 -197 -281 7 -39 -241 -249 -77 -298 -88 164 49 77 -123
5597 -123 -526 -63 80 -114 -133 -52 67 -17 -173 50 -439 112 102 -73 -80 -41 -136 242 78 295 -194 25 1
5620 1 -589 -64 -46 -84 -92 -307 -362 -102 -117 0 7 187 -171 -209 -152 -30 100 145 -59 -33 137 57 -191 108 -160
5645 -160 -42 221 14 72 102 -9 181 92 -84 43 -19 130 66 -96 -15 -8 200 -153 102 -368 28 -358 188
5668 188 -51 -160 96 -9 -34 -103 296 264 146 -29 -122 127 -56 153 258 112 433 150 -32 -10 130 -17
5690 -17 -5 -373 191 -251 90 -50 45 39 -117 -138 -331 -25 27 -4 -33 -13 84 104 140 16 186 -36 -109 -133 229
5715 229 -217 111 94 -103 -88 -213 -346 -146 137 209 38 77 261 75 -263 -280 -293 -234 131 11 -160 -306
$$ packed form
5550A15n5o3Q3p6Q8k12M78l91J06j89Q0j45K50J13o7N3L2j57M6k14J58j02k8R3
5574dN3k23K44k11L25j89L53m29n7L32l91q4K88m6k02qJ72k21K10K52j15K8k00
5597a23m03M63J43j94j9Q1J19q4j56K23m89N51j0j75pL9r5L78j64K17m89K19k4
5620An90N25J8l8qk15n5K60j5J17PJ80l58l8N7J22J30M5k04K6J70q0k48K99k68
5645a60J18K63k07N8L0j11J90q9j76J27o2J49o4j62Q1PK08l53K55m70L96l86N46
5668A88k39j09K56j05k5o9L99l2j18j75r3K49j83K09J05j46L21k83j82K2J40j47
5690a7J2l68N64m42L41j40R5oj56k1j93L06N2l1k9K0R7K0L6j24J70k22p3k4L62
5715B29m46L28j7j97J5j25j33K00K83P2j71L9J84j86l38j7j3N9L65j20j71j46
$$ plain form
5737 -306 72 -176 -137 -79 -330 163 -151 77 88 -189 -112 -220 177 -101 -57 -62 -57 1 -51 28 -76 -97 62 93 -28
5762 -28 57 -98 164 -64 -55 -100 35 -117 -404 219 229 36 -31 -4 -116 -116 318 -17 -200 20 -115 27 -170
5785 -170 -182 14 62 262 260 -163 -253 114 -36 108 116 287 -237 78 19 106 30 -169 -228 -94 -72 -310 319 -24
5809 -24 129 313 -155 -241 259 120 58 102 123 -79 -51 279 15 -32 49 219 -80 309 158 -119 287 -223 -63
5832 -63 77 202 25 -97 122 283 32 51 -58 -39 -18 231 165 -126 -22 73 -13 47 119 -36 -80 392 259
5855 259 -198 56 -115 -4 147 -128 -310 12 74 -222 -247 -147 23 54 39 -55 119 -39 157 146 -189 191
5877 191 -65 83 98 66 76 122 -34 -38 -175 -263 -225 47 -5 94 4 98 -224 -43 -39 -42 -22 161 -330 -3 233 -88
5903 -88 -40 -143 -82 118 -180 65 202 -171 29 65 -88 -187 -102 208 47 48 350 -223 81 78 86 196 -40 62
$$ packed form
5737c06L78k48L9N8k51M93l14K28J1k77P7j08L97k78M4nNN8n2P9j04k1J59L1j21
5762b8Q5j55K62k28Rm5J35j52k87O23J0j93o7K7j12%M34l35j83K20j35J42j97
5785a70j2J96M8K00km23r0L67j50J44QJ71n24L15n9Q7p6j99n9J34K2k38O29l43
5809b4J53J84m68q6N00j39o2M4K1k02K8L30k64m7Q1J70k99L89j51k77M06n10J60
5832f3J40J25j77j22K19J61k51J9j09J9K1K49o6k91J04R5q6O0P2j55m4M72j33
5855B59m57K54j71J11J51k75j82L22O2k96k5J00J70L1j5r4J74j58J96j1l35L80
5877A91k56J48J5l2J0M6j56mj37q8L8K72n2R9r0R4l22J81MlK0J83m91L27K36l21
5903h8M8j03O1K00k98K45J37l73K00L6j53r9Q5L10j61JL02n73L04lQJ10k36J02
$$ plain form
5927 62 148 250 -304 40 -12 -178 149 -37 308 -63 -179 -13 -16 -68 -38 -90 43 -13 2 124 20 95 29 234
5951 234 86 122 -104 18 -110 -29 -18 18 -184 56 71 -147 -104 -87 83 -180 333 245 310 -63 -127 -105 96 -3
5975 -3 -51 -250 -160 102 -204 144 66 -103 167 15 62 130 58 229 -140 -72 271 -55 -231 146 -152 -204 491
5998 491 42 -86 -258 -284 -71 132 -177 -46 197 -128 123 82 -107 -137 69 -8 53 -169 42 204 56 64
6020 64 -269 228 138 116 -40 229 3 -62 66 -23 119 -105 -246 -179 -154 -58 8 -226 8 -86 108 143 -79 118
6044 118 -134 -223 288 -47 168 176 -23 75 60 -65 -44 -58 219 15 57 17 -214 -122 -131 214 198 -368 -78 220
6068 220 57 -15 66 86 103 96 54 167 12 127 232 28 -29 -271 -306 -79 -11 39 1 -50 263 315 -126 115 124
6093 124 135 118 -381 -3 40 389 -11 111 59 98 104 106 446 64 -313 162 -333 -58 132 40 -162 -6 93 -329
$$ packed form
5927F2Q6J02n54L44n2j66L27j86L45l71j16J66ln2L0n2J33n6J5J22j04P5o6K05
5951B34j48L6k26J22j28Q1J1L6k02K40J5k18M3J7J70k63N13q8O5l73o4K2K01r9
5975cm8j99R0K62l06L48p8j69K70j52M7O8p2J71l69O8L43l26j76L77k98n2O95
5998D91m49j28j72k6K13K03l09J31K43l25K51m1j89l0K06p7O1k22K11J62j48Q
6020F4l33M97r0k2j56K69k26o5J28q9J42k24j41O7K5R6O6k34K34r4J94L5k22J97
6044A18k52q9N11l35K15Qj99R8j5j25K1j4K77k04M2m0k31R2rL45j6n66K90K98
6068B20j63p2Q1K0J7pm2J13j55J15J05k04n7k42l5K27O8N0l8n1L13N2m41K41R
6093A24J1j7m99L78M3L49m00J22n2L9OKL40l82l77M75m95K75J90r2k02J56R9m22
$$ plain form
6117 -329 248 -279 -61 -209 -239 -206 6 -94 98 -284 175 -62 148 -396 -79 -221 -64 -34 -308 -149 -108
6138 -108 -202 341 125 -165 -99 -11 -285 -114 -179 154 67 40 -37 74 -83 61 69 -28 261 138 67 137 9 250
6162 250 11 38 328 39 98 91 56 -137 -4 -329 123 -199 -174 -19 -31 133 194 -25 173 -144 321 -95 -42
6185 -42 275 414 -86 -71 -116 131 -66 -32 137 186 118 136 -92 -46 138 -158 98 265 -32 -119 -31 -153 -32
6208 -32 88 231 -217 -35 -2 -231 -282 -38 -103 -200 87 -90 -9 42 -69 -157 -41 63 33 -109 161 474 23
6231 23 42 -108 44 303 -271 132 -302 -304 304 -10 -134 177 252 196 200 97 107 -46 77 -210 -155 85 -94
6254 -94 5 132 100 -154 78 186 -82 -29 294 102 -109 -213 27 -5 211 106 113 92 382 -106 83 196 -96
6277 -96 21 -42 -73 -117 -109 234 -136 21 297 97 -163 -103 -232 -144 -96 305 206 -98 219 -230 -156 21 213 -37
$$ packed form
6117c29N77n27K18j48l0L3K12j00J92l82M59k37K10n44L17j42J57L0k74J59M1
6138a08r4N43k16k90O6Q8k74J71o5L33q7k7p7J11j57J44Qr7K89j23p1P0j28K41
6162B50k39K7K90k89N9pl5j93J33l25M52l22K5J55j2J64O1k19J98l17M65m16N3
6185d2L17J39n00J5m5K47j97L4J69M9o8J8k28M6J84k96K56J67k97q7Q8j22J21
6208c2J20J43m48J82L3k29n1K44o5r7K87j77Q1N1j11q8J16J04l0j42K70L13m51
6231B3J9j50J52K59n74M03m34kO08l14j24L11P5n6Mj03J0j53J23k87N5K40j79
6254i4R9J27l2k54K32J08k68N3L23j92k11j04K40l2K16j05Pk1K90m88J89J13k92
6277i6J17o3l1m4QL43l70J57K76k00k60O0j29Q8M8M01r9l04L17m49P4J77J92k50
$$ plain form
6301 -37 258 -303 89 -158 -47 -71 190 434 54 125 17 -28 -105 96 -135 -163 136 242 266 178 105 79 -9 215
6325 215 -189 -54 -217 -10 138 -202 274 -158 -165 224 -233 149 -211 -155 -61 215 -40 -45 108 206 58 -152
6347 -152 -114 -152 30 -23 -153 -4 66 140 -166 -33 -131 -191 7 97 -67 -89 -340 61 106 -41 -143 16 229
6370 229 52 441 -120 208 270 -6 -82 14 -68 -126 -58 -5 -117 141 -219 -4 227 -67 312 54 159 -232
6392 -232 -135 81 -224 -114 -1 -262 -99 130 -149 241 -251 70 221 -287 126 -164 69 95 9 -27 -352
6413 -352 -93 -8 7 -3 68 -44 -237 -159 -80 156 -82 174 160 -108 129 -442 -23 -201 -104 241 149 -103 103
6436 103 42 -6 122 -93 -161 -186 -234 -3 -108 -210 267 101 -54 72 38 -245 -8 -194 -60 156 -129 -137 -163
6459 -163 -26 85 117 20 46 141 45 68 -173 -71 -8 257 116 319 42 -200 8 -181 -270 -182 -7 23 38 -130
$$ packed form
6301c7K95n61L92k47J11k4K61K44l80P1j08m5p7K01k31k8K99J06K4q8p3k6q8K24
6325B15m04J35j63K07J48l40M76m32pL89m57L82l60N6R4K76k55nJ53R8j48k10
6347a52L8l8J82n3j30J49P0P4l06J33r8o0J98R0j64k2k51M01M5j47j02J59K13
6370B29j77L89n61L28O2k76p6R6q2n8O8N3j12K58l60K15K31k94L79k58J05l91
6392b32R7K16l05J10J13k61J63K29k79L90m92L21J51n08M13k90K33K6q6l6l25
6413c52K59Q5J5j0P1j12j93P8P9K36k38K56j4k68K37n71M19j78R7L45r2k52K06
6436A03o1m8J28k15o8k5m8K31j05j02M77j66j55J26l4k83K37j86J34K16k85qk6
6459a63J37J11L2r7K6R5r6K3k41J02O3K65j41K03k77k42K08j89q9Q8J75L0J5j68
$$ plain form
6483 -130 -110 145 233 -18 117 114 52 278 -255 -318 -223 -104 -92 63 -207 27 -3 220 -418 -95 235 -233 117
6506 117 -245 -49 -106 30 -107 168 -84 149 -55 270 -253 27 -320 -47 182 -83 89 -310 -74 57
6526 57 351 -107 -219 -164 44 -121 -173 -120 -60 425 247 262 64 3 177 139 19 14 -19 211 54 -20 195 165
6550 165 -93 -54 -154 65 -133 -21 160 174 95 -204 213 -200 56 -48 52 -128 -49 187 -121 131 -153
6571 -153 140 -164 104 40 279 -112 -60 478 15 95 -144 -166 -199 -164 -33 35 -164 67 -74 185 -189 -129 -261
6594 -261 -285 -8 44 -114 -175 176 411 82 -89 -370 -136 -147 73 -208 -183 35 -103 -158 37 243 -14 75
6616 75 224 -31 -149 -50 -22 101 204 161 11 -50 39 19 75 32 84 113 -18 38 8 11 -145 -64 55 -182 -14
6641 -14 -79 130 47 -91 -20 -65 156 -11 -245 -58 93 238 -172 2 166 11 171 193 -19 -295 52 -200
$$ packed form
6483a30K0K55Q8k51J35lo2K26n33o3R5J19J2J55k70K34l0K23o38L23L30m68L50
6506A17l62J96n7J36j37K75k52K33k04L25n23K80l47K73K29k65J72l99K36J31
6526E7K94m58j12N5K08j65n2N3O0M85j78J5j98o1J74l8j20nl3K30j57p4K15l0
6550A65k58L9j00K19j98J12J81J4p9k99M17m13K56j04J00j80P9K36l08K52k84
6571a53K93l04K68o4K39l91N2N38m63Q0k39k2l3L5J31O8j99K31j41K59l74O0j32
6594b61k4K77N2j58o1L51K35l29j71k81K34j1K20k81K5K18j38n5J95K06k57Q9
6616G5J49k55j18R9K8J23J03m3j50o1Q9k0N6m3N2K9j31N6l0Lj56Q1J19k37J68
6641a4o5K09q3j38P1m5K21j67k34J87J51J45m10J74J64j55J60K2k12k76L47k52
$$ plain form
6663 -200 -126 -211 -120 79 -282 276 38 31 -87 21 255 -10 -250 70 -149 37 3 -47 -102 -55 -10 -17 -43 142
6687 142 218 187 -32 103 348 -19 40 179 -72 -281 -44 63 -268 -60 -31 51 -25 -62 186 305 255 143 -91
6710 -91 55 34 99 -85 114 -83 74 -48 164 -361 -47 208 76 -236 10 172 16 -89 112 55 -137
6731 -137 -182 -90 -105 149 -110 -148 365 -47 -4 -36 -63 -50 -124 125 -74 -319 214 336 33 142 -407 -643 55
6754 55 79 5 -198 -158 -62 179 -64 83 51 -2 323 61 -273 56 -21 22 109 259 -57 -265 111 -137 198
6777 198 21 67 -224 -122 6 0 117 -99 123 -69 265 96 -38 -96 -81 120 74 146 -372 -9 -219 165
6799 165 56 -157 -82 -160 -233 64 89 136 193 -153 -75 -7 143 -226 64 182 37 -15 364 -411 154 124 77 -104
6823 -104 23 -77 3 -46 -51 15 260 -48 -3 618 -105 35 -14 483 -212 -142 240 185 82 93 -263 40 -317
$$ packed form
6663b00P4q5R1J99l61N58k38pj18J08K34k65k40L20k19J86l4n0n5M7M5pk6J85
6687A42P6l1k19J35K45l67N9J39k51k09K37J07l31K08K9Q2p6l7K48J19n0j12k34
6710i1J46k1O5j84J99j97J57j22K12n25L14K55j32l12K46J62j56j05K01n7j92
6731a37m5R2j5K54k59l8N13m12M3l2k7J3p4K49j99k45N33J22l03J09n49k36O98
6754E5K4p4k03M0R6K41k43J47l2n3L25k62l34L29p7M3Q7J50l16k08L76k48L35
6777A98j77M6k91J02J28oJ17k16K22j92L34j69j34n8J5K01m6P2n18L63k10L84
6799A65j09k13P5p8p3K97K5M7N7l46P8O8J50l69K90J18j45n2L79p75N65l0m7j81
6823a04J27j00Q0m9nO6K45l08M5O21p23J40m9M97o95P0L82n5j03J1l56L03l57
$$ plain form
6846 -317 -51 -300 -53 -21 -99 26 -28 224 123 -49 126 218 -255 21 42 -429 -130 129 -47 -141 -52 27 -56
6869 -56 6 79 257 57 -180 -5 -101 127 -86 236 -262 -256 20 -141 -98 60 225 -5 -41 186 -39 -77 121
6892 121 -173 -8 -384 65 -127 -85 48 304 162 119 176 -229 -310 -76 65 230 58 205 -145 23 -17 -82
6914 -82 -48 -12 81 135 249 -150 109 -112 -197 82 15 142 31 -257 35 -68 197 -176 -312 108 96 139 -221
6937 -221 66 -149 -147 211 -46 272 -388 -13 -455 230 28 110 194 -140 169 -12 19 271 266 13 -14 160 35
6960 35 -46 -237 25 -230 74 -97 -395 -128 29 -300 -280 -29 -147 -42 77 -16 -180 -32 -44 146 -69 67
6982 67 -291 -9 -356 -362 96 -35 219 342 -387 -109 -214 160 -23 -132 78 288 53 -164 -178 -158 134 104
7004 104 -170 214 -97 -135 -264 -42 30 -193 178 148 -89 148 -198 -282 60 157 -6 -60 -58 51 -439 43 -32
$$ packed form
6846c17K66k49K47L2p8J25n4K52j01j72J75R2m73K76K1m71K99K59j76r4Q9P9q3
6869e6O2P3J78k00k37J75r6K28k13L22m98OK76j61M3J58J65k30l6K27k25l8J98
6892A21k94J65l76M49j92M2J33K56j42m3N7m05q1K34J41J65j72J47l50J68m0o5
6914h2L4L6R3N4J14l99K59k21q5K79o7J27j11k88K92j03K65l73j36M20j2M3l60
6937b21K87k15KL58k57L18o60L75m42O85k02Q2Q4l34L09j81L1K52nk53k7J74j25
6960C5q1j91K62k55L04j71k98K67J57l29K0K51j18J05J19r3j64J48j2J90k15J36
6982F7l58K82l47oM58j31K54J23p29K78j05L74j83j09K10K10k35k17j4K0K92l0
7004A04k74L84l11l8j29K22P2k23L71l0k37K37l46q4L42R7j63n4KJ09m90M82p5
$$ plain form
7027 -32 -93 130 -177 135 41 241 4 18 -206 -82 -17 78 35 -66 96 -161 42 88 -180 -152 -137 -21 106
7050 106 332 -110 48 -70 408 -144 -199 121 344 -50 -34 294 -40 -172 185 70 255 -257 -292 141 304
7071 304 174 231 191 -164 275 -20 65 -101 113 17 -294 47 -39 -9 -297 -162 9 45 128 40 39 -4 65 -196
7095 -196 -68 -10 -30 -194 117 -17 -84 195 -77 58 -53 -103 188 -193 155 158 70 -112 -89 146 -82 -137 289
7118 289 -129 135 -103 -228 108 199 85 -6 49 62 265 -268 294 -9 -42 -192 177 -94 61 108 272 3
7140 3 198 103 30 -105 27 -88 327 -62 -17 -286 -183 102 -117 -62 -139 -202 14 195 167 219 -12 244 -28
7163 -28 234 17 -304 -270 -21 -87 169 134 -120 -182 49 -165 433 -242 144 75 118 164 -171 -61 -242 -124 -131
7186 -131 227 92 218 -380 -232 98 131 -17 134 -185 -118 82 266 -254 -181 92 -67 -207 -236 189 -25
$$ packed form
7027c2o1K23l07L12r4K00k37J4k24J24O5R5m3j01J62k57K03M6k68K8J5J16J27
7050A06K26m42J58j18M78n52n5L20K23l94J6L28l34j32L57j15J85n12l5M33J63
7071C04j30N7m0l55M39k95Q5j66K14r6l11L41q6L0k88J35J71L6Q3q8jm3O9k61
7095a96J28N8k0j64L11j34o7K79k72J35j11n0K91l81L48Lq8j82K3K35k28n5M26
7118B89m18K64k38j25L36R1j14r1N5J3K03n33N62l03l3j50L69k71J55M7J64k69
7140CJ95r5p3j35J32j15M15l89M5k69J03K85k19N5p7o3K16J81k8N2k31K56k72
7163b8K62k17l21L4K49o6K56l5k54o2K31k14N98o75L86o9M3M6l35J10j81J18p
7186a31L58j35J26n98J48L30L3j48J51l19O7K00J84n20P3K73j59j40k9M25k14
$$ plain form
7207 -25 -160 -375 24 278 80 -76 205 341 -37 190 -155 -149 -28 114 -102 72 164 -52 -116 -135 -60 225
7229 225 47 -289 -147 -154 24 -154 -107 -281 -145 152 -89 -31 137 -152 30 -62 -84 195 -94 -81 48 -64
7251 -64 1 305 49 118 -87 169 179 -3 -33 26 -130 210 -8 324 -214 42 -94 38 220 -41 119 -283
7273 -283 -73 273 103 -209 -65 -270 -10 10 52 -177 -296 -127 -140 -59 -169 -203 2 -257 27 -221 89 331
7295 331 -26 74 -50 -76 130 -87 140 291 -48 65 -159 7 130 -44 213 -300 -65 -125 -17 -215 291
7316 291 268 105 -365 -49 17 4 178 252 89 -2 36 -38 1 -318 -19 134 25 -58 -40 -43 -254 55 83 151 264
7341 264 -58 -362 -50 -214 183 64 -57 67 -255 -68 15 -214 -22 79 113 188 -31 14 64 46 -250 67
7363 67 58 276 108 -111 152 43 -112 71 -26 -133 28 -95 81 200 147 -105 55 8 10 170 86 -160 11
$$ packed form
7207b5j35k15L99K54j98j56K81J36l78K27l45OJ21J42k16J74R2k16o4j9P5K85
7229B25j78l36J42pJ78j78M7j74J36K97k41N8J68k89J82r2k2K79k89J3J29j12
7251f4O5L04k56O9k05K56J0j82l0N9j56L40k18L32n38K56j36J32J82k61J60m02
7273b83K10L46j70l12J44k05K60K0M2k29j19J69j3Q1j10l4K05k59K84k48L10K42
7295C31l57J00j24k6K06k17K27J51l39J13k24J66J23j74K57n13K35o0J08j98N06
7316B91k3j63m70L16O6j3J74P4j63r1L8p4L9l19K99J53j09q3J8lk11L09K8O8J13
7341B64l22l04L12j64L97j19j21J24l22J87Q3k29J92J01L4P5k19M5N0j8k96L17
7363F7rK18j68k19K63j09j55J83r7j07J61j23J76J19n3k52J60m7KJ60q4k46J71
$$ plain form
7386 11 -70 126 2 274 -251 -19 -106 6 113 -196 16 249 219 47 -53 -16 155 -218 -161 0 -56 -201
7408 -201 73 -79 -113 224 -8 199 156 -169 -91 123 -294 -4 -258 54 324 -115 -47 110 141 11 102 -176
7430 -176 53 -207 43 -132 42 -12 25 67 -384 -480 -3 19 -89 66 571 -58 -36 -251 -129 70 -9 -226
7452 -226 -49 206 -205 -151 158 -77 -121 -47 -12 -105 209 -165 90 -15 -349 -144 58 -63 27 -277 -28 101
7474 101 -110 -289 55 39 187 -207 57 147 -59 40 37 -79 -3 156 14 -166 -118 110 -401 96 1 -151 196
7497 196 -148 84 132 105 -84 -72 35 -54 44 -10 201 126 87 -158 48 44 -159 -54 224 32 -143 -132 -219 199
7521 199 -107 -86 -36 -305 -175 -198 98 -31 -32 -125 11 -47 141 -27 -186 -64 211 -3 -107 -6 45 44 195
7544 195 244 -197 -95 -88 -104 -165 -102 -119 279 -180 -156 -157 247 95 -193 -154 31 182 352 -105 253 151 -297 78
$$ packed form
7386A1q1J96j24K72n25K32q7J12J07l09K12K33l0j72j00L7J71l73N7J61n6j45
7408b01K74j52l4L37k32K07m3l25P8K14m17K90k54L12K70m39O8J57L1j30R1k78
7430a76K29k60K50j75J74n4L7M2m51r6M77K2j08J55N05o29K2k15J22J99p9k17
7452b26J77K55m11N4L09k35m4P4L5r3L14l74K55j05l34K05K02j21R0l04K49J29
7474A01k11j79L44j6J48l94K64R0k06R9lj16P6J59j42j80M8K28n11M97r5j52L47
7497A96l44K32M8k7j89J2J07q9R8n4K11p5l9k45K06mk03J05K78j92j75J1q7M18
7521A99l06K1N0k69J30k3K96j29jr3J36n8J88j68j59J22K75k14j04J01N1jJ51
7544A95M9m41J02Pj6o1O3j7L98m59K4jM04j52k88L9J85J51J70m57L58j02m48L75
$$ plain form
7568 78 -44 259 -108 -235 85 89 -8 -134 -50 -185 -142 110 89 -133 179 -56 -411 172 21 63 98 185 -211
7591 -211 20 91 181 -98 236 126 -149 285 56 9 -162 -112 -302 -130 -52 102 252 -23 163 -147 96 -107
7613 -107 -65 39 120 -21 200 -365 113 -181 -122 -78 204 90 -47 210 46 15 25 -159 -191 -57 73 87 -193
7636 -193 -120 -73 21 -258 72 -94 -63 74 -73 66 60 92 -35 -257 81 -48 -72 -124 -88 41 -145 306 -167
7659 -167 -106 26 122 43 -21 72 97 127 -122 -28 167 -191 199 36 -3 -132 -317 39 194 -281 16 119 -161
7682 -161 -2 -87 -148 110 162 -11 -160 161 -170 -207 -28 19 143 -228 51 -18 -211 29 47 273 -374 28
7704 28 -164 -72 1 -28 209 30 -53 -276 25 95 -214 -163 200 230 -115 -169 166 106 -122 -54 88 39 273 86
7728 86 20 -171 -116 -4 38 -128 -65 -316 -52 -78 131 -23 44 -133 2 12 361 140 113 167 211 72 33 62
$$ packed form
7568G8j22L03l67j27L20Mr7j26Q4j35M3K52k1k22L12k35l55N83j51M2L5Q7l96
7591b11K31P1R0k79L34j10k75M34k29m7j71N0j90J72P8J54J50k75J86l10K43k03
7613a07M2J04Q1j41K21n65M78k94N9M4K82j14j37K57j64l1J0j84l2J34J30J4k80
7636a93P3M7R4k79L30j66L1J37j47J39oL2j27k22L38j29k4n2L6J29j86M51m73
7659a67O1J32R6p9o4R3K5L0k49R4J95l58L90j63l9j29j85L56J55m75K97J03k80
7682a61J59q5o1K58N2j73j49L21l31l7J79M7J24l71K79o9j93K40J8K26o47M02
7704B8j92R2P3k9K37j79q3k23L01P0l09N1L63L0l45n4L35o0k28O8J42m9K34j87
7728H6o6j91N5J12M2j66O3k51K64k6K09j54O7j77J35J0L49k21k7N4M4j39l9K9
$$ plain form
7752 62 14 172 -299 -36 -202 -167 138 -19 6 10 87 -21 -83 307 169 178 -10 -198 -343 -251 39 116 14 192
7776 192 223 122 165 -150 -256 0 -169 39 -35 -86 89 -58 -117 59 175 123 48 54 39 133 1 -456 199 -165
7800 -165 -104 -26 181 83 -17 -185 -36 405 29 50 -212 48 -40 25 -141 276 103 74 -37 44 7 -350 23
7823 23 126 -171 -94 74 -3 8 -218 286 -108 41 -34 -88 38 87 137 -22 -376 -248 193 -2 75 -168 317
7846 317 106 53 -90 -178 34 146 202 -58 -30 38 168 54 -74 -79 72 -56 -32 -28 304 160 83 -128 0 -198
7870 -198 -29 -157 142 -75 146 -150 -130 90 -19 -42 4 24 68 462 -45 -112 158 -9 -228 -132 430 -136
7892 -136 -196 -201 85 213 27 175 242 68 -44 -188 -50 -64 -73 -143 93 -105 287 110 -53 -207 -34 158 89
7915 89 68 -19 -49 281 223 -301 96 237 -150 -52 -35 27 61 -305 222 -85 157 -113 -170 416 -17 61 21 39
$$ packed form
7752F2m8J58m71K63j66L5L05j57K5MP7j08o2L90j38Rj88j88j45R2K90P7j02J78
7776A92L1j01M3l15j06K56j69K08p4n1J75j47n9J76J16n2p5Oj5R4j32m57O55l64
7800a65O1P8K07r8j00j68J49M41l76K1k62K60q8O5j66M17j73k9j11Q1l7l57L73
7823B3J03k97P7J68p7J1k26N04l94J49p5n4J26M9N0j59l54J28M41j95P7k43M85
7846C17k11n3j43q8K12J12N6k60K8O8J30j14j28nJ51j28K4ML32j44p7k11J28j98
7870a98J69j28K99k17K21k96K0K20j09k3M6K0M4L94n07o7K70j67k19R6N62n66
7892a36o0nK86J28j86J48O7j74j12j44J38j4rp0K36j98L92j77j63j54J73J92o9
7915H9k1q7l0L30n8n24L97J41l87R8J7O2L4l66N27l07K42k70n7N86m33P8m0J8
$$ plain form
7939 39 -134 118 -339 118 240 -225 -56 -45 -6 13 150 -278 101 -155 4 3 -57 102 -329 57 -182 33
7961 33 147 -132 -280 -116 -21 27 -19 -103 -177 43 222 3 22 402 -130 41 -309 -203 -212 42 131 -75 -97 56
7985 56 -151 70 -16 -172 12 -12 -106 2 67 68 -136 109 91 -242 -53 218 -28 36 -112 -116 216 228 -78 -160
8009 -160 -123 -322 -145 58 -207 -252 -191 74 41 -41 -10 90 -44 67 45 -80 -15 -189 -195 -96 -48 118 -48 168
8033 168 -149 206 -250 249 98 -317 52 107 122 17 90 -32 211 -57 165 154 -169 270 276 -49 -75 35
8055 35 -135 -2 52 -236 83 -204 -81 -393 -57 -273 -214 57 360 150 28 -171 -275 -198 -136 57 -117 -110
8077 -110 177 116 20 -43 206 -110 181 135 138 -54 54 8 -143 52 -25 209 -19 107 -236 -167 94 -58 205
8100 205 143 -263 -242 -59 -233 -225 126 -193 -102 -10 36 163 8 -72 196 54 208 -227 -23 -43 -122 314 124
$$ packed form
7939C9j73K52m57M57J22m65J69J1L9J9J37m28L79k56J59jo0J59m31L86k39K15
7961C3J14k79j48J64R5M8m6q4p4K20J79k19J9L80n32J71l50J06rK54Q9k06k2J53
7985E6k07K21q6j56J84k4r4J08O5Jk04K45j8l33J89K71k46O4j48mL32J2l06q2
8009a60L7j99J77K03k65m5O1K65l3q2L1J00j34J11k2j25O5j74oR9M8J66j66K16
8033A68l17L55m56M99j51m15L69N5J5j05P3j22K43k68K22j1l23M39Ol25k6J10
8055C5j70J33N4k88L19k87J23l12L36k16N9K71L03k10j22j99j04P7O2J93j74P
8077a10K87o1r6o3K49l16K91m6Lj92J08m6j51J95p7K34k28J26l43O9K61j52K63
8100B05o2m06K1J83j74QL51l19R1R2M6J27j55q0K68j42J54m35K04k0p9M36j90
$$ plain form
8123 124 -26 -356 -1 -81 -45 -24 -220 84 121 78 -141 -168 61 201 123 -54 -73 192 -82 171 4 6 87 104
8147 104 -6 -32 -8 -117 -217 232 136 -37 -78 60 44 -142 -165 67 256 107 90 -111 32 -7 -24 212 -119
8170 -119 -93 -202 69 142 394 -11 -155 -27 136 -153 59 36 253 -281 -241 -110 53 -194 -256 -160 62
$$ packed form
8123A24j50l30L55q0L6K1j96L04L7m3k19k7K29J40p8j77j9K65k74K53j67KQ1J7
8147A04j10k6K4j09j00M49r6j73m1J38j6j86k3K32J89j49j7k01J43l9j7K36l31
8170a19K6j09K71P3K52m05j44J28J63k89K12k3K17n34M0J31J63k47o2R6K22
8191F2
$$ Imaginary data points
##PAGE= N=2
##DATA TABLE= (X++(I..I)), XYDATA
$$ plain form
0 0 0 0 0 0 0 0 0 -8 8 -8 8 -11 16 -16 24 -24 32 -40 44 -53 63 -72 80 -95 109 -125 141 -161 181 -205 230
31 230 -261 291 -325 363 -404 451 -500 553 -614 679 -751 833 -922 1022 -1133 1261 -1406
48 -1406 1571 -1765 1994 -2271 2613 -3043 3609 -4397 5555 -7436 11023 -20281 93274 162317
62 162317 -94290 -89463 93373 113782 -58515 -56633 73413 59625 -69875 -30050 95322
73 95322 57743 -75780 -35898 94825 71346 -52582 -34391 63118 42333 -42670 -15208 49066
85 49066 5395 -64681 -21165 48572 13293 -60284 -39682 28791 23243 -34396 -27174 26607 14010
98 14010 -45480 -24177 50761 24803 -76694 -63946 53778 60089 -68478 -103875 17638 73004
110 73004 -31554 -91208 2015 56871 -29505 -66229 32856 61797 -52777 -78107 50097
$$ packed form
0@%%%%%%%qJ6j6J6j9K7l2M0m8N6p2Q4r7J16j35J52j75K04k34K66l02L42l86M35
31B30m91N52o16O88p67Q55r51J053j167J293j430J584j755J944k155K394k667
48a406K977l336L759m265M884n656O652q006R952j2991J8459l1304J13555O9043
62A62317k56607M827J82836K0409j72297J882J30046j3788j29500L9825J25372
73I5322l7579j33523L9882J30723k3479j23928J8191R7509k0785q5003K7462O4274
85D9066m3671p0076M3516O9737l5279p3577K0602O8473n548n7639P222N3781j2597
98A4010n9490K1303P4938k5958j01497J2748J17724O311j28567l5397J21513N5366
110G3004j04558n9654R3223N4856q6376l6724R9085K8941j14574k5330J28204
$$ plain form
121 50097 79397 -53713 -88515 37348 70446 -45287 -71926 33910 49981 -48390 -50245
132 -50245 51455 47413 -53876 -43066 60890 50416 -48057 -30723 59451 30735 -55807 -14771
144 -14771 71644 20306 -73592 -23993 74463 36678 -60696 -38138 51966 45618 -29104 -30100 30374
157 30374 32217 -16971 -13081 31868 19450 -32098 -20236 36456 30678 -31449 -39486 18879 38298
170 38298 -13093 -40676 4112 35127 -4572 -35150 4989 33546 -10119 -36755 11023 33467
182 33467 -20325 -40860 14737 30587 -28746 -40282 22276 29051 -39909 -44805 33438 43027 -40530
195 -40530 -55506 29137 49269 -31435 -50384 24044 37014 -33462 -35959 31504 23388 -45100
207 -45100 -29082 42870 25207 -48448 -32937 41159 34150 -34583 -32704 28373 29943 -21595 -20781
$$ packed form
121E0097K9300j33110l4802J25863L3098j15733k6639J05836J6071r8371j855
132e0245J01700m042j01289J0810J03956j0474r8473J7334R0174k8716q6542M1036
144a4771Q6415n1338r3898M9599R8456l7785r7374K2558R0104o348p4722r96O0474
157C0374J843m9188L890M4949j2418n1548J1862N6692n778o2127q037N8365J9419
170C8298n1391k7583M4788L1015l9699l0578M0139K8557m3665k6636M7778K2444
182C3467n3792k0535N5597J5850n9333j1536O2558O775o8960m896P8243R589q3557
195d0530j4976Q4643K0132q0704j8949P4428J2970p0476k497O7463q116o8488
207d5100J6018P1952j7663p3655J5511P4096p009o8733J879O1077J570n1538Q14
$$ plain form
220 -20781 24413 18905 -21407 -11193 25820 11889 -22387 -5836 27857 11147 -21516 -6511
232 -6511 27554 17298 -17907 -12586 24015 25641 -12860 -19796 18036 29276 -7285 -20564 11744
245 11744 23224 -6355 -14244 14835 17972 -14562 -16440 21242 25080 -19071 -27107 21671 33667
258 33667 -18903 -35901 16122 34949 -15257 -33598 11850 24529 -18258 -24441 16241 15924 -25384
271 -25384 -21388 21721 14998 -30951 -23918 25166 18914 -32933 -29181 23505 21760 -28638 -28100 17792
285 17792 15982 -24712 -19901 15712 7492 -22775 -11531 16959 3016 -24526 -9527 21742 8382
298 8382 -26113 -16386 21315 16088 -20945 -19670 15807 17407 -13495 -15496 10514 12875 -7859
311 -7859 -7995 10378 8506 -10143 -5968 16491 12785 -14454 -12424 19845 21173 -14860 -18718 18926
$$ packed form
220b0781M5194n508m0312J0214L7013j3931l4276J6551L3693j6710l2663J5005
232f511L4065j0256l5205N321L6601J626l8501o936L7832J1240l6561j3279L2308
245A1744J1480k9579p889K9079L137l2534j878L7682L838m4151q036M8778J1996
258C3667n2570j6998N2023J8827n0206j8341M5448J2679m2787o183M0682l17m1308
271b5384L996M3109o723m5949P033M9084o252n1847L752N2686j745n0398N38M5892
285A7792j810m0694M811L5613q220l0267J1244K8490j3943k7542J4999L1269j3360
298H382l4495R727L7701n227l7033J275L5477J600l0902k001K6010K361k0734
311g859j36J8373j872j8649M175K2459l706k7239K030L2269J328l6033l858L7644
$$ plain form
325 18926 25525 -11164 -19374 14127 22708 -5907 -12989 12495 15886 -8255 -9016 16997 15035 -14570
339 -14570 -11715 22080 19359 -19456 -16889 24000 22663 -18391 -18995 18728 20224 -13240 -14235 13704
353 13704 13246 -11682 -8854 14112 8861 -15366 -7437 18826 9137 -21066 -11207 22544 13369 -21521
367 -21521 -15841 17884 14533 -15044 -14301 10545 10473 -9483 -9359 6914 5469 -10277 -6381 10940
381 10940 4625 -17002 -9364 16174 9205 -19147 -14115 14798 12404 -15035 -15954 8675 11902 -9064
395 -9064 -13248 3775 8156 -7818 -9938 6276 5833 -13217 -10145 13094 7700 -18297 -13202 15518
409 15518 11611 -18021 -16604 11835 13827 -11821 -15862 6337 10873 -8373 -11491 6100 7137
422 7137 -11318 -8572 12154 5888 -16958 -8776 17268 8817 -18924 -11788 15788 12109 -13396
$$ packed form
325A8926O599l6689q210L3501Q581k8615p082K5484L391k4141p61K6013j962k9605
339a4570K855L3795k721l8815K567M0889j337m1054o04L7723J496l3464r95K7939
353A3704m58k4928K828K2966n251k4227P929K6263r689l0203R859L3751r175l4890
367b1521N680L3725l351k9577P43K4846p2j9956J24J6273j445j5746L896J7321
381A0940o315k1627P638K5538o969k8352N032K8913k394k7439r19K4629L227k0966
395i064m184J7023M381j5974k120J6214m43j9050L072K3239n394k5997N095K8720
409A5518l907k9632J417K8439J992k5648m041K2199M536j9246l118J7591J037
422G137j8455K746K0726o266k2846Q182K6044q451k7741P136K7576l679k5505
$$ plain form
435 -13396 -12004 10139 11586 -7405 -8919 7559 8170 -6695 -4585 10938 5574 -11265 -2911 16746
449 16746 6740 -14021 -4778 17362 10960 -10578 -7539 12386 13101 -4582 -7542 7484 11793
462 11793 -1765 -3836 8532 7823 -4806 -1338 13346 6963 -9756 -3005 15822 10137 -10170
475 -10170 -7262 13273 13575 -6192 -10069 7962 13135 -3459 -8581 6181 8908 -5752 -4862 9637
489 9637 4816 -11402 -4250 12571 4807 -14280 -8163 11965 7483 -12839 -11877 7586 8921 -9157
503 -9157 -11719 4146 5174 -8916 -8062 4648 61 -12017 -4468 7758 -1425 -14486 -5839 9064
517 9064 1781 -13791 -9515 6591 5723 -9846 -11363 2807 5670 -6184 -8320 2225 2099 -6229
531 -6229 -3566 5121 201 -8767 -2580 8398 3612 -9393 -6061 8927 8912 -7112 -9372 7104
$$ packed form
435a3396J392K2143J447j8991j514J6478O11j4865K110J5523n364j6839Q354J9657
449A6746j0006k0761R243K2140o402k1538L039J9925P15j7683k960J5026M309
462A1793j3558k071J2368p09j2629L468J4684o383j6719O751J8827n685k0307
475a0170K908K0535L02j9767l877J8031N173j6594n122J4762K727j4660Q90J4499
489I637m821j6218P152J6821p764j9087O117K0128m482k0322R62J9463J335j8078
503i157k562J5865J028j4090Q54J2710m587j2078P549J2226r183j3061Q647J4903
517I064p283j5572M276J6106q68j5569j517J4170K863j1854k136J0545j26q328
531f229K663Q687m920q968O187J0978m786j3005L332J4988j5j6024k260J6476
$$ plain form
545 7104 11178 -3435 -7847 6195 8784 -3025 -3074 7663 5646 -4956 13 11184 4973 -7805
559 -7805 -1918 12908 8563 -8025 -5879 11614 11093 -5933 -6382 8876 8579 -4518 -2835 7012
573 7012 3143 -4866 1225 7802 4 -7780 308 9340 2013 -8913 -3923 8328 4772 -8189
587 -8189 -6840 4968 5223 -5027 -5689 1550 1335 -3711 -2292 1230 -2013 -5218 -1564 3221 -597
602 -597 -7582 -4988 4846 3933 -8615 -8963 4498 6749 -6432 -9286 2317 5632 -3586 -5803 1987
617 1987 2505 -4020 -2783 4642 1804 -7188 -3255 8665 4859 -9486 -5864 10753 7763 -8323
631 -8323 -6330 8274 6740 -4845 -2599 6398 3023 -3300 1201 6363 228 -4859 2734 8710 1139
646 1139 -7312 508 10254 2886 -6838 -1665 7834 3878 -3808 -1429 3400 1525 -668 310 190 -1370
$$ packed form
545G104M074j4613m412J4042K589j1809m9J0737k017j0602M969J1171o211j2778
559g805N887J4826m345j6588K146J7493n21j7026m49J5258k97j3097J683R847
573G012l869q009O091O577p798p784Q088R032p327j0926M990J2251l556j2961
587h189J349J1808K55j0250o62P239k15n046J419L522l243l205L654M785l818
602e97o985K594R834r13j2548l48J3461K251j3181k854J1603L315r218k217P790
617A987N18o525J237P425k838q992L933J1920l806j4345L622J6617k990j6086
631h323J993J4604j534j1585K246Q997l375o323M501N162o135n087P593N976p571
646A139q451P820R746p368r724N173R499l956p686K379M829j875k193R78j20j560
$$ plain form
662 -1370 -1253 1537 1658 -1041 -4573 -1712 4087 1200 -6466 -5041 4037 3605 -5464 -7901 353 3941
678 3941 -2261 -6686 -2186 1792 -2361 -5026 -355 532 -5664 -4926 4080 1480 -9910 -6558 7295
693 7295 4091 -10445 -7572 5773 4376 -7398 -5728 3701 1915 -5051 -2660 3645 33 -5602
707 -5602 507 7123 -1333 -8859 1295 10461 584 -8371 807 9521 2472 -4607 819 5497 2622
722 2622 283 2552 2775 1020 1961 4649 3783 -128 -159 4714 6573 1517 -1458 2473 6554 3863
738 3863 -308 -394 3526 6281 2868 -1842 265 5657 3664 -1389 784 3669 6 -795 4107 2937
754 2937 -4518 -2474 6451 3863 -6470 -5267 5578 5505 -5761 -7091 2417 4254 -4478 -5545 2283
769 2283 984 -6780 -3390 3862 -2090 -9900 -1255 6567 -3550 -11690 -2518 5767 -1677 -9308 -3609
$$ packed form
662a370J17K790J21k699l532K861N799k887p666J425R078m32r069k437Q254L588
678C941o202m425M500L978m153k665M671Q87o196P38R006k600j1390L352J3853
693G295l204j4536K873J3345j397j1774J670R429j786o966K391O305l612n635
707e602O109O616q456p526J0154R166r877q955R178Q714p049p079N426M678k875
722B622k339K269K23j755R41K688q66l911l1M873J859n056k975L931M081k691
738C863m171q6L920K755l413m710K107N392j993n053K173K885l663q01M902j170
754B937p455K044Q925k588j0333J203J0845p3j1266j330R508J837q732j067P828
769B283j299p764L390P252n952p810Q645P822j0117q140R172Q285p444p631N699
$$ plain form
784 -3609 2598 -1467 -5976 -2663 237 -2822 -3950 -89 -14 -4996 -4534 2771 2061 -5165 -5116 1335 2527
801 2527 -2229 -3155 -1167 721 1342 -193 -2796 -910 3257 2281 -2052 -1119 1919 1387 356 1707
817 1707 1637 -606 169 4022 3296 -1627 -1985 4787 6473 -1486 -4455 4079 8274 -526 -3795 3939
833 3939 5691 -1949 -840 5420 2773 -3523 1211 7115 1044 -5483 938 8368 2386 -5730 -1263
848 -1263 6684 3358 -4048 -1304 4438 1197 -3038 1150 3449 -1763 -2424 3949 2680 -4136 -3058
863 -3058 4072 3355 -2776 -3256 709 2157 42 -1605 -1194 262 1016 -24 -1090 -1487 -449 1219
879 1219 793 -1530 -1363 201 471 -140 -203 -1290 -1803 1118 2667 -1714 -4473 1795 4809 -1700 -5574
896 -5574 519 3911 -806 -2777 647 1284 -2033 -1288 1792 565 -3712 -1278 3830 1100 -5718 -2795
$$ packed form
784c609O207m065m509L313K900l059j128L861P5m982M62P305p10p226M9O451J192
801B527m756r26J988J888O21j535k603J886M167r76m333R33L038n32j031J351
817A707p0k243P75L853p26m923l58O772J686p959k969Q534M195q800l269P734
833C939J752p640J109O260k647o296M734N904o071o527O421P430n982q116M467
848a263P947l326p406K744N742l241m235M188K299n212o61O373j269o816J078
863c058P130p17o131m80L965J448k115j647M11J456P54j040j066l97J038J668
879A219m26k323J67J564K70o11o3j087n13K921J549m381k759O268L014o509l874
896e574O093L392m717j971L424O37l317P45L080j227m277K434N108k730o818K923
$$ plain form
912 -2795 5414 2958 -5256 -3235 3804 1716 -3644 -1019 2391 -1093 -2663 1545 1956 -2920 -2945 2605
928 2605 2810 -2909 -4351 959 3491 -523 -3644 -432 1986 -576 -1680 229 -88 -877 701 562
944 562 -2115 -1990 1335 1734 -1142 -1788 -434 293 1023 346 -1520 -1859 1300 2658 -897 -2807 356
961 356 3144 1000 -2195 -935 1394 1302 -480 595 1114 -886 -622 2611 1819 -2962 -1306 4725 2937
978 2937 -3264 -1987 4068 3347 -1782 -1210 2257 1296 -507 754 1911 50 -1054 1761 2882 -625
994 -625 -2971 1864 4741 -394 -3933 891 3900 164 -1728 624 1402 -225 485 792 -195 -1056 940
1011 940 1810 -374 -1781 -395 2111 1405 -1401 -2084 164 1616 -18 -1338 -1063 -114 971 676 -1843
1028 -1843 -1654 658 1580 -1317 -1601 -27 -590 -727 913 -624 -2584 -1033 2084 673 -3189 -1860
$$ packed form
912b795Q209k456q214K021P039k088n360K625L410l484j570M208M11m876k5N550
928B605K05n719j442N310K532m014l121L212K418k562j104J909l17p89J578j39
944E62k677J25L325L99k876o46J354P27P30o77j866l39L159J358l555j910L163
961C56K788k144l195J260K329r2j782J075N19k000K64L233p92m781J656O031j788
978B937o201J277O055p21n129N72L467r61j803J261J157j861j104K815J121l507
994f25k346M835K877n135l539M824L009l736j892K352P78j627P10L07r87q61J996
1011I40Q70k184j407J386K506p06k806o83K248J452j634j320K75R49J085k95k519
1028a843J89K312R22k897k84J574n63j37J640j537j960J551L117j411l862J329
$$ plain form
1044 -1860 1752 1355 -2070 -2624 431 1537 -401 -1644 -589 248 -1477 -683 1269 -1013 -3031 210
1060 210 2875 -1386 -4135 192 3044 -260 -2913 -671 1018 302 -517 -467 -179 -337 -365 217 -80 -1765
1078 -1765 -1121 1969 975 -2285 -2205 1480 1948 -1093 -1515 -39 598 195 599 -1014 -810 1014 1146 -615
1096 -615 -1301 -58 801 908 266 -1045 -678 1134 1446 138 -935 35 1490 1845 -520 -1382 862
1113 862 2729 766 -1272 539 1921 501 188 1622 266 -839 1584 2338 -93 -1402 936 2596
1129 2596 832 -1652 -564 2408 2000 -296 -828 1243 1257 330 569 1340 -337 -385 2430 1511 -1581
1146 -1581 -1064 1995 1796 -1222 -1359 807 1008 314 -726 -949 -22 617 62 -626 -524 -800 83 880
1164 880 -1056 -2054 -486 1189 -143 -1703 -1059 -374 -258 -53 -1251 -2171 -428 660 -784 -2522 -1165
$$ packed form
1044a860L612l97l425n54L055J106j938j243J055Q37j725P94J952k282k018L241
1060B10K665m261k749M327K852l304k653K242J689p16q19N0K88j58k8N82k97j685
1078a765O44L090r94l260Q0L685M68l041m22J476O37m03M04j613K04J824J32j761
1096f15o86J243Q59J07o42j311L67J812L12j308j073R70J455L55k365q62K244
1113H62J867j963k038J811J382j420l13J434j356j105K423P54k431j309K338J660
1129B596j764k484J088K972m08k296n32K071J4r27K39P71j677m8K815r19l092
1146a581N17L059j99l018j37K166K01o94j040k23R27O39n55o88J02k76Q83P97
1164H80j936r98J568J675j332j560O44O85J16K05j198r20J743J088j444j738J357
$$ plain form
1181 -1165 223 -559 -1251 -1035 -1498 -1043 231 -480 -1681 -1659 -716 409 -99 -2255 -1970 1236 1100 -2066
1199 -2066 -2039 665 743 -822 -655 -87 -612 -417 779 291 -1255 -728 1428 1534 -757 -1143 682 2037
1217 2037 543 -1167 -62 1731 1093 -150 418 736 109 1029 1894 238 -293 1390 2298 520 -638
1234 -638 487 1590 1322 897 129 310 1718 1762 487 120 768 1395 1485 244 -714 780 1766 781 -166
1253 -166 -37 539 515 912 471 -884 -612 1937 1451 -1521 -1372 1026 1187 -526 -1251 -217 -201 -138 -245
1272 -245 -448 -1199 -823 -110 114 -931 -2066 75 1170 -681 -2867 -614 1034 -740 -1572 -888 -272
1289 -272 -840 -369 -153 -1275 -1306 308 808 -1135 -1875 -801 310 311 -1417 -1516 178 311 -383 -735 -495
1308 -495 -194 -115 869 -386 -1320 304 1568 -77 -1558 168 825 120 -212 -250 -455 54 1229 472
$$ packed form
1181a165J388p82o92K16m63M55J274p11j201K2R43J125n08k156K85L206j36l166
1199b066K7K704P8j565J67N68n25J95J196m88j546N27K156J06k291l86J825J355
1217B037j494j710J105J793o38j243N68L18o27R20Q65j656n31J683R08j778j158
1234f38J125J103k68m25p68J81J408M4j275l67O48O27R0j241r58J494R86r85r47
1253a66J29N76k4L97m41j355K72K549m86k972J49K398J61j713p25J034J6O3j07
1272b45k03p51L76P13K24j045j135K141J095j851k186K253J648j774q32O84O16
1289b72n68M71K16j122l1J614N00j943p40J074J111Jj728r9J694J33o94l52K40
1308d95L01P9R84j255r34J624J264j645j481J726O57p05l32l8k05N09J175p57
$$ plain form
1326 472 -894 -754 810 1201 -417 -1192 -186 1048 610 -822 -155 544 -124 -211 667 -7 -1079 482
1344 482 1788 -271 -1969 415 1926 132 -1450 -58 536 -63 -86 112 -488 -200 484 531 -98 -750
1362 -750 -219 1157 519 -1508 -570 1257 890 -880 -17 597 67 320 586 -177 -921 796 2005 -153
1380 -153 -1103 24 1195 551 -386 -146 502 956 387 351 -178 287 500 1317 230 -971 -110 1917 1062
1399 1062 -1129 -62 1518 865 -407 390 353 -612 758 1260 -537 -1198 500 1380 277 -1143 -242
1416 -242 856 672 -543 -600 392 219 -309 123 -236 -1211 -438 1345 49 -2047 -931 1428 150 -1838
1434 -1838 -959 299 -552 -880 -6 -846 -1502 -146 396 -378 -1544 -542 473 2 -1878 -1500 563
1451 563 428 -1216 -991 55 -551 -675 342 -397 -1358 -758 1084 -45 -1908 -693 897 282 -924
$$ packed form
1326D72j366J40J564L91j618p75J006J234m38j432O67O99o68q7Q78o74j072J561
1344D82J306k059j698K384J511j794j582J392N94n99k3J98o00K88O84M7o29o52
1362g50N31J376o38k027R38J827l67j770Q63O14n30K53K66p63p44J717J209k158
1380a53r50J127J171o44r37K40O48M54n69l6n29M65K13Q17j087j201Q61K027q55
1399A062k191J067J580o53j272P97l7r65J370N02j797o61J698Q80j103j420R01
1416b42J098j84j215n7R92j73n28M32l59r75P73J783j296k096J116K359j278j988
1434a838Q79J258q51l28Q74q40o56J356N42p74j166J002J015m71j880L78K063
1451E63j35j644K25J046o06j24J017p39r61O00J842j129j863J215J590o15j206
$$ plain form
1468 -924 -388 -213 5 -121 243 -72 -403 173 995 403 -1193 -794 1297 1493 -793 -646 1249 930 -314
1487 -314 315 1067 -339 67 2090 786 -871 109 2292 885 -629 -5 1587 958 -48 435 775
1504 775 796 397 693 693 46 -81 960 1776 -1152 -748 1938 1781 -658 -573 1163 676 -218 385 485 -212
1524 -212 -273 1081 431 -943 -430 1147 918 -565 -1223 43 795 -357 -641 135 410 -600 72 134
1542 134 -1065 -835 700 626 -1377 -1426 947 242 -1132 -725 -80 -244 -622 -186 -252 -1008 -418 -256 -232 -1150
1562 -1150 -1163 189 889 -1151 -1645 82 277 -906 -852 106 -294 -1120 316 605 -1426 -1251 1027 819
1580 819 -1438 -929 675 310 -594 -643 -300 -456 -250 -186 126 -341 -425 390 716 -855 -1529 237 1418
1599 1418 -470 -1242 667 342 -418 -139 706 -106 -295 536 706 -675 -559 743 1139 -214 -688 263
$$ packed form
1468i24N36J75K18j26L64l15l31N76Q22n92j596L99K091J96k286J47J895l19j244
1487c14O29P52j406M06K023j304j657R80K183j407j514O24J592o29j006M83L40
1504G75K1l99K96%o47j27J041Q16k928M04K686j57k439Q5J736m87q94O03J00o97
1524b12o1J354o50j374N13J577k29j483o58J266P52j152k84P76K75j010O72O2
1542A34j199K30J535p4k003m9K373p05j374M07O45j64l78M36o6p56N90J62K4r18
1562a150j3J352P00k040m94J727J95j183N4R58m00q26J436K89k031J75K278k08
1580H19k257N09J604l65r04m9L43j56K06O4L12m67q4Q15L26j571o74J766J181
1599A418j888p72J909l25p60K79Q45q12j89Q31J70j381J16J302L96j353m74R51
$$ plain form
1617 263 1101 645 4 340 550 282 199 735 331 -445 935 1366 52 -1079 1183 1581 -190 -209 777
1636 777 436 216 320 911 -70 191 939 949 -568 -697 765 1251 266 -537 30 859 168 -610 337 574
1656 574 -491 -45 1056 -232 -880 174 1446 -652 -1330 -155 544 172 -788 -34 115 -295 -130 -135
1674 -135 -521 -439 -229 325 -334 -1214 -661 784 115 -1426 -697 451 -561 -812 -170 -212 -1150 -84 104
1693 104 -616 -1231 212 498 -613 -563 -478 348 130 -669 -528 -239 -49 -499 -105 -291 -648 -447 973 10
1713 10 -1349 -359 1206 372 -1096 -152 659 -87 -350 348 -163 -518 134 600 -80 -737 251 731 297
1732 297 -642 -354 463 743 -215 29 576 147 -133 516 517 -721 -247 1057 48 -799 -274 1226 437
1751 437 -122 156 306 305 635 108 -75 288 293 596 207 -294 -373 908 1059 -321 -582 555 589 -112 13
$$ packed form
1617B63Q38m56o41L36K10k68q3N36m04p76J380M31j314j131K262L98j771j9R86
1636G77l41k20J04N91r81K61P48J0j517j29J462M86r85q03N67Q29o91p78R47K37
1656E74j065M46J101j288o48J054J272k098o78J175O99l72r60P54J49m10J65n
1674a35l86Q2K10N54o59q80N53J445o69j541P29J148j012k51O42m2r38J066J88
1693A04p20o15J443K86j111N0Q5Q26k18p99J41K89J90m50L94j86l57K01J420r63
1713A0j359R90J565q34j468R44Q11p46k63O98n11l55O52M66o80o57R88M80m34
1732B97r39K88Q17K80r58K44N47m29k80O49Jj238M74J304j009q47N25J500p89
1751D37n59K78J50jL30n27j83L63NL03l89n01p9J281J51j380k61J137L4p01J25
$$ plain form
1772 13 317 -469 -246 455 66 -727 125 1017 204 -968 -193 739 261 -362 -51 -68 63 113 281 146 -181
1793 -181 -396 200 307 -640 -788 762 389 -356 -500 318 395 -634 -278 17 -657 -298 412 243 -725 -176
1813 -176 435 118 -321 -653 -207 336 337 -599 49 -111 -318 -421 392 -408 -740 297 327 -916 -721 568
1833 568 325 -745 -595 -208 -136 -234 -11 -240 -319 -68 -99 -104 -488 -326 -252 162 28 -963 -313 149 -545 -625
1855 -625 -31 -241 -623 -3 115 -668 -727 121 249 -846 -361 598 187 -274 -168 178 274 363 199 69 195
1876 195 23 367 775 280 -175 174 999 21 -567 476 943 188 107 482 310 139 738 776 -33 70
1896 70 944 786 109 58 138 547 688 -182 165 683 552 24 234 361 71 187 773 494 -493 357 786
1917 786 20 -481 -82 564 -211 -136 495 -142 69 57 321 -96 -223 -73 172 -158 -651 -354 3 31 -648
$$ packed form
1772A3L04p86K23P01l89p93Q52Q92q13j172P75R32m78o23L11j7J31N0J68j35l27
1793a81k15N96J07r47j48J550l73p45j44Q18P7j029L56K95o74L59P10j69r68N49
1813a76O11l17m39l32M46N43Jr36O48j60k07j03Q13q00l32J037L0j243J95J289
1833E68k43j070J50L87P2r8K23k29p9K51l1nl84J62P4M14j34r91O50M62o94q0
1855f25N94k10l82O20J18p83n9Q48J28j095M85R59m11m61J06L46R6Q9j64j30J26
1876A95j72L44M08m95m55L49Q25r78n88J043M67p55q1L75j72j71N99L8q09J03
1896G0Q74j58o77n1Q0M09J41q70L47N18j31n28K10J27k90J16N86k79r87Q50M29
1917G86p66n01L99O46p75P5O31o37K11j2K64m17j27J50K45l30m93K97L57K8o79
$$ plain form
1938 -648 3 -94 -411 -259 144 -352 -944 -144 550 -576 -1224 -139 171 -192 -440 -523 177 -596 -364 -727
1958 -727 -477 -437 -411 -100 -70 -586 -356 440 54 -918 -789 720 42 -446 70 -170 -586 -82 325 167 -368
1979 -368 41 117 -130 -52 -220 267 70 -122 -96 135 296 70 268 186 -7 166 465 317 -433 -6 800
2000 800 406 -209 212 574 128 431 545 421 73 561 513 138 -120 434 984 382 -168 133 706 554
2020 554 -201 60 169 344 -186 197 419 -186 -211 782 904 -628 66 974 229 -504 232 188 -68 -75 12
2041 12 -21 3 -31 117 348 -297 -283 137 442 20 -553 29 440 -416 -381 -31 -105 -343 -63 8 -587 -433 423
2064 423 -29 -788 -172 -95 -136 -89 -134 -70 -400 -206 -194 -423 -213 -423 133 18 -705 -612 136 19 -480 -679
2086 -679 37 180 -665 -351 317 -570 -194 368 -100 -507 -332 136 19 -641 -197 -158 138 -215 -133 -157 224
$$ packed form
1938f48O51r7l17J52M03m96n92Q00O94j126o48J085L10l63k48q3P00p73K32l63
1958g27K50M0K6L11L0n16K30P96l86r72J29J509o78m88N16k40m16N04M07j58n35
1979c68M09P6k47P8j68M87j97j92K6K31J61k26J98q2j93J73K99j48p50M27Q06
2000H00l94o15M21L62m46L03J14j24l48M88m8l75k58N54N50o02n50L01N73j52
2020E54p55K61J09J75n30L83K22o05k5R93J22j532O94R08p45p33P36m4k56pQ7
2041A2l3K4l4J48K31o45J4M20L05m22n73N82M11q56L5L50p4k38K80P1n95J54Q56
2064D23m52p59O16P7m1M7m5O4l30J94J2k29K10k10N56j15p23R3P48j17m99j99
2086f79P16J43q45L14O68q87L76N62m68m07J75M68j17o60M44L9K96l53Q2k4L81
$$ plain form
2107 224 -344 -296 15 -302 -504 412 542 -372 -339 731 373 -324 -233 209 4 98 -36 250 -110 75 288
2128 288 21 -94 -62 196 335 166 -287 -12 559 -38 -268 433 173 -13 125 550 69 140 637 448 -130
2149 -130 -147 665 101 132 -174 171 87 299 448 416 105 70 537 270 -59 -416 376 407 179 -385 317 398
2171 398 -8 3 254 196 -157 172 572 -331 -401 606 403 174 -113 264 375 -73 -459 -119 59 -141 -41
2192 -41 85 266 -656 -94 482 -72 -511 350 624 -275 -321 -134 231 -209 -41 304 -288 -470 -262 -177 -316
2213 -316 -138 184 -13 -264 -205 -27 199 -473 -354 -166 135 -370 -412 144 -423 -715 120 321 -498 -393 -225
2234 -225 9 -175 -382 70 87 -303 111 189 -313 -402 -143 -107 -64 -625 -83 444 196 -630 -89 375 31 -37
2256 -37 47 445 -137 -76 666 16 -439 139 588 82 -196 477 442 190 119 234 207 -26 109 563 197 -71
$$ packed form
2107B24n68M8L11l17k02R16J30r14L3J070l58o97R1M42k05R4j34K86l60J85K13
2128B88k67j15L2K58J39j69m53K75N71n97k30P01k60j86J38M25m81P1M97j89n78
2149a30j7Q12n64L1l06L45q4K12J49l2l11l5M67k67l29l57P92L1k28n64P02Q1
2171C98m06J1K51n8l53L29M00r03p0J007k03k29k87L77J11m48l86L40J78k00J00
2192d1J26J81r22N62N76n54m39Q61K74q99m6J87L65m40J68L45n92j82K08Q5j39
2213c16J78L22j97k51N9J78K26o72J19J88L01n05m2N56n67k92Q35K01q19J05J68
2234b25K34j84k07M52J7l90M14P8n02q9K59L6M3n61N42N27k48q26N41M64l44o8
2256c7Q4L98n82O1P42o50m55N78M49n06k78O73l5k52p1J15k7k33J35M54l66k68
$$ plain form
2278 -71 316 545 303 -136 106 347 313 -242 302 454 303 14 500 205 140 657 826 -236 130 484 241
2299 241 299 -154 -27 355 45 -118 -138 445 -51 -205 150 543 -365 -148 292 -186 -507 -222 604 -123 -285
2320 -285 -69 252 -400 -170 374 -97 -178 -65 10 -19 -424 -348 86 223 -406 -712 -75 -149 -478 -357 110 -413
2342 -413 -625 49 -334 -480 -557 7 -65 -639 -252 36 14 -577 -437 -444 -193 -26 -76 -425 -413 -339 29 45 -330
2365 -330 -384 266 207 -615 -73 347 -202 -506 122 88 -97 -275 691 67 -431 -21 585 80 -272 195 151
2386 151 188 -29 110 277 119 166 47 481 224 129 221 505 -70 14 502 684 23 113 478 5 11 349 374
2409 374 -364 84 150 268 -25 143 155 485 267 102 316 560 219 80 294 196 2 187 215 -89 -496
2430 -496 416 278 -455 -269 251 -164 153 -167 117 -281 -171 -186 -10 -244 -145 -162 -150 -559 -439 255 31
$$ packed form
2278g1L87K29k42m39K42K41l4n55N44J52j51k89M86k95o5N17J69j062L66L54k43
2299B41N8m53J27L82l10j63k0N83m96j54L55L93r08K17M40m78l21K85Q26p27j62
2320b85K16L21o52K30N44m71q1J13P5k9m05P6M34J37o29l06O37p4l29J21M67n23
2342d13k12O74l83j46p7N64p2n74L87K88k2n91J40pK51J67n0l49J2P4L68J6l75
2365c30n4O50n9q22N42M20n49l04O28l4j85j78R66o24m98M10O06n05l52M67m4
2386A51L7k17J39J67j58M7j19M34k57r5R2K84n75Q4M88J82o61R0L65m73OL38K5
2409C74p38M48O6J18k93J68J2L30k18j65K14K44l41j39K14r8j94J85K8l04m07
2430d96R12j38p33J86N20m15L17l20K84l98J10j5J76k34R9j7J2m09J20O94k24
$$ plain form
2451 31 3 -145 155 312 -479 -370 115 -320 -603 30 345 -304 -351 142 235 -390 34 -106 -122 -391 -222 -198
2473 -198 -57 -121 -315 -55 -110 -512 37 433 -127 -169 111 219 -420 -307 -274 53 -353 160 422 -291 -233 7
2495 7 32 40 -89 234 294 -27 -164 93 274 -225 29 312 128 -132 43 241 -268 -541 76 477 -251 -11
2517 -11 205 414 -155 -66 509 168 -122 -99 288 182 74 351 202 4 -108 307 87 32 -105 102 502
2538 502 21 -38 194 281 -16 72 500 216 -353 257 433 -45 -222 175 293 267 118 33 409 107 224 171
2560 171 51 110 -15 361 327 -108 185 76 -3 -233 411 339 -65 -8 252 387 -230 -31 274 14 9 66 77
2583 77 120 11 -98 -46 -43 -187 -19 -144 -346 -661 36 -35 -99 -191 369 -101 -655 -392 453 -69 -716 -58 380
2606 380 -314 -152 -116 -77 -155 -336 -257 -379 -130 -216 -145 -42 -477 -510 23 124 72 -274 61 -101 -320 75 -9
$$ packed form
2451C1k8j48L00J57p91J09M85m35k83O33L15o49m7M93R3o25M24j40j6k69J69K4
2473a98J41o4j94K60n5m02N49L96n60m2K80J08o39J13L3L27m06N13K62p13N8K40
2495GK5Qj29L23O0l21j37K57J81m99K54K83j84k60J75J98n09k73O17M01p28K40
2517a1K16K09n69Q9N75l41k90K3L87j06j08K77j49j98j12M15k20n5j37K07M00
2538E02m81n9K32Q7k97Q8M28k84n69O10J76m78j77L97J18k6j49q5L76l02J17n3
2560A71j20N9j25L76l4m35K93j09p9k30O44p2m04N7K60J35o17J99L05k60nN7J1
2583G7M3j09j09N2Lj44J68j25k02l15O97p1o4r2N60m70n54K63Q45n22o47O58M38
2606C80o94J62L6L9p8j81P9j22K49q6P1J03m35l3N33J01n2l46L35j62k19L95q4
$$ plain form
2629 -9 -200 40 28 78 -276 -67 155 -118 -164 81 120 -96 110 78 128 112 -218 195 199 173 285 174 135 142 -138
2654 -138 410 81 -164 102 238 10 113 293 335 12 134 338 13 125 -52 460 203 -178 304 239 106
2675 106 -41 341 407 227 248 176 203 -68 -273 212 214 -281 75 555 140 172 304 318 -346 137 -199 -63 -162
2698 -162 358 74 -13 56 -172 93 -43 115 -262 -124 32 -89 -7 28 -375 -204 -289 138 -151 -108 143 -213
2720 -213 -309 56 393 -114 -162 -168 -104 -208 -225 129 -572 -164 -431 -194 -33 -122 -485 -492 41 179 30 133 -218
2743 -218 -426 23 -53 -337 -424 -251 -36 -156 -490 -131 -56 -198 385 -15 -123 -136 -493 18 35 -92 -113 -134
2765 -134 28 -456 69 290 288 -190 276 76 -129 -118 361 78 54 -1 61 116 86 166 168 4 105 -79 317 142
2789 142 278 374 396 166 -11 201 241 100 114 513 213 171 74 130 -61 -31 3 113 -116 456 108 83 78 -24
$$ packed form
2629ij91K40j2N0l54K09K22k73m6K45L9k16K06l2N0j6l30M13Mk6J12j11l9Pk80
2654a38N48l29k45K66J36k28J03J80M2l23J22K04l25J12j77N12k57l81M82o5j33
2675A06j47L82O6j80K1p2K7k71k05M85Km95L56M80m15L2J32J4o64M83l36J36r9
2698a62N20k84q7O9k28K65j36J58l77J38J56j21Q2L5m03J71q5M27k89M3K51l56
2720b13r6L65L37n07m8oO4j04j7L54p01M08k67K37J61q9l63pN33J38j49J03l51
2743b18k08M49p6k84q7J73K15j20l34L59P5j42N83m00j08j3l57N11J7j27k1k1
2765a34J62m84N25K21km78M66k00k05J1M79k83k4n5O2N5l0Q0Kj64J01j84L96j75
2789A42J36R6K2k30j77K12M0j41J4L99l00m2r7N6j91L0L4J10k29N72l48k5nj02
$$ plain form
2813 -24 334 -48 108 204 276 105 219 -103 25 108 108 157 208 -140 -101 92 162 -290 -16 297 -171 179 177 115
2837 115 246 78 54 -78 207 -2 -126 -209 168 -156 181 -263 -300 -229 65 -224 -295 73 37 8 -534 35
2859 35 -315 -370 -63 54 -92 -406 236 -199 -294 -397 -39 -68 -169 4 -213 -215 -105 -164 -102 0 -196 -316 88
2882 88 0 -115 -117 -4 230 -308 114 51 -157 -68 353 -213 -36 -65 264 480 293 51 -152 -131 -108 -214 110
2905 110 168 -104 -246 141 300 -6 441 187 -51 200 713 258 72 141 71 193 -73 74 243 -203 140
2926 140 -92 32 -23 178 217 89 348 85 141 42 52 73 10 85 -289 268 340 13 -295 307 190 -173 99
2949 99 410 -135 -138 312 -115 -9 -96 -3 -232 -97 -381 34 77 -163 -146 -127 4 -171 -104 171 307 -70 -84
2972 -84 -144 -103 -228 296 149 -391 98 247 5 -166 2 -98 -55 1 -65 78 54 -261 -101 -87 -181 -283 -160
$$ packed form
2813b4L58l82J56R6P2j71J14l22J28Q3%M9N1l48L9J93P0m52K74L13m68L50ko2
2837A15J31j68k4j32K85k09j24q3L77l24L37m44l7P1K94k89p1L68l6k9n42N69
2859C5l50n5L07J17j46l14O42m35r5j03L58k9j01J73k17kJ10n9O2J02j96j20M04
2882H8q8j15kJ13K34n38M22o3k08Q9M21n66J77k9L29K16j87k42k03K1K3j06L24
2905A10N8k72j42L87J59l06M47k54k38K51N13m55j86O9p0J22k66J47J69m46L43
2926A40k32J24n5K01L9j28K59k63N6r9J0K1o3P5l74N57P2l27l08O02j17l63K72
2949I9L11n45lM50m27J06q7R3k29J35k84M15M3k40J7J9J31j75O7K75J36l77j4
2972h4o0M1j25N24j47n40M89J49k42j71J68j00M3N6o6J43k4l15J60J4r4j02J23
$$ plain form
2995 -160 -2 -114 -200 10 -52 -86 -169 284 -166 -466 -178 -57 -102 -59 25 178 185 -76 -230 -88 -27 -347 -109
3018 -109 -315 -165 -121 -68 56 -331 -128 168 3 -381 -311 4 -190 -116 84 -62 205 127 109 3 -17 -68 367
3041 367 -127 -18 251 346 115 -20 212 406 421 -16 47 90 131 93 55 76 261 33 286 -126 117 604 381
3064 381 -98 117 413 -171 136 234 74 280 99 180 135 222 -82 232 -98 -108 -23 32 334 -197 -141 -83 221
3087 221 -98 -273 246 133 -78 20 91 -15 -55 92 -26 -406 209 -138 -268 -273 -418 -54 -59 -104 -313 16 -140
3110 -140 -56 -383 22 194 -164 -77 30 2 -392 -239 -259 -16 -247 -174 -168 -19 136 -245 -15 -76 -141 93 -255
3133 -255 -339 -321 -45 -121 -47 156 120 69 -326 277 -79 -67 77 -217 23 -108 40 71 -513 23 108 -70 64
3156 64 81 -10 -40 -92 -224 57 158 -7 -95 8 -237 -66 11 120 76 -123 273 -19 -81 -97 279 56 -47
$$ packed form
2995a60J58j12q6K10o2l4q3M53m50l00K88J21m5M3Q4J53Pk61j54J42O1l20K38
3018a09k06J50M4N3J24l87K03K96j65l84P0L15j94P4K00j46K67p8j8j06k0n1M35
3041C67m94J09K69R5k31j35K32J94J5m37O3M3M1l8l8K1J85k28K53m12K43M87k23
3064C81m79K15K96n84L07R8j60K06j81Q1m5Q7l04L14l30j0Q5N5L02n31N6N8L04
3087B21l19j75N19j13k11R8P1j06m0J47j18l80O15l47j30nj45L64nm5k09L29j56
3110a40Q4l27M05J72l58Q7J07k8l94J53k0K43k31P3OJ49J55l81K30o1o5K34l48
3133b55q4J8K76p6P4K03l6n1l95O03l56J2J44k94K40j31J48L1n84N36Q5j78J34
3156F4J7r1l0n2j32K81J01j65q8J03k45J71P7J09m4j99L96k92o2j6L76k23j03
$$ plain form
3179 -47 -35 187 -25 167 323 440 326 85 -19 144 314 147 121 465 477 -240 90 159 -115 -137 484 62
3201 62 -143 -17 65 -244 27 38 -12 -143 -121 38 -123 -141 11 -36 77 -73 -237 -145 333 -114 -285 -299 259
3224 259 -326 -52 75 94 -319 -154 263 -383 -90 200 -92 -422 -123 132 96 -68 -287 -320 -403 203 -211
3245 -211 -377 13 -397 -234 56 -72 -73 75 3 -176 -458 138 12 -318 181 -68 -386 -106 -274 -125 93
3266 93 -68 -61 -114 -37 -159 -198 -169 56 -90 -249 206 56 -341 192 212 -110 167 123 -284 -71 397 -107 -253
3289 -253 -12 218 -60 169 190 61 -346 -259 -74 129 168 -104 20 300 225 146 72 375 -54 51 256 546
3311 546 321 349 346 -111 -92 171 330 -158 -20 135 -30 -124 45 243 202 -216 119 382 23 134 197 67
3333 67 124 187 -120 51 -121 -147 229 233 103 470 274 102 -276 -73 47 -56 -27 150 20 -25 118 -5 297
$$ packed form
3179d7J2K22k12J92J56J17j14k41j04J63J70j67k6L44J2p17L30O9k74k2O21m22
3201F2k05J26Q2l09K71J1n0j31K2J59j61j8J52m7J13j50j64R2M78m47j71j4N58
3224B59n85K74J27J9m13J65M17o46K93K90k92l30K99K55l6j64k19l3q3O06m14
3245b11j66L90m10J63K90j28jJ48p2j79k82N96j26l30M99k49l18K80j68J49K18
3266I3j61Pn3P7j22l9K9K25j46j59M55j50l97N33K0l22K77m4m07K13M68n04j46
3289b53K41K30k78K29K1j29m07Q7J85K03L9k72J24K80p5p9p4L03m29J05K05K90
3311E46k25K8lm57J9K63J59m88J38J55j65r4J69J98m1m18L35K63l59J11O3j30
3333F7N7O3l07J71j72k6L76Mj30L67j96j72l78K03J20j03K9J77j30m5J43j23L02
$$ plain form
3356 297 -232 237 65 66 -132 -17 -50 61 -122 -142 195 -23 -491 189 171 179 -68 -29 -63 -216 -118 -127 155 -300
3380 -300 -75 29 -237 45 -12 30 181 1 120 -55 163 -79 -225 -178 8 -22 160 232 1 -113 143 -133
3402 -133 -496 253 -252 -126 -36 -16 218 22 353 37 126 -103 -124 77 232 -279 -170 298 -25 -182 16
3423 16 377 53 -370 367 117 152 50 283 57 -273 22 -60 -128 375 -39 192 -205 59 132 56 279 172
3445 172 95 234 68 -97 128 105 -133 64 278 287 122 240 22 -79 -48 151 -149 -32 271 107 114 -12
3467 -12 -95 274 117 -169 148 13 138 -247 3 -128 -81 -429 -275 274 -215 -43 270 -499 -36 -262 190
3488 190 -39 -275 -327 -68 -315 -186 24 5 228 -260 35 -366 303 33 -119 -135 -266 159 -400 -182 -293
3509 -293 -283 -23 63 -291 442 135 -22 -259 -472 33 -134 -4 71 -248 -98 71 -270 -42 -206 34 -85
$$ packed form
3356B97n29M69j72Jj98J15l3J11j83k0L37k18m68O80j8Qk47L9l4j53R8rK82m55
3380c00K25J04k66K82n7M2J51j80J19j75K18k42j46M7J86l0J82P2k31j14K56k76
3402a33l63P49n05J26R0K0K34j96L31l16Q9k29k1K01J55n11J09M68l23j57J98
3423A6L61l24m23P37k50L5j02K33k26l30K95q2o8N03m14K31l97K64P3p6K23j07
3445A72p7J39j66j65K25k3k38J97K14Rj65J18k18j01L1J99l00J17L03j64Pj26
3467a2q3L69j57k86L17j35J25l85K50j31M7l48J54N49m89J72L13p69M63k26M52
3488A90k29k36n2K59k47J29K10j9K23m88K95m01O69k70j52j6j31M25n59K18j11
3509b93J0K60Q6l54P33l07j57k37k13N05j67J30P5l19J50J69l41K28j64K40j19
$$ plain form
3530 -85 -49 -115 -218 -119 -182 135 -191 176 -252 -11 198 333 18 96 146 -59 66 543 185 -196 196 -16
3552 -16 125 -27 113 30 63 177 33 272 187 -13 -129 218 -191 162 386 414 -34 118 124 72 -92 191 291
3575 291 277 190 29 427 205 1 190 103 12 163 -17 232 31 252 101 -134 151 88 156 132 161 109 -103
3598 -103 -58 164 6 -83 133 151 71 -18 35 142 179 129 46 87 -301 -52 215 317 288 330 -190 44 -48 72
3622 72 -286 -85 113 -77 -273 -112 -264 54 -35 93 -132 32 -8 -249 -315 -354 236 -78 7 -117 -238 -93
3644 -93 1 331 45 -172 -195 82 -278 -14 33 -99 379 -69 -205 -52 -272 59 -19 118 95 -210 74 68 269
3667 269 -11 124 -214 52 -402 36 305 44 -429 237 170 -72 -11 95 275 -37 117 298 9 117 228
3688 228 43 48 237 225 106 -77 199 328 -158 71 302 62 27 14 -123 335 513 49 49 436 429 124 312
$$ packed form
3530h5L6o6j03R9o3L17l26L67m28K41K09J35l15P8N0k05J25M77l58l81L92k12
3552a6J41j52J40q3L3J14j44K39q5k00j16L47m09L53K24K8m48J52On2j64K83J00
3575B91j4q7j61L98k22k04J89q7r1J51j80K49k01K21j51k35K85o3O8k4K9n2k12
3598a03M5K22j58q9K16J8q0q9N3J07L7n0q3M1l88K49K67J02k9M2n20K34r2J20
3622G2l58K01J98j90j96J61j52L18q9J28k25J64m0k41o6l9N90l14Q5j24j21J45
3644i3R4L30k86k17k3K77l60K64M7j32M78m48j36J53k20L31p8J37k3l05K84oK01
3667B69k80J35l38K66m54M38K69k61m73O66o7k42O1J06J80l12J54J81k89J08J11
3688B28j85NJ89j2j19j83K76J29m86K29K31k40l5j3j37M58J78m64%L87pl05J88
$$ plain form
3711 312 11 -257 -93 306 174 -54 165 25 195 -112 -3 132 -206 -57 217 149 -74 -55 25 290 15
3732 15 -135 -50 53 92 -96 -118 245 115 210 -31 -97 -13 67 -95 131 162 -81 67 -268 -246 72 -168 88
3755 88 -401 -111 -152 -161 -189 364 78 -117 -232 -48 -122 -456 311 50 -93 -17 56 85 -263 -65 12 -117 32
3778 32 17 23 -240 -80 -143 -138 32 266 -254 49 -174 -54 6 55 173 -62 290 150 -92 105 -130 -56 -62 -228
3802 -228 117 53 -66 -118 154 99 -215 97 86 -13 6 50 -276 -135 -182 -120 134 172 -184 18 32 -108 325 122
3826 122 -119 140 72 -36 44 71 122 40 202 65 13 230 23 -122 205 94 87 -236 118 73 10 -106 62
3849 62 -32 291 -135 112 -60 59 -81 22 -104 -149 172 -105 236 11 -218 -88 -16 -110 70 119 127 59 75
3872 75 -129 129 20 -60 100 -93 86 -213 -155 82 135 -51 -66 49 -285 -56 209 225 -290 -289 -386 62 -78
$$ packed form
3711C12l01k68J64L99j32k28K19j40J70l07J09J35l38J49K74o8k23J9Q0K65k75
3732A5j50Q5J03L9j88k2L63j30R5k41o6Q4Q0j62K26L1k43J48l35K2L18k40K56
3755H8m89K90m1rk8N53k86j95j15J84p4l34P67k61j43P6P3K9l48J98P7j29J49
3778C2j5Ok63J60o3NJ70K34n20L03k23J20O0M9J18k35L52j40k42J97k35P4oj66
3802b28L45o4j19n2K72n5l14L12j1r9J9M4l26J41m7O2K54L8l56K02J4j40M33k03
3826A22k41K59o8j08Q0K7N1q2J62j37n2K17k07j45L27j11pl23L54m5o3j16J68
3849F2r4L23m26K47j72J19j40J03j26m5L21k77L41k25k29J30P2r4J80M9Qo8J6
3872G5k04K58j09q0J60j93J79k99N8K37N3j86j5J15l34K29K65J6n15Jr7M48j40
$$ plain form
3895 -78 -135 218 -39 -125 124 -37 82 -170 -284 31 -189 -219 32 96 -197 129 -138 72 -235 34 188 -2
3917 -2 132 242 116 -101 115 83 -99 264 -146 -236 140 137 3 -27 34 -129 123 137 -1 -140 85 20 -325
3940 -325 -330 137 -234 -145 43 87 -247 -56 33 6 8 -11 76 -355 62 306 288 80 149 162 -96 53 -7 2 -16 52
3966 52 -61 -419 293 -94 -198 -105 143 -59 73 229 -49 -164 247 46 125 67 -107 155 27 220 226 174
3988 174 143 22 140 170 6 46 429 254 155 187 -153 -37 -185 -101 -17 -125 98 221 60 176 197 229 -175
4011 -175 12 51 62 -83 160 -462 -295 -123 147 -68 41 214 68 66 234 -188 -25 180 299 -38 -420
4032 -420 11 -310 55 -221 -53 -144 -148 -223 -446 128 -17 194 -64 3 -259 105 -83 -96 -86 -7 -106 -31 -178
4055 -178 69 -11 94 340 179 -298 194 188 262 -110 -195 212 114 104 60 -158 9 -149 -151 44 -117 66 -87
$$ packed form
3895g8n7L53k57q6K49j61J19k52j14L15k20l0K51O4k93L26k67K10l07K69J54j90
3917bJ34J10j26k17K16l2j82L63m10r0L76lj34l0O1j63K52J4j38j39K25o5l45
3940c25nM67l71Q9J88M4l34J91Q9k7Kj9Q7m31M17K44j8k08O9J3k58J49o0Rj8O8
3966E2j13l58P12l87j04R3K48k02J32J56k78j15M11k01P9n8j74K62j28J93On2
3988A74l1j21J18L0j64M0L83j75r9L2l40J16j48Q4Q4j08K23J23j61J16K1L2m04
4011a75J87L9J1j45K43o22J67J72K70k15J09J73j46kJ68m22J63K05J19l37l82
4032d20M31l21L65k76J68r1mp5k23N74j45K11k58O7k62L64j88j3J0P9r9P5j47
4055a78K47q0J05K46j61m77M92oP4l72q5M07r8j0m4k18J67j58kJ95j61J83j53
$$ plain form
4078 -87 195 27 -210 198 296 77 -42 475 120 1 120 105 82 -172 82 -267 41 203 17 -56 133 113
4100 113 -115 388 162 -189 245 -14 -289 157 68 202 -358 -79 -8 9 -271 -130 -139 -247 96 -17 88 -89
4122 -89 -138 -4 -164 -36 -110 -81 -355 -256 37 -58 -65 -144 317 120 -172 6 122 -118 -19 47 -10 203 -194 16
4146 16 -65 -336 -114 201 -265 -244 -16 60 23 -129 84 180 2 -302 -260 -133 -87 195 -2 -153 -147 -176 -84 -86 -245
4171 -245 -87 7 -198 -89 -78 50 -189 -54 -91 -14 -44 -21 238 -96 -89 119 97 79 -66 161 75 67 -285 -222 297
4196 297 -58 200 234 122 -213 -134 136 145 -135 329 -214 67 28 437 -85 15 208 -305 356 270 292 -10
4218 -10 73 121 96 -13 208 -8 48 -22 201 -43 359 42 -157 -115 289 37 20 176 -58 -68 -36 38 33 82 316
4243 316 344 224 -149 -245 -132 249 -105 -253 84 -20 -94 -147 27 -9 130 15 -96 95 24 222 -270 -219
$$ packed form
4078h7K82j68k37M08R8k19j19N17l55j19J19j5k3k54K54l49L08J62j86p3J89k0
4100A13k28N03k26l51M34k59k75M46q9J34n60K79P1J7k80J41rj08L43j13J05j77
4122h9m9J34j60J28p4K9k74R9K93r5pp9M61j97k92J78J16k40R9O6n7K13l97K10
4146A6q1k71K22L15m66K1K28P6l7j52K13R6j78l04M2J27M6K82j97j51Ok9R2kj59
4171b45J58R4k05J09J1J28k39J35l7P7l0K3K59l34PK08k2j8j45K27q6ql52O3N19
4196B97l55K58L4j12l35P9K70Rk80M64n43K81l9M09n22J00J93n13O61q6K2l02
4218a0Q3M8k5j09K21k16N6p0K23k44M02l17j99M2M04k52j7J56k34j0L2P4nM9K34
4243C16K8j20l73r6J13L81l54j48L37j04p4n3J74l6J39j15j11J91p1J98m92N1
$$ plain form
4265 -219 32 161 2 -182 -179 44 78 -226 -7 275 -10 229 78 -21 -10 -181 -314 32 -147 -382 159 -405
4287 -405 -325 122 -252 137 -73 72 2 -493 -129 38 79 280 44 -36 -298 -72 -49 170 -92 -187 -43 -214
4309 -214 19 57 -52 231 -97 132 31 -25 -250 -132 -11 43 -306 -349 106 260 -161 103 92 -228 -58 -85
4331 -85 -98 129 138 51 86 -67 -140 -188 -62 221 -199 -35 -106 -147 -274 -54 -226 -213 255 252 -33 241 73 -116
4355 -116 -98 249 -108 -119 244 -192 -73 -170 78 340 184 194 66 -356 186 98 281 -227 -121 266 -250 -120
4377 -120 -183 200 177 96 298 -6 69 2 92 -37 -41 -2 -107 -40 -150 216 87 -64 -236 -17 -37 77 -55 -50
4401 -50 -121 184 26 244 -217 68 -76 -121 -88 -27 140 104 5 -18 31 -241 166 -27 9 -181 36 -91 118
4424 118 139 -123 -209 -85 -344 -167 75 -220 -297 57 163 -43 114 -161 -89 -253 234 -4 -21 236 -206 -74
$$ packed form
4265b19K51J29j59j84LK23L4l04K19K82k85K39j51r9J1j71j33L46j79k35N41n64
4287d05Q0M47l74L89k10J45p0m95L64J67M1K01k36q0k62K26K3K19k62r5J44j71
4309b14K33L8j09K83l28K29j01n6k25J18J21N4l49m3M55J54m21K64j1l20J70k7
4331h5j3K27Rq7L5j53p3m8J26K83m20J64p1m1j27K20j72J3M68lk85K74j68j89
4355a16J8L47l57j1L63m36J19r7K48K62j56J0j28m22N42q8J83n08J06L87n16J30
4377a20o3L83k3q1K02l04P5o7R0j29mL9j05O7j10L66j29j51j72K19k0J14j32N
4401e0p1L05j58K18m61K85j44m5L3O1J67l6r9k3M9k72M07j93L6j90K17j27K09
4424A18K1k62q6J24k59J77K42k95p7L54J06k06J57k75P2j64M87k38j7K57m42J32
$$ plain form
4446 -74 -95 234 -174 -108 -179 24 224 -55 -358 -190 -105 -153 -176 58 65 224 -40 299 41 -105 170 114 81 203
4470 203 25 8 -107 -23 -32 253 227 -208 49 128 -24 183 62 -48 79 35 73 12 -148 311 -187 174 223
4493 223 82 -363 -158 -65 -39 157 -85 6 16 46 34 152 352 165 -18 -111 -252 -39 -215 50 152 229 26
4516 26 -29 93 196 -226 110 -76 36 143 95 3 -202 -73 -122 100 12 86 -181 -226 -312 -221 -154 -48 79 12
4540 12 -222 -76 -98 -194 -26 -166 120 -17 -234 -81 143 53 -58 159 -42 0 27 28 -143 139 37 12 147
4563 147 -263 122 -58 6 -74 -80 80 263 117 153 -275 -322 -446 203 307 -299 97 167 10 92 216 -134 -90
4586 -90 20 129 -15 84 146 174 -116 87 123 -44 240 108 -277 138 39 146 63 12 -4 78 -245 259 -27
4609 -27 -21 112 108 175 -161 36 -373 309 34 39 108 39 -95 -180 331 -130 -46 19 115 -131 106 231 294 -4 -336
$$ packed form
4446g4k1L29m08O6p1K03K00k79l03J68Q5m8k3K34PJ59k64L39k58j46K75n6l3J22
4470B03j78j7j15Q4rK85k6m35K57P9j52K07j21j10J27m4L8o1j60M59m98L61M9
4493B23j41m45K05R3K6J96k42R1J0L0j2J18K00j87j83r3j41K13j76K65J02P7k03
4516B6n5J22J03m22L36j86J12J07m8r2k05J29m9K22q8P4k67m5q6R1O7J06J27o7
4540A2k34J46k2r6J68j40K86j37k17J53K24r0j11K17k01M2K7Jj71K82j02k5J35
4563A47m10L85j80O4q0oJ60J83j46L6m28m7j24O49J04o06L96P0j57Q2J24l50M4
4586i0J10J09j44R9O2K8k90K03L6j67K84j32l85M15r9J07q3n1j6Q2l23N04k86
4609b7OJ33mO7l36J97m09O82k75NO9o9j34q5N11m61Q4O5R6k46K37J25O3k98l32
$$ plain form
4634 -336 -35 -139 -227 187 164 -289 241 42 361 -115 182 -109 -13 42 -22 -162 -56 -86 -311 -125 268 -105
4656 -105 161 38 64 61 -12 28 -392 98 -49 28 -25 183 -167 -46 -12 -110 -161 354 -284 -207 -147 -97 -116 -285 405
4681 405 -139 71 14 180 24 -255 -75 158 -258 183 15 246 -162 26 -233 76 -215 58 -59 -226
4701 -226 -92 185 143 145 14 -9 235 -34 -182 273 279 -246 -249 104 -72 -125 -146 -94 365 97 222 -98 -205 194
4725 194 19 -45 99 -125 -263 158 -215 237 175 21 51 275 -105 -104 114 32 80 -38 54 -108 125 -219 -294
4748 -294 -54 -125 -92 72 -103 142 247 -21 100 -240 46 422 29 386 104 95 -125 50 48 -20 -53 -307 -58
4771 -58 46 81 23 1 202 120 61 -69 -257 150 -24 157 138 204 66 -18 -14 206 360 -129 -75 -57 31 -305 -131
4796 -131 -1 210 39 6 -86 10 -22 -212 69 88 -155 -16 63 -156 -293 44 166 35 264 76 33 -49 180
$$ packed form
4634c36L01j04q8M14k3m53N30j99L19m76K97k91R6N5o4j40J06l0k25J86L93l73
4656a05K66j23K6lp3M0m20M90j47P7n3K08l50J21L4r8n1N15o38P7O0N0j9j69O90
4681D05n44K10n7J66j56k79J80K33m16M41j68K31m08J88k59L09k91K73j17j67
4701b26J34K77m2Kj31k3K44k69j48M55On25lL53j76n3k1N2M59k68J25l20j07L99
4725A94j75o4J44k24j38M21l73M52o2j54L0K24l80JK18q2M8j18R2j62K33l44p5
4748b94K40p1L3J64j75K45J05k68J21l40K86L76l93L57k82rk20J75ko8l3k54K49
4771e8J04L5n8k2K01q2n9j30j88M07j74J81j9O6j38q4MK20J54m89N4J8Q8l36J74
4796a31J30K11j71l3r2R6l2j90K81J9k43J39P9k19j37L37J22j31K29j88m3q2K29
$$ plain form
4819 180 16 -49 -2 34 25 294 11 -173 -54 -22 -149 77 -221 165 -102 -184 59 15 -76 -55 -30 -142 -261 131
4843 131 -105 -220 -213 -24 129 40 157 -8 43 68 -270 68 187 -316 94 431 182 112 113 7 11 308 -73
4866 -73 165 166 21 45 68 119 -107 36 -30 248 -89 -287 181 -166 -50 51 387 27 194 98 -65 200 78
4889 78 4 -173 310 136 -37 87 -251 -248 -129 -193 39 271 320 -10 79 -132 61 102 -213 -51 -103 -28 -56 105
4913 105 -180 20 -190 108 67 -71 -252 -176 99 -337 -4 -241 -122 -66 -133 -142 -234 17 -144 312 3 228
4935 228 -76 -36 -65 -35 -78 -365 53 -82 -225 76 -64 -63 85 -116 -102 -46 -181 102 -107 50 40 -50 283
4958 283 -129 44 136 13 -223 6 84 -248 -193 177 263 165 115 -124 -112 30 -5 41 -146 -260 -125 -36 47 -270
4982 -270 -133 -163 55 -48 -81 246 -20 26 -133 -51 -154 -93 30 -5 180 -100 45 24 -227 489 297 251 -134
$$ packed form
4819A80j64o5M7L6rK69k83j84J19L2j27K26k98L86k67q2K43m4r1K1K5j12j19L92
4843A31k36j15PJ89J53q9J17j65N1K5l38L38J19n03M10L37k49p0Jj06MK97l81
4866g3K38Jj45K4K3N1k26J43o6K78l37j98M68l47J16J01L36l60J67r6j63K65j22
4889G8p4j77M83j74j73J24l38LJ19o4K32K32M9l30Q9k11J93M1l15J62n2P5k8J61
4913A05k85K00k10K98m1j38j81P6K75m36L33k37J19N6o7rr2K51j61M56l09K25
4935B28l04M0k9L0m3k87M18j35j43L01j40JJ48k01J4N6j35K83k09J57j0r0L33
4958B83m12J73R2j23k36K29P8l32N5L70Q6r8n0k39J2J42l5M6j87j14J35Q9Q3l17
4982b70J37l0K18j03l3L27k66M6j59Q2j03O1J23l5J85k80J45k1k51P16j92m6l85
$$ plain form
5005 -134 140 -203 -270 204 461 -122 -132 290 -2 123 347 78 -27 208 243 42 -228 161 272 -34 206
5026 206 -119 -51 -21 138 26 -20 245 -294 69 91 -202 -240 95 24 -15 -261 -245 -113 -101 11 248 -91 175
5049 175 -128 -38 -55 -143 -129 -140 50 -280 196 219 -133 -270 34 57 11 9 -238 33 -160 57 4 -158 -117 -160
5073 -160 99 122 -99 9 -143 -299 -178 -179 -289 -16 177 116 -95 -35 190 -147 126 42 -110 80 -349 -13
5095 -13 -73 131 114 -98 13 -14 34 144 132 -58 -1 -179 8 -84 179 -57 -295 -136 198 71 308 38 118
5118 118 -45 -246 -185 61 85 25 -90 27 56 -119 -2 -60 -100 206 115 -136 -182 34 170 240 219 132 -47 -11
5142 -11 141 -11 2 -370 142 -48 173 99 75 16 52 114 -134 -123 -76 170 -105 43 63 -267 199 -181 179
5165 179 -18 -37 147 141 -100 -29 -172 -179 -48 -196 30 -61 30 82 -285 161 -36 -241 44 -64 108 -139 44
$$ packed form
5005a34K74l43o7M74K57n83j0M22k92J25K24k69j05K35L5k01k70L89J11l06K40
5026B06l25O8L0J59j12m6K65n39L63K2k93l8L35p1l9k46J6J32J2J12K37l39K66
5049A75l03R0j7q8J4j1J90l30M76K3l52j37L04K3m6kk47K71j93K17n3j62M1m3
5073a60K59K3k21J08j52j56J21jj10K73J93o1k11O0K25l37K73q4j52J90m29L36
5095a3o0K04j7k12J11k7M8J10j2j90N7j78J87r2K63k36k38J59L34j27K37k70Q0
5118A18j63k01O1K46K4o0j15J17K9j75J17n8m0L06r1k51m6K16J36P0k1q7j79L6
5142a1J52j52J3l72N12j90K21p4k4n9L6O2k48J1M7K46k75J48K0l30M66l80L60
5165A79j97j9J84ok41P1j43pJ31j48K26r1R1N2l67M46j97k05K85j08J72k47J83
$$ plain form
5188 44 -194 -17 -149 -140 103 -297 67 96 -83 -210 -278 -173 -41 -5 259 -59 -208 -42 -53 170 238 -117 -108
5211 -108 -80 282 -21 266 445 193 245 295 -162 -145 113 124 -279 48 271 140 -42 -220 183 -95 208 148
5233 148 212 108 -55 21 -267 71 -131 -36 3 361 276 264 115 165 -29 -300 -58 -152 174 92 316 103 60
5256 60 -131 -93 13 -24 -300 -149 183 -207 -112 9 -4 -19 85 106 -77 80 196 -165 39 -42 -382 330 89
5279 89 289 128 -26 -75 -146 22 186 -9 -86 -149 139 59 72 65 198 82 217 268 279 -115 -40 9 -186 -3
5303 -3 -225 356 -224 -118 -161 203 38 -205 -81 104 10 18 -18 77 35 6 252 233 -70 156 -114 143 226 -149
5327 -149 15 -104 116 -111 -29 345 -322 -176 -87 -269 12 24 3 -388 -11 -92 -170 -108 26 -96 95 -187
5349 -187 209 135 -222 541 -71 114 -202 80 82 55 15 -181 -360 -2 -242 2 -43 124 277 200 -1 57 167
$$ packed form
5188D4k38J77j32RK43m00L64K9j79j27o8J05J32L6K64l18j49J66j1K23O8l55R
5211a08K8L62l03K87J79k52N2N0m57J7K58J1m03L27K23j31j82j78M03k78L03o0
5233A48O4j04j63P6k88L38k02R5L9L58q5j2j49N0j94k71K42r4L26q2K24k13m3
5256F0j91L8J06l7k76J51L32l90R5J21j3j5J04K1j83J57J16l61K04q1l40P12k41
5279H9K00j61j54m9p1J68J64j95p7o3K88q0J3pJ33j16J35N1J1l94P5M9j95J83
5303ck22N81n80J06m3L64j65k43J24J85r4Ql6R5m2k9K46j9l03K26k70K57Q3l75
5327a49J64j19K20k27Q2L74o67J46Q9j82K81J2k1l91L77q1p8O2J34j22J91k82
5349a87L96p4l57P63o12J85l16K82Kk7m0j96j79L58k40K44m5J67J53p7k01N8J10
$$ plain form
5372 167 118 160 39 220 122 -110 160 231 -80 67 100 229 43 219 232 -36 256 145 108 2 -36 41 100
5395 100 123 145 -163 96 10 85 9 43 -141 39 252 -42 7 -91 176 94 18 211 -64 434 3 23 -33 -313
5419 -313 -70 -54 27 -34 88 66 -19 205 126 266 -18 84 -38 -203 34 148 -222 47 22 -243 246 103
5441 103 -12 356 -272 -235 118 -92 -348 13 -64 -238 18 -278 -47 -285 112 208 65 162 -57 239 60
5462 60 18 -207 -232 -112 63 414 -52 -22 -196 317 -123 -321 1 -178 88 -54 -205 -38 50 -10 -173 147
5484 147 27 18 120 229 -66 -294 -28 -159 -139 73 88 -384 70 224 -221 178 -169 -113 99 250 -1 8
5506 8 255 -46 -49 26 126 -220 -83 2 -210 80 99 32 -45 96 -151 26 -22 31 -87 104 145 116 -107 25
5530 25 174 -294 150 -42 170 -57 -171 -94 95 17 -43 4 -61 -31 213 -20 -250 193 67 -205 -109 -46 165
$$ packed form
5372A67m9M2j21J81r8k32K70P1l11J47L3J29j86J76J3k68K92j11l7j06l8P7N9
5395A00K3K2l08K59q6P5p6L4j84J80K13k94M9r8K67q2p6J93k75M98m31K0n6k80
5419c13K43J6Q1o1J22k2q5K24p9J40k84J02j22j65K37J14l70K69k5k65M89j43
5441A03j15L68o28L7L53k10k56L61p7j74K56k96K31k38L97R6j43R7k19K96j79
5462F0m2k25k5J20J75L51m66L0j74N13m40j98L22j79K66j42j51J67Q8o0j63L20
5484A47j20rJ02J09k95k28K66j31K0K12J5m72M54J54m45L99l47N6K12J51k51R
5506HK47l01lP5J00l46J37Q5k12K90J9o7p7J41k47J77m8N3j18J91M1k9k23J32
5530B5J49m68M44j92K12k27j14P7J89p8o0M7o5L0K44k33k30M43j26k72R6O3K11
$$ plain form
5553 165 -27 -200 -156 -443 66 -184 61 -40 -33 259 -112 188 -98 247 -83 216 186 44 140 -65 293 -33
5575 -33 -18 78 -149 -71 178 -144 -374 -104 -250 43 -149 -116 36 -214 -221 227 -147 -63 163 -160 158 166 46
5598 46 204 21 67 -40 -35 6 -181 -210 -6 -139 135 -66 69 -78 74 51 55 -126 114 169 25 -102 -78 -101
5622 -101 20 -71 -229 187 278 121 80 -131 -102 46 51 165 65 288 47 226 99 52 -260 -66 -297 148
5644 148 -43 -114 -169 249 62 34 123 -252 53 14 145 6 -87 -113 284 232 94 132 36 131 338 -69 38 11
5668 11 -130 -145 -109 -71 188 -121 -507 147 320 -144 -65 -131 -70 167 -111 -112 11 -204 -87 24 -115 -68 -45 -11
5692 -11 -36 -55 -23 -249 299 -120 -118 -36 47 -65 -287 -121 -137 -94 -219 168 102 14 -187 -110 162 -121 454 -54
$$ packed form
5553A65j92j73M4k87N09k50K45j01PK92l71L00k86L45l30K99l0j42R6k05L58l26
5575c3J5R6k27P8K49l22k30K70j46K93j92L3J52k50pM48l74Q4K26l23L18Qj20
5598D6J58j83M6j07NM1j87k9K04j33K74k01J35j47J52k3Mj81K40N5j44j27K4k3
5622a01J21r1j58M16R1j57m1k11K9J48NJ14j00K23k41J79j27m7l12J94k31M45
5644A48j91p1n5M18j87k8Q9l75L05l9J31j39r3k6L97n2j38L8r6R5K07m07J07k7
5668A1j41j5L6L8K59l09l86O54J73m64P9o6O1K37k78jJ23k15J17J11j39M7K3L4
5692a1k5j9L2k26N48m19KQ2Q3j12k22J66j6M3j25L87o6q8k01P7K72k83N75n08
$$ [...]
8191c7
##END NTUPLES=NMR FID
##END=
