##TITLE=1H_BAU-j-PK
 DMSO-d6, 72 sc, 
 2.7.2019
##JCAMPDX= 6.0         $$ Bruker NMR JCAMP-DX V2.0
##DATA TYPE= NMR FID
##DATA CLASS= NTUPLES
##ORIGIN= UXNMR, Bruker Analytische Messtechnik GmbH
##OWNER= root
$$ XWIN-NMR		Version 3.5
$$ Tue Jul  2 14:23:16 2019 Russian Standard Time (UT+4h)  she@DPX200
##.OBSERVE FREQUENCY= 200.13155
##.OBSERVE NUCLEUS= ^1H
##.DELAY= (6, 6)
##.ACQUISITION MODE= SIMULTANEOUS
##.ACQUISITION SCHEME= undefined
##.AVERAGES= 72
##.DIGITISER RES= 18
##SPECTROMETER/DATA SYSTEM= spect
##.PULSE SEQUENCE= zg30
##.SOLVENT NAME= CDCl3
##.SHIFT REFERENCE= (INTERNAL, CDCl3, 0, 15.7039)
##AUDIT TRAIL= $$ (NUMBER, WHEN, WHO, WHERE, WHAT)
$$ ##TITLE= Audit trail, XWIN-NMR		Version 3.5
$$ ##JCAMPDX= 5.01
$$ ##ORIGIN= Bruker BioSpin GmbH
$$ ##OWNER= she
$$ F:/spectra/data/she/nmr/H-F/1/audita.txt
$$ ##AUDIT TRAIL=  $$ (NUMBER, WHEN, WHO, WHERE, WHAT)
(   1,<2019-07-02 14:22:04.48 +0400>,<she>,<DPX200>,
      <created by zg, POWCHK disabled, PULCHK disabled
       configuration hash MD5:
       00 E9 B6 7A A2 85 ED C7 34 08 36 98 17 FE 4E 26
       data hash MD5: 16K
       5D 2D D2 1D C9 91 4F B9 A6 7A A1 15 60 53 D2 8D>)
$$ ##END=
$$ 
$$ hash MD5
$$ FB CD 2A 35 EF E2 9F 82 F5 BF 9C 69 70 C6 18 E7
##$RELAX= 
##$RELAX= 
##$RELAX= 
##$RELAX= 
##$RELAX= 
##$RELAX= 
$$ Bruker specific parameters
$$ --------------------------
##$DU= <F:/spectra>
##$EXPNO= 1
##$NAME= <H-F>
##$PROCNO= 1
##$TYPE= <nmr>
##$USER= <she>
##$AMP= (0..31)
100 100 100 100 100 100 100 100 100 100 100 100 100 100 100 100 100 100 
100 100 100 100 100 100 100 100 100 100 100 100 100 100 
##$AQSEQ= 0
##$AQ_mod= 1
##$AUNM= <au_zg>
##$AUTOPOS= <>
##$BF1= 200.13
##$BF2= 200.13
##$BF3= 200.13
##$BF4= 200.13
##$BF5= 200.13
##$BF6= 200.13
##$BF7= 200.13
##$BF8= 200.13
##$BYTORDA= 1
##$CFDGTYP= 0
##$CFRGTYP= 5
##$CHEMSTR= <none>
##$CNST= (0..31)
1 1 145 1 1 1 1 1 1 1 1 1 1 1 1 1 1 1 1 1 1 1 1 1 1 1 1 1 1 1 1 1 
##$CPDPRG= <>
##$CPDPRG1= <>
##$CPDPRG2= <>
##$CPDPRG3= <>
##$CPDPRG4= <mlev>
##$CPDPRG5= <mlev>
##$CPDPRG6= <mlev>
##$CPDPRG7= <mlev>
##$CPDPRG8= <mlev>
##$CPDPRGB= <>
##$CPDPRGT= <>
##$D= (0..31)
0 1.2 0 0 0 0 0 0 0 0 0 0.03 0 0 0 0 0 0 0 0 0 0 0 0 0 0 0 0 0 0 0 0 
##$DATE= 1562062923
##$DBL= (0..7)
120 120 120 120 120 120 120 120 
##$DBP= (0..7)
150 150 150 150 150 150 150 150 
##$DBP07= 0
##$DBPNAM0= <>
##$DBPNAM1= <>
##$DBPNAM2= <>
##$DBPNAM3= <>
##$DBPNAM4= <>
##$DBPNAM5= <>
##$DBPNAM6= <>
##$DBPNAM7= <>
##$DBPOAL= (0..7)
0.5 0.5 0.5 0.5 0.5 0.5 0.5 0.5 
##$DBPOFFS= (0..7)
0 0 0 0 0 0 0 0 
##$DE= 6
##$DECBNUC= <off>
##$DECIM= 24
##$DECNUC= <off>
##$DECSTAT= 4
##$DIGMOD= 1
##$DIGTYP= 9
##$DL= (0..7)
0 120 120 120 120 120 120 120 
##$DP= (0..7)
150 150 150 150 150 150 150 150 
##$DP07= 0
##$DPNAME0= <>
##$DPNAME1= <>
##$DPNAME2= <>
##$DPNAME3= <>
##$DPNAME4= <>
##$DPNAME5= <>
##$DPNAME6= <>
##$DPNAME7= <>
##$DPOAL= (0..7)
0.5 0.5 0.5 0.5 0.5 0.5 0.5 0.5 
##$DPOFFS= (0..7)
0 0 0 0 0 0 0 0 
##$DQDMODE= 0
##$DR= 18
##$DS= 0
##$DSLIST= <SSSSSSSSSSSSSSS>
##$DSPFIRM= 0
$$ [...]
##$SUBNAM2= <"">
##$SUBNAM3= <"">
##$SUBNAM4= <"">
##$SUBNAM5= <"">
##$SUBNAM6= <"">
##$SUBNAM7= <"">
##$SUBNAM8= <"">
##$SUBNAM9= <"">
##$SW= 24.9336996594482
##$SWIBOX= (0..15)
0 0 2 0 0 0 0 0 0 0 0 0 0 0 0 0 
##$SW_h= 4990.01996007984
##$TD= 16384
##$TD0= 1
##$TE= 0
##$TE2= 300
##$TE3= 300
##$TEG= 300
##$TL= (0..7)
0 120 120 120 120 120 120 120 
##$TP= (0..7)
150 150 150 150 150 150 150 150 
##$TP07= 0
##$TPNAME0= <>
##$TPNAME1= <>
##$TPNAME2= <>
##$TPNAME3= <>
##$TPNAME4= <>
##$TPNAME5= <>
##$TPNAME6= <>
##$TPNAME7= <>
##$TPOAL= (0..7)
0.5 0.5 0.5 0.5 0.5 0.5 0.5 0.5 
##$TPOFFS= (0..7)
0 0 0 0 0 0 0 0 
##$TUNHIN= 0
##$TUNHOUT= 0
##$TUNXOUT= 0
##$USERA1= <user>
##$USERA2= <user>
##$USERA3= <user>
##$USERA4= <user>
##$USERA5= <user>
##$V9= 5
##$VALIST= <valist>
##$VCLIST= <CCCCCCCCCCCCCCC>
##$VD= 0
##$VDLIST= <DDDDDDDDDDDDDDD>
##$VPLIST= <PPPPPPPPPPPPPPP>
##$VTLIST= <TTTTTTTTTTTTTTT>
##$WBST= 1024
##$WBSW= 4
##$XGAIN= (0..3)
0 0 0 0 
##$XL= 0
##$YL= 0
##$YMAX_a= 209010
##$YMIN_a= -340145
##$ZGOPTNS= <>
##$ZL1= 120
##$ZL2= 120
##$ZL3= 120
##$ZL4= 120
##$ABSF1= 10
##$ABSF2= 0
##$ABSG= 5
##$ABSL= 3
##$ALPHA= 0
##$AQORDER= 0
##$ASSFAC= 0
##$ASSFACI= 0
##$ASSFACX= 0
##$ASSWID= 0
##$AUNMP= <proc_1d>
##$AZFE= 0.1
##$AZFW= 0.1
##$BCFW= 1
##$BC_mod= 2
##$BYTORDP= 1
##$COROFFS= 0
##$CY= 11.3945322036743
##$DATMOD= 1
##$DC= 2
##$DFILT= <>
##$DTYPP= 0
##$F1P= 18.9103706918063
##$F2P= -1.10871071338519
##$FCOR= 0.5
##$FTSIZE= 0
##$FT_mod= 4
##$GAMMA= 1
##$GB= 0.15
##$INTBC= 1
##$INTSCL= 1
##$ISEN= 128
##$LB= 0.24
##$LEV0= 0
##$LPBIN= 0
##$MAXI= 10000
##$MC2= 0
##$MEAN= 0
##$ME_mod= 0
##$MI= 1.114404
##$NCOEF= 0
##$NC_proc= 0
##$NLEV= 6
##$NOISF1= 3.799351
##$NOISF2= 2.8
##$NSP= 1
##$NTH_PI= 0
##$NZP= 0
##$OFFSET= 15.70392
##$PC= 1
##$PHC0= -8504.258
##$PHC1= 17.20097
##$PH_mod= 1
##$PKNL= yes
##$PPARMOD= 0
##$PSCAL= 0
##$PSIGN= 0
##$REVERSE= no
##$SF= 200.130013532006
##$SI= 16384
##$SIGF1= 3
##$SIGF2= 2
##$SINO= 400
##$SIOLD= 16384
##$SREGLST= <1H.CDCl3>
##$SSB= 0
##$STSI= 0
##$STSR= 0
##$SW_p= 3612.71676300578
##$SYMM= 0
##$S_DEV= 0
##$TDeff= 0
##$TDoff= 0
##$TI= <>
##$TILT= no
##$TM1= 0
##$TM2= 0
##$TOPLEV= 0
##$USERP1= <user>
##$USERP2= <user>
##$USERP3= <user>
##$USERP4= <user>
##$USERP5= <user>
##$WDW= 1
##$XDIM= 8192
##$YMAX_p= 0
##$YMIN_p= 0
$$ End of Bruker specific parameters
$$ ---------------------------------
##NTUPLES= NMR FID
##VAR_NAME=  TIME,          FID/REAL,        FID/IMAG
##SYMBOL=    X,             R,               I
##VAR_TYPE=  INDEPENDENT,   DEPENDENT,       DEPENDENT
##VAR_FORM=  AFFN,          ASDF,            ASDF
##VAR_DIM=   8192,          8192,            8192
##UNITS=     SECONDS,       ARBITRARY UNITS, ARBITRARY UNITS
##FACTOR=    0.0002004,     1,               1
##FIRST=     0,             0,               0
##LAST=      1.6414764,     0,               0
##MIN=       0,             -340145,         0
##MAX=       1.6414764,     209010,          0
$$ Real data points
##PAGE= N=1
##DATA TABLE= (X++(R..R)), XYDATA
$$ [...]
2759A005j677n23K406o93j771J184r89J80K305j615k414L364J489k594n38J085
2775B04j166J315P88k372l76L291k94k231l82J457r7J76O02k902J677K526j168
2792A048l159J485R54l65J198j322k148J654L792l136j889K085M12L34j083k50
2808c90p49L077Q5l846O58K304J15r66r70j697J956K854k611k174J243K434r62
2825C61P43j971k25K714M07k971r96L424j689r22J281l40m53K459q96l048J199
2842i23J940p0j493O56q03k9K831j742l375L871J434k553m70J116j715K304P64
2859A743k559q69K924M93k052O68Q4r32K023k281o2O93K227r46k656J270N5O35
2877D58J133j511k174L375M88k162l90Q35m6J197m89q50m95K508p58k395P27M82
$$ y = [1005, -672, -1195, 1211, 518, -1253, -69, -1058, -878, 1427, -188, -2602, 762, 2251, -343, -881, 204, -962, 353, 1141, -1231, -1607, 1684, 1390, -841, -1223, 234, 137, 313, 915, -1987, -310, 2216, 1048, -2111, -626, 328, -37, 1161, -161, -2309, -655, 3137, 1, -1888, 197, 609, 943, -140, -390, -1139, 1938, 2023, -1823, -1165, 1139, 1254, 288, -682, -2379, -423, 2431, -180, -2354, -1111, 1323, 361, 1104, -867, -1092, 1622, 2029, -942, -1938, 1486, -203, -1125, 156, -184, -637, 1822, 926, -2122, -923, 1017, 947, -546, 110, -693, -722, 2109, 367, -3008, 863, 2297, -256, -726, 390, -1325, 979, 1743, -816, -1685, 1239, 1732, -320, 348, 432, -500, 1523, -758, -820, -127, 2100, 1154, -1502, -232, -177, 458, 1591, 80, -2094, 1281, 1769, -393, -783, 52, 6, 1203, 714, -136, -631, 1877, 1119, -1276, -549, -67]
2895f7M39J270k012j382J837K688l172q11K077n93p8J284k343p82K843M35k747
2912a114m00K359j918J187Pj869Q04L256j800k762K135Q69J29j237Q9j609K472
2929E98R91k207o29J063O1j62J033n73j296L166j712j911J512J191r57j42j215
2946a189j61N46K182j437j340J010J590j592o4l27j03J655J082k724p68K990j188
2963A62n22r0L59j337J824j20j464P09J122P0o79k6L56J027p95k19k020K987N94
2982A938l150O34N58j435K301K32l175J665K391j828j381R00L43m41J230m69j726
2999a413R58J665j302o03J006j83J6J302j984j037K883j76j933O8J453p37J171
3016A154j40k255N31K746j639j557J548P68j071l8N58k319J952J723k957M74J236
$$ y = [-67, 372, 1642, -370, -1752, 85, 2773, -399, -1210, 867, 274, 196, 1480, -863, -1645, 1198, 1633, -1114, -1514, 845, -1073, 114, 121, -1748, -944, 2312, 512, -2250, -115, 754, 883, -354, -265, -1874, 598, 1589, -618, -1247, -184, -123, -285, 748, 175, -1121, 2045, 333, -1578, -66, 1125, 168, 26, -1189, -1350, -804, 1378, -59, -1399, -389, 1201, -391, -455, -782, -885, 770, 1852, -872, -1640, 1350, 162, -360, -450, -91, -1428, 396, 276, -1188, -479, 643, 713, 34, 8, 364, 1391, 596, 377, -1643, 1344, 1938, -1212, -578, -20, -1455, 846, 1078, -2097, -432, 1959, 131, -1250, -350, -7, -448, 782, 313, -1413, -455, 1210, -92, -695, 311, 128, 144, 1446, -538, -1575, 1308, 1132, -801, -733, 720, -17, 1154, 1014, -1241, -710, 2036, 397, -1160, 388, 1156, 85, 47, 605, -1714, 238, 1961, -996, -522, 714]
3033G14N8o74Q78p24k028K878Q53l170L87J123m72M22J55j166P2J636o4j925J741
3052F94O88j665O3J51q94J604R60j775j288J221J926j705M40n06j382K110L23
3069I65j302K58J456q53j638P17j00O10K98Q0j359Q42Q54j831J021J76r55R65
3087B04M70j441q79J936J52j530J474n61q39K619j087j429J068J507j189r76J184
3104F83j05j054J703j409j442K830k50p31q48P35q54R24J355k915J124O73j11
3121C08j938J789J51p44J207j088j061R39J404j452q66J179R35K33l93j574j3
3138i84J233N90k110N03J088K31p23R54j522J94J412q98j409J191J309q09K88
3155E38p76m74J585r8j564k86J958L02j400L48p44K0N90N80j124m37K327j933
$$ y = [714, 772, 98, 976, 252, -1776, 1102, 1955, -1215, -828, 295, -177, 245, 400, -766, -694, 942, 878, -1047, 694, 1382, -283, -220, -69, -963, 641, 1601, -174, -1462, -241, 1685, -20, 420, -86, -1468, 642, 965, -337, -79, 1377, 524, -1114, -397, -497, 113, 411, 491, -868, -26, 828, -1003, 18, 194, -761, 204, 674, -767, -1646, 290, 442, -1088, 386, -175, -1014, 1605, 518, -911, 157, 1664, 475, -501, 683, 578, -476, 1227, -182, -1624, 1206, 956, 225, -623, 112, -742, 182, 1537, -1378, -254, 419, 308, -1630, 159, 310, -434, 773, -315, -1376, -437, 967, -485, -1351, -172, 763, 996, 603, -971, -984, 249, 839, -1271, -768, 320, 551, -172, 782, -740, -546, 866, -32, -1441, -250, 1059, 250, 538, -238, -712, 873, 775, -789, -1075, 883, 1185, -215, 133, -611, -591, -1, 579, -545, -982, 1345, -588]
3173e88N01Q86j004j07P91M39k700K176Q78j512n50J642j233N24J105j662n56
3190i70J809j10q17O48n00j482K481q0j942N18K290j571o68J034j406K25J284
3207G43n39j634J908N36k127R52O52j444Q75P40j427m57J364J29o13J301l86j190
3225f17L79R13k080J248P70l17r43R67n1K90J10j509k40J726p78m63o83K661j606
3244b23O45L22r96j21J800p90j538J090l72K5Q96l57p56L52R54j812p47K310l97
3263B85q09J213j230j820L805j35k032o4K060j858R47k94j004J033L66j083j64
3280g84Q31M10j210J381l94j382N60J636j837p28K385o6j130J382n65j887J049
3297c49J137j262J09M92m39L63M85o79o99K771k385k90J29J261j884J100P90n93
$$ y = [-588, -87, 799, -205, -312, 479, 918, -1782, 394, 1272, -240, -790, 852, -381, 143, 1248, -414, -970, 839, 729, -88, 560, 60, -1422, 1059, 979, -963, -445, 1845, 274, -394, 640, -766, -541, 743, 204, -1430, 478, 1014, -1113, -161, 491, -953, -78, 662, -765, -1222, 142, 271, -342, 959, 573, -617, -238, 675, -1405, -157, 613, 296, -647, 320, 269, 559, 669, -840, -1080, 646, -132, -595, -1278, 1383, -223, 422, 744, -252, -373, 1427, 637, -901, 189, -183, -158, 738, 381, -375, -23, 931, -881, -1628, 682, 285, -524, 689, -541, -2361, 1444, 1309, -723, -787, 1273, -585, 362, 68, -936, 97, 463, -620, -784, 47, 457, -753, 628, 234, -1148, -588, 1048, -789, -1517, 868, 802, -328, 1054, 489, -1398, -349, 788, -474, -365, 127, -312, 51, 536, -143, -842, 1929, -456, -746, -617, 644, -1240, -140, 650, 57]
3315E7k0M40l37j613J934l68m34J074o09m01J091q57o34O45J372o09j409J166
3333D88r86N6O53p09O17K02J01k79r51J242L9n17J466j571o2O55k99j323Q24J377
3353A023j066j77K8l1j71J731j636O7J029j499L14J195p77J12o67K774l308Q61
3371a98O07j143k45J571j128q9O26q6j218M73J090o5M26N30r44J41M94j343M04
3390i7P90K07j832J457r72K22J337j047o98N60Q19j880R96R2m70N30J252m93j609
3409h36J241r7j058L78Q75j152Q00N62j265l60J309M19j049J221p44j109J452
3426E87q67K29Q24n55n87R3J670j351p55J127m8k51O71q86m02J110r65K67K43
3445A54M32j042m78J309M37j438J149o46P4l73J68l57l37J760j626p5J844m15
$$ y = [57, 37, 477, 140, -1473, 461, 93, -341, 733, 124, -277, 814, -43, -677, -32, 1340, 731, -678, 488, -498, -442, 211, -498, 119, 321, 422, 143, -808, 434, 473, -44, 1422, -149, -211, 444, 145, -1178, -354, 1023, -43, -220, -192, -223, -394, 1337, -299, -232, 797, -702, -388, 807, 30, 142, -525, 2249, -1059, -198, 409, -734, -979, 592, -536, -625, 1, -85, -1303, -830, 260, 195, 621, 1151, 207, 348, 842, -501, -97, 693, 900, -932, 525, -447, -225, 1112, 65, -633, -73, 746, -1134, -138, -46, -516, 14, 1266, 773, -836, 405, 308, -750, -372, 503, -649, 151, 713, -552, -912, 397, 816, -233, 988, 244, -865, 587, -280, -51, 773, 218, -369, -276, 1394, 43, -712, 415, 367, 116, 787, -99, -501, 609, -356, -89, 154, 586, -456, -934, 375, 812, -626, 523, -123, -49, -422, -254, -611, -948, 812, -814, -889, 955, 540]
3463E40o01P38j41j461J668j20j326L4J632j081j63R29j216O13N26N05k157J100
3481A9K52k84n5M58r52M49R25j136p28J997l6j345L21M56p18n1Q98r80J01J044
3501F35o93K03P00j335P92M7r77p59J700j78m55P44k48Nn83R06o51j898K007L0
3521hj586K451q54p36K053p33j121K49J664j912j1J023n3l67P52r00r27J826o37
3540A73k62o20J692j599l71J400q50L35N55n82k48O20o40j31R27J153j987O39
3558B04k61K8l18J762k047M84M91j275j16J377Q3L03r88K7N56r76J339o02m47
3577c76J091r38j69J319l03q83L6J231j801J510l0j290K10J220j261L42l7l70
3595d99OM87P6l18m71P47J42j87M43j109M41J322j041q72J511m17q02Q85L20r32
$$ y = [540, -61, 677, 536, -925, 743, 623, -703, -669, 963, -118, -281, 648, -568, 45, 571, 1076, -1081, 19, 271, -13, -68, 390, -562, -113, 812, -324, -1052, 945, 909, -436, -115, 341, -377, -428, 470, -510, -409, 635, -58, 145, 845, -490, 302, 349, -628, -1387, 313, 135, -320, 424, 176, 181, -402, 504, -147, -2045, -38, -8, -1594, 857, 3, -733, 1320, 587, -534, -285, 1379, -533, -544, 479, 426, 59, 811, -89, -1016, 810, 173, -89, -709, 983, -616, -987, 413, -437, -102, 453, -129, -377, 243, -397, -528, 399, 1552, -435, 204, -57, -29, -347, 1415, -632, -148, 343, -932, -1048, 329, 412, 715, -273, -246, 310, -666, 673, 71, -376, 715, -223, -392, 927, 624, -259, -223, 1008, -793, 717, 687, -603, -393, 827, -434, -92, -129, -499, -493, -6, 70, -248, -719, 28, 170, -17, 426, -683, -242, 1080, 39, -833, 678, 261, -541, 344, 664, -268]
3615b68J042K70k87j458L17J557j391M93L26j245N04m01J91Q92M69p40o53K76
3633a06k31J95l0j21j08j6M88K18M11q32n36J03Q45n77j32J492m90r10N80L4o25
3654c48M86N23p15O67M22r38o91J596q76j452J751n66j51M97M18j368J236m08
3672H3p56N65O58o53o42J374j048L60N10p00K89o68J936k583Q24J624j805k98
3690i30J993o92q06o7Q32M73j206R13m34k78P71l17K47o06q7N21l08J2j307J072
3710b04J841k393Q05N43r25P9J287j154l52Q14l83n75R12N84j048k62J119j058
3728c70L14M32k51m44J97o86Q18N61k82o96R92o76J02O15J82j118L63M58o31o8
3748a88K18j08j35Q5M67j04N27n76r48O58K03M45j199O00M88r25P01r8o27N47
$$ y = [-268, 774, 1044, 757, -701, -384, 1173, -218, 275, 601, -644, -140, -541, -350, 542, 1011, 271, -382, -106, -337, -142, -172, -293, -401, -417, 71, 289, 700, -132, -668, -565, 280, -297, -429, 1063, 573, -337, 243, 277, -348, 138, 661, -54, 613, 1035, 97, -594, 1002, 126, -1326, 425, -141, -292, 205, 623, -745, 491, 83, -673, -108, 550, -103, -745, 629, -419, -59, 451, -249, 40, -628, 1308, -1275, -451, 1173, -632, -930, 1063, 371, -435, -502, 330, 803, -403, 510, 76, -202, 569, 252, 499, -107, -194, 327, 19, 31, -1276, -204, 1637, -756, 49, 592, -333, -254, 1033, -121, -473, 341, -42, -617, 295, 879, -169, -431, 688, -370, -56, 376, 125, -319, -122, -808, 10, 571, 289, -407, 585, -91, 11, 626, 808, -310, 53, 511, -120, -188, 30, -78, -213, -128, 339, 235, 762, 186, -762, -104, 99, 544, -655, -55, 433, -492, 209, 111, -516, 31]
3768C1k6p40R61K61q97M64J056j380l16M99q04M30J69k78R58j67P14j264K80R09
3788H60j179n34J619p89j514J908J94j07J45k93j48L8P77k270J686K30q6j233
3806f96L38P27n71J89O02l90M26p70L46l43L3k92N82N42m99j188J545l20n22J011
3826G50l5p09M25k23m5j84k58J14K70K79l73n15O65J106j048p25P80r61P73N41
3846F27j295K58L76M02q68R30j63j147J657j411N29K59j85J07j257R28M69r33
3864g17P74q74O56M78N41n76l75J064j297J00r3k9M84L72k83l02N21j22o22k80
3884e80Q86j923J693Q05j224M32O33p42J82L2j53Q53m89P65p43k03L03j059L57
3903a75Q41j91m88O7j42j23N69o15o19J500r04m31L73R55k72m89O67k46n87M51
$$ y = [31, 5, -735, 226, 487, -410, 54, 1110, -270, -586, -87, -891, -461, -292, -570, 388, 221, 935, -329, -49, 860, -319, -853, 766, -23, -1537, 371, 565, 458, 603, 310, 162, 200, 977, -1293, 393, 623, 537, -696, -358, 369, -202, -13, 589, 199, 625, -145, 201, -142, -109, -401, 181, 723, 224, -964, 581, 261, -261, 750, 715, 6, 431, 208, 163, -21, -279, -165, 105, 384, 11, -504, 161, 1267, 219, -506, 274, -687, 86, 627, -668, -410, -34, 368, -500, 430, 267, -880, 777, -634, -105, 154, -31, 76, -1181, -253, 216, -717, 57, -817, -161, 317, 858, 282, -93, 971, -326, -226, -319, -348, 136, 508, 225, -77, 444, 322, -300, -580, 306, -1617, 76, 881, -343, 89, 722, -20, 162, 194, 41, 894, 405, 1170, 427, 224, 527, -532, -175, 666, 475, -13, 54, -88, -211, 358, -257, -876, 624, -280, -711, -338, 617, 345, -144, 523, 277, -310, 141]
3923A41k39J37J09M0k95k42R96K3%q88Q59p76J44M2j97k77J081l80j42N35p28
3944e7N74Q3j030M26J187p66j135O62O05n23n29N62o63L12R22j045O02P78j341
3963c76L93O33j299O55J74n54l2N70l44j91p52J190l22M44J14l44j18K89O95j675
3983h50Q34k34P3j04N49o8q71J263q20r7J055r49j160J403k57O67j74K90n27n5
4003c2n10l2ON87O59n17R33n23j335J076P94j315J74O25o94k10O16J61j122M74
4023a85M39m83K17N46l79M9k24j67M6R13j357M49N99J18j020J037n27m0M40p02
4043b31Q83r79K26N30q03P29M45j236N04Q8n66k85J357J38j540Q58p65P36L05
4062C94L37j387J700j006j209J703j42m96L09j82l61k29R79p39r98J604q82M86
$$ y = [141, -98, 39, 148, 188, -107, -349, 647, 670, 670, -218, 641, -135, 9, 51, -146, -423, 658, 278, 136, 671, -57, 517, 600, -430, -4, 1183, 417, -718, -56, 549, 26, -503, 59, -604, -292, 630, -415, 187, 965, -376, 17, 650, -649, 6, 180, -374, -406, 164, -180, -371, -1123, 67, -255, 189, 303, -41, -159, 130, 825, -850, -16, -250, -177, -281, 268, 200, -671, 592, -228, -325, 730, -219, -1379, 24, -233, 434, 260, 550, 23, -32, -542, -574, -568, 19, 678, 161, 1094, 571, -764, 312, 1106, -209, -35, 590, -104, -314, 302, 463, -659, -185, 254, -229, -12, 534, 155, 204, -20, -187, -141, 772, -585, -136, 463, 581, -439, 598, 71, 31, 471, -231, 652, -327, -101, 429, -374, 355, 800, -436, 68, 156, -410, -695, 662, 800, -740, 118, -647, 89, 394, 731, -656, 1044, 38, -1171, 532, 390, -106, 203, 21, -340, -569, 410, -329, -1327, 277, -605, -119]
4080a19j35K83p79K23J435p68n15o9M83N9N9k72l99J572q01m85M56q3j216K086
4100A015j000L82l20n8l6M1K26q2j34p40N19N33k81Qo18o48J379k90p75J130m00
4121a49r52J917r91l40j24O81k19j37J144j841R05M84j36r32J319o55L00k38r4
4140e8n53Q37O20r17j88P27j14r96J070l21l2N0R5q8j6M78j034L82O93o68n78
4161f11J195k04j439J704p80N50j88N40m91n13J89j311K058k05k48j303J978m92
4179D29j412J957j073j030j08J265j397J654J32l8p61Q10n71L02O57k81n83P8
4197C0R10o25p47J419n28r8Q77k046J23P86o9J43J06K77j489J029L87k19j32L85
4217E19j255J1Q93k71M00L11o79J92l14J170j200M83J206k217J99J459n20r88
$$ y = [-119, -254, 29, -750, -527, 908, 140, -375, -444, 39, 98, 157, -115, -514, 1058, 257, -228, 228, 145, -1071, 1015, 15, 397, 77, 19, -17, 24, 250, 168, 34, -706, -187, 346, 65, 73, -545, -1193, 186, -104, -879, 251, -149, -1101, 816, -175, -515, -639, 42, -177, -314, 830, -1011, -106, 378, 242, -690, 629, -26, 274, 36, -58, -611, 226, 846, -71, -259, 468, 354, -642, 428, 107, 75, 125, 220, 132, 116, 594, -440, -58, 635, -33, -611, 584, 380, -1059, 645, -135, 415, 227, 767, 276, -237, -48, -1359, 699, 494, 246, -1057, 921, 429, -983, 974, -99, -1129, -1237, 28, -1369, 285, 417, 379, -382, 428, -143, 159, 816, 535, -48, 30, 940, 315, -432, 987, 459, 361, 1238, -808, -685, 101, 32, 175, 281, 558, -931, 98, 485, 266, 134, 519, -736, -725, 168, -103, 297, 608, -71, 121, -193, 977, -223, 260, 1466, -751, -552, 907, 387, -601]
4235f01J064n48l39O13o95j74J139L83r64J366Lo68j048O41O63j139M53j47l10
4254c08N4M84K14j4N75j033n03J158j188j66J533j336M55n68J209j639M32J391
4272G50j788Q83M45p63J77P95l20J34O20r81m83J210J48j557Q86J123j452k43
4290d16J236j444j27J146j048J1R23p74M12Q87L45J68j503N45l75q91J270m43
4308g8o09O57r6n07Q26M49l27J36j45j59o06R98M90j657J109q93K68Q65m40j175
4328h94J029O55j661k22J477l7j56J165j750l92R89K0n21K09J203j605J22J219
4346H50o50p56J478n79p45J04J692j229Q37r71l27L64O81j755P69K34l95R6J059
4365G57j283L08R01o78l51R2Q16j314J035M79j454o4J898j340k90N77k34n11J034
$$ y = [-601, 463, -85, -424, 189, -506, -680, 459, 842, -122, 1244, 1247, 579, -469, 172, 835, -304, 149, 2, -308, -254, 230, 444, 430, 1005, -28, -531, 627, -561, -727, 806, -530, -75, -643, 566, -1073, -641, 750, -1038, -155, 290, -473, -296, 499, 179, 313, 933, -48, -531, 679, 827, -730, 156, 1279, -173, -416, 820, -624, -751, 395, -653, -642, 281, -493, -81, 806, 1151, 1319, -184, 361, -14, -905, 365, -78, -687, -30, -126, -633, 193, 642, 315, 451, 306, 147, -459, 539, 1029, -628, 481, -412, -144, 721, 281, -894, 135, 790, -871, -1093, 384, 347, 191, 1356, -394, -786, 203, 223, -298, -89, 1114, -491, -369, 850, 200, -556, 922, 343, -402, -298, 1394, 165, 1002, 31, -296, 68, 749, -1006, -237, -3, -398, -302, 757, -526, -218, 683, 5, -346, -254, 562, -752, 283, 762, -692, -756, 1142, -198, -488, 89, -145, -656, 378]
4384C78M95j896M48P22o89n2J464p54m70R01m33l51m07O06l19O29p4J23n01J076
4404H96p03o37J053j023J78N92j23l31p3P20l02pN73j174N01J138p23p65M32M4
4424B66j567J782K48p29r2N94p75N81j118j2J034N04k27l28O23l58j108R21R14
4443A153j821O69J141k023O71N73j049m61J074M54j175J072M35k207J447N85j052
4460e14N04O18r97l0P68r67p45J766J50r08L9R31p22K48N84j291k6K20M93o50
4480e29N66n7R2J52O00j497J59M23O7N05M51j326j25P78k15r14J285k42r95p75
4500a597J415L4P73k80J42j357Q31J09q43M94M51o60Q43N48j791J532P87j021
4518D10M43L96n68m43O46n03r63R95L08j146Q2N94q90n28J874j16l87K64q08p11
$$ y = [378, 873, -1023, -575, 147, -542, -594, 870, 116, -354, 547, 114, -237, -644, -38, -357, 272, 198, 321, -180, 896, 193, -444, 609, -414, -236, 356, 233, -98, -171, 549, 247, 240, 813, -361, 140, 1278, 555, -210, 222, 266, -1301, 481, 729, 0, -92, 502, -273, 308, -810, -822, 212, 716, 489, 161, 784, 426, -682, 239, 1153, -668, 1, 1142, -881, -210, 363, -686, -1147, -73, 381, -794, 278, 713, -1494, -47, 538, -514, -10, 608, -389, -419, 349, -618, -1363, 403, 553, -355, -316, 615, -107, 141, 725, -566, -592, -372, 121, -529, 37, -20, 72, 224, 824, -673, -514, -91, -24, 481, 932, -394, -519, 259, 44, -870, 415, 173, -822, -1597, -182, -148, 625, 345, 487, -870, -39, 70, -773, -279, 172, -488, 355, 903, -888, 644, 1431, 410, 853, 1249, 681, 238, 884, 381, -582, 413, 721, -425, -343, 251, -639, -1167, 707, 591, 204, 468, -340, -1051]
4538a051N52Q31k97M93o5q68j4R87r03K54N5J12m07P3N19j76l6K59l29O4J01j32
4560B2j254J760l80n45l36J026q29OR19j295P13J338k419J101J502j605o87M05
4578e58Q08j96O01m92j060J031Q22j358J350o44p46k04J503r07M30R8k29j346
4596a097K68J500j551M2J789j526k65K655j563o83K90N74r68R18o7j151Q21l48
4614c62l65l7p8J154m30N18q54k63J408j371N52N14K95o79L75Q1q67p3Q26K76
4634F20j459J560r2j684K170l18o20K11o73M21j11M38L56j487J373n79q30P48
4652D4Np15O22J168k342J990%p24k74J39j92p49J329j439Q25J78m7m60M69J424
4672A251k263O66J263j246J32J271j478l34J646j44j226K8J577j686L13Q61j740
$$ y = [-1051, -499, 332, 35, 528, 463, -405, -419, 568, -335, -81, -26, 86, -321, -248, 271, 95, 59, 318, -11, 53, 154, 22, -1232, 528, 148, -397, -733, 293, -536, -530, 389, -906, -193, 1145, -1274, -173, 1329, -276, -963, -558, 250, 54, 655, 163, -897, 134, 956, -402, 948, 304, -442, -646, 857, -50, 380, 478, 249, -1097, -829, 671, -880, -838, 951, -575, -840, 1815, 252, -431, -141, 433, -535, 383, 316, -835, -14, -362, -727, -764, -842, 312, -118, 400, -454, -717, 691, -680, -128, 386, 681, 2, 377, 458, -409, -482, 344, 620, -839, 721, 629, -1055, 1115, 797, 177, 388, -285, 136, 25, 463, 819, -668, 705, 126, -704, 44, 49, -666, -44, 1124, -1218, 772, 772, 48, -226, -87, -279, -1028, 301, -1138, -313, -135, -182, -642, -173, 1251, -1012, -346, 917, -329, -197, 1074, -404, -738, 908, 764, -462, -434, 1143, -543, -230, 631, -1109]
4689a109P46K252j836m38Q03l40n31L70O22j620J044Q08j854k31K286n68j146
4706g42J089r47J76K503j518j606J764K31p57q20J870k169J96N62K74j163J240
4723A83O8q39M78P96r43Q59J76j033o99J641j431j54J787j545k57J472R02k306
4741h45J216l50p66N79J186j248q97N98N57J70L23k02n28J17J091j772R4P71p79
4760f85J161K88p81o23J491r13o87L28J278k575P13J748j128K97M87r5l83K49
4778A70J83k62lJ048j850L49R19j013K63L50n48K08Q75j79j455J540k87p73Q09
4797C44M21n53o70P89j224L94K54j97o38K011o16j413J496N27j662P61o0n53q22
4816a411K185o24q86K613j450j270J472Oj674N38R55k047J046N04m97M94P37K81
$$ y = [-1109, -363, 1889, 53, -385, 418, 78, -453, -83, 539, -1081, -37, 771, -1083, -1314, 972, 404, -742, 347, -600, -424, 2079, 561, -1045, 719, 950, 193, -627, 1243, -926, -730, -168, 106, -1057, 183, 251, -588, -110, 686, -257, 602, 778, -255, -954, 687, -744, -898, 889, -656, -913, 559, 1461, -845, 371, 21, -745, -166, 1020, -228, -1125, -527, 30, 200, 523, 321, -207, -90, 1001, -771, -677, 94, -685, 476, 764, -17, -640, 851, -62, -749, -421, 857, -1718, -1005, 743, -385, -88, 399, 304, -79, 170, 353, 91, 88, 1136, -714, -365, 554, -459, -196, 154, -394, -186, 689, 510, -945, 595, 308, -465, 344, 765, 212, -458, 331, -893, -499, -245, -442, -1080, 931, 315, -1098, 398, 925, -737, 24, -36, -589, -1411, 774, 150, -736, 1877, 427, -843, 629, 635, -1039, -501, 454, -1593, -547, -43, -540, -46, 691, 972]
4834I72k292J266K99p87J14Q93j953N42O81j88pR77r70j13L55o2k61J15Q99k146
4854a666J303m7j83J363O73j475l46J748k397K45R76Q79j751P39N05j436N05J031
4872F66j411K06J318l25r43R67j14n81L86p77j41N00L60n36l25R53l27m90J036
4891D22p1o40Q96j6r77M76J03j147N93R42o43k47O83K01n06o4J41j115J393J5
4911D39j570L98J570j184M00R17j560K45J051p65j523K278j84j454J020L98n15
4928c9O84j60j363P66K75K84l72J05M81r88J106l78o81M81O68o26j328J492M43
4947H50j400J543p46j59N64k50m60N49P5j729Q12J203q25j367K191q05m0R5m34
4966c33j92K54R77j369N7R59m15l85Q57N49j741R18L70m46K82L72k138R93J702
$$ y = [972, -1320, -54, 245, -542, -428, 465, -1488, -946, -265, -453, -460, 517, -453, -566, -211, -273, -534, -419, 480, -1666, -363, -410, -593, 770, 1443, -32, -378, 1370, -1027, -782, 194, 1073, -678, 61, 566, -870, -365, 666, -745, -539, 779, 454, -489, 478, 364, -217, 169, -608, -749, -249, 111, -425, -750, 203, -124, -614, 422, 351, -289, 607, 591, -386, 90, 193, -954, -361, 581, -62, -309, 374, 575, 69, 5, 146, -969, 424, 439, -1131, -733, 837, -347, 53, 970, -590, -345, 706, -59, -1582, 696, 512, -942, 78, 476, -39, 645, 485, -878, -112, 163, 447, 75, 180, 661, -327, 779, 401, -280, 201, 869, 243, -1085, 407, 850, -550, 993, 247, 88, 652, 402, -58, 491, 566, -1163, -351, 852, 27, -1340, 851, 46, 6, 101, -333, -525, -271, 706, -663, -606, 353, -62, -447, 410, 959, -782, 136, 506, 60, 342, 714, -1424, -431, 1271]
4985A271j134o07Q12L38r30M45k19j459J969M06j669n97J709j452P78J009j608
5002i38L12J734j032p66J554k46q44N32K79q93l91J566m21o19n13j98M97Q36n9
5021C90r82J315O09j852P30Q52n08j0J98n44n36N46k82r35J378M68l51L87n59
5040C14l64K68Lj497J216O01l31R07m08n23m05K79J411j386p99J727j039R02K20
5059A096j798M36O07l10o73M03K24q27Q60L96q76q3J743j469j208J108j29Q54
5077C54n99Q32j704R83P58r46o06J382j076P01M49o43J19J533j745j395J714L64
5095D75k81r05Q98k84M12J060j849m15P00j14p85P87P34j649J662J139k034M66
5113A7Q77j065n91J275j173R44L35o12r46J120J132j604n90O18J42k87J336k095
$$ y = [1271, 137, -470, 342, 680, -250, 195, -24, -1483, 486, 892, -777, -1374, 335, -1117, -339, 670, -938, -626, 1108, 76, -690, 864, 618, -226, 306, 585, -308, -699, 867, 446, -173, -686, -884, -387, 449, 390, -592, 723, 1332, -520, 210, 1062, 554, 544, 742, 198, -338, 208, -74, -1009, 369, 837, 486, 873, 314, -50, 218, 221, -1276, -60, 541, 210, 1117, 709, 186, -219, 60, 1471, 85, -714, 1013, -26, 876, 1096, -702, -266, 341, 31, -642, -239, -15, -842, 18, 414, -462, -545, 1198, -271, -1479, -371, -500, 354, -245, 587, -1117, -134, 624, -322, -928, 454, -622, 79, 528, -115, 4, 1537, -208, -1603, 111, 475, 194, -711, 187, -97, 315, 1375, -474, -889, -189, -303, -1088, -301, 433, -1216, 446, 1585, -449, 17, 894, -171, -762, 513, -660, 284, 619, 7, -939, 181, 1313, -291, -881, -263, -121, -408, 928, -1167]
5131a167R43N59K67j988M54R58p92R41M0j003P76J512r50j526R78O5o07J078k84
5150B54j598P45J653j010k84L06m86M69J473j869N84J92O82k545J596l8j60R4
5168E8O26j125L44J598j846k67N3N92j47J29P3j153J765M31j891m5J626l69j609
5187a157J362J29p07J631k62j976J199J758k169k9K88j70n93K051r62j200J448
5204F41l3k002J169K6j07J220l32q94p21K142p77M79n64q94K14J223o63j458P93
5223e38O03k76J43O30p96P2O08j177J97J460q55o73Q08k26j202J232P95j175n22
5242h92J619j020l22J210p44l87R33J308k716K08J619j720O92M27j291P61Q03
5259D88r16n99K707k062l67Q81P69q67o71J434q18j137J574R54j978J069O35j987
$$ y = [-1167, -224, 335, 602, -1386, -932, 26, -766, 175, 215, -788, -12, 1500, 550, -976, 2, 67, -540, 538, 254, -1344, -599, 1054, 44, -240, 66, -420, 49, 1522, -347, 237, 429, 1111, -1434, 162, 124, -36, 58, 684, -441, -97, 1501, -345, -612, -559, 33, -114, 15, 88, -1065, 700, 1131, -760, -805, 821, 452, -1157, 205, 334, -373, 1258, 996, -980, 219, 1977, -192, -221, 67, -103, -696, 1355, 393, -807, 641, 608, -1394, -225, -199, -306, 914, 582, -312, -1033, 1109, 332, 811, 247, -647, -433, 790, 127, -1331, -538, 65, -211, -68, 562, -234, -162, 446, -731, -534, 926, 71, -602, 206, -20, -1222, 10, 805, -370, -892, 727, -293, -615, 595, -149, -536, 397, 1705, -1011, -803, 816, -904, -212, 215, -1076, -315, 488, -428, -1027, 1680, -382, -749, 132, 901, 34, -637, 797, -21, -1158, 416, 1370, -608, 461, 1096, -891]
5277h91M20N46j111J471M20r16o53P55J03l02L81m32j53N69k36p94J15J554k46
5296F00l0o55n42j26J788j024l63L53m90L74N00M18j608L26J423j272j08J115
5314F79l68K90k67K37p65M74j40k23j05O36j75j90M31j680N57K277j828j097J674
5333D17p36J137n85o26O29j83J016j439O68J234j376m69J062j303L98J685j301
5350B28l59J44M70p31p09J472j850J665J43j079l32J285L76j390J053R25o23l64
5368C24r4j15j523J434N21j089J742j075o74J633m19j125j06J499j223J12J206
5385A028k113J523L97r43n21J49J071j074J427m23q02R61K18j812k14K081j033
5402h0m05M25M16j051R08M41k678J947J869k508q0K80l2j05J710j570m98J897
$$ y = [-891, -471, 75, -1036, 435, 855, -61, -714, 41, 144, -158, 223, -209, -362, 207, -29, -823, -708, 846, 600, 570, -85, -627, -753, 1035, 11, -352, 1, -489, -115, 385, 803, -805, -479, 944, -328, -436, 679, 311, 601, 334, 571, -194, 280, 140, -83, -188, 448, 273, 83, 514, -1166, -609, 1668, -160, -1257, 417, -319, 818, 233, -393, 236, 53, 1069, -370, 298, 1532, 156, -313, 749, -554, -156, 1529, 228, -131, 13, 483, -248, -957, 515, -1335, 330, 473, -606, -938, 347, 723, -667, 386, 1311, 688, 324, 230, 115, -1408, 26, 547, -542, 1200, 125, -549, 1084, 665, -460, -566, 933, -290, -178, 1028, -1085, 438, 835, -108, -629, -480, 591, -483, 944, 521, -281, 680, 898, -914, -1128, 953, -80, -485, -60, 356, -695, 213, 654, -2024, -77, 1792, -716, -796, -516, -548, -653, 1057, -513, -1011, 886]
5420H86R82k581M62J055m82n78j1jl40J382j257n63J301P32j184O24p35j202J900
5439C90m2p93j93J51R84p67K58j35q62J996M8j465M13R24j149k08J150J32j035
5458b03R81m29r28o2P43J96j32M37m81L9J647j579j221N65R98r67P33M58n59l62
5478a26O31j965K082k83j70q67J460m94o3Q92j040p42N00O07j720R73K79l92L68
5497g0J151j549K82P21j85j949K085m90o8J026l75j175Q0J231p82j260J706K54
5515F33j103O85P44j183N16m04q26J073k7J16q90O98r51P56J063k71j181J133
5533E81m49L09r20N25q19J103P25r85mM64K60j302Q84J40j102J214J14j134k23
5552f19R26o61k8M97n89j43R80j16j615K060r76k68Q45P1j285R77n0o19l21J455
$$ y = [886, 1868, -713, -251, 804, 322, -256, -267, -268, -608, 774, -483, -1046, 255, 987, -197, 427, -308, -1510, 390, 348, -445, -638, -487, 497, -270, -12, -147, -1009, 987, 1035, -430, -17, 907, -242, -450, 700, 832, -203, 778, 349, -579, -641, 102, 298, 166, 603, 122, 161, 1808, 229, -992, -427, 571, -396, 337, 795, 236, -126, 505, -1460, 622, 339, 169, -698, 762, 268, 205, 1097, 57, -685, -185, 422, -1298, -325, -46, -438, -70, 1081, -468, -186, 535, 350, -1599, 486, -4, -72, 954, 579, -596, -516, 715, -67, -1327, 379, 633, -470, 215, 959, -224, 292, -112, -938, 135, 108, 224, -666, 32, -919, -163, 900, 629, -552, 581, 132, 441, -479, 46, -773, 330, 1055, 70, 66, 530, 790, -512, 372, 512, -590, 624, 738, -396, -619, 307, -354, -382, 115, -474, -617, 363, 247, -1368, 692, -284, -552, 293, 364, -921, 56, 6, -613, -934, 521]
5572E21K09r66M26k20o54O50N70q41P7R45r1j235Q02n87J5M00q5l21lJ439j005
5593D6r63J369p09l39J516j174j333K332r72j376Q30J247j091Q86K01q28N12K71
5611D25o10K00L82J98j05K78q97m37J563o89j038M58J601k288J184M30o38l23
5629c06J370r17q40J35R29o08l33J021o86P26M37o84l66Q20n97j41M87j53p64
5648d70M54J002j614J038m00o21O1Q58o05m14J533j93j115J152Q5j201J092J75
5666H17j540O47J310j104m80J507j755l45K250j848m06J795j52j035l66P67P73
5683H35j084Q7L36r29J439j168p24J887j124O76l30P8j33j55J982j566j200J640
5701E47r1j316Q44M27l41Q5J8j169Q38R86j201o66J863q50j567K361n68j008L01
$$ y = [521, 730, -236, 190, -30, -684, -34, 536, -305, -228, 717, 626, -609, 193, -394, -379, 21, -64, -385, -388, 1051, 46, -917, 452, -257, -596, 920, -254, -1587, 745, -227, -1603, -773, 474, -617, 269, 470, -358, 154, 425, -185, 15, 397, 595, 490, 768, -129, -566, 997, 308, -730, -272, 1329, -959, 225, 655, 17, -306, 1064, 147, -693, -558, 371, -237, -570, 451, -235, 491, 928, 244, -122, 698, 101, -40, 447, 294, -470, -16, 986, -628, 410, 10, -611, -550, 308, -297, -711, 822, 629, -486, 666, 751, -450, 642, 817, -723, -76, 1234, 130, -350, 1157, -598, -943, 1307, -541, -947, 848, 696, -339, -705, 62, 835, -249, -162, 174, -755, 684, -484, -1208, 679, -445, 231, -99, -21, -154, -309, 1673, 107, -1093, 547, 456, -860, -16, 411, 70, 155, 173, -996, -158, 828, -373, -1039, 824, -26, -1593, 768, 200, -808, -507]
5720e07L41j2q62J983j544Q9J576j571M81L52m02l33M25J110j667j65J210j220
5738g16J56J927j076j680J974J56j488J170n96o90M31Q39m95q18M47N27j109Q01
5756b40K88p70J111M9n44l86M22r45J301N89j012o95K179j187r32Q17j36r95Q30
5775b56J191k179J530P27j224j35Q97l16o40O91K95j342J177L1q16j74O02p95
5793g36Q27N76j333L96P80q47J28J239p90j179R92R19j293K07L89j204P32N65
5811C68m19L0j67M64j032J679m78p55K20Q91j433P91P45o81p9k87R63O3o90N24
5831G17l70j417P95r44N92L96q99j37J649J90j160Q37K01o8n10n80n3L58R89r18
5851c32l53J992o19j840J304q5r12J124L74j759Q06J233j442M18P61n52r24J698
$$ y = [-507, -166, -178, -1040, 943, -601, -512, 1064, -507, -26, 326, -76, -409, 16, 1126, -541, -706, 504, -716, -560, 1367, 291, -1389, 585, 741, -747, 423, -173, -863, -432, 407, -88, -906, -459, 68, -1041, -240, 48, -722, 389, 438, -106, -492, -70, -1015, 286, 875, -137, -832, 1347, 160, -772, 45, -91, -1086, -256, 935, -1244, 286, 1013, -211, -346, 551, 235, -405, 286, 581, -761, 416, 447, -369, -543, 59, -736, 91, 667, -666, -270, 510, -337, -209, 1030, 240, -939, 53, 972, -321, -114, 275, -929, -197, 368, -51, -21, -188, 276, -756, 923, 445, -310, -90, 801, -632, 159, 904, 223, 144, -143, 820, 883, 193, 717, 347, -1070, -275, -1219, -627, -231, -1130, -1267, 382, 572, -588, 249, 450, 382, -128, -708, -761, -403, 586, -332, -685, 1307, 688, -1152, 152, 67, -845, 279, 653, -1106, -300, 933, -509, -91, 670, 118, -806, 892]
5869H92j384m55J302o95N0N4N58J6m05J720r78j954K178n19j163O08P43j301J757
5888A024P08k634P35J588j604K64K07l94k53J95O19j172J73R48r90R99j90r28
5906g05M31R80r26n54J991j275J0K06j92j212J999P73j646k73J416n60j093M64
5924a66Q76j830O67O41q57J548j204q5j53O96j297n7K295m85p83J835j360j255
5942i74J511o03J01r86J595r06P13O51j455O09R99j374o57K005j100j294J337
5959A72Q60j452L21J59m44M63P84j281O58k60J51j568R93Q78l60O88J21j555J452
5978G80J41l70j658P06N42k83N36j121j29J040o01j54L58O51o57p05K432j681
5996a73n75J559k04j276J87R00j2m80J146j636P16O67j809O33J065q37j351J772
$$ y = [892, -492, -947, 355, -340, -290, -236, 322, 338, -67, 1653, 675, -1279, 899, 380, -783, -175, 568, -733, 1024, 1732, -902, -167, 1421, -183, 81, 288, -106, -359, -164, 455, -717, -544, 404, -586, 413, 223, -705, -274, 706, -220, -774, 1217, -58, -48, 158, -34, -1246, 753, 1526, -120, -393, 1023, 463, -630, -166, 710, -1120, -453, 188, -669, 879, -325, -410, -563, 133, -1164, -1221, 1074, 589, -194, 1641, 281, -974, 537, -66, 35, -951, 644, -262, 451, 1102, -353, 256, 1255, -119, -776, 1229, 129, -1165, 172, 1032, -420, -99, 60, -384, 79, 863, -418, 240, -20, 131, -1437, -444, 434, 74, 762, 883, -672, 780, 921, 551, -1107, -401, 141, -142, 394, -727, -856, 184, -417, -571, -213, 438, -219, -924, 1508, -173, -748, 811, 607, -669, -482, 418, 406, -74, 1072, -564, 152, 819, -990, -357, 708, -129, -1480, 292]
6014B92k55p18J317m25j273Q90J458k148L24Q53p58J69N37k78l96K75R14j498
6032g20L51J23j45P04J076j643n53J143o52J00P49K58j530J636K11r72p22J002
6050D16j091L35Q79j503N38N42n0j264K026k13j258J401q43p17P93QPr09J291
6069C88o72L22L83n2r59K74J126j375Q18M77r56l58R00L21j660J862q30K11L95
6088F15N31j677M24N48l6M8J50o42l56J664r32r24R07K48j298Q19J686k057J73
6107a09N56N30j622J087m28r24N06j91L54Q9J126j336k83K017k454J370o86L44
6125e4o33J495k08j116R96O47j959P44J201j401P21j266J435p7P25q19j178J047
6143C00Q73j459Q38l22n31k99J522q96r13J176M45j552J496r79k92O22M79j664
$$ y = [292, 37, -681, 636, 211, -1062, -172, 1286, -862, -538, 315, -443, -274, 263, -15, -411, -136, 778, -720, -369, -246, -391, 313, 1389, -254, -807, 336, -316, -216, 533, 791, -739, 897, 1108, 136, -586, 416, -675, -340, 539, -964, -426, 116, 66, -1198, 828, 615, -643, 758, -85, -802, -9, -1, 6, -903, 388, -284, 38, 421, 369, -590, -316, 810, -565, 253, 730, -226, -584, 316, 637, -1023, 839, 9, 220, 615, 1146, -531, -107, 441, 405, 453, 603, -39, -395, 1269, 337, -587, 320, 568, -730, 89, 1775, -282, -109, 447, 977, -645, 442, 14, -910, -404, -595, -241, -152, 974, -362, -645, 1372, -1082, 288, -398, -54, -687, 808, 600, -516, 480, 1127, -832, -88, 1113, -288, 433, -833, 602, 525, 1250, 431, -747, 300, 1173, -286, 552, 230, -301, -600, 922, 26, -887, 289, 734, -818, 678, -301, -593, 29, 508, -1156]
6161a156R12J163p75m29L67m40p8M48J665j854M92o8q0l91J081j237M09J009j085
6180d7p8L23l02n82J461o19j857J96K146q32L4M41n11q21K007l1j062Q4J26p38
6200f62O46n5m48N40O83q87j049J919p39l70Q53m48p41Q26J072j970J488L7r88
6219b93m03O27J79P2J28kj117J078K23k43o48P30m34l94J183l59o08J546j125
6238A40l09K18M08o25J34L99r94L18J103o93j03J614j741j209J913o32p71J438
6256F08o84q99P20K75m75M23o4L43p74J773j285j041J139P5l14N08K99k048J433
6275A2K57p89K75R04m88o1L92L71j710J498q70n00N98O96j072N89np14J79O60
6295B22L8j064J980n44r41M37O41q64n3J343k135N56J590k49j518N14N64q48O19
$$ y = [-1156, -244, 919, 144, -285, 82, -358, -436, 12, 1677, -177, 315, 247, 167, -224, 857, -380, 29, 1038, -47, -125, 198, -104, -686, 775, 156, -1701, -1505, 641, -191, -157, 284, -227, -1048, 959, 928, -134, -50, 76, -662, -16, -71, -519, 21, 704, -183, -1232, 687, -52, -422, 431, -17, -758, 68, 1140, -830, 658, 695, -293, -696, -69, 110, 182, 310, 308, -809, 269, 492, 249, -399, 331, -103, -497, 686, 327, -281, 1265, 140, -169, 49, 457, -168, -34, 365, -629, -311, 792, 99, -4, 1610, -131, -1340, 573, -59, -830, 608, -76, -975, -255, 20, -455, -32, -96, 247, -527, 1246, -39, -1080, 59, 134, -180, 328, 627, -1421, 12, 269, -520, -245, 659, 171, 110, 502, 873, -837, 661, -209, -709, -111, 585, -487, 102, 97, -617, -438, 222, 260, -804, 1176, 632, -309, 128, 769, -95, -148, 1195, -940, -384, 1206, 957, -561, -47, 517, -331, 288]
6314B88r0m41kO36o22K52R8q3k85P31j214L21N13K38l80Q78o42n91j61M32R0r67
6336a001J891j330P54Pp12L85l31P1R3K7J758k011N1J276n68j427J332O28j782
6355h89R79O66k575J698o0P48k47M43m16k31L62p17m13J851j033o05K90O38p91
6374c02K64Q30p25MJ628j876j89N2P53j688J098q2R3l79R41O41j254R44p40m44
6394d31Q25l08k26P52n99n19P96M08r75j6J104j429p00J763l23j326R43J103o93
6413A49ok59m95N50M92k31q58J295J12j134N34r63J050j28P83j300K94N71o48
6432a92L61N46n99p18O49o57k5J119m6j724K298q95r31J34J597p48j156J347r35
6451e75K68M41P58m38j69O59j462R96L41r49p66J470p45l99J347r00j350J492
$$ y = [288, 198, -243, -245, 391, -231, 21, 119, 36, -249, 482, -732, -411, 102, 340, -40, 838, 196, -395, -556, -124, -34, -1001, 890, -440, 314, 321, -391, -6, -337, -266, -173, -146, 1612, -399, -348, 928, 360, -1067, 265, 893, -889, 90, 756, -1819, -121, -181, 567, 320, 763, 347, 116, 478, -239, -652, 1199, 166, -439, -149, 489, -302, -38, 792, 67, 71, 1699, -177, -366, -314, 439, -1249, -151, -233, -140, -519, 422, 1063, -191, 753, 13, -431, 394, 86, -140, 612, 13, -506, 290, 698, -277, -293, 811, -618, -1318, 445, 122, -1204, -261, 842, 149, 143, -116, -611, -61, 431, 200, -658, 637, 749, -385, 149, -814, 236, 108, 891, -409, -115, 456, -192, 169, 715, 116, -602, 47, -610, -635, 484, 438, -1286, 1012, 117, -814, -680, 917, 169, -987, 360, -575, -307, 134, 892, 454, 285, 944, -518, 478, 819, -130, -896, 574, -171, -570, 777, -123, -1473, 19]
6469A9J049j159j63l3L10j38O24l36o99J476q70m1o8L56r48Q35N93j696M29M18
6489d2M95n29O12j516O03P81j735J539R7L02j620O08K55j105j6J625q12q20J466
6508A88k77l38J269kk125J515J81k25O7l9l16P45n60l50r34J508r73o24O42J329
6528F81q67R3M13o83J97J04M09j137J347L9j763M30M93o26M34J275k040N56J171
6547E26m60R0o74P55j530K342m87j052l56J398q51j57J548k002N45J47O47j486
6565a057J453L31p75r95K056p34k45np20J127J81m22n3M67m69m62Q48K0j399J633
6585G80q34j52nJ496k080q1J058l67JL81m59q66J303L40m31mj13q90N73Q79k95
6606B34J30M5M34j286P17K76k052J196Q86o09J70K35k89j41O48q05q40J531K42
$$ y = [19, 1068, -91, -254, -287, 23, -115, 509, 173, -526, 950, 80, 39, -29, 327, -621, 214, 807, -889, -460, -42, 453, -76, 536, -980, -377, 404, -1331, 208, 305, 607, -1013, -405, -150, -1255, -1271, 354, -458, -1278, 188, -89, -427, 842, 840, -1285, 230, 411, 186, 253, 214, -102, 643, 83, -267, -1201, 307, -666, -1290, -648, 681, -186, -93, 320, -363, -166, -62, 347, -790, 557, 596, -1167, -737, -244, -870, -436, 839, -1201, -645, 526, 66, 156, -518, 237, -1293, 1049, 562, -490, -846, 552, -299, -456, 1092, -910, -365, -218, 429, -1057, 396, 727, -48, -1043, 1013, 279, 34, 29, -691, 436, 617, 195, 142, 609, 140, -322, 526, 546, -853, 780, -54, -206, -211, 1285, -795, -876, 182, -185, -184, 197, -262, -1128, 175, 515, 84, 80, -33, -923, -350, 529, 234, 364, 409, 843, -443, 274, 550, -1502, -306, 580, -29, 141, 376, 87, -54, 594, -211, -1051, 480, 722]
6625G22j138O34J83p91k8J801k590J325R8k01K26J61r30K98k43M79Q5o12J152
6644F31p49L68O30r55n46J604L4j224K30K97j64k7j02l79K16J71p52N83m08R06
6664C64l26q0K68j161J24J043n83k60L01l7N2N36k14Kk87O20p07k04P35m28J28
6685a14O36n77m84N59j10j18K69K73j180OR48r64R5J324j717R49l07k76L95J249
6705H56n98q15M26O9j69J466l60j198m4M07o22L70P67q98N16O94n93k62L4k71
6725b25k19K46m75N90J31O60j134J83N78q05K00O65Lj239J254o15l03L25N04j51
6745A73m43J58o46J326m58N76r95P64K59n80J25P92j951J396o47L72p5J467k643
6764a030Q57L62N99j445J28J154q08q6K87n8l23K33N33k68k30R16o43K2L73r3
$$ y = [722, -416, 218, 401, -390, -418, 1383, -1207, 118, 216, 15, 241, 402, -528, -230, -473, 6, 91, -521, 631, -118, 250, 880, -75, -621, 983, 1017, -207, 23, 320, 156, 129, 27, -352, -136, 35, -717, -134, -542, 364, 38, -42, 226, -935, -811, 232, -351, -611, -310, -347, -295, 241, 27, 29, -258, 362, -345, -549, 186, -242, -114, 522, -55, -539, 20, -90, -208, 61, 334, -846, -840, 108, -856, -761, 563, -1154, -205, -512, -788, -393, 856, 258, -557, -131, -62, -231, 1235, 875, -323, -367, 40, -582, -212, 555, -343, 173, 867, 274, 12, 46, -225, -444, -198, -673, -83, 48, 708, -426, -243, 335, -470, -270, 395, 398, -841, 413, -202, -505, -180, 324, 173, -270, -112, -758, 568, 110, 686, -309, 455, 714, 134, 259, 1051, -900, 496, -151, 221, 146, 1613, -1030, -173, 189, 788, -657, -529, 625, -183, -269, 18, -40, -363, -130, 403, 135, -95, 821, 178, 200, 573, 480]
6784D80k44K43o29J43K6j37o44J31N38O31J19m91m27L10rr0P0L34j605J035R84
6805G68j317M50M86l82j136N14K49n35J099K09p16J03K18J030l73r72N09l90O54
6824D68R8l60m92J6O78j707J619r14N53k71M94j48p49J146r15k57J327o99J570
6843A457j063j333J510n31J015j335Q70k43o14P21j3j314J474o71n38l17P01L1
6861a93J30J7k93O09K13n65M50p44J191j604J132M58l03p29L94M06j701J316m42
6880b58M64j14j01n18L45O10o19m5J103r51L99K57r58j89L40K61p47K70J272r76
6900a55k52J090n59j077J471l8j197J514r76O26R52j346n16P52m96L86k44N69
6918E04j117J398j577N54N14p1M69j239J371p1r33m8L54l9j227J920n37P82l06
$$ y = [480, 236, 479, -150, -7, 19, -118, -762, -631, -93, 538, 657, 166, -261, 49, 40, -50, 20, 354, -1251, -216, 768, -549, -99, 387, 5, -1131, -617, -368, -903, 196, 405, -311, -208, 10, 1040, 667, -305, 204, -186, 468, 566, 206, -286, -270, 408, -1299, 320, -594, -41, -312, 182, 34, -715, 431, -484, -741, 586, -113, 1457, 394, -939, 571, 40, 1055, -280, 590, 347, -267, 454, 441, -873, 601, -70, -608, -925, -224, -193, -63, -46, -339, 270, 483, -82, 368, -376, 815, -789, 343, 801, 498, -231, 163, 569, -1132, 184, -258, 206, 92, -9, -527, -182, 428, -191, -236, 867, -84, 315, 572, -386, -575, -235, 26, -721, -451, 821, -155, -407, 683, 124, -953, 518, 480, -717, 797, -179, 447, 1399, 53, -463, 289, -207, 179, -65, 504, -613, 785, -792, -238, 276, 205, 674, -565, 806, 735, -198, -246, 108, 69, -1158, 762, 225, 1007, 701]
6937G01m37p65N30K04N42m38j13n24L64o49J035L6j36k75p72P45k45p58O67J028
6957G40j412J357L1n83p57R65m58Qr2N23k98mP7q74J910n33m99k23j28l04O00
6978D6k1m6q13K090j853J37Q71r7k72n19Q83n45o8Q58o58q95J146K88j437J329
6998D24K63j378N66O16J40o48O03o29k87J86P90j425J218o98N69j851J562M93
7016E14p57K65K91K19l15n70l55O26N75j041j53J796r42r35J206j326J063K0o22
7035d41P34M44n11m56Q60p07k80N70Rm5m63Q28o02n73Q90K29P5n94Q6l61L58O7
7057A17o30M70R20j186k12Q56L49r77J48L12o96K134k474O20P48L03n18p58k82
7076g56K91j17l2J150j042N29N89j220J045m38n8l07M55m08J14J017m84n39N25
$$ y = [701, 264, -501, 29, 233, 775, 337, 224, -300, 64, -585, 450, 486, 350, 75, -697, 48, -197, -955, -288, 740, -672, 685, 716, 133, -624, 341, -117, -109, -201, 322, 24, 20, 97, -777, 1133, 600, 101, -122, -250, -554, 46, 25, -21, -834, 1256, -597, -460, 411, 314, 42, -477, 406, -139, -207, 651, -7, -902, 244, 532, -905, 424, 687, -691, -125, 491, 631, -17, 586, -43, -330, -144, 646, -779, 439, -259, 310, -1541, 21, 514, -243, 22, 313, 532, 217, -353, -708, -82, 493, -548, -701, 1095, 153, -782, 424, -902, 161, 181, -441, 293, 737, 226, -230, 630, -77, -357, 213, 222, 177, -286, 542, -60, -633, 257, 486, 561, -33, 53, -308, 50, 117, -513, -43, 877, -309, -521, 335, 684, -293, -145, 167, -529, 1605, -869, -249, 499, 802, 284, -474, -756, -465, -582, -614, 536, -506, 23, 612, -608, 437, -1, -59, -366, 89, -319, -205, 812, 328, -211, 314]
7095C14K7n28j80Q52m88K26M20p34%m56Q64q69O25J59m67m2L24o29lQ25j214J457
7117D83l85l85L12M56n0K0o10O47j259J492o19r36J677q83M05q78J76O47q2K35
7137D63o32k97P02K15k18m34P34q86l44J286j014N27R7k30j82J038m40j76N57
7156G66m37o84l0J479j905K75Q27r1o66m3P48k78L46N21q38j97Q06r14K24%N01
7177D10op83R1r73J512o7l44k50N15p5j29L07P55j048K90K92j785J686N0r00M49
7198cJ5j91o15J133Q38m51j4j167P16m16P85q19P82K29m87l87J101j594J071o64
7218a38k1l28J351j093k81J265n15k02j052J507j358Q94l0j6r68J523r31m8Q56
7237D15k94j242J543j145O76N15j048M41R73K6p99p03N02k02j41P40j30o62R37
$$ y = [314, 341, -187, -367, 485, -3, 223, 643, -91, -91, -547, 317, -552, 73, 232, -235, -277, 47, -582, -585, 240, -974, 483, 98, -287, 25, 481, 431, 451, -159, 488, -771, 721, 102, -834, 843, -40, 365, -513, -337, 310, 228, 463, -169, -466, 236, 451, 233, -201, 533, -353, -697, 589, -425, 102, 199, -31, -213, 825, 385, 209, 766, 329, -355, -385, 1094, -811, -536, 291, 200, -466, -509, 239, -39, 307, 828, -10, -207, 599, -315, -91, -91, 410, 404, -379, -288, -1261, 251, 184, -160, -410, 105, 30, -99, 208, 963, -85, 205, 497, -1288, 398, 448, -452, -3, 12, -179, -794, 339, 1177, 726, 712, -455, 261, -155, 630, -189, 593, 822, 335, -52, 1049, -545, 526, -138, -159, -487, 864, -229, -510, 755, 240, 38, -1014, 493, -865, 29, -1, -17, -985, 538, -393, -441, 415, 121, -1121, 422, -723, -47, 468, -580, -139, 834, 860, 61, -642, -140, -342, -483, 257, 127, -535, 402]
7256D02O01j447K4Q07j209J307k13P3J46j469J335n5j93L96L25o56K39o21j27
7275c35q7J192j182J094q89J83o85J330o99n81R39P6m64N66j53m17M28k34k6p67
7295g11P80m11j68J509q93q57R98o39q88R36j6m53J549n99J37m50j42N00pQ11
7315I86p71K32p43l24l49J544j62j428J641p26j76p47J049j00k05O20k07J67K72
7334E73j371N21o30N25M79j286J512K57m85P52n07p31J098j92o91R23m61j45K36
7353C77L86j023J31J010q78j69O45K41o25L13r79k04K74N81K23k10l30k5M44l19
7373a37Oj278J496Q3r9Q7l66M66r0P34j760K074q12l31pk79M13m61l91J598k055
7394a109J882j490J012p77J7l86L08R56%r07M07Q9j04L90K6m50l14J001k042J230
$$ y = [402, 1003, -444, -420, 387, -822, 485, 272, 345, 491, -978, 357, 302, 109, 505, 830, 174, 413, -208, -335, -422, 770, -412, 682, -207, -24, -709, 621, -78, -659, 280, 356, -108, 458, 305, -112, 316, 82, 56, -711, 69, -342, -510, 999, 106, -751, 247, -392, -1280, -344, -360, -813, 736, 137, 274, -176, -318, 182, 175, 986, 215, 447, -296, -620, -969, 575, 413, -1015, 626, -100, -276, -1023, 26, -74, -279, 341, 134, 301, 573, -798, -277, -907, -382, 97, -1189, 323, 580, 95, 847, 340, -391, 707, 515, -176, 747, 286, 141, 377, 763, -260, -129, 881, 3, -166, 479, 720, 95, 408, -571, -775, -501, 80, 303, 93, -237, -262, 182, -137, -131, -1409, 87, 170, 71, 158, -208, 258, 168, 902, -858, 1216, 404, 73, 66, -213, 200, -261, -652, 946, -1109, 773, -717, 295, -482, -465, -851, -543, 413, 413, -494, -87, 2, -102, 288, 314, -136, -450, 551, -1491, -261]
7414b61Q64m14m54N49J69j79r49O11P14n26j55l52k41K59M76j67N59l28o63N68
7434H0l31L78k60O26j208J071l97k04J84L94j442J091J78k28k35o6L53o7K06K59
7454C82j354L10P86L08m16J88k40K0o2J063j119j91L26K81K18o65J72k02J99j98
7474a94O36r34R55o55o21O47rK18m2l07M21k9Q36j866J099k55o67R16K92p38O09
7495C12J26K55j026P64r83J97R82o04k2L02o68L19R30l61j846J450R81j433R84
7514F59q57l01k15N28l43k59J183L17j285J135k50m9M97r91O0L08q70L02o11j99
7534a241J747j75O9J029j306o06J671j038p89O80K54l72lk80L48O00r48Q34k00
7553B74q7n80J84M25l18J84m00N65j71R4Q5r25K68J145j473M03R02n72l94Q47
$$ y = [-261, 603, 189, -265, 284, 453, 274, -675, -64, 650, 124, -31, -383, -624, -365, 111, -56, 503, 175, -488, 80, -251, 127, -133, 493, -715, 356, -41, -245, -61, 333, -1109, -18, 160, -68, -303, -369, -16, -83, 123, 382, -972, -662, 124, 432, 16, 204, -36, -16, -78, 985, -134, -325, 1, 282, 500, -165, 7, -195, 4, -194, 442, -492, 463, -192, -813, -166, -175, 43, 1, -306, 115, 86, 922, -944, 155, -100, -767, 149, 441, -297, 312, 438, 693, -333, 431, -552, -355, 627, 23, 1, 303, -365, -46, 884, 523, -1323, 127, 1108, -325, 659, -198, -499, -714, -186, -529, -788, 395, 712, -573, 562, 312, 263, 760, -231, -171, 137, -733, -431, -1042, -1241, 506, 331, 400, 1429, 123, -483, 1188, 150, -639, 41, 295, -77, -80, -360, -12, 588, -360, 474, 274, 187, -393, -209, 216, -102, 82, -318, 247, 76, 170, 255, -670, -402, 743, -730, -327, 575, 3, -391, 456]
7573D56n25o37J098k78K75p42J59J103j805K048q59K95m5L58j835R87p3O80K05
7592H65o74j98oK11j021P81L93k4j180J237r36J3J185j159m90J320k89K90n42
7611b24P00l56m78O62M13m49m99m21P92k68Q5r12O97j45N59q32J670j548l71P09
7631b16O09r47J108o76N67J076o27m12j61lj40p6L91p56l12J532q06l73K6P14
7651E18j126K92M07p26L82l71O92J88M00q74k75M29k34J71l8j77O26j112L09P22
7671B03K65r23k36R92N13k63n10m38N57J51J32K3j40p82O36p33j69J592j302J68
7691b64K70L55j455J714l98L82q01M24l85K97n98N79r5m79Q50j79k94K75m66j90
7711d58N85j000N70P3K16k34j34O55k11r55Q6O52L25l86L17j112Q06J91J02K87
$$ y = [456, -69, -706, 392, 114, 389, -353, -194, 909, -896, 1152, 293, 588, 543, 901, -934, 53, -20, 660, 865, 191, -7, -13, 198, -823, -42, 351, 327, -853, 384, -552, -539, 646, -513, -1003, 317, 28, 318, -224, 476, 120, -358, 304, 717, 268, -231, -652, 140, -128, -43, -955, -258, -403, 156, -676, 994, -554, -925, -216, 393, -554, 554, -122, 445, 1521, 894, 482, 321, 318, 178, 102, 493, -263, -575, 957, 151, -222, -196, 518, -608, -316, 91, -635, -253, -624, 68, 256, 656, -218, -493, -64, -298, -127, -165, -342, 284, -828, -519, 203, 468, -455, -691, 301, 814, 551, 41, -397, 160, 311, 443, 466, 326, -456, 180, -553, -722, 870, -432, -264, 6, 361, -1094, 620, 222, 604, -197, 227, -158, 139, -459, 120, 25, -454, 396, 217, -77, 198, -268, -458, 127, -873, -303, -230, -14, -248, -382, 273, 62, -893, -807, -155, 170, -216, 101, -1011, -205, -14, 88, 375]
7731C75m63j17R08p9l93r68R50L78j080j15N40m41M90N01q30k6J74L49k19N52
7751D86j004l47J360k77J42K28m39l46K51J4l49L9J78m73N69j68J98M2L16l11
7771A09n20R25o45O69n44n64J021n22m34L25Q12n98M28l78K56K8r26M54m16R45
7791D25p51L90p62R10p85N56l72K69L41Q8K15k56n51J66P7k12K17l38O33n08j71
7812d19L99p93J332j40k74K14k13M1K42k84p63K03K45o4PQ36j346J075l38K98
7832B58j107P79O8J27m86R20j308M66N83K82o03J44o41p42K407k036R77L63m81
7851c0l39L90O32q97j71R92K13r28j91L27m17M23k89J72l58R85o71P2J100o58
7871C57j353N64R61J26p80k19r0J84N9N69p62L45L9k17L71np49J123k00o99L18
$$ y = [375, -88, -205, 703, 624, 231, -737, 213, 591, -489, -604, -64, -505, -15, 486, -344, -370, -196, 153, -66, 486, -518, -865, 495, 218, 360, 588, 149, -197, 54, 68, -281, -242, -64, -537, 32, -136, 62, 104, 420, 109, -411, 514, -131, 538, -6, -570, 451, -71, -505, -180, 632, 34, 462, 84, 340, 368, -558, -104, -520, 425, -326, 64, -698, 212, -573, -17, -389, -120, 221, 309, 524, 268, -283, -117, -40, -252, -35, -373, 260, -248, -419, -20, -813, 519, 379, 105, 319, 106, 147, 389, 105, -658, -455, -210, -274, -267, 569, -777, 298, -40, 258, -849, -70, -2, 125, -361, 559, -749, -283, 300, 582, -21, 123, -518, -1260, 1147, -889, 88, 451, -30, -369, 21, 653, -244, -415, 577, 790, -138, -329, -2, -419, 4, -285, -113, -471, 514, -157, -85, 1015, 357, -996, -432, 529, 655, -125, -344, -434, -250, -191, 378, -384, -39, 0, -217, 154, 149, -600, 523, 323, -376, -58]
7892e8L84j120p27J121j21K80M23r25M64J2k8J97j93m34O2L75p52K36R05k01k76
7913c76K4N70n50k49j50J86M62N31m43k90l45J79Q90o98Q74k77N2o01l39j82K74
7934d58M68j75K93m91Q2M94o53N4K2R36p86O77j076J055q32q0J193p04n43Q66
7954C42m78L53m84P2O25J41j140K46R43r79O66n45O00k02m56K70R8N9n4j54KK15
7976A40p89P66n8K84n63j47M80M49o84j83O93k37J46K91q29m72N31J98L11j31
7996A96l07N1j243J188R11j93K02l59k26l10j020J071l52J068j040M17R40j244
8014b50J204j087L2P1n28Q12j95m52k15L90J95j009J659n68k09j34N33m88O7L0
8034a42N25J31m83o0n1P53j216o36J601J34o50n56N42J37r40J169j411J064l47
$$ y = [-58, 326, -794, -1521, -400, -521, -241, 182, -743, -279, -267, -295, -98, -291, -725, -663, -288, -1040, -804, 101, -100, -376, -352, 218, -332, -581, -731, -545, -83, 448, 5, -285, -630, -451, 439, -259, 615, 338, 390, -211, -550, -732, -458, 10, -165, 128, -363, -281, 213, -440, -386, -364, 572, -214, 463, -613, 442, -390, -470, 723, 19, -524, 342, -136, 217, -267, -195, 430, 571, -569, -323, 620, -359, 307, -238, 362, 160, -296, -26, 72, 131, 77, -77, -75, 140, -649, 117, 59, 343, -220, -367, 113, 562, -122, -305, 388, 151, 297, 588, -241, -713, -182, 16, 327, 196, -111, -60, -1303, -115, 796, 603, 805, 446, 220, -90, -1110, -39, -391, 677, -363, 54, 994, -250, 954, -133, -101, -30, -558, 254, 59, -393, -608, -218, -23, -1032, 627, 59, -150, -284, 249, -239, -172, -142, 383, 514, 31, -29, -80, 673, -543, -1179, 422, 556, -94, -650, -108, 29, -911, 258, -1153, -89, -436]
8053d36J002q64K15l41M87K10l26O01j72J93on54k01K22m33k58J485p75l61qK33
8074h7N20n73j40r9R71m70j212R89j60L69k55K59K93n42n14J417o03J75J79q63
8094c46j04R07p63o78J193J25m92J18q34J36P50j98K50J05M05l05k95j0P9j84
8114a41O9n28K25O27l65N4J08K09k2Np99Q11M05p37P8k15O78l02K96o2j072O80
8136BK86l5j45o83J673j637j43P64n91J007j12j60q17O44J24j04N43j59p12o33
8156h88R85m74r2Q55n14n2L6o81k20R33K30L23n40O76k76k62Q34l3j158j18j47
8177e83Q64L11m34J66M36l01m80l34J99K75o56O72M80m44
$$ y = [-436, 566, -298, -83, -424, 63, 273, -53, 548, 376, 569, 563, 9, -192, 30, -403, -661, 824, 49, -312, -320, -87, 433, -140, -280, -379, 592, 122, -1090, -101, -261, 108, -147, 112, 405, -137, -651, 766, 163, 338, 517, -346, -450, 457, -306, -984, 209, 334, -158, -40, -874, -738, 12, -186, 64, 169, 574, 269, -26, -36, 43, -141, -72, -600, -375, 252, -113, -59, 49, 258, 236, 241, -558, 253, 658, -79, -1, -216, 462, 160, 456, 394, -678, 2, 288, 253, 108, -575, 1098, -539, -682, 82, -509, 498, 386, 226, -591, 53, 177, 73, 616, 457, -255, -888, 97, -377, -469, 386, -128, -180, -144, -825, -1045, -112, 118, 441, -99, 577, 301, 39, 873, 840, -318, -436, -583, 281, 592, 158, 324, 760, 459, -21, -355, -156, 119, -537, 135, 615, 171]
8191A71
$$ Imaginary data points
##PAGE= N=2
##DATA TABLE= (X++(I..I)), XYDATA
0@%%%%%%%%%%%%%%jL9j10J44j44J44j44J53k06K69k89L07l69M28m73N41o11O86
32C64p68Q55r56J067j185J318j462J622j800J993k204K440k706L001l337L712
48A954m143M645n235N944o806P894r306J1222j3986J8347k6317M5544j81617j88285
62c40145L19057K03597l7426j79631j12482M5790J95443J6071j53008l2507R8939
73B3698O04m5023j5455J9353P5622K4271j61612p6703J90359J33933j35632j43562
85a10147L653J04774J26373k5273k00206m4527J83469Q7377j04150r1386k261
96g2304Q6456Q7993q4401j37902Q4253J48548o7020j22834J7498P1606O0846n429
108F7310j32578o0169J62964J03835j27968j17317L8580J02660O7861o9478j49638
$$ y = [0, 0, 0, 0, 0, 0, 0, 0, 0, 0, 0, 0, 0, 0, 0, -1, 38, -72, 72, -72, 72, -72, 81, -125, 144, -145, 162, -207, 221, -252, 289, -322, 364, -404, 451, -505, 562, -623, 695, -767, 855, -945, 1048, -1156, 1284, -1422, 1579, -1758, 1954, -2189, 2456, -2779, 3165, -3641, 4253, -5053, 6169, -7817, 10530, -15787, 29757, -151860, -340145, -21088, 182509, 145083, -34548, -147030, -101240, 94203, 110274, -42734, -75241, 23698, 24302, -20721, -36176, -16823, 58799, 83070, -78542, -155245, 35114, 169047, 33415, -110147, -106494, -1720, 124653, 99380, -100826, -145353, 38116, 125493, 21343, -70043, -72304, 14152, 102145, 17744, -120158, -35905, 112643, 45623, -77211, -59713, 11893, 72739, 67310, -65268, -125437, 37527, 141362, 13394, -103923, -65343, 37317, 105178, 35700, -113938]
119a13938L5051J80268n197j50733k1850P5535N4368J3290q5088r0727J05109
130c912J32203r2083j35440M3308J03529L4205n2350j14787K390J62194L5945
141A15202j56726n6317R7040O2706l477o2096q8462N6452J49086m5334j58605
152i0531J7269J21178K5594n1778p8778j8909J18749P0898j27763r1126R2932
163a2265Q2935k2711n6935o2998K6381J31875J682j61158k2052J35570M1187o8590
175A2921o1636j6484P9321Q5793q3738j21124O7345J12142k2278p1726m0683J5940
187d4207J02143L2555j38389o2281J31961P1780q1682o6599M87N7901P7528m4233
199C6964j29255K7851J31822L61r2597l5546K3829P4744M5568j03450r2588J06956
$$ y = [-113938, -78887, 101381, 96184, -54549, -76399, -864, 53504, 66794, -18294, -109021, -3912, 128291, 36208, -99232, -55924, 47605, 81810, 29460, -85327, -82937, 79257, 115202, -41524, -97841, -801, 61905, 58428, -3668, -92130, -35678, 113408, 68074, -90531, -73262, 47916, 73510, 21732, -57046, -75955, 42794, 113692, -14071, -105197, -12265, 70670, 47959, -8976, -71974, -45593, 86282, 87964, -73194, -95246, 40324, 81511, 12921, -48715, -65199, 14122, 99915, 16177, -104947, -37602, 74540, 52262, -19464, -60147, -44207, 57936, 90491, -47898, -110179, 21782, 93562, 11880, -54719, -54232, 3669, 81197, 36964, -92291, -64440, 67382, 67743, -24854, -60400, -36571, 38173, 83741, -19709, -112297, -5341]
211e341J04700p5403q7663J4754N1887N6845j3651j13125j6649J32247L5881j04293
223a9811m7871L9734N6773L8706o4977j01242O4500J26446m6251j09557J0397
234e3153O1545L8716l414q3026m6957J08540P1433r7349p2634M9417N9118K0962
246E3198m0331q5904K1527J26359q337j20499j1712P7710L4109j0288n7336n4127
258g5631P4281R3941p1187j00619M2789P7588O856l7180o4498k765J07189L0173
270H0937j14679m3697Q5232M5681k4111m4442m5010M1273R8467l4960j16788J9110
282e2987R6561P588m5345m3878j1804P6715N4992q9730p5080P5110O8613l2401
294B8354m5242k6884J9578Q0954K221j10855j4398J00786K4980n9191l3438l854
$$ y = [-5341, 99359, 23956, -63707, -48953, 2934, 59779, 46128, -66997, -83646, 48601, 84482, -19811, -67682, -27948, 28825, 67531, 2554, -98688, -34188, 92258, 46007, -63550, -53153, 8392, 47108, 43694, -39332, -86289, 22251, 93684, -3665, -76299, -26882, 32236, 53198, 12867, -73037, -51510, 74849, 66512, -53987, -65699, 12011, 46120, 35832, -21504, -75631, -1350, 92591, 21404, -79215, -36426, 41162, 48018, 10838, -53660, -56425, 50764, 80937, -33742, -77439, 7793, 53474, 29363, -15079, -60089, -18816, 79651, 44691, -72097, -52987, 43574, 51162, 5817, -38061, -49865, 26850, 81842, -7888, -82968, -7858, 60755, 28354, -16888, -43772, -24194, 56760, 58981, -51874, -66272, 34514, 59494, 303, -33135, -36989]
306c6989M5180O1197n5454q9656M9696Q6776k5230n8790j3273J6316N6102K3012
318E8887q7972m5348R1233N0728o3411m3226J1043L1577M8614k3423r0872J5507
330d6663R9392m353p5792j2705K8617L6127K5128n8177o3328O7290P4256n4657
342A5135o2042J8982L4357L0645p421p1051j4394R2727K4181q1996k7808M0521
354h164L0656J2805l2457o1909L6458Q5285k9780p9169J2543M6625J5521m615
366B3799m7193l1162O9560M9978p0603n0029M6199L6402m33k0367m6898O813Q0011
379D6077p21q3368n799N8773J4721j5787k5451l2344M0912O2077m6675o7782L5872
392a9495N1924q809k2360k6854p586N9470K6210p4986l0603O3422K6677k7028
$$ y = [-36989, 8191, 69388, 13934, -75722, -26026, 60750, 35520, -23270, -36543, -20227, 35875, 58887, -29085, -74433, 16800, 67528, 4117, -39109, -28066, 3511, 52125, 28702, -62170, -46663, 52729, 48376, -27416, -40121, -11504, 24623, 49751, -8426, -71754, -4464, 69792, 15135, -46907, -27925, 6432, 37077, 29656, -41395, -55789, 36938, 61119, -20877, -48685, -8164, 22492, 35297, 2840, -59069, -22611, 62674, 32894, -46275, -33732, 12893, 28414, 23799, -23394, -54556, 15004, 64982, -5621, -55650, -9451, 26951, 26518, 6151, -40747, -33934, 46077, 45356, -38012, -43811, 14962, 29683, 13896, -11555, -43899, -2987, 59090, 12415, -55367, -19495, 32429, 23620, 1260, -25594, -33180, 26290, 52500, -22486, -53089, 10333, 37010, 9982]
404I982k0784j9956J7482N9516j7311p6951J5043O6796m904l4983j4496m271L6879
417A2042L7477n4934n1617N3966M7275l2009k9466l704Q205M3170N992p0021j0095
430d3719O9408J1965m5799j4192O629J9796L3267k6479o0079L1816O0349k3437
442A9525m1947L889J1860K2246J7970m8865l1951N9197L2597m7997k5068J7790
454a0754J3166K1569o235n2315M213O5402m610n3378K97K3249J0421J3248k6403
467b130m0608L8025N1212l9625m1076K3927K0051N041J381l5837j5362N6161J7781
480C8941n6147j2935L2199J0587J660r105l6551J5394N5122j8189n4968J6632
492a7360L4172m037l545j7456k1628L5729L5916m4604l2332L5253J9889j0371
$$ y = [9982, -10802, -30758, -13276, 46240, 28929, -48022, -32979, 33817, 28913, -6070, -20566, -24837, 12042, 49519, -5415, -57032, -3066, 44209, 12200, -17266, -20970, -12765, 30405, 36397, -33624, -43719, 25689, 37654, -8145, -22337, -15708, 4088, 37355, 10876, -49203, -17387, 42962, 19525, -22422, -18533, -6673, 15573, 33543, -15322, -47273, 11924, 44521, -3476, -28544, -10754, 2412, 23981, 17746, -34569, -30356, 35046, 30436, -22942, -22645, 604, 11025, 24273, -2130, -42738, -4713, 46499, 6874, -34202, -10275, 9776, 14817, 16198, -19639, -35001, 21160, 38941, -17206, -30141, 2058, 12645, 14305, 5200, -31351, -15957, 39165, 20976, -33992, -17360, 16812, 12775, 9230, -8226, -29854, 5875, 41791, -2813, -35145, 108, 19997, 9626]
504I626o143k2180k971M8555L015n6455K76M2973J54j3992n028j7211J4179L9373
518C4171k4060m4700K4753L4600j4862j2705o760p280L0079J8823m5243j8566
530c1750M4609R596k6331j207l533j592L2072j620m7467P662M4052r082k4959
543i550J387j025J1970K3689k7238l3463L5428K7231k8442j1756R573m077J5819
556I546J2870l8432j2534M6059O152l5792n56J1597J858J5069r698l3588J7263
569a0186L7485k0783k5375J5110L410J792J5668k1382k5910L5814K4015l7758
581h100j3595K4489J517N75M082k5760j079L7788l766l4941R213J5371n323P881
595H352m634k7917J8709L4612k7193k7977K5043J3056j1509M227j0259j2666K7148
$$ y = [9626, 3483, -18697, -21668, 26887, 29902, -26553, -26277, 16696, 16850, 2858, -2170, -19381, -5202, 34171, 10111, -34589, -9836, 24764, 9902, -2803, -9563, -16843, 13236, 32059, -13184, -31750, 12859, 22455, -3876, -5083, -8616, -10208, 21864, 20244, -27223, -19561, 24491, 15409, -9550, -8163, -9188, 2782, 26471, -767, -34230, 1198, 28429, -13, -11769, -2196, -6273, 9546, 22416, -16016, -28550, 17509, 23661, -12131, -12687, -1090, 768, 15837, 6139, -27449, -10186, 27299, 6516, -18859, -3749, -339, 1453, 17121, -4261, -30171, 5643, 29658, -8100, -21695, 2794, 4311, 4886, 8968, -16792, -17871, 19917, 16151, -18790, -9577, 5794, 471, 8352, 3718, -24199, -5490, 29122, 1929, -26048, -1005, 12051, 542, 4769, -5490, -18156, 8992]
608H992J3065l4697n981K5618j470l556L255j9001P23L7020j1816l8044J7914
621g978K5250j5562m632L585j4130J3125K2755k4106k0818K5774J0187j4094J114
634D70q343n128K6839O057l8549J512L5019q506j6966R989p795k373K4362o466
648A0122l1694J5260K4815j5781p670M101p907J3933J5626k8244j4508L2905N895
661A6853k5268N571N945j0473J5395R167l0899k020L2119n023j9395O161K42O27
675i98J6153j2106k4102K2431J9458k4356n032J3598q571K447J6957j8680j7545
688b0346K9346P827k4592O56J0463n335Q493K212k1694N298K5278j3852j6207
701a2453J5421j40q127J5879l992k5274J7296K1668k3960j0238J7616k57n390
$$ y = [8992, 22057, -12640, -18621, 6997, 5527, 1971, 5226, -13775, -13052, 23968, 12152, -25892, -7978, 17272, 1710, -2922, 663, -13467, -342, 22413, -1693, -22511, 3263, 13450, -644, 470, -7873, -13001, 13838, 19895, -18654, -17142, 17877, 9371, -7595, 2394, -5401, -7774, 16588, 10122, -21572, -6312, 18503, 2722, -4948, -847, -8754, 5179, 20805, -7439, -21947, 10958, 16853, -8415, -2844, 3101, -7372, 8023, 17190, -13709, -15729, 16390, 11367, -8028, -1867, -1625, -998, 15155, 3049, -21053, 1378, 20836, -3520, -8552, 5046, -3525, -1078, 15879, -2801, -20346, 9000, 16827, -7765, -7109, 3354, -1981, 6512, 8724, -12970, -7672, 17606, 3754, -12453, 2968, 2828, -5299, 10580, 6588, -18686, -1390, 20278, -3682, -13920, 3696, 3439, -1951]
714a951R416j2242p480K2720r19k1381R032J0008j2140P401P192k2091K382K7713
728A7660j3831k1037J8306P409j4404P925K231j4862R977J2246j7556k594J5522
741F992p860l340J2283j1540r546K3197N77k5599R065J7798j5766j549J3271j2664
755d681k894J7364p092j4550J4201L506j2931R526N93j4452J1719J2673k1946
768h964j609K3653j0835j2936J6449j255j4532J3634M745j7540N619J3263j2995
781c303n47R542r304l39J3880j0912j1966K0490J399k0192J0237J0807j6505L900
795b813J4008j5150n865J7975l753j3355J2736j131q616J0540J036j5345R955
808B22J1991k0141N83J7480j1110q274J7183n101j4086J5901N577j8661M726J1730
$$ y = [-1951, 7465, -4777, -12257, 10463, 9544, -11837, -2805, 7203, -4937, 2464, 9656, -12435, -10053, 17660, 3829, -17208, 1098, 8507, -5897, 2028, 4259, -10603, -626, 11620, -5936, -8530, 6992, -868, -4208, 8075, -3465, -13011, 10186, 10763, -14836, -5771, 12027, -3739, -5288, 7983, -4681, -7575, 9789, 2697, -11853, 2348, 5854, -7077, 2449, 3042, -11410, 309, 12982, -8964, -10573, 13080, 2245, -10691, 5758, 4503, -10029, 3605, 8350, -9190, -3571, 9692, -3303, -3850, 5692, -3612, -3951, 9929, -983, -12949, 7541, 8940, -11252, -1015, 9792, -6713, -2813, 11195, -3955, -9820, 8155, 4402, -8953, 3783, 2652, -5964, 4576, 5612, -9733, 222, 12213, -7928, -7345, 10135, -975, -9249, 7934, 2833, -11253, 4648, 10225, -8436, -3710, 8020]
822H020j1365P66J0073j1698j480J5778j0175r752J5569N87j4987J0818O405j8198
836i639P095J4810j5104o389J7949n368j0471J0726j237j0480J2942J503j5602
849i265Q381J0181j4231l13J4786j2409n491J8166n785j5838J5689M762j4774
862f141M858P804j2284L464J1298j2488l006J5243p707r183J3187j498j3817J4354
876D084L453j7305O347J4388j4039l366J3803p460o741J3117k815j2871J2613
889C208L736j4500P995P272j4006M727J1588j3558n527J8678o854j1312J2649
902D096J779j3382Q547P134j5001L736J2501j2476j778J1244o370p654J4413m071
916B718j2415J3423M406j6163N631J1817j3790m11J2986r409o858J4288l027j1547
$$ y = [8020, -3345, -2579, 7494, -4204, -5684, 10094, -81, -9833, 5736, 6323, -8664, 2154, 8559, -9639, -2544, 12266, -2838, -9227, 8722, 3354, -7117, 3609, 2372, -8108, 4834, 6337, -9265, -884, 9297, -4934, -5247, 9539, -2870, -8361, 9805, 4020, -11818, 3871, 8633, -6141, -1283, 6521, -5763, -2299, 8999, -3489, -6495, 8748, 1041, -8142, 5045, 3547, -10270, 4084, 7537, -9768, -3421, 10967, -3072, -6438, 7365, -95, -6836, 6281, 3466, -9405, 3208, 6944, -7556, 439, 7711, -6295, -1568, 10020, -3538, -9065, 9613, 2759, -8553, 4096, 5875, -7507, 1040, 8174, -6827, -3091, 9410, -3066, -4844, 6400, 30, -7624, 6789, 2718, -9697, 3726, 8132, -8031, -2400, 9417, -4373, -4784, 8202, -1207, -8065, 6223, 3196, -8351]
930h351J0748K870j2131P397O740j3678L614J1969j2049l967J4389o800r699J2996
944D048j08j2246J0380O041j4559L474J0547j1120j554J3095r085o244J2533k044
958C158j1684J1414L056j3438Q350O314j1914n56J2810q503o948J4411m048j0623
972h201J2365q5j1982Q549O138j2987L758R815j1485k143J4465q017q550J3085
986D725j072j1959J0174M072j2744M412R653j1792O72J2794j0648n337J3323l867
1000B406r229R829K683j3381P341Q543j3650J860J1898j0547m527J2841m415r347
1014g695J1700O56j1981Q638N188j3574N913Q831j1053j662J2195p591n867J1938
1028E636k097j0684R831L038j3279O179Q835j1620o22J1631r040m496J2835l710
$$ y = [-8351, 2397, 5267, -6864, 533, 7273, -6405, -2791, 9178, -2871, -6838, 7551, 751, -8948, 4048, 3940, -8306, 2074, 8115, -6444, -2970, 7577, -3543, -5097, 7998, -1087, -7331, 5202, 3158, -8526, 2888, 5944, -7494, 856, 7170, -4744, -5300, 7510, -993, -7941, 6470, 2422, -8201, 4164, 4079, -7903, 646, 6784, -6203, -2445, 7370, -4115, -6258, 8207, 190, -8360, 4725, 3653, -8306, 1868, 5940, -6804, -2392, 7261, -4531, -3859, 8935, -1713, -7050, 6273, 2406, -6823, 3006, 5689, -7692, -351, 8192, -5458, -3598, 8300, -2247, -6774, 6067, 1652, -7695, 4005, 4661, -7320, 1318, 6506, -7068, -1155, 7676, -3377, -5039, 7156, -435, -6302, 5636, 3539, -7145, 2686, 5724, -7555, -1376, 7459, -4161, -4783, 6848, -2192, -6688, 6147, 2437]
1042B437r356J0503J134j2462Q607O015j2262L146J0444j1144k346J2060n461
1055A315p345J0906j572j1021R318M565j1903M640R180j0781j750J1932q360n739
1069f615J2620l701r711J1058J831j2009O522O965j0782J79J0676q382l314J0773
1083F110n117p887J1324p18j0901Q903M817j1753K793R641j0345j428J1205n273
1097A371q615J1918j248j0522R392K778j1059M075Q644j0476K2J0731q411m384
1111e784J1621k788r611Q821L187j2162O932O314j1124K303Q291p937l647J1755
1125F171n515p033J0344l23j0248Q169L579j0820M314Q061j0681j123J2342p251
1139a4o127R823p82r319Q835K324j0205N405N423r783J221R871q765k251J0275
$$ y = [2437, -6919, 3584, 4718, -7744, 863, 6878, -5384, -2238, 8206, -2938, -5284, 6776, 1315, -6030, 4876, 3304, -7717, 1601, 6166, -5737, -1097, 8083, -2698, -4448, 7484, -876, -6615, 6005, 2304, -7407, 3651, 5482, -6527, -5, 6960, -3822, -3643, 7033, -1349, -4663, 6110, 993, -6894, 4430, 3712, -7189, 1714, 6531, -5222, -2429, 7212, -3133, -4561, 6644, 1371, -7244, 4674, 3426, -7096, 2296, 5074, -5985, -1910, 6734, -3742, -3720, 7011, -1400, -5784, 5837, 3049, -6562, 2259, 5446, -6716, 216, 6530, -4594, -2291, 6000, -1937, -5584, 6171, 656, -6377, 3967, 3644, -6604, 1565, 5144, -5676, -1362, 6699, -3982, -5105, 7237, -14, -6141, 3682, 2900, -6419, 2416, 4740, -5465, -60, 5363, -4420, -3199, 6672, -2093, -4344, 5931]
1154E931m801p251R716J619j2002P504N184j0889L150Q735r591k051J0845n757
1168C42n543R331j500q289P303K709j0154M691Q997j1618m35J0740p069n189J0082
1183D398k294q533R359J402j0198M911O630q868J203O962o931k516J0387m891
1197A021p783J0201l09r763P000L911r089L458P831j0048j049J0252m944n675
1211d986P913j241p340Q511J700j1148N533Q197r773j107J0230q171m232J1707
1225E793m338r082J0303J864r998M315N002p924K589Q110r217j193R964o124n575
1240e511R181q74q980Q521L636j2548L769J0256r791j665Q505m815l918Q224l521
1255D69p087R808J800j0548N120M897q419K248Q652r914k399J1407l766r095P767
$$ y = [5931, 1130, -6121, 3595, 5214, -6788, 716, 5900, -4989, -1839, 6896, -2695, -4746, 6099, 342, -5201, 4130, 2630, -5659, 1644, 4353, -5801, -1110, 7887, -3731, -4166, 6574, -495, -5684, 4398, 2104, -6429, 2930, 4332, -5866, -955, 5675, -3193, -1990, 4972, -1959, -4475, 5912, 1021, -6762, 3439, 3130, -6633, 367, 4278, -4811, -1353, 6478, -3570, -4619, 5633, 689, -4986, 2927, 1686, -5654, 2857, 4557, -6591, -1058, 7139, -2634, -3741, 6489, -1682, -5914, 5793, 1455, -7627, 2676, 4540, -5458, -1143, 3859, -4065, -1476, 6634, -2583, -3776, 6188, 64, -5511, 3670, 2796, -6184, 2337, 5973, -6575, -2806, 7450, -2341, -4006, 4499, -316, -4234, 3990, 469, -6618, 3190, 4990, -5558, -438, 4459, -3960, -1712, 6940, -2974, -5373, 6034, 2268, -6827, 940]
1270I40K279q023M936L707q645L198P228p468j771Q479n929k551Q335l517q731
1285g533J0233L500j2484M842P228p834j73P484n713m934R860j630p427P436p48
1300B107o677O976J818j0187M720R021j0147l391J1518m511o727Q313M33q926
1314e660O701M319q932J059O651n835J38N466p811n02J0129l034r138Q754K737
1329E042j0441N675N135r092J445Q537p018m241P439l92m892N846j458p015Q327
1344B897K289r759L094P639q939j005Q671n786l829R574r70r568N882M393p415
1359b832J227O045o959N38P104o393k582Q926l543o174P792L80q952O422N171
1374F170j0688J689Q734n869m759P694k129m693P518j885p136P822J755q063L701
$$ y = [940, 3219, -4804, 132, 3839, -4806, -1608, 5620, -1848, -3619, 4860, -1069, -3620, 4715, 1198, -7533, 2700, 6200, -6284, -1442, 5786, -2048, -2221, 5263, -450, -5384, 4476, 2846, -4581, 2855, 2107, -4570, 2406, 4224, -5963, -1243, 7778, -2369, -5760, 5758, 1247, -5480, 2833, 3266, -5660, 1041, 5360, -3572, -2513, 4138, -1697, -1559, 3907, -3904, -4406, 5723, 2689, -6449, 2305, 5042, -5399, 276, 5411, -3681, -2236, 6301, -717, -4958, 2481, 2089, -2803, 3043, 1585, -5430, 2897, 5186, -4573, -1479, 6160, -2779, -3784, 4887, -899, -4728, 4846, 3876, -5692, 190, 4583, -2832, -1605, 4440, -2519, -1981, 5123, -1270, -3852, 5074, 1531, -4643, 3149, 3529, -5423, 999, 6170, -4518, -2829, 5905, 36, -4723, 2971, 842, -3851, 3667, 1782, -5354, 2468, 4223, -3840, -139]
1389a39N024p289n31P904n681o003J1109r84q796N331M270p796K844M375p224
1404c586K220N667o732j158P546l553n798Q977j428q172P104M290j0368J154Q647
1419D810n334k499O029l630l667P639j510o744N757K306p844M859L586p707K016
1434a933Q244q066l579R369k198o986N995K104p224L700L908p144K006O145n649
1449a308j344O270m514l272Q212k464q402Q180L317q079J951N767o206j570P639
1464D177m183n647P378N66p090N584P40n806N554K856q767K627Q091p598k967
1479d485Q290k693n131O660O44r231O622N199p886l40N222m517K92N596n956l073
1495d787R244k028p328P000Q76o665M012N161r223O77R077n910m570P731k454
$$ y = [-139, 4885, -2404, -2935, 4969, -712, -6715, 4394, 3410, -5386, -55, 4215, -3581, -737, 3638, -3586, -1366, 4301, -2431, -3589, 3957, 404, -5394, 3583, 2155, -6017, 1087, 5377, -4991, -3837, 4810, -524, -3023, 3006, -624, -4291, 3348, 1838, -4906, 851, 3157, -4687, 172, 3758, -3949, -1933, 6311, -1755, -5334, 4035, 1837, -5149, 846, 2950, -4274, -574, 3334, -3810, -1804, 4341, -1308, -2652, 3618, -896, -4168, 4044, 1580, -6822, 1358, 4675, -3404, -1453, 4314, -1892, -3462, 4177, -6, -5653, 1725, 2291, -4799, 785, 1525, -4281, 1273, 4129, -4638, -2011, 6080, -1518, -4485, 3805, 1112, -4019, 2641, 3285, -5946, 676, 5875, -2011, -2351, 2871, -1646, -1354, 4242, -1714, -4787, 4457, 2429, -4899, 2101, 2977, -3688, 324, 5485, -3738, -3061, 6016, 106, -4464, 3267, 813]
1510H13l239M606r72n125M888M152r026J724P180n838k443P121m590m007P498
1525B742M53p390M507M551o862J285M210n830n01P600n059l521P360j925n673
1540d053O163L17o771M171N328p758l72P827n196k017N946l221m430O505N45o473
1556c489L483M525p705K143N438p162N32O743n032l619P562r45o870N977J918
1571C499o923K656M309n727K99M829m324j679O083j908m743O390J139q242N065
1586G23K731n520j69O385n313j725O298l179m206O422n30n377K802L308n631K387
1602e94M377o960K99O725l711m392P878k039m955M474J712o992L722L616m533
1617a373j977P115m254k568O842m802k859P171j456n943M759J864m390J059M374
$$ y = [813, -2426, 2180, 1208, -3917, 971, 5123, -3903, -2179, 5001, -837, -3280, 3841, -749, -4756, 2742, 3195, -4195, 312, 4863, -1999, -714, 3496, -2334, -2835, 4765, -294, -3815, 3545, 1620, -4053, 2110, 2427, -4344, -173, 5155, -2603, -2975, 4852, -344, -2361, 3585, 364, -4066, 2439, 2984, -3489, -6, 4519, -3186, -1043, 4395, -2767, -2235, 4508, -524, -4143, 3419, 2474, -4396, 1581, 3499, -3424, -768, 3541, -2186, -1887, 2942, -1382, -3061, 3022, 1114, -3629, 2761, 3900, -4342, 723, 3454, -2066, -2235, 4150, -1163, -2888, 3410, 231, -3975, 2447, 1917, -3460, -658, 2650, -2981, -594, 3783, -3177, -2878, 3847, 136, -4256, 3622, 1583, -3372, 1102, 2814, -4178, -456, 3160, -1373, -3350, 3765, -489, -3057, 3785, -1017, -3876, 3295, 1839, -4104, 655, 2519, -1871, -812, 3562]
1632C562n254p05O217l367m030O297j009n251M229J675n785K263N223o566q1O436
1648C854m394k451O333l302l091M364J076o375M495L010o193J557M160m606n30
1663b093N109l675m003O893J41n025K612K937o292L152M167o202m17N756k818
1678B42l661O019k514l877N423M10n540K918L977o257O21O060m813k485O046k352
1694B17l007M402K82n871M374K847n924J411M161l511j452M583j714l294N109
1709B613j141l786L660J622n635K260L595n080l23N402l622k548N548j086l865
1724b386M378J72n199K858L266n619J293M266m197j444O154k454l915N562q10
1739A925n576M405J949m825K490L980n714j031O116l610k321N026j695m290M438
$$ y = [3562, -1692, -2397, 3820, 453, -3577, 2720, 1711, -3540, 689, 2364, -3421, -1158, 4065, -2501, -2582, 3854, -540, -2991, 3342, 40, -3051, 1313, 2389, -3986, 509, 3519, -2674, -1117, 3043, -1563, -2093, 3016, -659, -4662, 2231, 2372, -2653, -41, 2896, -3396, -244, 3923, -2279, -2696, 3060, 242, -3419, 2600, 86, -3791, 1632, 2042, -3498, -580, 3397, -2860, -2239, 3821, -992, -3477, 2569, 217, -2790, 1612, 1894, -3977, 397, 3244, -2680, -1269, 2892, -619, -2071, 2512, 798, -2496, 2613, 1472, -2314, 1346, 2968, -2667, -407, 3188, -1892, -2215, 3187, -435, -2983, 2565, 1479, -2386, 1992, 2164, -3035, -177, 3089, -2530, -1237, 3029, -1168, -2612, 3542, 1088, -2827, 2735, 1925, -3651, 754, 2703, -2122, 368, 4348, -1366, -2397, 3719, 109, -2212, 2814, 1119, -3171, 1267]
1754A267Q28m610K985K031n802K171L995l075k974N447o98n360O043l51m978L560
1770D79K088l794L8M277m153n41M207k674k650M581j7n055M019K048n070K663
1786D46K284m244k06M607k498l354N291j360m296M432l6l165K597K567n375J614
1802f96M386m547j278M383j488l548M761k40m468L296J364m915L127K808l589
1817f44j448M748l407j818M808k244l122L490J547m436J293M308m979K07M978
1832C281m308j956M993n95m135M908j308m094L043K948n530R16N003m678o64L967
1848A791j839l071M624o27l193K752J928m756K470J605l136O42K795k894j926
1863b835N720j523l199K861L43l714J559L235m426j47M708l206q61L196j505k974
$$ y = [1267, 2095, -2515, 470, 2501, -3301, -1130, 2865, -210, -3184, 2263, 1565, -3795, 2248, 1897, -3081, 479, 2567, -1227, -1189, 3088, -1065, -1606, 2601, -73, -2723, 1858, 1841, -3214, 805, 2853, -2217, 446, 2730, -1514, -1720, 2887, 389, -2965, 2326, 966, -3330, 1102, 1066, -2099, 498, 3065, -2310, -696, 3690, -857, -2135, 2248, 760, -2788, 1973, 1733, -2735, 561, 1925, -2990, 137, 2945, -644, -2092, 2656, -751, -2569, 2239, -5, -3127, 363, 1910, -2526, -1233, 3075, -1904, -1697, 3281, -1027, -2983, 2010, 1415, -2720, 2188, 880, -3214, -171, 2777, -2753, -1837, 3166, -1512, -2176, 1791, -48, -3119, 1505, 878, -2315, 437, 2365, -2391, 79, 1684, -1452, -810, 1985, -909, -2835, 2885, 1362, -1837, 1024, 1367, -2347, -788, 2447, -1979, -2126, 2582, -624, -1485, 1711, 206, -2768]
1879b768M573j240l873M428J557n262K367L672m288j747N974l167l028M563j255
1894E06l357L861M23m189L086J987m640K211K685l503j492N119k716l217M619
1909A383J249o091L650K740m031J54K922l186p43L991k998j174M143r16m287M851
1925A657j97l827K705J399l422K91L625k538j477M331n40m680M301L92l710K300
1941F10J530l039k12M093l807r08N221m317r30L638j28m418K847K492m685R05
1957a108K777k718j101M233k361j402L719q72l195L231M43m223K768K976n654
1972b487J136M802m042j476M037o61m530M444L11m011K876J569l443R07L003l323
1988h88m39M238l287k709N288j207l341K778J372l252J190K387l870J63M336l220
$$ y = [-2768, 1805, 565, -3308, 1120, 2677, -2585, -218, 3454, -834, -2581, 3393, 226, -2802, 1761, 506, -2851, 1010, 1433, -2756, 330, 2317, -2323, -112, 2573, -930, -2422, 2697, -19, -3236, 1383, 2632, -3459, 191, 2931, -1100, -946, 1976, -1210, -1953, 2038, -960, -2134, 2009, 1093, -3194, 1657, 1460, -2367, 338, 1737, -1685, -1394, 2231, -307, -1784, 2547, 2007, -2673, 1628, 2020, -1690, 610, 2140, -899, -1111, 2982, -825, -1733, 3488, -829, -1759, 1879, 1751, -2667, 180, 2672, -2013, -1108, 1669, -1049, -2150, 2083, -278, -1680, 2039, 1167, -2028, 1203, 1646, -2577, 191, 3167, -2487, -1351, 3451, -591, -2067, 1970, 1309, -3221, 1223, 1534, -2477, 399, 1968, -1475, -568, 2435, -888, -1327, 2911, -376, -3085, 2203, 996, -2345, 433, 1805, -1447, -257, 2130, -1740, -1577, 2759, -461]
2004d61k132M337j254j973J658N73k624L244O82l351J136K969l159j389L521j252
2020E25k675L171J014m757K881J751l744J515J830k052j236L987l128o69L140
2035A553q39l020K476J130l268J835K407l624L40K889k630k129M468j879j759
2050b050M438j996k918K585K432m755J415K490k928J12K936k251j827L555rl249
2066b020K123K063k438L83M91k157N59L593l654j809M620l01k924L052o45l372
2082b436K081L164m035J83K245k548m22K713j122k034M129l35m264K644J383k568
2098a222J133K713m438J071L595k700l210M715l11l120J822N92k195J283K550
2113B278l298l47K708j946k47L177k397j593L693k98m745L101J570k958M97L017
$$ y = [-461, -2593, 1744, 490, -1483, 175, 748, -1876, 1368, 2050, -1301, -165, 2804, -355, -1744, 1777, 525, -2150, 1021, 2035, -2722, 159, 1910, -1834, -319, 1511, -541, -1777, 2210, -918, -1587, 1553, 714, -2306, 170, 1300, -1968, -133, 2274, -1350, -1010, 1879, -751, -2880, 1588, -291, -2050, 2388, 392, -2526, 59, 2491, -2264, -849, 1641, -1287, -1175, 1761, -490, -2317, 1238, 1229, -2020, 103, 2166, -272, 111, 602, -1555, -996, 2597, -1057, -2866, 1754, 1453, -1471, 1581, 936, -2436, -355, 2809, -1226, -1043, 1202, -1346, -1768, 945, -177, -2211, 1918, 1583, -2681, -37, 1346, -1222, -89, 2624, -1814, -743, 2852, 152, -3058, 1657, 1346, -1774, 48, 640, -1555, -272, 2278, -1020, -1367, 1341, -605, -852, 2325, -72, -1665, 2028, 1730, -3015, 86, 1656, -1302, -805, 2212]
2129B212m162K149K074k472j717L201p76j973K649m43k515K326J672l908K39L676
2145B232j516j878K654n18k598K886k23l964K893J915k802N24J038j748L33K862
2161B090k267k707M023M01k880K179K90k423J516K322m665M14M254j407l053L649
2177A736j316j569K566J61l898J952K981m730J043K583k303q79M092k427l062
2192c070M375Q33m017O97J916k362Q89K464l386NL728j084l448K548Q70l201L114
2209H71j67l077K449K000m456K86L928j317j076J122r82j752L833m31l297J038
2225a028K024j742N41J561k627Q48L930m012j793L001R88k692J952j628j05J100
2241C18K011m246k02L173l27k005J180l20j496M262p60m506K705K948k984m64
$$ y = [2212, -1950, 199, 2273, -199, -1916, 1285, 509, -1464, 1185, 742, -1773, 553, 2225, -1683, -1444, 2232, 716, -1162, 1492, 974, -1624, 1262, 1039, -2925, -32, 1883, -919, -395, 643, -1105, -772, 2090, -177, -2884, 1139, 1540, -1340, 839, 1129, -1294, 222, 2544, -2121, -1707, 2547, 1140, -1913, 1736, 420, -1149, 1417, 1578, -2320, -368, 2613, -2117, -1074, 1509, -794, -1673, 2419, -8, -3070, 1305, 2138, -1879, -1182, 734, -1628, -739, 1725, -1661, -1656, 2072, 988, -2460, 88, 958, -2243, 871, 704, -2373, 76, 2076, -2380, -2094, 1834, 517, -559, 563, -419, -2171, 1662, 1231, -2066, -1028, 996, -746, -205, 1356, -1271, -423, 3507, -505, -2298, 703, 1691, -1001, 951, -677, -782, 318, 2329, -1917, -2119, 1054, 727, -1278, -98, -418, -1914, 2348, 1588, -2918, -213, 2735, -249, -713]
2257g13Q66p16j04K339j337k981L805L80k034O61L16j664K777R82n196P55L736
2274A872n36l615J890K73r02J727r45j801P60L011j399l13J420j503M7J665j795
2291a44k798M665j48l459J054J318q93K62J315l048k6M817j587l396K965n27j350
2308i80K349m05l207K411K239k853k072K474P94o39R44r12k777L727O82l957Q81
2325a301K453M45j331K23k641J433L360j992l071L112J009j577l48O54k814K622
2341B36K133l709k8K852p34p72J209j571p19K750J36m994J430L937j450j589J226
2358C43j492J297K875k849l437L665J295j674p95R55j229J377K455m361j206L957
2374A176j84j504j57n2k01K525j70m428J424L936j834j637J472r05P41K795l044
$$ y = [-713, 153, -563, -667, 1672, 335, -2646, 1159, 1539, -495, 166, 482, -1182, 1595, 2577, -2619, -1864, 1872, 1336, -2279, -389, -116, -1018, 709, -236, -2037, -1277, 1734, 335, 22, 1442, -61, -14, 1651, -144, -2942, 1723, 1575, -1884, -830, 488, -405, -143, 1172, -1876, -1902, 2915, 1328, -2068, 897, 370, -980, 1369, 964, -2243, 168, 2407, -446, -2518, -44, 750, 111, 1055, 143, -2634, 1093, 1775, -2182, -1301, 1152, 1597, 266, 489, -2152, -719, 2641, 649, -2422, 690, 1699, 122, -226, 428, -2386, 236, 2369, -1340, -1368, 1484, 750, -22, 1187, -384, -1103, 1647, 1783, -3211, -1781, 2156, 706, -883, 343, -1149, 148, 3023, 174, -3263, 402, 1697, 23, -772, 183, -1046, 331, 2786, -1575, -2781, 1176, 992, -512, -669, -721, -922, 1603, 1433, -2995, -1571, 2365, 531, -1106, 366, -539, 202, 2997, -47]
2391d7k480M033J30k535R53J83j188J373Q16k809m82M694j791k007N5R51J43K391
2409B383k828k172L269K099l062l46J661n78l82J471j859j843L748R84m321J10
2425a666K249k44N5K07k284J040L409j595l223J015K619j256L73q18k412L071
2441E40K486l358k251K482Q24p09R16k395j0L882r11l247j49L346q90r24k87j711
2459b366K114K726j102l943K174Q24n42K75m67j611K739J746l546j975M134J249
2475B429l035J266j285j78K976j326l183J008L463j193j110l40n1p45L681k579
2491b02k985L035J833j678j169J275J84n1J817l997k06L983k79k699P72L58m04
2508d13K546q11m644K781L442k400k408K537p0J01J699l098j310K737R58k715
$$ y = [-47, -2527, 1506, 1636, -899, 54, 237, -951, 422, 1238, -1571, -2053, 2641, 850, -1157, -1102, -151, -8, 2383, -445, -2617, 652, 2751, -311, -657, 1004, 426, 44, 1515, -344, -2187, 1561, 2545, -1776, -1666, 583, 339, 394, 601, -1683, -643, 2766, 1171, -2052, -1037, 1582, 326, 699, -119, -2531, 540, 3026, -332, -2583, -101, 723, 14, 930, -1465, -1475, 2407, 1496, -1751, -1900, 1446, 556, -368, -655, -2366, -252, 2474, 1372, -2571, -397, 427, -115, 160, -307, -1918, 821, 2567, -979, -2954, 1180, 2429, -606, 660, -625, -803, 2173, 847, -2336, -1328, 2135, 942, -168, -508, -559, -1304, 2377, -202, -3187, -152, 1681, 3, -1166, 109, 293, 242, 2059, -1938, -2144, 1839, 1560, -1139, -367, -9, -413, 2133, 1322, -3322, -541, 2901, 501, -1907, 630, 560, 661, 2360, -738, -2048, 689, 1647, -1068]
2524a068O71j5R93l99J280l714K76L654n46l312N11K321j057J131j40k674K531
2541D43K096l272j127J497J546j096K82j287k015M858O94m560L18K422K13j566
2557e54J056k333J658K644j879k316J071J697J04n04j407o25K699lj836p03K537
2574A306l65q02q1j263r04L698m62l101N83K658J21j219j062j33P48L505m150
2591i23m43J931M15j323n30M98r59K519Q00l209p56L357Ml191J892j376K56L322
2609B284j575k783J619L055k204j673LJ285M22J452k783j930L622J540l165k19
2625a050N16N75J448R0l045l07L076o96j981k93J445P8J317j072k392J501L356
2642B566j755j749j0J229N13j54j831j741M436J180l989o08K085k99R78L88k802
$$ y = [-1068, -397, -412, 581, 182, 1462, -2252, -1976, 1678, 1132, -2180, -1669, 652, -405, 726, 586, -2088, 443, 2539, -733, -1860, -363, 1183, 87, 369, -918, -2933, 1925, 2619, -1941, -1623, 799, 1012, -554, 502, -1831, -173, 2471, 592, -1724, -653, 1044, 1148, 644, -763, -1388, 1311, 1308, -528, -1231, 1306, 941, 139, 58, -1205, -2109, 1589, 1127, -1974, -1391, 1267, 1388, 169, -893, -1026, -278, 3227, -923, -1366, 565, 980, -343, -873, -375, -1334, 1185, 1985, -1224, -1980, 1377, 1381, -1810, 82, -1294, -1038, 2284, 709, -2074, -455, 2600, 396, -1277, -1274, 11, 433, 1885, -898, -2828, 794, 2334, -831, -1050, -534, 41, 1489, 1579, -1466, -1773, 1303, 607, -1374, -1667, -222, -144, 1173, 101, -2291, -790, 2566, 811, -938, -948, 281, 794, 640, -1191, -2932, 1504, 2684, -1305, -1913, 172, -127, 851, 1239, -1563]
2659a563J62M378j414l271R21J571j53r64j05j784K529J951k171j858K403J6q08
2676a60K01l24j113L072r53k721K50K572m13k6o3k176K056J559k92l759J936J525
2694A171j1l41j088n80K226M29l373j29L097l25o3j353M72k5J804r66k266m40
2712a761K357Q05j914J86q72J190J986k670j590K571K225l872O32N3N14Q45J406
2729B091l377l81L445M6k362o16Q59L24J111j501j169J224K352j817j835M85M70
2746f51J257J424k287k032L430J466l831O0J879j357O18P45k109N64K882j184
2762H74j993K10K28K74J37Q54k861K648J356k348j983K792M15R8j8k062l63L077
2780A335J128l277n51P33L95J06K99n76o2K781p46l289R24K547j362j447J857
$$ y = [-1563, -1401, 2977, 1563, -1708, -787, 784, 631, -333, -438, -2222, 307, 2258, 87, -1771, 632, 648, -160, 41, -283, -1396, 1676, 723, -1998, -1748, 824, 411, 385, 322, -1854, 202, 1761, 1469, -2290, -354, 1171, 1160, 819, -269, -849, 1377, 1806, -1567, -1696, 1401, 1076, 1013, -340, 132, 107, 1911, 945, -1321, -1761, 596, 1401, -513, -327, -1199, -9, 1977, -693, -2283, 288, 2513, -1359, -727, -674, -160, 685, 2091, -1286, -1667, 1778, 1824, -538, -1154, -295, 29, 1140, -361, -1530, -306, 2046, 229, -1606, -1121, -651, 606, 2030, -257, -2289, 1141, 2607, -1224, -1164, 715, -642, -24, 721, -1388, -824, 2058, 874, -1119, -909, -681, -407, -270, 584, -2277, 371, 1727, -621, -2604, 188, 603, 701, 683, -1379, -1742, 1335, 2463, -814, -1365, -632, -237, -131, 168, -408, -470, 2311, 1565, -1724, -800, 1747, 385, -1062, 795]
2797G95k505K317J286k978j873L604Q04j804K81r14k60K421J69k826K85K710q47
2814F65j136P85j362q8L013j838j885J494K470j418j768J846j636J735L53k602
2830a372n94L047O64k155N39O4K62O30o31k241J783R21L65k009J05J092M4O79
2848A193j805j736K507J669k055L97p46N97Q92N10k303o23L404n89j945M03K72
2865D2O52m4N96m108K671K517k357j129J187k97MO43j693k49K149J468k288m23
2883f59R9N97R2K05j465k50K684j441j807J666J279m46j19o28n28P66K291k099
2901B37j959Q20P19M09N50j270o73K269J270m379P57J456K50j02p5j526L94K346
2919A493p89k955J189J871M68o68k0j424J899J743l617j009K287J028j340j8p32
$$ y = [795, -1710, 607, 1893, -1085, -2958, 646, 1450, -354, -73, -987, -1247, 1174, 1343, -1483, -1198, 1512, 665, -471, 314, -1048, -1136, 1877, 39, -1846, -352, 2118, 700, -1068, 778, -858, 877, 1230, -1372, -1966, 1081, 1745, -410, 129, 193, 455, 1085, 454, -1787, -4, 917, 1282, -727, -622, 470, 514, 1193, -612, -2348, 159, 1828, -227, 170, -576, 21, 913, 1423, -880, -1503, 1901, 1312, -633, -230, 42, 694, 650, 1246, -2862, -191, 2326, -31, -1160, 27, -270, -266, 377, -1316, -1565, 584, 2052, -236, -659, -560, 37, 129, 334, -1131, -1381, 1303, -138, -1945, -279, 1000, 554, 435, -193, -721, 45, 2336, 237, -1722, -902, -183, 226, 776, -494, -1167, 1102, 2372, -2007, -1250, 206, 456, 354, 279, -1247, -853, 1493, 704, -2251, -1062, 809, 1277, 609, 589, -835, 1064, 2807, -810, -1819, 468, 1496, 156, 138, -594]
2936e94l3J224O00l251L49L017m74r73r59M82K60J888j231k068K452P89j703l18
2954e43N2n56J351J437k041r47J861Q40j854k10J171j010J498o82j519j77K859
2971A530j356j393J129L26j40P58j057m29J638m51j349l47Q64k9K7J142j865o1
2989a063J383J604l490R81J230l57L08k70j816J563J491j916j149J141N83k86
3005f3K97q56q86J594J312j930j04J099q12Q91k25m88q8J774j082k541J346J332
3023E70j66Q6q70j241J739P86k026K04J629P8m83j04n83j223K425J40j841N34
3041c46O78o64O05m49r56J328P34l78k567K048K31j632J539K24j223P92P18p08
3059b6j142J357k47o63P41O3j80O58j83j848J116R71l24j210M56o29J094k20j72
$$ y = [-594, -627, 597, 1197, -2054, -1705, 1312, 838, -135, -1094, -612, -352, 1536, 305, -1763, 689, 1478, -225, -543, -491, -1047, 304, 1741, -300, -1247, 614, 1454, -400, -610, 561, -449, 1049, 367, -1152, -1329, 1530, 174, -1219, -90, 236, 96, 854, -203, -632, 1006, 555, -794, -1141, -277, -306, -279, 863, -1002, -1063, 320, 1924, -1566, -585, 645, 288, 596, 326, -1490, 73, 1564, -352, -1501, -360, 223, -63, 234, -622, -1508, 86, 1398, -532, -636, 463, -349, 542, 317, -171, -259, 1515, 433, -2108, -762, 570, 404, 490, -380, -1621, 118, 904, -1122, -918, 711, 789, 306, 202, -381, -1604, 821, 961, -880, -346, 332, -332, 273, -176, -1132, 196, 930, 552, -2015, 33, 264, -1368, 171, 395, -828, -36, 682, -26, -1168, 189, -58, -721, 20, 83, -97, 561, 378, -1470, -354, 617, 293, -917, -461, -1090, 4, -216, -388]
3078c88r71J364J697k485j20J349l13r38J812j565q61K220o96j43p9O68j120K37
3096c32Q53j848J399P93p19j065J196L02r12J106l95o20k15J114r46o69J270N07
3114H19r05L27j581O58K003j045k890L101K50p17k59R06j389L60P35k44j323J030
3132a64j00L28k93J294j593O19J688j903j006K330j391k36Q91q69J97j76J931
3149A547l543K793n10L81o38J539j300p97J636j068r28J773K01j419O63Q19k072
3166i23J907l20j356K65R65p17r83J252j14p85J060l4j198J676K08j231j479K471
3184F64j065J19J225j054m52J636o86j016Q15Q49j714J614o56j082J448N68j278
3201f5n83J381J96j660J238p74l66J488O43k859J384Q16j560P35M34n32j481K758
$$ y = [-388, -1359, 5, 1702, -783, -903, 446, 133, -805, 1007, -558, -1419, 801, 105, -38, -117, 551, -569, -332, 521, -1327, 72, 865, 146, -919, 277, 579, -333, 773, 378, -242, -457, 657, -289, -958, 312, 819, -86, 241, -1340, -682, 1321, 276, -2614, 487, 737, 20, -239, 667, -722, -362, 373, 129, -1194, -164, -264, 64, -229, 1065, -528, 91, 1779, -124, -1130, 1200, -191, -427, 464, -405, -208, -384, 1547, -1996, 797, 287, 668, 30, 1569, 269, -528, 1108, 40, -888, 885, 1086, -333, 330, 1149, -923, 984, 664, -692, -427, 538, -179, -1162, 90, -24, -809, 251, 217, -981, 695, 903, -328, -1807, 664, -401, -282, 943, -111, -563, 1073, 387, -629, 186, 1035, -679, 935, 279, -803, 645, 1213, -65, -648, 733, 929, -731, 507, -267, -633, 855, 1498, -1361, 23, 839, -721, 14, 448, -84, -1565, 1193]
3219A193J73k039N12K34o90J477K77j503j333L125n60j726R70P88k052R48R33
3236G27k301J862P00j665L47O24J12j215J591m05j545J791n27m55J063l10j195
3253h01Q96Rq35K16K042j653j117K037l8j144N35O45r96O82J017j960%J466j019
3272a8l52L20N66j173N13J45k59J82J191j616J337K31j218q3J246r00j269J341
3290A84O62j357N74P53k147J213J188j477N19J115j247r66J229P87k507J890j233
3307h20L1J349P48j440o82J171p14N00Q08M23j651J123l07j559J618k97j030P29
3325@L51r79K94J739j587k41N03l6j33O64k86j214J685O3j628O22O91L50j242
3344c84Q25l36r67J475j26j124J655m01q16O48q5m59M81O13q45n63J368j754k02
$$ y = [1193, 1366, -673, -161, 73, -617, 860, 1137, -366, -1699, 1426, 866, -860, 110, 898, -1154, -206, 727, -1574, 288, 988, -677, -330, 294, 406, -809, 782, 377, -1168, 623, 96, -359, 704, 394, -801, 95, 104, -731, -515, 1527, -126, -1243, 794, 756, -388, 147, 792, -204, 478, 1495, -465, -465, 1001, -18, -370, -50, 516, -657, -144, 1, -258, -76, 1115, -501, 836, 1067, -151, -234, 1012, 112, -1157, 184, 846, -511, 63, 816, -1331, -118, 1070, -407, 112, 1227, -20, -986, 243, 1030, -1477, 413, -820, -789, 560, 1308, -132, -814, 357, -357, 143, 951, 1374, -277, 846, 539, -1020, 598, 301, -729, 0, 351, -628, -334, 1405, -182, -423, 80, 44, -89, 575, 289, -925, 760, 823, -805, -183, 508, 858, -384, 441, 105, -862, 613, 487, -637, 1018, 617, -199, 449, 364, -95, 386, 999, 154, -409, 959, -795, -997]
3363i97J440n00p82R43M82j012o96J948j132n43J336k57j032J431J35j580L11
3380e05O77j079R66L92j212j07J902j524j07J684r69n43L0O94q38R57P03j493
3398c72k32J114oj975K212k29j463J423m96j052R20J085j577K27J769k688M98
3415h42K231j311q72J106k60N5N65j3J47j138J137n51q39J799k07j335J155M17
3433A244r00l36n1j121J162J479j112j014P13M75j002N21L72l00L45n60j381l9
3451a505K244p72k2K66j01m89J304q05q88P86L41j199J965j357p52J12J061l9
3469A50n00P32q45l46O87R72n76l77L70p51P12m49l99k7J120m83j139J167L0j000
3489i52J339Q24k195J593p25j70M65J456k687rJ755l26l00N0K46j009J015J57
$$ y = [-997, 443, -57, -839, 104, 586, -426, -1122, 826, -306, -849, 487, 230, -802, 629, 764, -816, -505, 172, -907, 59, 451, -761, -868, 1034, -490, -597, 1087, 118, -425, -395, 299, -539, 418, 1121, -372, -604, 510, 504, -1471, 741, 512, -951, 472, -24, -1076, -156, 929, -648, -421, 1348, -1340, -842, 1389, 78, -794, 312, 52, 107, 672, 659, 806, -332, 805, 254, -585, 1214, 1007, -328, 827, 1244, 344, 8, -43, -1164, -2, 1477, 365, -649, 64, 539, -463, 58, 430, 130, 475, -85, -1466, -1505, 739, -33, -55, 211, 110, -379, 925, 120, -768, 18, 359, -840, 1125, -232, -984, -872, 189, 150, -350, 382, -463, -809, -122, 850, 274, -103, 267, -484, 228, -221, -620, -647, 473, -10, -1149, 18, 48, -952, 387, 1211, -984, 609, -116, -286, 179, 1635, -1052, -1061, 694, 368, 68, 118, 364, -645, 370, 527]
3507E27o06P30J18o29j034J281p05j002J731p26p02K195l38k354J517q10L43k16
3525f80O68N22k01Q64o47j163J742l16j156m3O94m62j46J30m21N05K61q1j139
3544a069J243O13j140k82L15n83J072K96r25l95J703q42N92N04j131q65J356L74
3562H36r66Q24l87p24NR04m07K14Q38j919Q62K33j96j24O47Q67j500Q07n99j030
3582h15R24O9M64o88J6Q91j494M75N99j731J821mj359O95n49K27J81P06j274J78
3602f68Q49J78j853J829M27q97k9J30o14K91O37n21j07M75O9m38P56q94j92J257
3622F85N1j536P01n7K54L22P45j598q5Q34J55j3O1k31n17L36K79j071R72j69n56
3643d38L32J270j339j62K05O0j40Q49o06n20K51P82k93j97J78K00j278J567m04
$$ y = [527, -79, 651, 769, 140, -894, 387, -318, -1320, 411, -315, -1017, 1178, 840, -1514, 3, -807, -464, -680, -12, 510, 309, 1173, 526, -637, 1105, 789, -367, -410, 284, -178, -324, -194, -615, -110, 151, 70, -1069, 174, 787, -353, -635, -320, -903, 169, 465, -460, -855, 848, 6, 598, 1102, -29, -894, 462, 836, -130, 694, 307, -417, -412, 492, 85, 299, 1137, -782, 80, 313, 117, -7, 640, 1507, 7, 814, 215, -815, 109, 178, 642, -46, -30, 861, -633, -158, 441, -1290, 531, 527, -832, -137, -686, -459, -278, 428, -846, -668, 181, 359, -1494, 335, 762, -135, -164, -34, -648, -357, 280, -241, -348, 127, 196, -242, 514, -380, -572, 685, 736, -800, -99, -156, 98, 420, 1165, -433, -518, 316, 471, 458, 519, 288, -229, 107, 386, -685, 287, 118, -438, -106, 1164, -175, -337, -132, -72, -212, 637, 31, -489, -238, 544, 251, 54, 232, 432, -846, 721, 317]
3662C17l44k37Q78p10Q40K90j547Q42L55j865J093Q15o89q9n9N57m29j52N51n44
3682a27M10L85j018L58O27n33p80J266p36l88L16J133k000R95O30m40k30l4k41
3701d07p03K398j376M30L38p58q13l81P84oL59M99q14q38K165M6j267J292o71
3720B77r71J141n96q19J581r18o3J293l68n47o4Q16j043k3R68p47l84J126J332
3739A991k713n66J563o61m32J191M64j617J609n58o05j16J069j205p3P64l05j09
3757c09O99j94m76N77j018N46j26m0o26J236j99K44k63M25p61o45J013J19j93
3776Il17L50l81L43o6j627O79K208r10r62J428j188L66j84l34k21P76J01j89K09
3796I0M40j29l59L79k87j2J32l88j93M43K04q78J511l9m33p37Q01r81p6P81L71
$$ y = [317, -27, -264, 614, -96, 744, 1034, -513, 329, 684, -1181, -88, 727, 38, -51, -110, 447, 18, -134, 417, -127, 283, 668, -350, 8, 635, 102, -678, 588, -148, -536, -220, 913, -1087, -92, 538, 98, -132, -166, -407, -1110, 1288, -88, 342, 680, -78, -891, -1272, -488, -494, -135, 364, -450, -1288, 877, 923, -344, 948, 277, -694, 447, -149, -968, 613, -305, -368, 925, 557, 10, -54, 762, -281, -304, 664, -83, -467, 659, 1991, -722, -1288, 275, -386, -818, 373, 837, -780, 829, 271, -334, -450, 619, -586, -659, 105, -200, -309, 390, 196, -280, 297, -721, -175, -301, -341, -967, 269, 70, 314, 51, 476, -285, -930, 83, 202, 9, -308, 42, -339, 4, -62, -1689, -1010, 1198, 288, -674, 754, -434, -68, -252, -586, -807, -31, 70, -119, 90, 530, 401, 42, 421, 134, 122, 254, -134, -327, 116, 320, -558, 953, 914, 481, -256, 545, -436, -512, 269, 640]
3817F40p22N67m84q76J153p08l65J145P13j577J63J428j674N77m8J17Q17l09p18
3836a61n88J18M97o72J096J156j983j18J015m71j164J904N1p22K41r3q73J44P87
3855A64j72L21O67n80k80K37m3j469J222m86O00m1M90l36k56L09m77k75Q66j97
3875B64m16M10j72N5l61M62p9l65J122p24N5O08o31j180K187j480N45m00M38m92
3895a54m86R89q12O26j49R6J10m19M95l66L14o09j51L97oN5N61O23p29r40O79
3916A24j39n6P98j026L0J97J195k619P41J185j076O60Q9n3j379K147o36L1l10
3935i7M83k33j36J075j688Q46o82Q93j155J139r64K1P24k91j050J613l80j825
3953a707J439M43l60l73J389o19j66K63j96o90J534o62q27m60J835o21r12J110
$$ y = [640, -82, 485, 1, -875, 278, -430, -795, 350, 1063, -514, -351, 1077, -597, -20, -68, 49, 866, 557, -161, -749, -631, -134, -806, 290, 1446, -537, -655, 360, -111, -1275, 629, 680, -42, 199, 106, -767, -623, 164, -8, 313, 980, 400, 120, 357, 314, -1155, 67, -419, 181, 140, 630, 294, 38, 347, -130, -405, 461, 264, -152, 258, 86, 141, -220, 242, 163, -202, 920, 196, 251, 859, 228, -952, 1235, -245, 300, -100, 338, -154, -640, 349, -463, 163, 14, 110, 220, -199, 296, -70, 244, -365, -516, -119, -125, -70, 491, 1114, 385, -555, 124, -15, -71, 727, -299, -269, -72, 1123, -1496, -755, 430, -646, 14, 103, 50, -1329, 818, 182, 213, -97, 386, 153, 17, 1092, -596, 250, -432, 461, -694, 445, -519, -498, 226, -65, -1115, 498, 118, -1707, -268, 175, -185, -558, 831, 212, 46, 309, 113, -577, 957, 295, -532, -992, 843, 222, -690, 420]
3971D20j015j14J829j220n14J743j003j539J946O23j152m75J076p42j15R07j089
3988d34j61J106o42q85J385o75J40n23J331p42K66J336j080o80L99M16m62K88
4006C83M0j151N17R98j452M88K21l03k55M57m05n4M53K6n03J139L60j644J115
4025D30j7k15l53J015n88m84p29R11m13J328k77j611M43O46j85j216J547j288
4043a056J295L63n63j173J432k82n15P57o29n40Q06L92J29q53M95M52j789J884
4061F05l70m56l88R08n05N82n4o22K02O33k74j340J947m39m75j01Q67j307J047
4080D60o18J028j161J225j887R37P79m43l15r0L05n95L0J661j705N06k87n97O68
4099i9N59J09j385J389j076j50Q33L29m91q1Q17j240K14N82j322O22J085m92j047
$$ y = [420, -595, -709, 1120, -100, -614, 1129, 126, -1413, 533, 1156, 4, -471, 605, -137, -252, 655, -434, -595, 511, -131, -1016, 369, -306, -166, -689, 642, -100, 166, 1502, 422, -258, 141, 557, 95, 383, 423, -728, -211, 787, -665, -177, 44, -259, -514, -57, -462, -516, -63, -37, -540, 599, 959, -685, 430, 413, 198, -155, 860, 272, -212, -941, -30, -443, 885, 608, -1003, -560, 86, -99, -1315, 232, -1056, 239, 602, 39, -1134, 298, 16, -499, 258, -371, -911, -105, 287, 416, -437, 58, 510, -1279, 605, 235, -221, -609, 299, -206, 376, 322, -300, -98, 535, 261, -1079, 868, 429, -46, -147, 720, -587, 460, -158, 870, -291, 934, -953, -16, 763, 320, 5, -85, 220, -375, -345, 1316, -389, 117, -170, -767, -99, 460, 569, -816, 573, -503, -653, 180, 509, 18, -63, 754, -486, -272, 310, -1012, -390, 695, 203, -844]
4118h44J556qj214R72K89j016R54p92o83P26L20q0K36o30O39L17p7j267M21L42
4138A61o11K01l49J844k481J303N58o47m77L61l92Q84l43J91l67l44J102q57Q31
4157E68j12j272O49l52l98J160J79L5j344O53R93j300M10k86N40l42K22K56j059
4176h00O13O23l91n27Q53m90r8J128q26j247J496j4j07J253q89j003L57P82j64
4195E49n21O73j193L01J117j135pN49p57j20J49R30r74R05P8j172J414L54j755
4214f15L43L11o90J23n0P2M87k2O95p92J46j58M47l24M11j076R51P02j473L43
4234a69L21N37n96J11k46n71J021M56j732J215Q5l40q06J312o41o01Q68p36q10
4253a322J069J058j249J01K97J55j323J232l31j46N43J151j043m05J56O00m49
$$ y = [-844, 712, 704, -510, 462, 751, -265, 689, -103, -786, -60, 260, 180, 416, -214, 425, 742, 665, -602, -181, 161, -450, -249, -598, 1246, -1235, 68, 626, -21, -498, -137, -529, 355, 12, 203, -164, -508, 594, -263, 568, 456, -816, -167, -519, -917, 243, 422, 457, -887, -234, 759, -541, -131, -417, 123, -219, 3, 259, -800, -187, 436, 45, -482, 371, -119, -217, 911, 85, -1162, 334, 320, 213, 1466, 577, -426, -69, 713, 549, 28, 701, -492, -191, 926, -209, -216, 333, -424, -544, -395, 535, -439, 466, 544, -628, 786, 1140, -615, -272, 39, -651, -528, -578, -506, -19, -41, 654, -138, 8, -150, 297, -27, 384, -692, 259, 961, -512, -169, 152, 689, 93, 204, -42, -613, 408, 864, -868, 347, 432, 92, -714, 598, -43, -644, 224, -512, -1322, -253, 805, -444, -343, -46, 109, -1214, 18, -313, -459, 84, 1235, 192, -213, -57, 543, 94]
4270I4K8o20N27P66j377pN88Q11j056L14j85L06K40L15j034J96P89m24o59R46
4290E58m39l61R9K46l73M18M9q99J004mq81m56J283m9m18J337p76q40M82k60N95
4311C15q16R23o26p35J357r01j051K061m94L1R4o89K9M76M08k75q6j13N41o71
4331b22J320o36j200J044l90j275J013K25m09j57N43rj056R58J59m84P87m93O1
4350b21J09O38j287J214j01k49l04J545j628l52J135p66M9j30L16m34N94N95j097
4369c74Q58K90n42j04R10j050j090J648O33j466Q68O14k016J109J154j924M11
4386g1J074r43l81R57Jj958J857m79r41J030L58q40l03J443p78q06J685j196L4
4405b57O99j96r57P93R82k130P60J436j174K29Rl49r32M12Q59k87k59R19j465
$$ y = [94, 122, -498, 29, 795, -582, -589, -1, 810, -246, 68, -117, 189, 429, 744, -290, -94, 695, 271, -388, 558, 119, -242, -143, 103, -270, 148, 197, -702, 302, 298, -583, -1039, 244, 195, -223, 1114, 338, -502, -20, -280, 315, -501, 422, -204, -939, 418, -483, -1534, 527, 33, 64, 158, -531, -502, -26, 382, 107, 21, -92, 449, -222, 1098, 462, -738, 306, -84, -1359, -346, -121, -530, -687, -144, -153, -1209, -251, -92, -576, 211, -282, -221, -112, 526, -761, 453, 352, 103, -201, 1344, -284, -636, 499, -267, -218, -348, -32, -466, 128, 723, -374, 484, 774, 232, 128, 1038, -12, -1102, 546, 1179, -287, 581, 1195, -821, 288, 1442, -482, -71, 1003, 60, -321, 636, 637, -1321, 536, 57, -884, 146, 504, -336, -639, 804, 26, -780, 905, -291, -257, 442, 246, -711, 82, 1064, -1066, -306, 1130, -44, 185, 194, -155, -1087, -675, 184, -103, -362, 557, -908]
4424i08L82N70m18K75P96j428J085j08j000L34J125L31j128J65K82n43j54J071
4442G29j175L38Q85j240N55K41l38m02M46m57l68Q72l04L47J36R79j544l66O86
4461B0J10j128J430q8j266J302K73j252J031k16p5j466J854m55p21J098j249M82
4479c16J040m78n94m50K143j993M34Q28j138p30J779j08j031K72P34j148R59O11
4497H14j861Q10K09m93m99K395k310O26P58o31n4Q52l46q04k84J936j410m7J108
4516G69j273m8R30k67l37N19L55p72Q5Q52j039O8J005j191J18P99r45o47Q90J47
4536A8n14K88J319j487L63J210j658N16O44p96j84O40p82p2K42N37j386O16J72
4555c14L81p26R10o19J61J762j178j031J692p97j108J080k48j23p09R34j037N63
$$ y = [-908, -526, 44, -374, -99, 697, -731, 354, 246, -754, -420, 705, 1036, -92, 73, 355, -188, -342, 729, -446, -108, 777, -463, 92, 333, -5, -407, 39, -418, -786, 86, -218, 129, 265, 1244, -300, -666, 20, 130, -998, 432, 344, -922, 380, 653, -599, 432, 216, 141, -1325, 529, 74, -647, 451, -798, -316, 724, 246, -348, -798, 1345, -648, -214, 614, -524, -1254, 525, 417, -614, -342, 392, -756, 203, 814, -1047, -237, -28, -521, -1020, 1375, -935, -309, 449, -182, -236, 616, 270, -534, -818, 1118, -292, -339, 769, -504, -552, 378, 111, -226, 293, 648, -124, -39, 813, -226, -158, 847, -344, -226, 573, -372, -1019, -129, 18, -496, -208, 1111, -376, -13, 1197, -461, 55, 699, -97, -281, 359, -423, -495, -253, 284, -1102, -486, -314, 67, -659, 251, -368, -207, 1555, 377, -654, 1038, 241, -867, 213, -35, -158, -867, 67, -970, -407]
4573d07J716j605l33J500q67n57N67J249k040N90L57j96m29R49n22j73%O13j142
4592g30M50J051j752J242l46m17L11Q65q64n6N50M74j363O15N1p85L89J428j352
4611b39j56J593j152k24K69q55m46P18Q31m60K14N02j586L55J675j456L15Q48
4629G46j608K09J001m37n70J212l57m91K82R58j129J23Q70j390r5N85k83J21O90
4648D37j331o00K323q76r64O66P41p00N54P06k279n2J604q35Q35R03n55r75L47
4667e1Q88r53K04q97J046j093J635n63r08P40N79j144R14L67k478Q18R87L02j060
4686f67O73o67P50N63M39k036J057N69j183J117r0j159O18J090j851j20J713l7
4704G79j750J153L36m46K4O31j400J223M40j154j494K339r80L88P25n14p31J332
$$ y = [-407, 1309, -296, -629, 871, 4, -553, 14, 1263, -777, -187, 170, -26, -455, 494, -28, -201, -201, 412, -730, -280, 771, -981, 261, -85, -502, -191, 674, -190, -246, 304, 778, -585, 30, 81, -704, -315, 1113, -239, -395, 1198, 46, -178, 91, -764, -1210, -492, 339, -121, 93, 595, -991, -636, 1039, -417, -102, 746, -862, -653, 348, -89, -659, 553, 196, -295, -13, 945, -184, -61, 809, -581, -676, -91, -374, -253, 437, -894, -1494, 829, -47, -1011, -345, 396, -304, 250, 956, -1323, -1375, 229, -606, 229, 1132, 577, -398, -51, 837, -116, 88, -809, 237, -856, 779, 216, -692, 48, 627, -517, 397, 764, -1714, -896, 91, 393, -667, 6, -661, 89, 652, 1091, -945, 112, 681, -502, 615, 525, -634, -16, 1074, -777, -897, 816, 779, -971, 182, 518, 72, 96, 727, -673, 550, 990, -164, -1658, 681, -299, 89, 814, 300, -431, 901]
4722I01j160o05N76M41q23J106R23j923K92Q32p83M71J516j158j128N2J386j843
4740i27O79J081j327q7J501q62j241J102m72p06L71R08q44N02J31m26q2J958r31
$$ y = [901, -259, -864, -288, 153, -670, 436, 1359, -564, -272, 560, -223, 248, 1764, 606, -522, -470, 916, -927, -248, 833, -494, -581, 920, 58, -1183, -81, -553, -1259, -888, 20, -824, -322, -191, -617, -699, 1259, 328]
$$ [...]
8191f
##END NTUPLES=NMR FID
##END=
