##TITLE=1H_BAU-j-PH2T
 CDCl3, 8 sc, 
 7.3.2019
##JCAMPDX= 6.0         $$ Bruker NMR JCAMP-DX V2.0
##DATA TYPE= NMR FID
##DATA CLASS= NTUPLES
##ORIGIN= UXNMR, Bruker Analytische Messtechnik GmbH
##OWNER= root
$$ XWIN-NMR		Version 3.5
$$ Thu Mar  7 16:34:21 2019 Russian Standard Time (UT+4h)  she@DPX200
##.OBSERVE FREQUENCY= 200.1316
##.OBSERVE NUCLEUS= ^1H
##.DELAY= (6, 6)
##.ACQUISITION MODE= SIMULTANEOUS
##.ACQUISITION SCHEME= undefined
##.AVERAGES= 8
##.DIGITISER RES= 18
##SPECTROMETER/DATA SYSTEM= spect
##.PULSE SEQUENCE= zg30
##.SOLVENT NAME= CDCl3
##.SHIFT REFERENCE= (INTERNAL, CDCl3, 0, 15.7039)
##AUDIT TRAIL= $$ (NUMBER, WHEN, WHO, WHERE, WHAT)
$$ ##TITLE= Audit trail, XWIN-NMR		Version 3.5
$$ ##JCAMPDX= 5.01
$$ ##ORIGIN= Bruker BioSpin GmbH
$$ ##OWNER= she
$$ F:/spectra/data/she/nmr/H-F/1/audita.txt
$$ ##AUDIT TRAIL=  $$ (NUMBER, WHEN, WHO, WHERE, WHAT)
(   1,<2019-03-07 16:32:53.00 +0400>,<she>,<DPX200>,
      <created by zg, POWCHK disabled, PULCHK disabled
       configuration hash MD5:
       00 E9 B6 7A A2 85 ED C7 34 08 36 98 17 FE 4E 26
       data hash MD5: 16K
       2B 64 2B 37 00 3D 16 BB C1 FC 48 99 D3 03 A1 33>)
$$ ##END=
$$ 
$$ hash MD5
$$ 77 B1 4C 76 47 C1 E9 40 17 E5 FF 2C 57 DE 87 D6
##$RELAX= 
##$RELAX= 
##$RELAX= 
##$RELAX= 
##$RELAX= 
##$RELAX= 
$$ Bruker specific parameters
$$ --------------------------
##$DU= <F:/spectra>
##$EXPNO= 1
##$NAME= <H-F>
##$PROCNO= 1
##$TYPE= <nmr>
##$USER= <she>
##$AMP= (0..31)
100 100 100 100 100 100 100 100 100 100 100 100 100 100 100 100 100 100 
100 100 100 100 100 100 100 100 100 100 100 100 100 100 
##$AQSEQ= 0
##$AQ_mod= 1
##$AUNM= <au_zg>
##$AUTOPOS= <>
##$BF1= 200.13
##$BF2= 200.13
##$BF3= 200.13
##$BF4= 200.13
##$BF5= 200.13
##$BF6= 200.13
##$BF7= 200.13
##$BF8= 200.13
##$BYTORDA= 1
##$CFDGTYP= 0
##$CFRGTYP= 5
##$CHEMSTR= <none>
##$CNST= (0..31)
1 1 145 1 1 1 1 1 1 1 1 1 1 1 1 1 1 1 1 1 1 1 1 1 1 1 1 1 1 1 1 1 
##$CPDPRG= <>
##$CPDPRG1= <>
##$CPDPRG2= <>
##$CPDPRG3= <>
##$CPDPRG4= <mlev>
##$CPDPRG5= <mlev>
##$CPDPRG6= <mlev>
##$CPDPRG7= <mlev>
##$CPDPRG8= <mlev>
##$CPDPRGB= <>
##$CPDPRGT= <>
##$D= (0..31)
0 1.2 0 0 0 0 0 0 0 0 0 0.03 0 0 0 0 0 0 0 0 0 0 0 0 0 0 0 0 0 0 0 0 
##$DATE= 1551961972
##$DBL= (0..7)
120 120 120 120 120 120 120 120 
##$DBP= (0..7)
150 150 150 150 150 150 150 150 
##$DBP07= 0
##$DBPNAM0= <>
##$DBPNAM1= <>
##$DBPNAM2= <>
##$DBPNAM3= <>
##$DBPNAM4= <>
##$DBPNAM5= <>
##$DBPNAM6= <>
##$DBPNAM7= <>
##$DBPOAL= (0..7)
0.5 0.5 0.5 0.5 0.5 0.5 0.5 0.5 
##$DBPOFFS= (0..7)
0 0 0 0 0 0 0 0 
##$DE= 6
##$DECBNUC= <off>
##$DECIM= 24
##$DECNUC= <off>
##$DECSTAT= 4
##$DIGMOD= 1
##$DIGTYP= 9
##$DL= (0..7)
0 120 120 120 120 120 120 120 
##$DP= (0..7)
150 150 150 150 150 150 150 150 
##$DP07= 0
##$DPNAME0= <>
##$DPNAME1= <>
##$DPNAME2= <>
##$DPNAME3= <>
##$DPNAME4= <>
##$DPNAME5= <>
##$DPNAME6= <>
##$DPNAME7= <>
##$DPOAL= (0..7)
0.5 0.5 0.5 0.5 0.5 0.5 0.5 0.5 
##$DPOFFS= (0..7)
0 0 0 0 0 0 0 0 
##$DQDMODE= 0
##$DR= 18
##$DS= 0
##$DSLIST= <SSSSSSSSSSSSSSS>
##$DSPFIRM= 0
$$ [...]
##$SUBNAM2= <"">
##$SUBNAM3= <"">
##$SUBNAM4= <"">
##$SUBNAM5= <"">
##$SUBNAM6= <"">
##$SUBNAM7= <"">
##$SUBNAM8= <"">
##$SUBNAM9= <"">
##$SW= 24.9336934301222
##$SWIBOX= (0..15)
0 0 2 0 0 0 0 0 0 0 0 0 0 0 0 0 
##$SW_h= 4990.01996007984
##$TD= 16384
##$TD0= 1
##$TE= 0
##$TE2= 300
##$TE3= 300
##$TEG= 300
##$TL= (0..7)
0 120 120 120 120 120 120 120 
##$TP= (0..7)
150 150 150 150 150 150 150 150 
##$TP07= 0
##$TPNAME0= <>
##$TPNAME1= <>
##$TPNAME2= <>
##$TPNAME3= <>
##$TPNAME4= <>
##$TPNAME5= <>
##$TPNAME6= <>
##$TPNAME7= <>
##$TPOAL= (0..7)
0.5 0.5 0.5 0.5 0.5 0.5 0.5 0.5 
##$TPOFFS= (0..7)
0 0 0 0 0 0 0 0 
##$TUNHIN= 0
##$TUNHOUT= 0
##$TUNXOUT= 0
##$USERA1= <user>
##$USERA2= <user>
##$USERA3= <user>
##$USERA4= <user>
##$USERA5= <user>
##$V9= 5
##$VALIST= <valist>
##$VCLIST= <CCCCCCCCCCCCCCC>
##$VD= 0
##$VDLIST= <DDDDDDDDDDDDDDD>
##$VPLIST= <PPPPPPPPPPPPPPP>
##$VTLIST= <TTTTTTTTTTTTTTT>
##$WBST= 1024
##$WBSW= 4
##$XGAIN= (0..3)
0 0 0 0 
##$XL= 0
##$YL= 0
##$YMAX_a= 594218
##$YMIN_a= -821789
##$ZGOPTNS= <>
##$ZL1= 120
##$ZL2= 120
##$ZL3= 120
##$ZL4= 120
##$ABSF1= 10
##$ABSF2= 0
##$ABSG= 5
##$ABSL= 3
##$ALPHA= 0
##$AQORDER= 0
##$ASSFAC= 0
##$ASSFACI= 0
##$ASSFACX= 0
##$ASSWID= 0
##$AUNMP= <proc_1d>
##$AZFE= 0.1
##$AZFW= 0.1
##$BCFW= 1
##$BC_mod= 2
##$BYTORDP= 1
##$COROFFS= 0
##$CY= 11.3945322036743
##$DATMOD= 1
##$DC= 2
##$DFILT= <>
##$DTYPP= 0
##$F1P= 18.9103706918063
##$F2P= -1.10871071338519
##$FCOR= 0.5
##$FTSIZE= 0
##$FT_mod= 4
##$GAMMA= 1
##$GB= 0.15
##$INTBC= 1
##$INTSCL= 1
##$ISEN= 128
##$LB= 0.24
##$LEV0= 0
##$LPBIN= 0
##$MAXI= 10000
##$MC2= 0
##$MEAN= 0
##$ME_mod= 0
##$MI= 1.114404
##$NCOEF= 0
##$NC_proc= 0
##$NLEV= 6
##$NOISF1= 3.799351
##$NOISF2= 2.8
##$NSP= 1
##$NTH_PI= 0
##$NZP= 0
##$OFFSET= 15.70392
##$PC= 1
##$PHC0= -8861.716
##$PHC1= 14.20014
##$PH_mod= 1
##$PKNL= yes
##$PPARMOD= 0
##$PSCAL= 0
##$PSIGN= 0
##$REVERSE= no
##$SF= 200.130013532006
##$SI= 16384
##$SIGF1= 3
##$SIGF2= 2
##$SINO= 400
##$SIOLD= 16384
##$SREGLST= <1H.CDCl3>
##$SSB= 0
##$STSI= 0
##$STSR= 0
##$SW_p= 3612.71676300578
##$SYMM= 0
##$S_DEV= 0
##$TDeff= 0
##$TDoff= 0
##$TI= <>
##$TILT= no
##$TM1= 0
##$TM2= 0
##$TOPLEV= 0
##$USERP1= <user>
##$USERP2= <user>
##$USERP3= <user>
##$USERP4= <user>
##$USERP5= <user>
##$WDW= 1
##$XDIM= 8192
##$YMAX_p= 0
##$YMIN_p= 0
$$ End of Bruker specific parameters
$$ ---------------------------------
##NTUPLES= NMR FID
##VAR_NAME=  TIME,          FID/REAL,        FID/IMAG
##SYMBOL=    X,             R,               I
##VAR_TYPE=  INDEPENDENT,   DEPENDENT,       DEPENDENT
##VAR_FORM=  AFFN,          ASDF,            ASDF
##VAR_DIM=   8192,          8192,            8192
##UNITS=     SECONDS,       ARBITRARY UNITS, ARBITRARY UNITS
##FACTOR=    0.0002004,     1,               1
##FIRST=     0,             0,               0
##LAST=      1.6414764,     0,               0
##MIN=       0,             -821789,         0
##MAX=       1.6414764,     594218,          0
$$ Real data points
##PAGE= N=1
##DATA TABLE= (X++(R..R)), XYDATA
$$ [...]
2199b994L678J408j096M54K382j235n569k715M829N862M3m629k711R87P63k408
2215b951k0M837K645m061n934n03L525K160j280o77K202k1m513l430K629N456
2231F4K197l031l454J89J362o30l04L763L216j596m806j775K664M013M70j234
2247A108R07P62j926l017J73L856M141o60m493j802J947L19j028J260L766Q17
2263F130l752n538J212N457J838k345j423J804j82l218k155L305N031n93m741
2278H30k241K142N73k393O95L224J647l870n076p92M105K108j347r18k39r56j996
2295d504j589J638L757J121k655l086M25J309P89J4O82K485O45l754k930K370
2311c283M663J442k118j193J492M06k923l99M315M327k491m862r19L574Q66j771
$$ plain form
2199 -2994 684 2092 996 1450 3832 2597 -2972 -5687 -858 5004 5047 418 -2293 -1306 -543 -2951
2215 -2951 -2971 1866 4511 450 -5484 -5987 -2462 -302 -1582 -2259 -57 -78 -4591 -8021 -5392 64
2231 64 2261 -770 -4224 -4035 -2673 -3303 -3607 156 3372 1776 -3030 -4805 -2141 1872 2342 1108
2247 1108 2015 2777 851 -2166 -1993 1863 6004 5344 851 -951 996 1315 287 1547 5313 6130
2263 6130 2378 -3160 -1948 3509 5347 3002 1579 3383 3201 -17 -2172 1133 6164 5571 830
2278 830 -1411 731 1304 -1089 -394 2830 4477 607 -4469 -5261 -1156 952 -395 -1313 -1552 -2508 -4504
2295 -4504 -6093 -4455 -698 423 -2232 -5318 -4893 -3584 -2795 -2781 -2099 386 1031 -2723 -5653 -3283
2311 -3283 1380 2822 704 -489 1003 1409 -1514 -1913 2402 6729 4238 -624 -1543 2031 2897 1126
2327A126J14L098Q12m567l126K078L655K76j905p03O00k89k275r26L219K659q84
2344B962l525j540N81J316L80o87J131O66j699l407q76L062K976l67l415r36J447
2361a931K5k354J08L481J907k454l686K28L369J012j584M89K920k01l596j445
2377c712K846M342m3k901o05K088L52j384k89K562K156j442l093l17K363O69j245
2394B347P4J563J61k225k572O44L025J598k191k246J48Q28n30j171J000J888k27
2411B114l294j552J835J674r51j291j54R38l5k565j529K303L017j297k186p97
2427c770J023P29j408p64K188K097k306l029J167L029N04j762r98K168J466j845
2443a511k006J993K832l77j675m40J615J068j485q64K175K072j847k104M81K004
$$ plain form
2327 1126 1240 4338 5150 583 -2543 -465 3190 3466 1561 858 1458 1169 -1106 -2032 1187 3846 2962
2344 2962 -563 -2103 -1522 -206 174 -513 618 1284 -415 -3822 -4698 -1636 1340 973 -2442 -3378 -1931
2361 -1931 -1906 -4260 -4152 -671 1236 -1218 -4904 -4676 -1307 -295 -1879 -1390 1530 1329 -2267 -3712
2377 -3712 -866 3476 3433 532 -73 2015 2367 983 694 3256 5412 3970 877 560 2923 3592 2347
2394 2347 2421 3984 4145 1920 -652 -8 3017 4615 2424 178 326 1154 624 -547 453 2341 2114
2411 2114 -1180 -2732 -897 777 -174 -1465 -1619 -681 -716 -3281 -4810 -2507 510 -787 -2973 -3770
2427 -3770 -2747 -2018 -3426 -4190 -2002 95 -2211 -5240 -4073 -1044 -540 -2302 -3300 -1132 334 -1511
2443 -1511 -3517 -1524 1308 931 -744 -1184 431 1499 14 -850 1325 3397 1550 -554 -73 1931
2459A931J016q92j079P94P75p11q72J72Q28P61q20j526M66J684P3j945j50J627
2477B132J002j486k050N02K359m4k470o32J908L97j840j511J289K260q59l090
2493b133j6K825L23k583q92K128J277j869j439R87K013o62j972M51J688J84j033
2510g23p04M30J176L90j538k88R02P95k44j049j66O22J265j147r88J106J036p53
2528A22j856J82J896J290k200j724J242K009r09k117N06K350k00k407q93J921
2544g88J626j562j941J911J198j062j869n2K493O95j080k119P37J587m60r26R21
2561f91J448O3j471o59J337J436m82l57N27R73K3n49o04Q58K019J51j614p58J160
2580B810L60j01l12K00J026q27k106l68J430J217j536j105K31L95r53j708L10
$$ plain form
2459 1931 2947 2055 976 1770 2545 1834 962 1134 1962 2723 1903 377 843 2527 2600 655 505 2132
2477 2132 3134 1648 -402 100 2459 2415 -55 -687 1221 1618 -222 -1733 -444 1816 957 -2133
2493 -2133 -2149 676 999 -1584 -2476 -348 929 -940 -2379 -1392 621 -41 -2013 -1562 126 310 -723
2510 -723 -1427 -997 179 569 -969 -1257 -355 440 196 -853 -1019 -397 868 -279 -1267 -161 875 122
2528 122 -1734 -1552 344 1634 -566 -2290 -1048 961 52 -2065 -1559 791 591 -1816 -2709 -788
2544 -788 838 -724 -2665 -754 444 -618 -2487 -2539 -46 649 -431 -2550 -1813 -226 -686 -1612 -691
2561 -691 757 820 -651 -1310 27 1463 981 624 1151 2124 2147 1598 994 1852 3871 4022 2408 1650 2810
2580 2810 3170 3069 2757 2957 3983 3156 1050 682 2112 3329 1793 688 919 1314 361 -1347 -1037
2597a037J902N16k371j619M98Q82r6r78M05J291k09k768p69K208J551o33j226
2614b453l17J049j18j658K28K589Q03j417j491nJ373N48l91M95J194j86j422o51
2632a830R57J557P96k01p80n7N47m99o2J217J500k0j147k218J079J722M23j371
2650A613N17O22p79j986m07J691J682j053k039J9R09j057j187P55K262M5k416
2667h09j622O25J678j20p80J072O90j328j542j5J808J501k58j063m90m7n80M28
2685h52N43P35J071m89k106r11J244J500j14q5m87O4o37j509k6K923J217j522
2703E59j478j05P29j67j32R81J990n87k925r36J688J708j75n37L38L86j175j664
2721a502O61K430M90j114q96m78k10j57K93P71J165k59j841j586M94Q76J646k20
$$ plain form
2597 -1037 865 1381 -990 -2609 -2111 -1229 -1325 -2303 -1898 -607 -816 -3584 -4353 -2145 -594 -1227 -2453
2614 -2453 -2770 -1721 -1839 -3497 -3269 -680 123 -1294 -2785 -2790 -1417 -869 -1260 -765 429 243 -1179 -1830
2632 -1830 -873 684 1480 1279 499 442 989 490 428 1645 3145 3125 1978 -240 839 2561 2984 1613
2650 1613 2130 2752 1973 -13 -420 1271 2953 1900 -139 -120 789 -268 -1455 -700 1562 1607 -809
2667 -809 -2431 -1806 -128 -248 -1028 44 734 -594 -2136 -2151 -343 1158 900 -163 -653 -700 -1280 -852
2685 -852 -309 426 1497 1008 -1098 -2009 -765 735 621 536 49 113 -524 -2033 -2059 864 2081 559
2703 559 -919 -1024 -295 -462 -594 387 2377 1790 -1135 -2071 -383 1325 1150 613 951 1337 162 -1502
2721 -1502 -841 1589 2079 965 69 -409 -619 -776 -483 288 1453 1194 -647 -2233 -1739 -863 783 563
2739E63l04m47n80j153K5J396J588M99j152j757l39J150M50J87Q28J244j391k214
2757a407n80J817J623L60j278j34M00j291j269J366K405N14j454j631l66J242
2773C17M6j47J215Q65o50k334q77R23K104L07p96J6l69j365p83O51J754J175q69
2792A183j984j202N80L87L87M40N64n64j362j136m01J717J663l67j091m16p58
2809b360K80k8R82K336k6j645j805Q97J238O19R75M41N08j115k043K5K100K034
2827C413o10p51k99n68m75o78J412J934L48k410j668k95L59P38L07M10j36j470
2845d39j902j04J309P92L65l12p49r75m51J65M06J489R93o30j513j137O33J751
2863c09J351ok52M9j494q25M68K223J892p14j828k35P91m06m89J792J407l87k319
$$ plain form
2739 563 259 -188 -768 -1921 -1896 -500 1088 1587 435 -1322 -1661 -511 -61 126 954 2198 807 -1407
2757 -1407 -1987 -170 1453 1813 535 401 801 -490 -1759 -393 2012 2526 1072 -559 -925 317
2773 317 363 216 1431 2296 1646 -688 -1565 -642 1462 1769 973 989 620 -745 -1528 -877 877 2052 1183
2792 1183 -801 -2003 -1423 -1036 -649 -209 355 -209 -1571 -2707 -3108 -1391 272 -95 -1186 -1602 -2360
2809 -2360 -2080 -2108 -1126 1210 1184 -461 -2266 -1369 -131 488 1463 1904 2412 1297 -746 -721 1379 3413
2827 3413 2803 2052 1753 1185 710 32 1444 3378 3726 1316 -352 -647 -288 450 757 1167 1031 -439
2845 -439 -2341 -2445 -1136 -344 21 -291 -1040 -2015 -2466 -2301 -1895 -406 587 -43 -1556 -2693 -2060 -309
2863 -309 1042 1036 784 833 -661 -1486 -1018 1205 3097 2383 555 320 1111 705 216 2008 3415 3028 709
2882G09j285N97J213L45k80O22k61j829j553N43J565O36j54j504o65o41m01O02
2900a741J116L05m60q67j298j002J287J448Q8k01o06n39j28o06L00K092J558j338
2918e92j277j76Q69M90L79J154Q20k28j981n85J980J516l51J78L51o51p38n01
2936F57R24J954N83j153j203m86j55J95O58O78N94o98k142n18M99R99M67K35o03
2955A485r92m63m32J39J194P82n35j005r90l72N41M63J40M23K57j531j140m28
2973b464J244P82K88p71j114l02m30k81O56J252J19j190j630j36J277L29J9P51
2991a601N36m78j632j60J211J481K95k53l5K79m49j37J262J450N96r31n89kM41
3010A284M81L64J028m02p50o07o4q0P44R14l97j011o30n60J31N81M5N44N2r89
$$ plain form
2882 709 -576 21 1234 1579 1299 1921 1660 -169 -1722 -1179 386 1022 868 -636 -1301 -1942 -2343 -1741
2900 -1741 -625 -320 -780 -1647 -2945 -3947 -2660 -1212 -1124 -1325 -1931 -2470 -2598 -3204 -2904 -812 746 -592
2918 -592 -1869 -2045 -1176 -686 -307 847 1667 1439 -542 -1127 853 2369 2018 2196 2547 1896 1158 657
2936 657 1581 3535 4118 2965 1762 1276 1121 1316 1974 2652 3246 2548 406 -112 387 1386 1853 2088 1485
2955 1485 493 30 -402 -263 931 1713 1178 173 -817 -1189 -648 -185 -45 378 635 -896 -2036 -2464
2973 -2464 -1220 -438 -150 -921 -2035 -2337 -2767 -3048 -2392 -1140 -1021 -2211 -3841 -3977 -2700 -2371 -2352 -1601
2991 -1601 -1065 -1543 -3175 -3335 -2124 -643 -348 -601 -636 -357 -806 -943 319 1769 2365 1434 845 843 1284
3010 1284 1765 2129 3157 2755 2005 1398 1334 1254 1998 2912 2515 1504 874 314 445 1026 1071 1615 1667 678
3030F78j435J80Q67M95r3l70N8k52j091m33J832J073j157m25j03r0j24k56M20
3049b26J765k83j557o17O00M50k70N79M97j60j208q66J86J600J17l04m9k97j126
3068a169K45P90RL08k4k57o73o11j86J059M69m19n81J44l18r49N36Q91P94m23
3088c65j156n49Q44K17l60O85J151m50j144r0P68J154l00l90N28M07q90l64J005
3107G01O67J57m89j05j51q2n0N5M85K05k40q77k64l8L97K53m19j41j02l59j19
3128e16J04k42O07K08m98p54M03M75j57l6J52L82L13p60k31R70P56q4n21K05R6
3149H72j31N0K74M6P08r99m74J31J97q2m45J16L06M7j059l59L26K47l48K4j99
3170g52J1j93k86L6N19J72m10K9L48j02r6M33j47K79j20j00P6o4M20j08L19j22
$$ plain form
3030 678 -757 -577 290 785 692 322 380 128 -963 -1396 436 1509 352 -73 -176 -266 -390 -646 -226
3049 -226 1539 1256 -301 -918 -318 132 -138 441 938 778 -430 -1296 -1110 490 607 303 254 -43 -1169
3068 -1169 -924 -134 -125 183 159 -98 -771 -1382 -1568 -509 -40 -459 -1040 -896 -1214 -2163 -1627 -736 58 -365
3088 -365 -1521 -2070 -1226 -1009 -1369 -684 467 17 -1127 -1217 -449 705 405 15 543 950 60 -304 701
3107 701 1368 1525 1036 931 780 698 648 703 1188 1393 1153 276 12 -26 371 624 205 64 -38 -397 -516
3128 -516 -412 -654 -47 161 -337 -1091 -688 -213 -370 -406 -254 128 441 -319 -550 420 1176 1092 571 776 872
3149 872 741 791 1065 1111 1819 820 346 477 674 592 147 263 569 616 -443 -802 -476 -229 -577 -553 -752
3170 -752 -741 -934 -1220 -1184 -665 -493 -903 -874 -526 -628 -724 -291 -438 -159 -279 -379 -303 -367 53 -55 264 142
3192A42N1P1K85l61j2M14R6p3o34K5Q93r0o64n69J335p2q72j64N77K31m34q95
3214g20N33O91l69r06L95M70n06j04l44R32k26k93l84M99J30n96O6O05k42m44
3234h13o3J01M55J44j80J40j29j42LN25M57m93K4P65pk98j00M04O56j49p33L84
3256I51N46p52p15J007N01p06m66R7J7K87m83o4N17j41o82p06O86N40l79k82k30
3277d57L49k42p59M53O35r7r3k72j6j23p5M63K45J40l1m71M0lj01N29J82m70l51
3300e25p0j74K01L42q1j5Q1q93k71P64N02l56O3M89k58k82p06M69J211j40o33
3321b82J98O7j87N5Q8P45J22j01o22p1N07j22r8N29j10r1m21m18O28L20R2l86
3343D42k2m98l94K03P68k15N59o29n15L19k59N0P66J15n35m60K52n19M28K67J46
$$ plain form
3192 142 193 264 549 188 176 590 686 613 -21 4 897 807 143 -426 909 837 -35 -199 378 609 175 -720
3214 -720 -187 504 135 -771 -376 94 -412 -516 -860 72 -154 -447 -831 -332 -202 -798 -732 -127 -369 -813
3234 -813 -876 -775 -320 -176 -356 -216 -345 -487 -484 41 498 5 29 794 787 489 389 793 1449 1300 567 951
3256 951 1497 745 30 1037 1538 832 366 463 480 767 284 220 737 596 -86 -792 -106 434 55 -227 -457
3277 -457 -108 -350 -1109 -656 -21 -118 -211 -483 -499 -622 -697 -234 11 151 120 -351 -311 -314 -415 114 296 -174 -525
3300 -525 -595 -769 -568 -226 -307 -322 -241 -1134 -1405 -641 -139 -495 -432 57 -201 -483 -1189 -720 491 351 -282
3321 -282 -84 -17 -204 -149 -61 684 806 705 83 12 519 397 299 828 718 627 206 -212 416 736 828 442
3343 442 420 -78 -472 -269 499 284 843 214 -301 18 -241 -191 575 690 155 -305 -53 -572 -144 123 269
3364B69L77n05n54Jq7N61k35O18L36j226m61k83O98P21L67r73M80l42j090K70
3384a058R04O35k07L8q74J35l1K17O66P14k92n76k7O6J18M10J79J15p1n75o97
3405b11Q5O77n8J32M2p61m13OJ78M22Q7k69l98j51o34j11P35O51l63l69j41l19
3427a183l3P0O09Q65j57j159L08J5K32Q2J122o6k21o92j80j35P87M70k8L98p20
3448C84o51j47O91L59L42j41k91j036J68mN09Q57n33k03l51k03m95M01J110K5
3468G91m38n76k58JJ00k17P18P19q65q19j47j0Q62N4k46M79j85q57m14Q28N78
3489I8O06l90k55j56m30J78N52Q02L48m71n59m36K2Q40K18L31N7n21p91K80k90
3510C3N93J99L84o89m12m59l16O06M77k43P3q00j014J69J61O31K95o2n2n80p15
$$ plain form
3364 269 646 141 -413 -412 -499 62 -173 445 781 -445 -906 -1189 -491 230 597 -376 104 -238 -1328 -1058
3384 -1058 -154 481 274 312 -562 -427 -458 -241 425 1139 847 271 244 310 428 838 1017 1132 1061 486 -211
3405 -211 -126 551 493 625 667 -94 -507 -501 -323 99 186 -83 -481 -632 -1266 -1377 -642 9 -354 -723 -864 -1183
3427 -1183 -1216 -1146 -537 328 171 -988 -680 -665 -433 -351 771 705 484 -208 -388 -523 264 734 706 1104 384
3448 384 -267 -414 277 636 978 837 546 -490 -322 -326 183 1040 507 304 -47 -250 -745 -344 766 791
3468 791 353 -223 -481 -480 -380 -597 121 840 -25 -844 -991 -1001 -139 -85 -331 148 -37 -894 -1308 -480 98
3489 98 704 314 59 -97 -527 -349 203 1005 1353 882 323 -113 -91 749 967 1298 1355 834 43 323 33
3510 33 626 825 1209 520 108 -351 -667 -61 416 173 246 -554 -1568 -1399 -1238 -607 -312 -374 -426 -1006 -1721
3531a721M03M38O70K34q57k86J16K24L02L14O55m6n98m97l1M72M46M2N12k86n05
3552Al12l56P43N69K16m88l13j71l54M98L96M42j99l21p02R5o7L61O78k17K25
3573G24r24NP0j30O84L72j19o7j207K06N47L26n5M67o08n96l98M3Q66J92J5m10
3595Cm02k9q20J79J056L55l13o29K34l13p9J50K65Q05J50j054N7K42J09M18K13
3616E97L15m50n81l11L16N70Q6J71j29k35m75k44R95J12j34l3k85k09k28j55Q42
3637E35P28o23m46m31K89k00K76Q2L95r8n94m68N25K1l07O22L8k96p98j01R6M90
3659b65J48k41l1j73p26J22P43J66k14j25l24j16o2LN38N06j87q2l08K65j41J85
3681c19R8J001n6q90k41K39L33N19k6N78n10q18K01P6P62J44l33L5l08n15J63
$$ plain form
3531 -1721 -1318 -880 -210 24 -833 -1119 -1003 -779 -477 -163 492 446 -152 -649 -680 -208 238 280 792 506 1
3552 1 -311 -667 76 645 861 373 60 -111 -465 33 429 871 672 351 -351 -256 -323 38 716 499 724
3573 724 -200 -195 -125 -255 429 801 682 615 -592 -386 161 487 432 899 291 -305 -703 -660 206 398 413 3
3595 3 -399 -428 -1248 -1069 -13 342 29 -600 -366 -679 -758 -608 -343 462 612 -442 -385 -143 -34 384 597
3616 597 912 462 -119 -430 -114 456 542 713 584 349 -126 -370 625 737 603 570 285 76 -152 -307 535
3637 535 1263 640 194 -237 52 -148 128 210 605 507 -87 -555 -30 -9 -316 306 344 48 -750 -851 -755 -265
3659 -265 -117 -358 -389 -562 -1288 -1166 -423 -257 -471 -596 -920 -1036 -1098 -1095 -557 -51 -238 -320 -628 -363 -504 -319
3681 -319 -221 780 724 -166 -407 -168 165 684 658 1236 726 -92 109 185 947 1091 758 793 485 -30 133
3702A33L19K90L6k04k24J19n79J97P1O70J09o65O2n55J12L34N68k0k5l94q65K74
3724b37K29N53N9j89k12k68j44j17K43N68l62l42J34j76m97O8N04J05l96k38k44
3745i59J01%M08J41N74o79m44J59M22j2J7M48n76Ql0k60Q88j87k39K88qq1m49
3768d70j06L34M35J34q44J14K40m07r7Q91J79l51j80k45L57J14j21K05K20j28
3788B74l64K70J24J24o5L47K05j73n81m2L65M45k50O6j0j51l24m8L77M61n38m12
3810A00q9J33Ok95M05N57q44q2N4N7q3K43j56L78J0n22m00N33k9l01M55j92k85
3833c47k7P4J39L16n29k74L44L62o46p4N26l30k05K7O1q4J73l36K68M18l32j89
3855f65J70J17q4L90j53L11J63n33k6K05J75l8n6M31j82j01J09mK22k74ok7j6
$$ plain form
3702 133 452 742 778 574 350 469 -110 87 158 828 937 272 334 -221 -109 225 793 773 748 354 -511 -237
3724 -237 -8 545 604 415 203 -65 -209 -326 -83 485 123 -219 -85 -261 -758 -690 -186 -81 -477 -715 -959
3745 -959 -858 -858 -450 -309 265 -414 -858 -699 -277 -289 -272 176 -400 -392 -422 -682 206 19 -220 68 60 -21 -470
3768 -470 -576 -242 193 327 -517 -403 -163 -570 -667 224 403 52 -128 -373 -16 98 -23 182 402 274
3788 274 -90 180 304 428 363 710 915 742 161 119 484 929 679 745 735 584 260 212 589 1050 512 100
3810 100 11 144 150 -145 260 817 -27 -109 -55 2 -81 162 6 384 394 -128 -528 5 -24 -325 130 -62 -347
3833 -347 -374 -300 -161 155 -374 -648 -304 58 -588 -662 -136 -466 -671 -644 -583 -667 -494 -830 -562 -144 -476 -665
3855 -665 -495 -378 -462 -72 -225 86 249 -284 -310 -105 70 32 -24 407 225 124 233 229 451 177 171 144 128
3878A28J76n51O6M05R2l66P6O6J59j62j71K0K02k06l84N64j12J64K03k55L9J56
3900C09k35J87l0L6j29O5j50O10n97J11j77K67k80j97J76J49l36Q4K07j55k24
3921c09k02K34K47%k73j65M05j25k43M26J52l12k9K50k7K01k39k0K47P7l4k86
3943b5P3j2J32k60M4Q2n2j75M65K78n87m13M29j0k48o5L24J07j27j35k49L82N
3966c7r4K32J25o4l13Q1p0J23M77m04K63Nm76mK69O1l9k82L36l34K2k33R9M13
3990A56l3l72L2K40l22J18L62k33K36j80m27M84K14j59J2K27m5o39L86K66k23
4011A00M37p03J70J42j50J90K18K24l86j53j42N8k78J97K42q0k8n35m2K43p0l3
4033c79K85J41m7m87J07k51Q17j46J88L1o5k38j02L44J18L8k43j29K50k15O2K39
$$ plain form
3878 128 304 -247 -181 224 316 -50 26 92 251 89 -82 -62 140 -66 -450 114 2 166 369 114 153 309
3900 309 74 261 231 267 138 203 53 663 66 177 0 267 -13 -210 -34 115 -221 -137 70 -85 -309
3921 -309 -511 -277 -30 -30 -303 -468 -63 -188 -431 -5 147 -165 -194 56 29 230 -9 -29 218 295 261 -25
3943 -25 48 36 168 -92 -48 34 -18 -193 272 550 -37 -450 -21 -31 -279 -344 -20 87 -40 -175 -424 -42 -37
3966 -37 -131 101 226 162 -151 -70 -140 -17 460 56 319 324 -152 -156 113 174 135 -147 189 -145 -123 -356 -257 156
3990 156 123 -249 -217 23 -299 -181 181 -52 184 4 -423 61 275 116 128 355 310 -329 57 323 100
4011 100 537 -166 4 146 -4 186 404 628 242 89 -53 5 -273 -76 166 86 58 -477 -519 -276 -346 -379
4033 -379 -94 47 0 -487 -380 -631 186 40 228 259 194 -44 -146 198 316 354 111 -18 232 17 79 318
4055C18J84l19k93Q1J36j45K36K8L86m11k69k40K9J42l1L10l0n3k4j40J33k2J29
4078A35j90J31J54n77Q5o1K75J89p7k21Q7l2J48n9N31n4n82J14l15J32k00K90
4100i7L53j62o30j36N11J96L8J53k69J32m36j27M20q9L15j65K11k22j39N5J9M62
4122C93J79l43k59k64J59n1K65K39o1k44k57j08K29l14M28q7K28l18m59P7L95
4143a73L33l4p5J19k98K7j62N03K08Lk58o4j36k15M79J88L44m96J59m23m25L98
4165BJ42N0M88m14m32k2L86k58K47K68m37j37j83o14J116K08n1k65Ll9k39k15
4187c96N88M19k75j05m49N5K49O5N3K94n39J09m35K10l7k05M17K29n90j98l42
4208h83O26j28M16k25J0k59l92L98m9M28l9k26M44l96k43K2M17J17K30l58l68
$$ plain form
4055 318 502 183 -110 -29 107 -38 198 226 612 201 -68 -308 -279 -137 -168 142 112 59 35 -105 28 6 135
4078 135 -55 76 230 -347 -262 -323 -48 141 64 -157 -70 -102 46 -13 518 464 -118 -4 -319 -187 -387 -97
4100 -97 256 94 -536 -672 -161 35 73 226 -43 89 -347 -474 -54 -143 172 7 218 -4 -143 -88 -69 393
4122 393 572 229 -30 -294 -135 -186 79 318 257 13 -244 -352 -123 -437 -9 -96 132 -186 -645 -568 -173
4143 -173 160 126 51 170 -128 -101 -263 240 448 451 193 129 -7 -222 257 445 789 293 452 29 -396 2
4165 2 144 194 682 268 -164 -186 200 -58 189 457 20 -117 -300 -914 202 410 359 94 97 58 -181 -396
4187 -396 192 611 336 231 -218 -163 86 151 204 498 -41 68 -367 -157 -194 -399 18 247 -343 -541 -883
4208 -883 -257 -385 31 -194 -184 -443 -835 -437 -486 -58 -97 -323 121 -275 -518 -496 -79 38 268 -90 -458
4229d58M99k5j47P5R04o72j01l08J65J88M9M31p1k9n66J6K0K97j05J17K65j83
4251C61m42L01r0K69L04l00J74m08K4l02N56Q0m7Q0m51j15Jl13M69N6r3r0k79
4274b55j13k9J82L84j33l01J3j58l4K36J39J12j36j38M5j3q4K51K74k66k47J3
4296b58j99K86J16N42j5n05q8P6K16l38J38K51j90k49m0l0m7k7M16J07j44On70
4319e46m1N65L9r8J31q6l26j32M45M9L96P1n17K64K6l84L04M43j60n22L03j13
4341A11J6j33K68J13J11j53j049L81K87r6M59R4n07K29m14P4K33M36n07K9K01
4362A83j54k36J92M30K09n14J56m69J02P7l63N20K65J6q18J44K98K8J48j25J27
4383B16k94k34J31L7K91k08L01k42p0l12R4K26K59j56K14j00k09j70L20Q4L26
$$ plain form
4229 -458 41 16 -131 -56 848 176 75 -233 -68 120 169 600 529 500 -66 -50 -30 267 162 279 544 361
4251 361 -81 220 130 399 703 403 577 169 193 -109 447 527 480 560 109 -6 -5 -318 151 207 114 24 -255
4274 -255 -368 -397 -215 169 36 -265 -252 -410 -444 -208 -69 43 -93 -231 -186 -199 -283 -32 242 -24 -271 -258
4296 -258 -457 -171 -55 487 472 -33 -121 -45 171 -167 -29 222 32 -217 -257 -287 -334 -361 55 162 18 24 -546
4319 -546 -587 -22 17 -81 50 -36 -362 -494 -49 0 396 467 -50 214 240 -144 160 603 443 -79 224 111
4341 111 127 -6 262 375 486 333 -716 -335 -48 -144 315 409 -98 131 -283 -209 24 460 -47 -18 183
4362 183 29 -207 -15 415 624 110 266 -203 -101 -24 -387 133 398 414 -404 -260 38 66 214 89 216
4383 216 -78 -312 -181 -144 147 -61 240 -2 -72 -384 -290 -64 195 39 253 153 -56 -226 94 178 504
4404E04m10k40O5j04R1n4L32M67n29m85P4MM89l29J31o7J9k77m7J32K32j07L01
4427A92k04j67j06l6J98N20k63j73k42J17j12K56K89k37n4R5j17JL52j11p7K57
4449C78j7n26N7J79J92k39J58j53N2n84K60PL09L2O1k29j03j01K2j69O79p8j41
4472D6l30J24K53j07qJ92J46r2k55j5J62P3k09O7J46n55K93N8L8M54j98j41J15
4495B57J5l67k0L86j05j31k13L05K7l16p8K90N58k88m66L23r2l67O8L69J19m10
4517a36P1k22K19J74j02l6J6k07m6J07J65k83M08m23J43J87l16j18J83M42k58
4538c2j28K06j57N7p2L60J44k94K5k53O7J35L10K6k25j80P1M6O6o3J07m55L92
4561A53kk45J4K23l01J17K9Pk94j03R3J93R6j20j89R1J79l8LJ62r8N8l66M40J4
$$ plain form
4404 504 94 -146 -81 -185 -94 -148 184 651 122 -363 -289 -285 204 -125 6 -61 -42 -319 -366 -234 -2 -109 192
4427 192 -12 -179 -285 -321 -123 397 134 -39 -281 -164 -276 -20 269 32 -22 73 -44 -43 309 198 121 378
4449 378 361 -165 -108 71 263 24 182 29 81 -503 -243 -236 73 105 166 -63 -166 -267 -245 -414 265 187 46
4472 46 -284 -160 93 -14 -22 170 316 224 -31 -46 116 189 -20 47 193 -362 -69 -11 27 481 283 142 257
4495 257 272 -95 -115 271 166 35 -178 127 154 -162 -240 50 608 320 -146 177 85 -282 -214 155 274 -136
4517 -136 -65 -287 -68 106 4 -32 -16 -223 -269 -162 3 -280 128 -295 -152 35 -281 -399 -216 226 -32
4538 -32 -160 46 -111 -54 -126 234 378 84 109 -144 -77 58 368 394 169 -11 60 106 172 109 216 -239 153
4561 153 151 -94 -80 143 -158 -41 -12 -5 -299 -402 -309 -116 -20 -140 -329 -238 -59 -97 -94 68 -30 28 -338 102 116
4586A16L0l7K52l0k90j6q5n8j3N03l13q3J66k18J66J84l69q3K26n0j25K72j41
4609Dj5mJ56j61L1J12k29L1r4L90k46j77L2J75J79j92k47M98j1j63m5K1q2J23
4633H6p7l49M12j04j75K11K22j68n77L21L49k71r9j41L37l50K07Q6QO4m6P7N7
4656H0j52M50k01l4k3j13r8j52L85j88J58j83L88k48l01J92J71k33j5J37Jn1K99
4679B69l25K14j69k57L1L29K09l24M0J87J09l12J33k28J3J2L91j76Q0l36O9J08
4701F7k06K02J2o7k11J24R6m10K37M30l10l37L40J9j4k13K30L41j85l09OP1o8
4724a55k06N09K05m91L2PM6K33j15K48J22k69k49J87l03M34j83j82J82r2L5L04
4746B99j6j71Q1k47J39L8m00r6N16J12o28k7L07k7J13K6j00J69Q5m37J47L39k07
$$ plain form
4586 116 146 109 361 331 41 25 -60 -118 -131 372 59 -24 142 -76 90 274 -95 -178 48 -2 -127 145 4
4609 4 -11 -15 141 -20 11 123 -106 -75 -169 221 -25 -202 -170 5 184 -8 -255 243 232 69 24 45 -37 86
4633 86 9 -340 72 -32 -207 4 226 58 -519 -198 151 -120 -219 -360 -23 -373 -166 -80 -72 -8 -54 23 80
4656 80 -72 378 177 143 120 7 -91 -243 142 -46 112 -71 317 69 -232 -40 131 -102 -117 20 21 -30 269
4679 269 -56 158 -11 -268 -237 92 301 -23 17 204 313 1 134 -94 -81 -69 322 146 226 -110 -41 67
4701 67 -139 63 75 8 -203 -79 17 -393 -156 274 -36 -373 -33 -14 -28 -241 -11 330 145 -164 -158 -87 -155
4724 -155 -361 148 353 -138 -106 -99 -53 180 65 313 435 166 -83 104 -199 235 52 -130 52 -40 -5 299
4746 299 283 112 193 -54 85 123 -277 -373 143 255 -373 -400 -93 -120 -7 19 -81 88 173 -264 -117 222 15
4769A5J0k08M44K9j58o31M42J76l5k10K30k15k24L97j45L8J66l54J07j11L2kK93
4792H6o3M6k84K01M8J4P9KJ27k38lp7L38j27j77Q3jj3L3l28K50K68j89l9r4K46
4818A88j53l98J31K48j12j2j66J67oJ32p3J67n07N03l57J49K6J38k03L60l05L2
4840e1q3J09L12l49L16j33j12N2n12M55K09k91M5J65j74M0rj64N15j90r5l21j08
4863c74L04N5j87N13j37J00l11j4K82l6P1M2P8l95N2k72j8L00n7%j58J79k35J70
4887d8J18K38o0m91M9J99k36P0j43L14m0l06m4R0N8K24K12k20j91J97j33N85m5
4910C97l72R5J15k80J83n7M38j98j51R8k58j45n0K57j96K54K2k52K21m49L84j48
4932i2K04J99J0n92L8L67j53Q0j24K47j00k39k3N9K34N2l33L94k37l7O8K93j0
$$ plain form
4769 15 25 -183 261 290 132 -499 -57 119 84 -126 104 -111 -335 62 -83 -45 121 -233 -126 -237 -205 -207 86
4792 86 23 69 -215 -14 34 48 127 129 256 18 15 -62 276 149 -28 55 54 41 74 -254 -4 264 75 36 -58 188
4818 188 35 -363 -232 16 -96 -108 -274 -107 -113 19 -54 113 -394 109 -248 -99 -73 65 -138 222 -83 -51
4840 -51 -134 -25 287 -62 254 121 9 61 -451 4 213 -78 -33 132 -42 -2 -11 -175 340 150 55 -266 -374
4863 -374 -70 -15 -202 311 174 274 -37 -51 231 195 266 308 386 -9 43 -229 -247 53 -4 -4 -162 17 -218 -48
4887 -48 70 308 248 -243 -194 5 -231 -161 -304 10 -30 -336 -380 -290 -232 -8 204 -16 -207 -10 -143 442 397
4910 397 25 120 235 -45 138 81 519 321 170 268 10 -135 -185 72 -124 130 152 -100 121 -328 56 -92
4932 -92 112 311 321 -271 -233 134 -19 61 -63 184 84 -155 -178 -119 115 167 -166 228 -9 -46 22 315 305
4955C05l4m61J00J7o1J32n8J56L08n96j10L50p4R1M21l35k79J17j62L64l65M36
4977B62L6j62l32JR3M30k80k0m4p9J18j85lK17J16p5j28J22k93k4j2K03J2k4m8
5002i9l62J83J17J92J92J00l32p8j44J62nL30l42K6M87m96NK10K61n68J30J19
5024H8M8l72K32q8L36r1r0l02K86j18o7M61k28P8l65j07M3M34l83M6K07K9j71
5047i4l11L94K45O2q7j04J37j53j31m1M9J44J55l0ol2K1j99m3J06j22k77M68q0
5071G1p8n1Q7K3l2Mq2L28k87k62M32j93J1Kk53M99j97J53j65O1qJ36l23J83K91
5096C50l95L05m96L91l10P1l4K09r7o2n8J03k59j05M58r7j36J09k3J60j52J98
5118A30l56J74Oj43K21K79j96L4p7N2k42K14k58N62j36l90k5J88n1n3J53j76K49
$$ plain form
4955 305 271 -190 -90 -73 -134 -2 -60 96 404 -192 -302 48 -26 65 486 151 -128 -11 -173 191 -174 262
4977 262 298 136 -196 -195 -102 328 48 28 -16 -95 23 -162 -165 52 168 93 -35 87 -206 -230 -242 -39 -27 -51 -99
5002 -99 -461 -278 -161 31 223 323 -9 -87 -231 -69 -74 256 -86 -60 427 -69 -64 146 407 -161 -31 88
5024 88 136 -236 -4 -92 244 153 63 -239 47 -71 -138 323 95 173 -192 -299 -256 178 -205 -159 48 77 -94
5047 -94 -405 -11 234 296 209 105 242 89 -42 -83 -34 110 265 235 229 197 218 19 -24 82 -40 -317 151 71
5071 71 -7 -58 29 52 20 24 -58 270 -17 -279 153 -40 -29 -27 -280 219 22 175 10 71 63 199 -124 59 350
5096 350 -45 260 -236 155 -155 -84 -118 91 -6 -68 -126 -23 -282 -387 71 -26 -162 -53 -76 84 -68 130
5118 130 -226 -52 -46 -189 32 311 115 149 72 124 -118 96 -162 400 264 -126 -151 37 -14 -67 86 -90 159
5141A59j59k32k1M03j66K26J15j05k50k57L7L68P9k04J52J46m7k28O6K93p9l19
5163b3J76j13K5k3M3K31k36K67m48R6Q8J21m1j9l46Q5j76k87M36J53j34O4N8q8
5187i1Q6j77j35J54On5M46m43r0O5M41k73K08M2l4m18M55j63l17J45J68j60l34
5210d74L21P7p3J63l9j22K39j43R2j99M17k83J3J60j02M4r5J83n92N46J1l73J78
5233e1L02o6j54k2L9j41K01j60J75lp3o0L43n06O1J7Q2kp2L15k99R4J0k31J37
5258f4j30J91j05oJ2Q1N1K42j79j33P0N2j35l9J50J59n02K45J61j44Q7m38M83
5281A09L58m65L0j2Rj07K08j37p7M14k96j76r4M71l16K68m09K82l33Q2K67k01
5303a25J25J09N8j79K12l68L70J40l97k04K79K73k61q1k69L82j02N7l10M78k16
$$ plain form
5141 159 0 -232 -253 150 -16 210 325 220 -30 -287 -250 118 197 -7 145 291 244 16 82 375 296 -23
5163 -23 153 40 65 42 85 316 80 347 -101 -5 83 204 163 144 -202 -117 -293 -580 -144 9 -125 -61 -3 -91
5187 -91 -5 -182 -317 -163 -157 -212 234 -209 -299 -234 207 -66 142 184 150 -268 187 24 -293 -148 20 -140 -474
5210 -474 -153 -76 -149 14 -25 -147 92 -51 41 -158 259 -24 -11 149 47 91 -4 179 -413 133 144 -229 -51
5233 -51 251 185 31 9 48 -93 108 -52 123 120 47 -13 330 -176 -115 -98 -16 -18 -90 225 -74 20 30 -201 -64
5258 -64 -194 -3 -108 -114 -102 -21 30 272 93 -40 30 82 -53 -92 58 217 -285 -40 121 -23 64 -374 109
5281 109 467 2 32 20 29 -78 130 -7 -84 330 34 -142 -236 235 -81 187 -222 60 -273 -191 76 -125
5303 -125 0 109 167 -12 200 -168 202 342 -55 -259 20 293 32 -49 -318 64 -38 19 -291 187 -29
5324b9k06M97j0k79J20M1j19J98k85m9K22M2k96J87n3l0m5M6K0Q9J46m1q6J81
5348B61k16O1nj1J83k88k33K88K45j61k55J7M84l76k83J19L06q3J75j62P7nj96
5371e8K7L40k98J3k32J15K54k87L60l2k0j00k93J24L19m72K70K12n58K35J06k82
5393b57K49j42K07O6m12O00l18K27j81l7j27O4k0j33M31l60K49J09k62J49o8r
5415B5o7J20J50j77n3L1N0j97J12J73j72k20J97J15j59q5J90j47R4ok04k87L25
5438a92K01r9J32o1J60j2j97q4K49J73p9j48J70k64J26L2P9N3l79L73j23J93j02
5461B01l10P9K12l88K46k38J37N44m62o6r6l5p2K20N3L7r6O2J0l10k40N47k63
5484b28L28rj2K4j5r6j7J66k9p8k4J7j84LK72l09J95j96k36K12K11j08n3n8L22
$$ plain form
5324 -29 -235 262 252 -27 93 134 15 213 -72 -121 101 143 -153 34 -19 -49 -94 -48 -28 61 207 166 80 261
5348 261 45 106 101 90 273 -15 -248 40 285 124 -131 -114 370 -6 -289 -170 136 53 228 66 143 138 -58
5371 -58 -31 309 11 24 -208 -93 161 -126 234 202 182 82 -211 -87 232 -240 30 242 -316 -81 25 -257
5393 -257 -8 -150 57 123 -289 311 -7 220 39 2 -125 -61 -81 -214 217 -143 106 215 -47 102 34 25
5415 25 -42 78 228 51 -2 29 79 -118 -6 167 -5 -225 -28 87 -72 -157 33 -114 -20 -26 -230 -517 -192
5438 -192 9 -90 42 -19 141 129 -68 -152 97 270 191 43 213 -51 75 107 186 239 -140 233 110 303 201
5461 201 -109 -30 182 -206 40 -198 -61 483 21 -45 -141 -176 -248 -28 25 62 -34 28 38 -272 -512 35 -228
5484 -228 100 91 79 103 88 -8 -25 141 112 34 10 27 -157 -154 118 -191 4 -192 -428 -216 -5 -113 -166 -224 98
5509I8k82P6J93pJ93m56j88J72L05j57J48L5J36l77M3K65j50K39l91M04j73n41
5531d15M39j26j79K02J3L0K52o2k50L26l40K59o3k03J51K70l10j99K72Q9j32o
5553A8R2j33l14J58M24o9j0k62o5K43k3m9K24J31k94l57N59m65J21J0J75j87j92
5576b65J90l23M49j99L12k00j87K59j60M24k33J59J25k85l5nJ7j85L10j27M9j50
5598f0O9j18o8k8m4N6K01r6m5L40Ll03J65j81J10K8k48K93n5J79p73M86O4j20
5622a45M89n51M97k63n9j98Q3L53j26k85L34j58l6J06M0O5k30J2K5o4j57K51P8
5645F1j00KJ17p1k68K24k77L37J44M8j58Q0j24q6q6N77o64J23j59J75nl8L75m20
5669a93L96j51m2j71J22K05r2j55N5m0O1l39L37l9P8J78l91%K45q7k20K79K24
$$ plain form
5509 98 -184 -108 85 78 271 -185 -373 -201 104 -53 95 130 266 -111 -68 197 47 286 -105 299 126 -415
5531 -415 24 -102 -281 -79 -66 -36 216 154 -96 230 -110 149 86 -117 34 304 -6 -205 67 156 24 18
5553 18 110 -23 -337 -179 245 176 166 -96 -161 82 59 10 234 365 71 -286 273 -192 -71 -61 114 -73 -265
5576 -265 -75 -398 51 -148 164 -36 -223 36 -124 300 67 226 351 66 31 26 43 -142 168 41 90 -60
5598 -60 9 -109 -177 -205 -249 -193 8 -88 -133 207 210 -93 72 -109 1 29 -219 74 19 198 -575 -89 -25 -145
5622 -145 344 -207 290 27 -32 -230 -147 206 80 -205 129 -29 -65 41 81 146 -84 -72 -47 -111 -268 -17 61
5645 61 -39 -37 80 9 -259 -35 -312 25 169 217 59 139 15 -71 -157 420 -244 -121 -280 -105 -110 -148 227 -193
5669 -193 203 52 10 -161 -39 166 74 -81 -26 -66 -5 -344 -7 -46 32 210 -181 -181 64 -23 -243 36 260
5692B60R8l12J47k36rJ07J77l44k7j70K31L54n52K71o5J13kQ6J57k14Q5k35l83
5715d63J09K14j88J87K29K55j51l11J55o2j11R8pQ5m0K6O8l18K63J26P1o0m5k34
5739a04J28J78r5j83L22j95ml7j03J78K04l61J62K1M7k22j94K38J95j58K6k0L02
5762C25n13J62j79L89j82l19L63r5K47l37J95K15j80o3J90l05K71k42K34l22J60
5783A4k77L65j09N7j74N9J67m8j11j83L19m1o5l7J8N8l5o5Q8QK65k84j75J67J56
5808A37j44k02J34L4K12j57Q2J04r4J9oo5j40j74M30m48M53l25Q6l3J44R2l18
5831a79J74l1L11l15M6k9k22L88m0J83k15j75L40k31Q0l9K5j66J5j7J55l18M69
5854B09k80K34j30j01r7nK59Rl82K27l0J38k91J45J42k02J33j81M67ll96r3J52
$$ plain form
5692 260 358 46 193 -43 -52 55 232 -112 -139 -309 -78 276 -276 -5 -70 43 41 127 284 70 155 -80 -463
5715 -463 -354 -140 -328 -141 88 343 192 -119 36 -26 -137 -39 -46 39 -1 25 93 -225 38 164 235 175 130 -104
5739 -104 24 202 107 -76 246 51 47 10 -93 85 289 -72 90 111 158 -64 -258 -20 175 17 43 23 325
5762 325 -188 -26 -205 184 2 -317 46 -49 198 -139 56 271 91 28 218 -87 184 -58 176 -146 14
5783 14 -263 102 -7 50 -124 -65 102 54 -57 -240 79 38 -27 -64 -46 12 -23 -88 0 8 273 -11 -186 -19 137
5808 137 -7 -209 -75 -41 171 14 96 200 106 125 119 54 -86 -260 170 -278 175 -150 -64 -97 47 139 -179
5831 -179 -5 -36 275 -40 6 -23 -245 143 103 286 71 -104 236 5 85 46 71 -95 -80 -97 58 -260 209
5854 209 -71 163 33 -68 -165 -170 89 98 -284 -57 -87 51 -240 -95 47 -155 -22 -203 264 261 -135 -228 -76
5877g6%J87l93L93j37q8J27J34k70J50j24J83Q5Rj97j00M08n21J22L7j2j34M8
5900a69J61j81J52P5R0N5J04l06r1j28N19k21j44J32o6N1p5J55J06j37q5K82o9
5923B10k63K64l07J57j30K24j03o6J84k07L15m80K84j46M7l34K18P3j27n0Q0N4
5945a03j12L48n1J3qj06Q9M37m68J46Q8j58r2j53L37l20n0J10K57k45K60m07K2
5968a66J82J15r1o5K33l49J69l5k6l6N4J74k11R5Oj60P0L66j17j73r3J51L1l19
5992a95P1K70j56J02l30K03O6R7j80j14J48q0P7n7RL7L17l50j41J02K45j13n6
6015b8J15k2l8K01k34k9K51k88J42p3Mr8J34J06k73J06J93j86j26K79j24k1j83
6038a92J79l76Q8K30o1J39Mk11J08N25n11L72k54O7j6j36k66L06J99k05K88j32
$$ plain form
5877 -76 -76 111 -282 111 -26 -114 13 147 -123 27 -97 86 171 180 -17 -117 291 -230 -108 -71 -83 -217 -169
5900 -169 -8 -189 -37 38 128 183 287 -19 -110 -238 281 60 -84 48 -18 33 -42 113 219 82 -3 279 210
5923 210 -53 211 -96 61 -69 155 52 -14 170 -37 278 -202 82 -64 -17 -351 -133 -60 -187 -237 -157 -103
5945 -103 -215 133 82 95 87 -19 70 507 39 185 273 115 23 -130 207 -113 -163 -53 204 -41 219 -188 -166
5968 -166 16 131 40 -25 208 -141 28 -7 -33 -69 -15 159 -52 43 49 -111 -41 325 208 35 -58 93 124 -195
5992 -195 -124 146 -10 92 -238 -35 31 128 -52 -166 -18 -98 -21 -78 -69 -32 285 -65 -206 -104 141 28 -28
6015 -28 87 65 27 228 -6 -35 216 -72 70 -3 1 -97 37 143 -130 -24 169 -17 -143 136 12 -9 -192
6038 -192 -13 -389 -301 -71 -132 7 11 -200 -92 433 -78 294 40 107 91 -45 -311 -5 194 -11 277 145
6060A45o3n38L83n9J65k36k24O66j57K41l54o8j65L07l44K03R2j69N67l38J36
6081A90m57J10L9J93L0P4r8j11R4k56K20l19M76k51J05l6j70K09k12J42J76m8
6103A00k04n5r5R0K47p2j01k04M85M6m94J57K62J5l19N4O5q3K27Q3k47J97j49
6126Ej65K97l39J41l0K65j24l37L81j06L03k83J77j36k78L59P1j49l9l1m6J16
6148E2o5J38j27J28j99N1K25k65K29k20R3N5l3j34j11j62L22J38k06J22J78k54
6170d5j42L10J2l33J61K8j21l47M24J33J5k11j60L83k25m7j13Q9J94l05L03M6
6192D9r3J27k75L3L03j86j08O9K09o6J6l5K82l49P4L27q1l58J37j17J27o5n3K70
6216B37j78m5j9M7j6K76j68n55L07J26j23j9J59J32k26O2l05L15j3O1L5J89r5
$$ plain form
6060 145 82 -456 -73 -132 33 -203 -427 239 82 323 -31 -99 -264 43 -301 -98 -6 -175 392 54 190
6081 190 -267 -157 -118 75 105 179 81 -30 64 -192 28 -291 185 -66 39 3 -167 42 -170 -28 148 100
6103 100 -104 -159 -254 -164 83 11 -90 -294 191 237 -257 -100 162 177 -142 -88 -23 -106 121 204 -43 154 5
6126 5 -160 137 -202 -61 -91 174 50 -287 94 -12 291 8 185 49 -229 130 201 52 13 -18 -64 52
6148 52 -13 125 -2 126 -73 -22 203 -62 167 -53 40 95 62 -72 -183 -345 -23 115 -91 31 209 -45
6170 -45 -187 123 135 -198 -37 -9 -130 -477 -53 80 95 -116 -276 107 -118 -165 -278 -189 5 -300 3 49
6192 49 -44 83 -192 -159 144 -42 -150 -81 128 62 78 43 325 -24 50 377 296 -62 75 -42 85 20 -33 237
6216 237 59 14 -5 42 26 302 134 -421 -114 12 -111 -130 29 161 -65 -3 -308 7 -6 55 90 279 184
6239A84j00J58J05k64j87k70M17k42M48l42Q7L00l03j30k14N49l11J04j99J47
6259f3r7K39l16N7K22j63M0L7K6M7k1M8K6l55K34m4k48L52P5l27L59j76mlM33
6284C78n83M8K21k37L95n6Pj28m28L17M69n21N3r7R4j75M71l26M2p4J18J45j3
6307A20q1m4j54J25K06j50Nk49K88j28J44j53Q2J13j18N5L4j45P6k27R0k0p0J84
6331a7k2o7rL8K27M4k58O8O7kk38J98k34J15K66n13O76j98j43j6m22M04K11q7
6355H8k62K54j33K30m54K06L20j88o2Kj8Q1k62J76P6jj03L1J14j59L29l38j31
6378b04K93k40o6L40j40l0J00k3n6k57K68N5Q5o3j78o3l9J41L6j48J98K25j81
6401E3j66J9m5K56l50J39J24Q9m4j77L44k95o5Q3P8m8j2K09j02K16l69j32p5K45
$$ plain form
6239 184 84 242 347 83 -104 -374 43 -199 249 -93 -6 294 -9 -139 -353 196 -115 -11 -210 -63
6259 -63 -160 79 -237 -180 42 -121 -81 -44 -18 29 8 56 82 -273 -39 -83 -331 21 96 -231 128 -48 -52 -55 378
6284 378 -205 -157 64 -173 222 166 173 45 -383 -66 403 -118 -65 -162 -68 -243 228 -98 -56 -130 -12 133 120
6307 120 39 -5 -159 -34 172 22 27 -222 66 -62 82 -71 11 124 6 61 95 -50 26 -201 -111 -131 -201 -17
6331 -17 -39 -106 -115 -77 150 194 -64 4 71 69 -169 29 -205 -90 176 -337 339 141 -2 -18 -440 -36 175 88
6355 88 -174 80 -53 177 -277 -71 249 61 -1 1 -17 64 -198 -22 54 53 -50 -19 95 -64 265 -73 -204
6378 -204 89 -151 -217 123 -17 -47 53 30 -26 -283 -15 40 125 62 -116 -179 -218 -77 -41 -189 9 234 53
6401 53 -113 -94 -139 117 -233 -94 30 119 75 -102 242 -53 -118 -35 43 -5 -17 192 90 306 -63 -195 -270 -25
6425b5J15k4R9j32j38l5J22J7J79j63L68j80k55J33L9k22J72m3Q6j31K11k49j29
6448a85L45l17R7j18M00j99O0j02J50%p4n8K0l7J6p5M9n3j04K05j18J08%J88M6
6473B44j45m0j03J17k51J09K5K26j68n7K05n6k67L49l20Q4J7k20K70k48J14K03
6495H8M4pl39K12J49k11K01l63K62j85J84j08L2Kk46J43O0K06M4r5lk10o0M99
6519B99l25j04J1rQ5K17k40k98L88P2k92M39l14J59l51J74K93m45M15l24K58J6
6541A24l22L11j73K4k57J49K39q5K5l56R4K02j63M17k99N3r2j73K32K45J14j94
6563A15O0j56j59P2L1J90n4k36J40K58k48j35L00k71M7L15l83m5M16k24l12K55
6585b4Q9J13k35R9L7J20o7j33m2k69L93r9K68k31M1k7J1l2J10j70K89o1k24J55
$$ plain form
6425 -25 90 66 165 33 -105 -140 -18 -1 178 15 383 203 -52 81 120 -102 70 27 113 -18 193 -56 -185
6448 -185 160 -157 -60 -178 222 23 83 -19 131 131 57 -1 19 -18 -2 -77 -28 -81 -185 20 -98 10 10 198 244
6473 244 99 59 -44 73 -178 -69 -44 182 14 -43 162 106 -161 188 -132 -48 -31 -251 19 -229 -115 88
6495 88 132 125 -214 -2 147 -64 137 -226 36 -149 35 -73 -41 -39 -285 -142 -82 124 168 73 70 -140 -200 299
6519 299 -26 -130 -119 -128 -43 174 -66 -364 24 96 -196 243 -71 88 -263 -89 204 -241 174 -150 108 124
6541 124 -198 113 -60 -36 -293 -144 95 10 35 -321 -227 -25 -188 229 -70 -17 -109 -282 -50 195 309 115
6563 115 175 19 -140 -68 -37 153 99 -137 3 261 13 -122 178 -93 -46 269 -114 -159 257 33 -279 -24
6585 -24 65 178 -57 42 79 199 132 -1 -43 -312 81 -18 250 19 60 33 44 12 122 -48 241 180 -44 111
6609A11j57k40L16l2l29N13k60Q3j4p9q0m2L35N3p5L2k48K43J23m6lj92r0K0j75
6634b33J81j74N27l10J86pj33j87m4r9O4J05J33m5k7K38k86J05k73mO6M49j18
6657A14l72K33J83k79J95P5j06n5L6J08q3L6pR1l8k14Q1O7j66rK07k93J16q6k7
6682a93J11J00J75j45r1k5K43j93k5NL4p5k26J70J5J51J68k55j38K24n0j85J70
6705c5N5J00j74K41j77R4l97N59m1m6k89j10J75m0N4j27J11L10n36M80j50K88
6727C45l32P0j94j84J05L43l6n09M03j85K11J66j54P4k60K25q6j46n6K51k26O0
6749a15L78j69j80L02j09m1j86K64pk94K00L00m68K73Oj56R3J35j50k9l5J07K8
6772A47n7nj39J0j12K14j74J2J84r7J18j43Q1J61k37L5P5j02K80l18J61kj72J19
$$ plain form
6609 111 -46 -286 30 -2 -331 182 -78 5 -9 -88 -168 -210 125 178 103 135 -113 130 253 207 204 12 -78 -58 -233
6634 -233 -52 -226 301 -9 177 170 37 -150 -194 -293 -229 -124 9 -36 -63 175 -111 -6 -279 -283 -217 232 114
6657 114 -258 -25 158 -121 74 149 43 -12 24 132 49 85 78 169 131 -83 -2 65 -101 -110 97 -196 -80 -166 -193
6682 -193 -82 18 193 48 -43 -68 175 -18 -43 -38 -4 -79 -305 -135 -120 31 199 -56 -194 30 -20 -205 -35
6705 -35 20 120 -54 187 10 104 -293 266 225 179 -110 -220 -45 -85 -31 -158 -47 263 -273 207 57 345
6727 345 13 83 -111 -295 -190 153 117 -392 11 -174 37 203 49 123 -137 88 2 -144 -200 51 -175 -115
6749 -115 263 94 -86 216 107 66 -120 144 137 -157 43 343 -125 148 154 -2 91 226 76 47 12 119 147
6772 147 90 85 -54 -44 -156 58 -116 -104 80 -17 101 -42 39 200 -37 -2 73 -29 251 -67 94 92 -80 39
6796C9O4k48L1J07O7j11J20m0J33j22P5J78j71J7l56K82N3p8Mm1j74M15r8J01
6820B47k40j05J80k50L2P3n3K37l38J89m7o7L61k81P4p1m7K4K6M35j15j36k07
6843g9K37j30rr4j33K49k9j8j02L49L2k64q3l1J1K32j75K04j60J73j74j41N1P3
6867a1k3k96K68J98j75L0K34j86k5j4j55J67L02k10Q9k07j56Q7J81K1j17J10j16
6890dJ8j19k2J55j10K8Q9j31J45J3J08j66q3K87j61ln27N79P3j11L10m22j49J36
6914f7P4m5r2J28J98j70q7k4L0J13k03K50j73P8j59j17K01l05N73l02J10k3P3
6937F1K3j67M44l30m5J04j73k14K01j66L34N4p2J13r1J62l86J09J1j08J96j50
6959i0N27n84L37j2l7k11l3O3k8N6l4R8L4j51n0J0r4M46l68J41j9J15p3k30L11
$$ plain form
6796 39 103 -145 -114 -7 60 -51 69 29 162 40 115 293 122 139 -217 65 118 40 44 3 -171 244 146 247
6820 247 7 -98 82 -168 -136 -63 -116 121 -217 -28 -75 -142 219 -62 12 -59 -106 -82 -56 379 264 128 -79
6843 -79 158 28 19 -75 -208 41 12 -6 -108 241 273 9 -74 -105 -94 138 -37 167 7 180 6 -135 -84 -11
6867 -11 -34 -330 -62 136 -39 -9 225 39 14 0 -155 12 314 104 193 -14 -170 -83 98 119 2 112 -4
6890 -4 14 -105 -127 28 -82 -54 35 -96 49 62 170 4 -79 208 47 44 -483 96 169 58 368 -54 -203 -67
6914 -67 7 -38 -130 -2 196 26 -61 -85 -55 58 -145 105 -68 10 -149 -266 -65 -370 203 -99 11 -12 61
6937 61 84 -83 361 31 -14 90 -83 -297 -96 -262 72 126 54 167 76 238 -148 -39 -28 -136 60 -90
6959 -90 437 -147 190 178 141 -70 -103 -40 -68 -12 -46 52 86 -65 -115 -105 -199 247 -121 20 1 116 43 -187 124
6984A24M2J9j04j72l9K77k97L26l46j6NL95j16l18k3L05K4J13l67K83m62J87J
7007a59K44p3Q7O7j69K3j11J06j26j29K69L0j99K93r9l53L27j77k19L49J81j9
7029A43j37L04k88j33o3k5L81n0n8n8R8j11K34o4N4m11J28K53o24N36l4j35Q7
7052B7r9p0K25l35L80j96PJ85p7j66O9k22N30j58LQ6N3k55j81K40m6Q1J44k76
7076e1J56j77k52K97K01k89mn7L04l08M46o4k76K20j18J45k66K15j09J29l60M03
7098A85j98L4p8J15L1k11K25k49P6q1K26Q7j27nq2J81K1l31K92j02K86k27j1n9
7122bj7J19Q6l69J56O7j52K80j72P4Qj78L27m03n5J31O0J01J12k04K86j50l0J42
7146B17j39k50L30j51j38j11J18K5J86r8J25k49l6J79j21p9K16K1o9L8m7m3J20
$$ plain form
6984 124 166 185 81 -91 -130 147 -150 176 -170 -186 -181 214 98 -220 -243 62 86 199 -168 115 -347 -160 -159
7007 -159 85 12 99 166 -3 20 -91 15 -111 -240 29 59 -140 153 54 -299 28 -149 -368 -19 162 143
7029 143 6 310 22 -111 -174 -199 182 132 74 16 114 3 237 173 227 -184 -56 197 -427 109 75 -60 27
7052 27 -72 -142 83 -252 128 -68 -61 124 47 -119 -50 -272 258 100 103 189 242 -13 -194 46 0 81 225 -51
7076 -51 105 -72 -324 -27 174 -115 -119 -176 128 -180 266 202 -74 146 28 173 -93 122 13 142 -218 185
7098 185 -13 21 -57 58 89 -122 103 -146 -70 -151 75 162 35 30 -52 129 150 -181 111 9 295 68 57 -2
7122 -2 -19 100 186 -183 -27 40 -112 168 -4 70 78 -100 227 -176 -231 -100 -40 61 173 -31 255 105 75 217
7146 217 78 -172 158 7 -131 -242 -124 -99 87 -11 114 -135 -171 8 -113 -192 24 45 -24 14 -33 -76 44
7169D4J60K6j57p1m8P7L7j02o7L75k95j25L08J48Nk08N4Q7k42j72J95n4%M2q9
7194g2j06J10J57j09N6J0k52K78k53K04K50k49K15q9m10L47P0j35j67J18j83M34
7216B24j6j31J71k45J39o2N3J63n43L97o8k47J42j87J59K16m1k52J02l2J94j46
7238a0K12l50j77M43k46L0P8pr1k10J92J07j16K35l05K17k02j81L39R6J98m20
7260a68L12r6k4n6J64l54L91j07n6N3R0j29j30J8J16Ml54M16j1k52K72l67K08
7283f0L8M7k04p4K48o9J00l04L74j24j19K13j75K27K5J16n92L84j64L57k57k26
7305b39L70j30K47r9k82M4j40L08L5j97J70K9j03J25O9k20J43Q6j19k72J49K41
7327B15M4r2p6l39K11k6j18R0J69j70J80k11N4JL63n7j39P3n49K88N8J47j25j
$$ plain form
7169 44 204 230 73 2 -46 31 68 -34 -101 274 -21 -146 162 310 315 107 161 248 6 -166 29 -25 -25 17 -72
7194 -72 -178 -68 89 -20 36 46 -206 72 -181 23 273 24 239 150 -260 87 157 22 -145 -27 -210 224
7216 224 208 77 248 3 142 80 133 296 -247 150 82 -165 -23 -210 -51 165 124 -128 -26 -58 136 -10
7238 -10 202 -148 -325 118 -128 -98 -20 -27 -118 -328 -136 -29 -145 90 -215 2 -200 -381 -42 54 252 -168
7260 -168 144 48 24 -32 132 -222 169 62 6 59 149 20 -110 -92 24 28 -326 90 79 -173 99 -268 -60
7283 -60 -22 25 -179 -253 -5 -74 26 -278 96 -28 -147 66 -109 118 143 259 -333 51 -113 244 -13 -239
7305 -239 131 1 248 149 -133 -89 -229 79 114 -83 87 116 13 138 207 -13 130 216 97 -175 -26 215
7327 215 259 167 91 -248 -37 -63 -181 -91 78 -92 88 -123 -69 -68 295 238 99 172 -377 -89 -31 116 -9 -10
7351a0L8j09O0j61L50j96lK23m32J15%J95J05r5k61Q2J85q7j45OK11j87P2K8K49
7376B33j39Nn2m1J72k17j29J63j69M47n0k99K43L13l97N1o7j44K7p8K49j15o1
7399e5K16l23M59k91L1j36J63n0nllj31L93k36J24j82k00L82o2l05J30J67m14
7422c31PK81K53j10J18M6o2P0l38o8J59J43k30j08J54k24L32k09O7R1L4J00J23
7445B98k30J42k69Q1m09M53J52j76K97l65L7l26M21J6n55M51J51k29K60Pq8r6
7467B3J17K51n22L82l17J65l32N6j74M64j08K02k30%J8o7J13k47K39J17j49q2
7489h1K09Lj71J19k98K54Q4j01n1k56L72k66M56l95JjK07j63J9Q5K32o1l66K1
7513a48J00J01m0j65J10R9j7L9l8j2J01R6n16K91J45J00k72M41k68m7j20J78k94
$$ plain form
7351 -10 28 -81 -21 -182 168 -28 -31 192 -240 -125 -125 70 175 80 -181 -99 86 -1 -146 -140 71 -116 -44 -16 233
7376 233 94 99 47 6 178 -39 -168 -5 -174 273 223 -76 167 480 83 134 67 -77 -50 -128 121 6 -55
7399 -55 161 -162 297 6 37 -99 64 14 9 6 3 -128 265 29 153 -29 -229 153 91 -214 -84 83 -331
7422 -331 -324 -43 210 100 218 264 202 272 -66 -134 25 168 -62 -170 -16 -240 92 -117 -50 41 75 175 298
7445 298 68 210 -59 22 -387 66 218 42 339 -26 11 -315 106 122 -433 18 169 -60 200 207 119 23
7467 23 140 391 -131 251 -66 99 -233 -177 -351 113 5 207 -23 -23 -5 -72 41 -206 33 150 1 -81
7489 -81 128 131 -40 79 -219 35 119 18 -33 -289 83 -183 273 -122 -121 -122 85 -78 -59 26 258 197 -169 -148
7513 -148 -48 53 13 -152 -42 57 40 79 41 29 130 226 -290 1 146 246 -26 415 147 100 -20 158 -136
7536a36j6K73p0q6J65p3P5p8J01k03k52O02k27j77L09p6j50j72R5j95N03j27j31
7559d6J65m0m62O53m33J17Q5J55k37J16j28K51j40j91j29K22J98j44j49K30mk87
7581a98J45j61K33O6K2l76M90k15N1j43K69l13J56n8J08J01j53K8J89m25J12K38
7603A66j40j30k49L99J49O4Mj78k05L09k34l1J31k01M84k98k01K65l94K31J15
7624E6k23K18j48J28j2l4JK3k03J92j07K37J63o03J62J77J3P4J36j97N4Q7k38
7647d4J39N2j28l4J29O4p5j80l7L6O8l08M06k40J7J18k7N4j6Q6l41M91l14om8
7672a38K29m6j38K98k83j6Q1k3L0K77k62pK58k78j82K35j88pJ19o0K11J62l52
7695h0J75P4l64k46P02l85K04j79K26J7j94j56j05r5M50P4j58k0K87R3l76r6J45
$$ plain form
7536 -136 -152 121 51 -35 130 57 132 54 155 -48 -300 302 75 -102 207 131 -19 -191 -96 -291 212 85 -46
7559 -46 119 79 -383 270 -163 -46 39 194 -43 73 -55 196 56 -135 -264 -42 156 12 -137 93 89 -198
7581 -198 -53 -214 19 85 107 -269 221 6 57 -86 183 -130 26 -32 76 177 24 52 241 -184 -72 166
7603 166 26 -104 -353 46 195 259 263 85 -120 189 -45 -76 55 -146 338 40 -161 104 -290 -59 56
7624 56 -167 51 -97 31 19 -15 -14 9 -194 -2 -109 128 291 -312 -150 27 40 114 250 53 107 194 -44
7647 -44 95 147 19 -15 114 178 103 -77 -114 -78 -10 -318 88 -152 -135 -17 -44 10 -6 80 -261 230 -84 -90 -138
7672 -138 91 45 -93 205 -78 -94 -13 -36 -6 271 9 2 260 -18 -200 35 -153 -160 -41 -101 110 272 -80
7695 -80 95 169 -195 -441 261 -124 80 -99 127 144 -50 -206 -311 -406 44 118 -40 -60 227 320 -56 -152 -7
7718gK11j47J06k16Q9j41J76k33K22j35m6oJ26J07k32J85j01J57m06J14kL65j75
7741A1K29p7l07J86m3QJ13k76p4J71K50j92J77k88j10K24J08j62M6j1r5K45j00
7764C3J33j96L30k50n5j18M5J07J80l18J08P1j20J32j36k13M14k59J1m9J96Q4
7786A30j36J05l90N0Q4J99j08N3O2o8l9P2j17N9j96J79p8J81O3P4J60k37j30J31
7810A03k3J7L9k42q6J41J0K03k21L81l11j65j5M24k39LJ22J23m13K39J79k75O7
7833F1o6J77j58Nj13K95j85j07R2q0r1J58j38L51l15J48r6J26P4j57j10k7L13
7856A57j75j72K30Jo7J58L2k68k1k51L04J39j11l6l99M02J49K59m24J64k6p4J93
7879A64l62K19J07n3k36J94K42p22O26j39J04k76O6J11P0k98J83M0j31j98L89
$$ plain form
7718 -7 204 57 163 -53 36 -105 71 -162 60 -75 -121 -127 -1 106 -126 59 -42 115 -291 -177 -179 186 11
7741 11 240 163 -144 42 -1 7 120 -156 -230 -59 191 -1 176 -112 -222 2 110 -52 -6 -17 -112 133 33
7764 33 166 -30 300 50 -5 -123 -78 29 209 -109 -1 70 -50 82 -54 -267 147 -112 -101 -150 46 130
7786 130 -6 99 -291 -241 -157 42 -66 -13 49 -19 -58 14 -103 -44 -240 -61 -139 42 105 179 339 102 -28 103
7810 103 80 97 136 -106 -192 -51 -41 162 -59 322 11 -154 -169 255 16 19 141 264 -149 90 269 -6 61
7833 61 -5 172 14 19 -94 201 16 -91 1 -79 -170 -12 -150 201 -114 34 -62 64 138 -19 -129 -156 157
7856 157 -18 -190 40 41 -26 132 164 -104 -125 -376 -72 67 -44 -80 -479 -77 72 331 -93 71 45 -29 164
7879 164 -198 21 128 75 -161 33 275 -447 179 40 144 -132 -66 45 115 -183 0 40 -91 -289 100
7900A00J51k84k0j56L19k57j1J36J1j57P5L18j16Om11L52j05o4q5K16J20j55j80
7923a97L23m6K08o10K46K01m6rQ3l19L27J30q1m4j46k77L35j99J12R0j23o1r7
7946b00K28k1k95N05M0k47Q2O2m6k36L04k01k9L7Om4K01j07q4M1P7k55J71O9N9
7971A17QJ60j78q6K6l50J11K71J23k59N4Oj12K19l24L50k45p2O0o9n8J73j00L81
7995B06k39L04pj45k37L2J82j67J41J27l60J10K43k23K73m65J30j79K08N0K38
8016B22r4j84k54P3j01L64K26k62L2M9k3k68K26j09J51k18K9k00k1N22p1j43j48
8039b02L57k64K77j00l19M86k93K88o0j70J82k41R3j92j35L20P2n06J79L78k30
8060h0J24j3QJ64k69j69K22K5k00j3K10j1j9J42j45j18J44R1K21l88P0J04N6m22
$$ plain form
7900 100 251 -33 -53 -209 110 -147 -158 -22 -11 -168 -93 225 109 115 -296 56 -49 -113 -198 18 138 -17 -197
7923 -197 126 80 288 -322 -76 125 79 70 153 -166 161 291 210 166 20 -257 78 -121 -9 81 -42 -103 -200
7946 -200 28 7 -288 217 257 10 92 154 108 -128 176 -25 -54 -17 -11 -55 146 39 -45 -4 73 -182 -11 58 117
7971 117 125 285 107 21 47 -303 -192 79 202 -57 -3 3 -109 110 -214 136 -109 -181 -121 -190 -248 -75 -175 206
7995 206 -33 271 264 119 -118 -86 96 -71 70 197 -163 -53 190 -33 240 -225 -95 -274 -66 -16 222
8016 222 128 -56 -310 -237 -338 26 252 -10 22 71 48 -220 6 -103 48 -170 -141 -341 -362 160 89 -54 -202
8039 -202 155 -109 168 68 -251 235 -58 230 170 0 182 -59 34 -158 -293 27 99 -407 -228 150 -80
8060 -80 44 31 39 203 -66 -235 -13 12 -188 -201 9 -2 -21 121 -24 -142 2 93 314 -74 -4 100 156 -266
8084b66N4L62j14J34l79J14Q0j06P1Q0M9J03O7k86J13j38R9j03J27k1R0l9r0K44
8108B45j78L1k35K14l23K53k25K59q9J3k13K31J0R3r6p4K19j4l31K98k52L89m61
8131b36J50Q2J10j07lj2o6q1M91l33J37j50j84Q5K40j28K10l19K6K37M6j71L52
8154C76o86m8K77j4J05k21J81J31n02N24j19n0k9l1K49k85M7J6J22Q5k72K43k28
8177a29O7L83m77Lj73K74M15l57J65J21m07o0M2Q
$$ plain form
8084 -266 -212 150 36 170 -209 -95 -15 -121 -50 30 79 182 249 -37 76 -62 37 -66 61 40 130 91 1 245
8108 245 67 98 -137 77 -246 7 -218 41 -48 -35 -248 -17 -7 86 -10 -84 135 121 -210 88 -164 225 -236
8131 -236 -86 -4 106 -1 -4 -16 -82 -163 328 -5 132 -18 -202 -117 123 -5 205 -114 -88 149 195 24 376
8154 376 -310 -358 -81 -95 10 -211 -30 101 -401 123 4 -46 -75 -106 143 -142 -95 -79 43 128 -144 99 -129
8177 -129 -62 321 -156 -153 -326 -52 363 6 171 292 -115 -175 -133 -125
8191a25
$$ Imaginary data points
##PAGE= N=2
##DATA TABLE= (X++(I..I)), XYDATA
0@%%%Qj6QqJ6k4L2m0N4p0Q0r6J20j44J73k05K40k82L31l84M43n09N85o67P57q59
29d57R73j095J230j382J549j728J926k144K381k642K932l249L594l979M408m881
45b564N412o014O697p478Q382r449J0722j2276J4230j6765K0202k5168L3018m7369
59b8420Q2194l22235n20839K77369J66890q3134j93338M6728L7149j17781j66372
70h21789R1806K34319J13674j16830r5792O5725J40290K5972k0670Q9606K01888
81i1801Q1729j05032j05492Q5060J93800J16305l1681m6043M5658N3028o7039
92A28492o9778J05557J85393l233j96321j12249J12724J20381p8211j18828Q2109
103A56036J45698q4221k33693l6857J96033J07423j20188j10832O6576O0370j11345
$$ plain form
0 0 0 0 0 8 -8 0 -8 8 -16 16 -24 30 -40 40 -56 64 -80 93 -112 128 -154 177 -207 236 -273 312 -355 402 -457
29 -457 516 -579 651 -731 818 -910 1016 -1128 1253 -1389 1543 -1706 1888 -2091 2317 -2564
45 -2564 2848 -3166 3531 -3947 4435 -5014 5708 -6568 7662 -9103 11099 -14069 18949 -28420
59 -28420 53774 -268461 -789300 -511931 -345041 -428175 -621513 -574785 -537636 -655417 -821789
70 -821789 -729983 -495664 -381990 -498820 -594612 -528887 -388597 -362625 -383295 -293689 -91801
81 -91801 -10072 -115104 -220596 -135536 58264 174569 142888 96845 142503 195531 128492
92 128492 58714 164271 349664 346431 150110 37861 150585 270966 192755 73927 156036
103 156036 301734 217513 -16180 -53037 142996 250419 130231 19399 85975 146345 35000
114C5000j19247P5795J70501K3394j58723j34040M4219J10518j5767r1862K3138
125c7074J10069j1325j55030q3822J03944J39031r189j02011j0223Q8873J8115
136E1358r9778m0397J40172J58575m7526j72035k1834J44178O0718q6138k3838
147F3455J17641N8947j37091j59283M4120J72466L7108j35218q9469M2707J7480
158C2863j03659q5582P3110J27590k3875j71901j03016O8177Q8963k6656n6579
169a80565N1472R2141m5581j50884k1326J74354J45834m4560j04789J2500Q7017
180A5613P835o6458K4792J51084P5311j26108j43354M8452J39520N850j04024
191B8513j0964R3979l129j53111r3785R5789J27527k6798j29919n5868N2977K6381
$$ plain form
114 35000 -84247 -8452 162049 185443 26720 -107320 -63101 47417 31650 -60212 -37074
125 -37074 72995 61670 -93360 -177182 -73238 65793 56604 -45407 -55630 33243 51358
136 51358 -48420 -88817 51355 209930 162404 -9631 -31465 112713 173431 87293 63455
147 63455 181096 240043 102952 -56331 -12211 160255 197363 62145 -27324 15383 32863
158 32863 -70796 -156378 -83268 44322 20447 -151454 -254470 -186293 -97330 -123986 -180565
169 -180565 -129093 -36952 -82533 -233417 -254743 -80389 65445 20885 -83904 -71404 15613
180 15613 23448 -43010 -18218 132866 208177 82069 -61285 -12833 126687 132537 28513
191 28513 17549 111528 108399 -44712 -138497 -42708 84819 58021 -71898 -127766 -74789 -48408
203d8408o5350l2269R4398R1492o8112j40770q866J33987Q8389n1538n9974N8111
215h910Q0546m4523r8346L0040J48731O9088q9954r2649M6548Q8163l1673q6926
227A0135L6213J27473J0160j46017r4623Q7594J15607m1021j07808J7292R2116
238A07121k4098j23087k9773J09136Q0666o2967j03082O800P6195k268q0619j3568
250e9544R3905N6569q6346j18789J5215J09880K5185q1062l7654N6022K8055p5071
262g3635p6125M8452J14999J0788j11049o0385P1585O6644m7344o0801O1545J10878
274E5552j7635j29012l3740J20593R1429m9714o2246M9940P2351m0447r5341J8835
286a9435J30705N5558r3602r1566L5936P7422j5319p4264K707Q2955J3413j11378
$$ plain form
203 -48408 -113758 -146027 -51629 39863 -28249 -169019 -177885 -43898 44491 -7047 -67021 -8910
215 -8910 71636 27113 -71233 -41193 107538 176626 86672 -5977 40571 128734 97061 10135
227 10135 46348 173821 183981 37964 -56659 30935 146542 105521 -2287 15005 107121
238 107121 83023 -40064 -69837 39299 119965 56998 -46084 -39284 36911 34643 -45976 -59544
250 -59544 34361 90930 4584 -114205 -98990 10890 36075 -44987 -82641 -26619 1436 -73635
262 -73635 -149760 -101308 13691 24479 -86570 -146955 -75370 -8726 -56070 -116871 -55326 55552
274 55552 37917 -91095 -124835 -4242 87187 37473 -24773 25167 97518 57071 -38270 -19435
286 -19435 111270 166828 73226 -18340 17596 95018 79699 5435 8142 91097 104510 -6868
298f868p9585O4515R3044k5659r2512j6002O2293J0171p9647m3029P6959Q3518
310D7198m1827j06093j5003Q7524M7724n7889m5936O4566O8323n5741r3567K8103
322g2618J12744L1440q1062n2415N8416O3376m2459p1039L3733R5037Q086r2031
334h792m9623O6054P2121l7406p5063K5441Q4628o889r4289k8661Q2611O3342
346I3474n2787p8885K4294Q0341o263q3306k0604P5458M9459n7737p5535K6315
358b5776Q1698n519q6860j9025P9448L9679p0746o9814M0274Q2115j0189q2781
370d7496j8467O9513L2067o1162n3803M3471P6166j2787q5761k0940P7703M2904
382D1408o2142n5216N1170P4738k5322q5970n456Q7501M0119o4378n0693M9376
$$ plain form
298 -6868 -86453 -21938 71106 45447 -47065 -63067 -774 9397 -70250 -113279 -36320 47198
310 47198 5371 -100722 -115725 -28201 19523 -38366 -84302 -19736 48587 -7154 -100721 -72618
322 -72618 40126 71566 -9496 -61911 -3495 59881 17422 -53617 -19884 75153 83239 -8792
334 -8792 -58415 7639 79760 42354 -32709 -7268 77360 70471 -23818 -52479 30132 93474
346 93474 40687 -38198 -13904 66437 60174 -23132 -43736 31722 81181 23444 -52091 -25776
358 -25776 55922 50403 -36457 -55482 23966 63645 -7101 -76915 -36641 45474 35285 -47496
370 -47496 -65963 3550 35617 -25545 -79348 -35877 40289 27502 -58259 -79199 -1496 41408
382 41408 -20734 -75950 -24780 49958 24636 -61334 -66790 20711 60830 -3548 -54241 -4865
394d865O3809k7517p1581Q504Q5644K9086p5034n4724N7063O9498l1574p3421
406b5112J0694P5174J1804p7064l9085N9975N5029m2894p0075J1929O4622P976
418D2973o6184l6359N1044N1362m1129p0168J5707P4157J1241o9916l7348N6027
430a8593N5284l7614o2664K3408P1902J203p0938k5538O4867N5121m4351p1637
442e9550J9981P6563J759p3349k2120O6459M0728o0680o7293L6311P9330q795
454B9344p5408j4520O2593K8310n3532m4378M5820P1780j3661p4738j3567O7547
466A5590M0392m0657l9145L8985N7442k4110p0255K034P7416L4045n4351n0674
478a3288K6148M7179j6365n7158M18O3517J8931o8792n7999L5408O3928j2230
$$ plain form
394 -4865 58944 31427 -40154 -31650 53994 83080 8046 -46678 10385 79883 48309 -25112
406 -25112 -14418 60756 72560 -4504 -43589 16386 71415 28521 -41554 -29625 34997 42973
418 42973 -23211 -59570 -8526 42836 1707 -68461 -52754 21403 32644 -37272 -74620 -18593
430 -18593 36691 -923 -63587 -40179 31723 32926 -38012 -63550 1317 56438 12087 -59550
442 -59550 -39569 36994 38753 -34596 -56716 9743 50471 -10209 -77502 -41191 38139 29344
454 29344 -46064 -60584 2009 30319 -23213 -67591 -21771 50009 36348 -38390 -51957 15590
466 15590 55982 15325 -23820 15165 72607 48497 -21758 -19724 57692 91737 37386 -13288
478 -13288 12860 60039 43674 -13484 -13066 50451 69382 590 -57409 -22001 41927 29697
490B9697o5072o227N9876J3723o6889l5293O0966O4804k7876o9251J018O4941
502B4417K1044n0731k2793N7545M9206m1473o8246J1679P1876K0720n7863l2296
514a6915M5654L3366n0580n8698K5544O7783K787o7527l8118L7388L5089l4067
526a8294m4186K5298N6665o993o9521l0596N5263N3431k7590m9928J8939N1696
538A4184j0583o0190q791O6804M6933m2317o2733J1879N3535r39m9719o636N6007
551G434K7051n8915o4678K8135P2096J316n7862j1507M9209J5131n2197l3174
563g7961N3079P1455j1593o5653j2405N2375K9225k7773j5618M5485M7375l0646
575E7345o9621J14P2105L6515l8448l6154K0826K5536l0913m8517J6485O5694
$$ plain form
490 29697 -35375 -41602 18274 31997 -34892 -70185 -9219 55585 27709 -41542 -40524 24417
502 24417 45461 -5270 -28063 29482 78688 37215 -31031 -19352 52524 73244 15381 -16915
514 -16915 28739 62105 11525 -47173 -21629 46154 48941 -18586 -56704 -19316 15773 -18294
526 -18294 -62480 -37182 19483 12490 -57031 -87627 -32364 21067 -6523 -56451 -37512 14184
538 14184 3601 -56589 -65380 1424 48357 6040 -56693 -44814 8721 7782 -41937 -48573 7434
551 7434 34485 -24430 -89108 -60973 11123 12439 -45423 -56930 -7721 7410 -44787 -77961
563 -77961 -24882 46573 34980 -30673 -43078 9297 38522 10749 -4869 40616 87991 57345
575 57345 -12276 -12162 59943 96458 58010 21856 42682 68218 37305 -11212 5273 70967
587G0967J3702o3883n2233J9749M1980p095l7377O559M6707J0o7466l6156N3985
600a0551O6338j1339n4452n882M2864O016m6876j0027O3966M6877m2640p0592
612b6298j322N5099J7910m2949k0543L9681J8701n9427o1926K3257O5212M909
624A2304n8193l2521K7076J5884l8552k8738L9157N4940j1108o1786k6139M2778
636f4898M5217r093k3214K5643M0179j4974n0037j018O5447N0022k3696m4604
648e026R948L9099m984l5860Q481N6498K5181m9810n8422J4492N6380P388l9003
661B4362n822L7980K910n8691l6990M5625O6460r737o2287j7208L4206Q766l5204
674e630j2516M4027L8681l3631o8951j2165M8903K4514l0218k3063K1859J5013
$$ plain form
587 70967 84669 20786 -31447 -11698 30282 23187 -14190 -7631 39076 39086 -28380 -64536 -10551
600 -10551 55787 44448 -10004 -15886 26978 32994 -13882 -23909 40057 86934 44294 -26298
612 -26298 -27620 27479 45389 2440 -18103 21578 40279 -19148 -81074 -57817 7395 12304
624 12304 -45889 -78410 -51334 -35450 -74002 -102740 -63583 -8643 -19751 -81537 -107676 -64898
636 -64898 -19681 -28774 -51988 -26345 13834 -1140 -51177 -52195 13252 63274 39578 -5026
648 -5026 4922 44021 39037 3177 11658 68156 93337 43527 -14895 -403 55977 63365 24362
661 24362 18540 56520 59430 739 -36251 9374 75834 66097 3810 -13398 20808 29574 -5630
674 -5630 -18146 25881 64562 30931 -38020 -50185 -1282 23232 -6986 -30049 -8190 6823
686F823m1651n3491J4352O5648J9773m9875m2406J3693K6167j0497k0264K4139
698d7589M9693Q76n6407l0017M4206N6503K166k6214R150L7006j370m4228o231
711a2456O3263N3359k2436n2002n255L4214R847k5519j846M1220J6330n2513n9049
724a2843J2258N5542J3683m2555k6775K1146Q584m5169l4893L5019N4458p556
736C0899n6368k6724K5401K1010k0487j4415L2260L3597k7009n9143j0641M9909
748b1711L8520k0093l4008Q046J9355k0956l6555J1424N2540K0250m2057m6404
760g1649Q967L6189J703k4466P949L9298O036m7242l5296L4010O0575P201l6959
773a3684n875L2381N836l3969q164N1828M9126k0402n5522p034M0930J8958k2189
$$ plain form
686 6823 -34828 -88319 -73967 -8319 11454 -38421 -80827 -67134 -40967 -51464 -71728 -47589
698 -47589 2104 2980 -53427 -83444 -39238 17265 19431 -6783 2367 39373 38003 -6225 -12456
711 -12456 50807 104166 81730 29728 24473 58687 68534 43015 41169 82389 98719 46206 -12843
724 -12843 -585 54957 68640 26085 -690 20456 29040 -16129 -51022 -16003 38455 30899
736 30899 -25469 -52193 -26792 -5782 -26269 -40684 -8424 25173 -1836 -60979 -71620 -21711
748 -21711 16809 -3284 -37292 -29246 -9891 -30847 -67402 -55978 -3438 16812 -25245 -71649
760 -71649 -62682 -26493 -24790 -49256 -41307 -2009 4027 -43215 -78511 -44501 16074 23275 -13684
773 -13684 -19559 12822 18658 -15311 -23475 28353 77479 57077 1555 -5479 35451 54409 32220
786C2220p778L1464J8638l8055n1242R213N5228J9039l6210k6436J3993Q421k8206
799B89k4072K6511M7633q93n2131l3032K0460L1370k369j7145R623K4206j2226
812A8224m7769j4268M5723M1668j6813m0660m844K2371k757l0374p15M5365K4394
825C9545l9540n1130L771M0441J2942k3834o637K8862P589m3872l3065L4516N6870
838B6458J967m2268j7671K5783J3959k3460j0206L7423L5462k1315m8749j0283
850c2900L5170K6103j5045j8348J4733J5468k6664l9054P599M6795K0644l2207
862B294l7278N372K2112o721k0767J1486L4163L710l9690l0672K1757M2579J617
875I962k8001N94K9037J358l5922j3796L9483M3028j2578m1138n523K9654O790
$$ plain form
786 32220 24442 55906 74544 36489 -14753 -5540 49688 68727 32517 6081 20074 28495 289
799 289 -23783 2728 50361 49468 -2663 -35695 -15235 16135 13766 -3379 6244 30450 18224
812 18224 -29545 -43813 1910 43578 26765 -13895 -18739 3632 875 -29499 -30214 15151 39545
825 39545 5 -51125 -47354 -6913 6029 -17805 -24442 4420 12009 -31863 -64928 -30412 26458
838 26458 28425 -13843 -31514 -5731 8228 -15232 -25438 11985 47447 26132 -22617 -32900
850 -32900 2270 28373 13328 -5020 9713 25181 -1483 -40537 -32938 13857 34501 2294
862 2294 -34984 -29612 -7500 -14221 -34988 -23502 10661 14371 -25319 -55991 -34234 8345 9962
875 9962 -18039 -17445 11592 12950 -22972 -36768 2715 45743 33165 -7973 -13496 16158 22948
888B2948k2746k103L3750K0684k9577m2585M802M1864J4415k6099j4402K0386
900B1337J1490k7124k8021J9553M4672M558m0043k1604K0370J7235j3958j4176
912e711J8447K7151j1012m3936j5203L4200K9851j5030k7419M112J9209j0194
924D465l2679k457L8700K0907k9527l4907N978K4620p72k1889j39K9566J0013
937A1879l4058l2175J9470L9635L951k7764r029K1919Q255k6213j5564L1600L6150
950B8056j2368l8777p719K8876J6326j7886j3112K2434K2395k0029l4688L909
962b2583L6490J5433k2773j9370J5087J7671j6370k4130J4672L4793M268l1483
974A705k1677J6041K4407m610j9207M692K3069j230l0415j5635K4840K9530r439
$$ plain form
888 22948 202 -1901 31849 52533 22956 -19629 -14827 27037 41452 15353 951 21337
900 21337 32827 5703 -22318 -2765 41907 46465 6422 -15182 5188 22423 8465 -5711
912 -5711 12736 39887 28875 -15061 -30264 3936 33787 18757 -8662 -4550 14659 4465
924 4465 -28214 -30671 8029 28936 -591 -35498 -29520 -4900 -5672 -27561 -27700 1866 11879
937 11879 -22179 -54354 -34884 4751 8702 -19062 -28091 -6172 2083 -24130 -39694 -8094 28056
950 28056 15688 -23089 -30808 -1932 14394 -3492 -16604 5830 28225 8196 -26492 -22583
962 -22583 13907 29340 6567 -12803 2284 19955 3585 -20545 -5873 28920 33188 1705
974 1705 -19972 -3931 20476 15866 -3341 1351 24420 23190 -7225 -22860 1980 31510 22071
987B2071l0981j443K5475Q51k8431q680K9597K3018k0675l5260K399L1501O216
1000A5658k5530p931K4587J3436k5314k6846J5231L6242J149l1595j0452K4246
1012B881J2051k1312j6777J9125K8049o638l1355q336K3873J5004j4050j4482
1024a1967J1834J8668q145k6924l885K9594J8147k0175k4041Q952K2232l552k2539
1037a1801j744K6605J1737k5375k3942J4261K6212l667k4609k795K4048Q298k7042
1050i814j9778K2308K8042j0862k9508o03K5741O784k3061j1660K1794K0691j5238
1063D836k5929M866K6736P183k0719j2376J7736J8610j4169k3448Q149K7473M109
1076B3057k4191j3779J7232J8426j2377k1001P102K3387R6k4595j0920J9001J8589
$$ plain form
987 22071 -8910 -10353 15122 15973 -12458 -21138 8459 31477 10802 -24458 -22059 9442 15658
1000 15658 -9872 -17803 6784 20220 -5094 -31940 -16709 19533 20682 -10913 -21365 2881
1012 2881 14932 -6380 -23157 -4032 24017 17379 -13976 -22312 1561 16565 2515 -11967
1024 -11967 -133 18535 10390 -16534 -20419 9175 27322 7147 -16894 -7942 14290 10738 -11801
1037 -11801 -13545 13060 24797 -578 -24520 -10259 15953 12286 -12323 -15118 8930 17228 -9814
1050 -9814 -29592 -7284 20758 9896 -19612 -20215 5526 12310 -10751 -22411 -617 20074 4836
1063 4836 -21093 -16227 10509 17692 -3027 -15403 2333 20943 6774 -16674 -8525 18948 23057
1076 23057 -1134 -14913 2319 20745 8368 -12633 -5531 17856 17952 -6643 -17563 1438 20027
1089B0027j2361k3834N505K5057J216k4707r202K1638J6838j5756k3302Q929K5285
1102A5333p68k5687o709K2390J3660j6869k0561Q697K3741k608k6743n306K3968
1115B538J1816j9585j9562J1526K2263n499k3799j148K4012Q727k0093j4949J4392
1128i361K0615m096k0152j007K2260Q735j8360j2915J5798K1002o342k1621j480
1141f924K1674Q515j8434j2825J5518J7231r762k2624j260K1360R593j9412j5821
1154a3171J4178J7298j1383k3301L043K5520O832k3182j5734J7011J9140j3174
1166C077j9875Q530K3749R6k4132j1195J9634J8076j2106j9610O225J8930l216
1179H183k1727n961K0772J4716j5404k1063N698J8188j313j6667k226J6956J0288
$$ plain form
1089 20027 7666 -16168 -10663 14394 15610 -9097 -18299 3339 20177 4421 -18881 -9952 15333
1102 15333 14565 -11122 -17831 4559 18219 1350 -19211 -10514 13227 10619 -16124 -21430 2538
1115 2538 14354 -5231 -24793 -13267 8996 3497 -20302 -21450 2562 11289 -8804 -23753 -9361
1128 -9361 11254 7158 -12994 -14001 8259 16994 -1366 -14281 1517 22519 16177 -5444 -6924
1141 -6924 14750 23265 4831 -7994 7524 24755 14993 -7631 -8891 12469 22062 2650 -13171
1154 -13171 1007 18305 6922 -16379 -13336 12184 19016 -4166 -19900 -2889 16251 3077
1166 3077 -16798 -8268 15481 15577 -8555 -19750 -116 17960 5854 -13756 -7531 11399 8183
1179 8183 -13544 -19505 1267 15983 579 -20484 -14786 3402 2089 -14578 -16804 152 10440
1192A0440j4481j8456P076K3215L567j6298n942J5118J0873j2267j5197J1225
1204a127K5333K36k4216q245J7664J2218j2279j3747J0761J8546q163k7891n628
1217a6538K2926J3237j6184j7609O938J4110r646k2513K483K6267P144k2850j7413
1230b9648J1392J6482m647j4020M963J9193J561k1008j0854J6610K0732k911j5979
1243h134j784J3983L528j5444n909J9360J7190j0486k1603k136J7175R122j1276
1256C586p326J3387J1422j3068j9640M404K4229J0128j5270j4089J0372J2660
1268B0795j0380j4163J0951K3508N2k4963j3528J3912J6352p493j3707O466J3263
1281B1065q606k4015o371J9750J5925j2218k0931J213J2001n772j5762J985K0146
$$ plain form
1192 10440 -4041 -22497 -15421 7794 11361 -4937 -10879 4239 15112 2845 -12352 -1127
1204 -1127 24206 24442 226 -8019 9645 21863 9584 -4163 6598 25144 16981 -10910 -16538
1217 -16538 6388 19625 3441 -14168 -7230 6880 -2766 -25279 -22796 3471 10615 -12235 -29648
1230 -29648 -18256 -1774 -6421 -20441 -15478 3715 5276 -15732 -26586 -9976 10756 7845 -8134
1243 -8134 -9918 4065 7593 -7851 -13760 5600 22790 12304 -9299 -11435 5740 14862 3586
1256 3586 -3740 9647 21069 8001 -11639 -7235 16994 27122 11852 -2237 8135 20795
1268 20795 10415 -3748 7203 30711 30763 5800 -7728 6184 22536 15043 1336 7802 21065
1281 21065 12459 -11556 -17927 1823 17748 5530 -15401 -14188 -2187 -7959 -23721 -21736 -1590
1294a590P644j8360j9450O233J8896K699j0496o96J3040L276j5482j1542J3654
1307a2174K3318J887j8223p285J1014N981r563o191J3600J7539q232k5331o819
1320b0479J7379J3067p504j0493N527R867r729j9650K740K5977J1967j7385j6682
1333a5398O914J4311m013j1095Q444K2375J734k3464j2562J5114J8349o74j0782
1346I253J855J0511l623j8883l707J9941J6040r750j9649m148R613K041r852j246
1360a604J3161N940j5772j9275J112J6821R051r286r685N457N598j2120j3145
1373b3747J0099K3153L641j9966j5268Q845J2608n322q822J0893J5305p580k3897
1386b0058o632J9404J6906p170j3645M580R681p795j4901N052K2562J0836j5102
$$ plain form
1294 -1590 6054 -12306 -31756 -25523 -6627 -3928 -14424 -15120 -2080 1196 -14286 -25828 -12174
1307 -12174 11144 13031 -5192 -12477 -1463 4518 -5045 -11236 2364 19903 11671 -13660 -20479
1320 -20479 -3100 9967 2463 -8030 -2503 7364 -2365 -22015 -19275 6702 18669 1284 -15398
1333 -15398 -8484 5827 1814 -9281 -837 21538 23272 -192 -12754 2360 20709 20035 9253
1346 9253 11108 21619 17996 -887 -4594 15347 31387 21637 1988 -2160 7453 9494 -358 -1604
1360 -1604 11557 17497 1725 -17550 -16438 383 9434 148 -9537 -4080 1518 -10602 -23747
1373 -23747 -13648 9505 13146 -6820 -22088 -13243 -635 -5957 -14779 -3886 11419 3839 -20058
1386 -20058 -26690 -7286 9620 2450 -11195 -6615 3066 -4729 -19630 -14578 7984 18820 3718
1399C718j7166M366J4272j03o407O597J3655n44j6866j2204J0357J9513L582j2818
1413I952n424N511P92j0873o321J2122J6143n639k2615q873J1145P037p486n599
1427a0128Q445P870j1967k1317l47K2063J1485j0629j1197M016O228o600r018
1440b1096R955K2558K752j9212j2310J0522J3718m40n615N487J1527l922j7796
1453c872o468J6979J6518m003j3661l093O436j124j1069L10J7618R387j5658j9775
1467a1475P67J4105N220p830k783Q232K068j4676j2323Q819J8057L883j2627r411
1481i974M835N266p941n416J2190J4581m954j9601q672J1420J3149k028p972M242
1495h75P068p509j5328R72J8766J2898r746j5717K184J0638k553j0038O133J7284
$$ plain form
1399 3718 -13448 -9082 5190 5087 -1320 5277 18932 18388 1522 -10682 -325 19188 22770 9952
1413 9952 4528 10039 10831 -42 -6363 5759 21902 16263 -6352 -15225 -4080 2957 -4529 -10128
1427 -10128 -1683 6187 -5780 -27097 -27444 -5381 6104 -4525 -15722 -11706 -5478 -12078 -21096
1440 -21096 -11141 11417 14169 -5043 -17353 -6831 6887 6447 832 6319 17846 13924 -3872
1453 -3872 -10340 6639 23157 19154 5493 2400 8836 7712 -3357 -3047 14571 23958 8300 -11475
1467 -11475 -10708 3397 8617 787 -1996 6236 8304 -6372 -18695 -9876 8181 12064 -563 -9974
1481 -9974 -5139 127 -7814 -13230 -1040 13541 8587 -11014 -19686 -8266 4883 2855 -5117 -875
1495 -875 6193 -1316 -16644 -15672 3094 15992 6246 -9471 -7287 3351 798 -9240 -3107 14177
1509A4177K845j7324j3552P762J5221O08q456J762Q062m393j4227m032J2843J4863
1523A6159l984j5063m783O619J919o392l46J0504O517r179j6044k527J3645Q983
1537F028n267n929M246M107p668j1839M777K0416P769j5495j3395O347J0125l259
1551I63o213P750J3183l447j9664o796J5116J2995n453r215K589O500n044j3097
1565i833Q08J5735R173j0516j2619k58P007M14m592J677R529J730j3047j1190
1579a5982N622J3562M800p634o124L916M186p053p575Q946J5479k09j5147p815
1593a1028Q363Q655m466n230Q765R422r031j6674l37J5706R794p567j0087K835
1607h80O039n702r086N538J4003K107j3167r880N062R424j608o810M064Q830j874
$$ plain form
1509 14177 17022 -302 -13854 -6092 9129 9737 1281 3043 11105 6712 -7515 -11547 1296 16159
1523 16159 12175 -2888 -7671 -1052 867 -5525 -5871 4633 11150 1971 -14073 -16600 -2955 6028
1537 6028 761 -5168 -922 3185 -4483 -16322 -11545 8871 16640 1145 -12250 -5903 4222 963
1551 963 -5250 2500 15683 12236 -7428 -14224 892 13887 8434 -781 1808 8308 3264 -9833
1565 -9833 -9025 6710 15883 5367 -7252 -7510 -503 -89 -4681 -3004 6525 8255 -4792 -15982
1579 -15982 -10360 3202 8002 368 -5756 -1840 2346 -4707 -12282 -3336 12143 11934 -3213 -11028
1593 -11028 -2665 5990 1524 -3706 5059 14481 5450 -11224 -11561 4145 13939 6372 -3715 -880
1607 -880 5159 -543 -9629 -4091 9912 12019 -1148 -11028 -5966 3458 1850 -4960 -896 7934 6060
1622F060j2255o441Q974J2934m03j0004k520O044N53p477j531J0985R428p213
1636G134j4773j076J1905M229p528k991O903L671q711j0556L522J3472L731j0575
1650a643o545N125M168n636n728O130J1895p68j4146o438R418Q856l936n390L319
1665a319O539k456j0832k220J2638Q231o933r904K385P507j319q740K16J2156
1679E949M825j1499j0045N060R465J23o017k27O736Q87r079n355R014J0229j705
1694H361q722l134O361M355m747m695O557Q027m138j0297j327Q388N283n490o456
1709a674L956O198n435j0681J293J1592L748r305r768M776Q230l961r072L208
1723f895J0865l18j1637m877Q736P977l963p739L391Q215j892q924p53R044N968
$$ plain form
1622 6060 -6195 -12636 -3662 9272 8869 -1135 -3655 2389 2942 -4535 -6066 4919 14347 7134
1636 7134 -7639 -8715 3190 7419 -109 -3100 3803 7474 -1237 -11793 -8271 5201 8932 -1643
1650 -1643 -8188 -3063 1105 -4531 -10259 -4129 7766 6998 -7148 -13586 -4168 4688 752 -4638 -1319
1665 -1319 5220 2764 -8068 -10288 2350 10581 3648 -6256 -3871 3636 2317 -6423 -6207 5949
1679 5949 10774 -725 -10770 -5710 3755 3878 -2139 -2366 4370 5257 -3822 -9177 -163 10066 8361
1694 8361 -361 -3495 2866 7221 2474 -2221 4336 12363 8225 -2072 -3399 4989 10272 4782 -1674
1709 -1674 2282 8480 3045 -7636 -6343 5249 8997 -308 -10076 -5300 2930 -1031 -10103 -6895
1723 -6895 3970 3652 -7985 -12862 -4126 3851 -112 -7851 -4460 3755 1863 -7061 -7814 1230 7198
1738G198m158q418J039O905O56o306p30O125L287n808p313J364Q742K451p606
1753b572l922N196N626m445o881J868J0410K223r375m371Q927N720n270o313M896
1768A717R322j066j0880k606J0830N407p552o902M457O368l325q680m90Q135K947
1783G682r099o577N439N190l799p159j26O656K081p085n021N168N954j850o018
1798h564m75O385L626m586m616M884P723k236o927N69P854L522n905n275N087
1813A066P747k506p910M39P506K056o805m748N652O852l703r092J678Q461R37
1828G630p866l300O296N986m814p917K263Q077k76p071j665N505K986m758o520
1843e444K889P170r28q143k713N200K816m252m902K571N537j721p925j839O605
$$ plain form
1738 7198 3040 -5378 -4339 2566 3222 -3084 -3814 2311 5598 -210 -7523 -6159 2583 5034 -2572
1753 -2572 -6494 -1298 4328 -117 -6998 -5130 5280 7503 -1872 -6243 2684 8404 3134 -3179 1717
1768 1717 11039 9973 -907 -3513 7317 12724 5172 -1730 2727 9095 5770 -2910 -3400 4735 7682
1783 7682 -1417 -7994 -2555 2635 -1164 -8323 -8449 -1793 288 -6797 -11818 -6650 -696 -2546 -8564
1798 -8564 -9039 -2654 972 -3614 -8230 -3346 4377 2141 -4786 -4217 3637 7159 1254 -4021 1066
1813 1066 8813 6307 -1603 -1164 6342 8398 1593 -3155 2497 9349 5646 -3446 -1768 6693 7630
1828 7630 -236 -3536 2760 8746 3932 -3985 -1722 6355 6079 -992 -2657 2848 5834 1076 -5444
1843 -5444 -2555 4615 3687 -4456 -7169 -1969 847 -3405 -8307 -5736 -199 -1920 -9845 -11684 -5079
1858e079M213l521m132J495N567l32n639p07Q251N287m640o000K577P924J081
1873F345n188q84P476L052o685n419M629P712q45p126k446O441K035p312m647
1888b862N950O293l642r124j145N630K499n751k672N318L612o060o302K116P191
1903A051K167m388l969L125L258k795l710K362O291J409o066n366L665N496j327
1918A203l907J040M049n69o569l378N447P658k534p065j107N299J060n025j593
1933e991O504N761n005q233J552Q269J452n295l84N598K154o257n697M755Q554
1948G737K20p238j792L429J426l594k326M760N190k985q218j608N104L317k072
1963A350j934J703J944k675n600N48O731M298l701m861o44L199P45l432M71O604
$$ plain form
1858 -5079 -866 -4387 -8519 -7024 -1457 -1789 -7428 -8135 116 5403 763 -5237 -2660 5264 6345
1873 6345 1157 273 7749 10801 4116 -1303 3326 11038 10193 3067 621 7062 9097 1785 -2862
1888 -2862 3088 9381 5739 -3385 -4530 1100 3599 -2152 -4824 494 4106 -1954 -8256 -6140 1051
1903 1051 3218 -1170 -5139 -2014 1244 -1551 -5261 -2899 3392 4801 -1265 -6631 -2966 2530 1203
1918 1203 -2704 -1664 2385 1816 -4753 -8131 -2684 4974 2440 -4625 -5732 -433 627 -4398 -5991
1933 -5991 513 6274 1269 -6964 -5412 2857 4309 -986 -1370 4228 6382 125 -5572 -817 7737
1948 7737 7957 719 -1073 2356 3782 188 -2138 2622 7812 4827 -3391 -4999 105 3422 1350
1963 1350 -584 1119 3063 388 -5212 -4664 2067 6365 2664 -2197 -2841 358 1103 -2329 -1858 4746
1979D746J786p180o313K847O536J176m203j714L950o4o437l374O219O908j945
1994B938p147k483M308K435m107j214O660M059n644p084J297O935L278k811j924
2009e04L182J097n098l166N053P031J032n459m907J831L106q38j666L131L505
2024G330k321o643l390M224N857q73m421k98J336j822m370l70O098M721l496q070
2040f508r06M625J593l094M65N087J476o336o051K794Q490J617m597j220K492
2055g3J65m276j370N881P147j707p556k659M550K809j293N3L604J471m327o381
2071c962J219P135L580k660k767m79L19j566k115K265N893J522n656n589K93L850
2087A282J175j483K19K715j320o507l918N159O528k92n035k889J701N77l440o58
$$ plain form
1979 4746 6532 -648 -6961 -4114 2422 3598 -605 -2319 1631 1567 -4870 -8244 -2025 4883 2938
1994 2938 -4209 -6692 -2384 51 -4056 -5270 1390 5449 -195 -7279 -5982 953 4231 1420 -504
2009 -504 2678 3775 -1323 -4489 564 7595 8627 3168 -1739 92 3198 2360 694 3825 7330
2024 7330 5009 -1634 -5024 -800 5057 4184 -237 -535 801 -1021 -5391 -5761 337 5058 1562 -6508
2040 -6508 -7414 -2789 -1196 -4290 -3825 1262 2738 -3598 -9649 -6855 1635 3252 -1345 -2565 -73
2055 -73 92 -4184 -5554 327 7474 5767 -1789 -4448 102 2911 1618 1671 5275 6746 2419 -3962
2071 -3962 -2743 4392 7972 5312 2545 2066 2385 819 -1296 969 6862 8384 2728 -2861 -2568 1282
2087 1282 2457 974 1193 3908 2588 -3919 -7837 -2678 3850 3558 -1477 -4366 -2665 -2088 -5528 -6186
2103f186O304M311m510p674j09M702K615k156p8L882M95n941m161L557P380J842
2119D273l526l081J200O51j816l94N209M548j885o037l497K923M390N93j498J033
2135C086J030l033m561k4N245M792j773n080k111J966k59j748J234N091J835n886
2151a96o660J319O559J965k982k68K499p55m938j982M698O847m97n503j973K272
2167D05N66k104Q70M650K940l925o801q56N151K771r28r14O11q28l342k767K110
2184b391N888K059m599m453K46J925L36p85J454L687k62o200l739L428M965R57
2200B516k758p55J270j409m182k36N800M219k514n913j740K785J971j288M8L880
2216A694P65n184m590K154N111J845j886j304J261J13l273j454M698N510k57m554
$$ plain form
2103 -6186 118 4429 -81 -7755 -7864 -3162 -547 -2703 -2781 1101 1596 -4345 -8506 -4949 2431 4273
2119 4273 747 -2334 -1134 -483 -2299 -2693 2516 7064 5179 -858 -4355 -1432 2958 3551 2053 3086
2135 3086 4116 1083 -3478 -3502 1743 6535 4762 -318 -2429 -463 -722 -2470 -1236 3855 5690 -196
2151 -196 -6856 -5537 1022 2987 5 -263 2236 1481 -3457 -5439 -741 6106 5609 106 -1867 405
2167 405 971 -1133 -263 4387 7327 3402 -3399 -4255 896 3667 2739 1825 2436 1608 -1734 -4501 -2391
2184 -2391 3497 5556 957 -3496 -3250 -1325 -989 -1774 -320 3367 3105 -3095 -6834 -3406 1559 2516
2200 2516 -242 -997 273 -1136 -5318 -5554 246 4465 1951 -3962 -5702 -2917 -946 -2234 -2186 1694
2216 1694 2459 -2725 -7315 -5161 -50 1795 -91 -1395 -134 -21 -3294 -4748 -50 5460 5203 649
2232F49l253J975K431K09k50L011J794l667m407j00M261L335n56k976k32N87j986
2249H25j740J461M054J885l292m792j000L073J528r49L69K334p35m835l211K697
2265b328N769Q66m582j916J796k08k691n14L690L426k155n719j001L204J252j666
2281b777J5K620j14m026l324J641N126J871k475j721L52m1j072O64K299L247J91
2298B476l856j993J694K953J232n96O10R40k79l244j588L957L744k69l230j561
2314I90R82O06j775o46M109K170m012n425P29M048J336k274j028K002n3m443j872
2331d556L421L849p57l103j044Q39K58j763R9K697K220k226l565q93J856K151
2347e17Lr70L04M15j852j728J039L072K150j153l416m26K489O12j319N54L306
$$ plain form
2232 649 -2604 -629 1802 2011 1761 4772 6566 2899 -1508 -1608 2653 5988 5432 2456 2224 2811 825
2249 825 -915 546 4600 6485 3193 -1599 -2599 474 2002 1053 1422 3756 3021 -1814 -5025 -2328
2265 -2328 3441 4307 -275 -2191 -395 -603 -3294 -3808 -118 3308 1153 -4566 -5567 -2363 -1111 -2777
2281 -2777 -2762 -142 -256 -4282 -7606 -5965 -839 1032 -1443 -3164 -2812 -2853 -3925 -3261 -962 2285 2476
2298 2476 -1380 -3373 -1679 1274 2506 1910 2520 3460 3181 -63 -1651 2306 6050 5781 2551 990
2314 990 1972 2578 803 157 4266 6436 2424 -3001 -2272 1776 3112 838 -190 1812 1759 -2684 -4556
2331 -4556 -1135 2714 1957 -1146 -2190 -1351 -1093 -2856 -2757 -60 2160 -66 -3631 -4524 -2668 -517
2347 -517 -514 -1484 -1180 -765 -2617 -4345 -3306 -234 1916 763 -2653 -3079 -590 22 -1297 -743 2563
2364B563J194l538k596J670L686J233k470k92K204l96k921l21L160L257j330m351
2380G52n96K347L61j400q9J964O06k466l079K48K741M94j894p56J414n45k256
2397b154j353J287K991O83l370k179J147Q64O9p96O70J458p82k585j312K898K147
2414c17j706j050M95R77j65j692l64K754K226j655k006j72J820J029p12l69K240
2431A333Q13j902k390J890L325L0k167p33K001J610k056j470K246K396j425k563
2447I38M3J684P92j384j117K125J038k190k101N79K374P4j505r19J1J123j109
2464D56q88O98P58K5q20j165O8J397j46j716m35J767O35j947j405P03K207J2k657
2483b453o40K436Q57k530r20K066J847j058l021O72L175J64l125PK767P18j892
$$ plain form
2364 2563 3757 219 -2377 -707 2979 4212 1742 1450 3654 3258 337 16 3176 6433 5103 752
2380 752 156 2503 2864 1464 1375 3339 3945 1479 -1600 -1352 1389 1883 -11 -767 647 102 -2154
2397 -2154 -3507 -2220 771 1454 -1916 -4095 -2948 -2084 -2015 -2811 -2141 -683 -1465 -4050 -5362 -2464 -317
2414 -317 -2023 -3073 -2578 -1601 -1766 -3458 -3822 -1068 1158 -497 -2503 -2675 -855 174 -538 -907 1333
2431 1333 2146 244 -2146 -256 3069 3099 932 199 2200 3810 1754 284 2530 4926 3501 938
2447 938 981 2665 3457 2073 956 3081 4119 1929 -172 407 2781 2855 1350 431 442 1565 456
2464 456 -432 266 1024 1049 229 -936 -868 529 383 -1333 -1768 -1 634 -1313 -2718 -2015 192 204 -2453
2483 -2453 -3093 -657 200 -2330 -3250 -1184 663 -395 -3416 -2744 431 595 -2530 -2523 244 962 -930
2500i30j257R28K559o82k143N31K093k51j390j59R84N57j34j337j02J103M93r25
2518f2m98j13O15Q09r28p54O39J125q70j341P19J409Q89k251j475J164K625r17
2536G85k326R83J626j05k227m03K097J235j580j765J859J604j329j759J108J777
2552A580Q59j700j578J228K122q01r89R52J176o04j146m82J717J274r78j034N18
2569B114P53q78m68m76O14J234o08k247o01Q79M77q76o72K19J90r11k266N01J947
2588a075M00j748o91J76K42J22j573Q92J790M39k588q44J269J507J63p24K27J298
2606g18l30k311O63K675J587j349j708O48J078J30q51O22K042K32j805j345J047
2623C07J128R43k79k03O46k67j396o19J752J370p4q94j115k36N00j30P6P37Q48
$$ plain form
2500 -930 -2187 -1259 1300 618 -1525 -994 1099 848 -542 -701 283 840 706 -631 -733 370 863 -62
2518 -62 -560 -673 -58 751 -177 -931 -292 833 -37 -1378 -659 750 1639 -612 -2087 -923 1702 785
2536 785 -1541 -558 1068 963 -1264 -1667 430 1665 85 -1680 179 1783 454 -1305 -197 1580
2552 1580 2439 739 -839 389 2511 1710 721 1673 2849 2245 1099 617 2334 3608 2630 1596 2114
2569 2114 2867 1989 1521 1045 1659 2893 2285 38 -563 316 793 -83 -755 -536 -346 -1257 -3523 -3022 -1075
2588 -1075 -675 -2423 -3114 -2938 -2696 -2574 -4147 -3255 -1465 -1026 -3614 -4458 -3189 -1682 -1519 -2243 -2016 -718
2606 -718 -1048 -3359 -2696 -21 1566 217 -1491 -843 235 365 -486 136 2178 2410 605 -740 307
2623 307 1435 2378 2099 1896 2542 2275 879 260 2012 3382 3308 2414 1299 1063 1563 1433 1509 2246 3094
2642C094j298j838r47O90J924K0j879k34M84r40j873O37K463O82j643k034J11
2659b581J312j00p88J132J576m12k754p95J745K209j49j151N46P11j457q21R17
2676h60J642J044r11j444m44R07k36L46R54M21k25j101j261n25J895J191j00q76
2694D17p71nj93o71Q04K283M63j822k168Q09J298M64n80P88J097j108k726k43
2712a864K269J719p22j159n38L82r28p07R87K200J55k017j205j57P89J24K26N61
2730A15P74p09j694p64J484J215P95l25r99j15m68j85K01J651J143m59j864j455
2748a659N73J558O50j52O40j7j930j256J68K346J565n31k119l13N41r56j49J856
2766H15J633q65j527k104N91J945M24n59N51L90j777j781k9J762J880M4j679q83
$$ plain form
2642 3094 1796 -42 -989 -299 1625 1645 -234 -468 16 -924 -2797 -2160 303 985 -658 -2692 -2581
2659 -2581 -1269 -1369 -2157 -1025 551 139 -2615 -3410 -1665 544 395 -756 -210 501 -956 -1777 -860
2676 -860 782 1826 915 -529 -973 -66 -302 44 998 1419 1194 93 -1168 -1693 202 1393 1293 417
2694 417 -354 -359 -552 -1223 -419 1864 2327 505 -1663 -854 444 908 328 1116 2213 1105 -1621 -1864
2712 -1864 405 2124 1402 243 -295 87 -841 -1548 -561 1639 1794 -223 -1428 -1585 -796 -672 -446 115
2730 115 889 180 -1514 -2278 -794 421 1216 891 -108 -223 -691 -876 -675 976 2119 1660 -204 -1659
2748 -1659 -1086 472 1122 970 1610 1593 -337 -1593 -1425 921 2486 1955 -164 -477 64 -892 -1041 815
2766 815 2448 1583 56 -2048 -1457 488 912 353 904 1294 -483 -2264 -2293 -531 1349 1393 -286 -1169
2784a169j26p58K16J217R68M75j453j930m20J508P63K36N17k20m84j013o81J131
2802a223J924J293j120j340j16K62O92Q83N67J265m34k248j224J546J794L84l75
2819B530m77k33r27j420L27K239J125j454j810n90j74q8J00R36J059o34k781j144
2837c416Q68J283O00K76k60p25r56j003O66K272P59l73q08m86l76O73J025M62
2855D81J122M25j369j321k12J076K098M46j189r70L19o01p54J183J983L12j520
2872A509k068k66J033L27n81J016P75j721k266n32J069K368o64r00O6l29j518
2889b682o65J563J496L49j206j272n28L33O18P24J096M9p39o90n82L03J960J033
2907A160R1q31p01q9L63P00Q29J494N73j791j655P71J445M66K37L52K45j418j876
$$ plain form
2784 -1169 -1295 -2053 -1837 -620 348 823 -630 -2560 -2980 -1472 -709 -473 44 -176 -660 -1673 -2354 -1223
2802 -1223 701 1994 874 -466 -582 -320 372 1255 1822 3087 2653 405 -819 727 2521 2905 2530
2819 2530 2053 1820 893 -527 -200 2039 3164 1710 -100 -690 -864 -952 -852 84 1143 509 -2272 -3416
2837 -3416 -2548 -1265 -665 -389 -649 -1374 -2330 -3333 -2667 -395 364 -9 -817 -1303 -1679 -1006 19 481
2855 481 1603 2028 659 -662 -874 202 2300 2746 1557 587 906 305 -449 734 2717 3029 1509
2872 1509 -559 -825 208 535 -46 970 1745 24 -2242 -2774 -1705 663 -1 -901 -835 -1164 -2682
2889 -2682 -3347 -1784 -288 61 -1145 -2417 -2945 -2612 -1994 -1270 -174 -125 -864 -1554 -2136 -1833 127 1160
2907 1160 1251 420 -281 -370 -7 693 1522 3016 3589 1798 143 914 2359 2825 3062 3414 3659 2241 365
2926C65L47J927J521j402o21q28j4r96j4P42J473r6k177j278Q2L51L96L39M98
2945F15n22j219j193o2J099J155k56n97n63j257L19K04N75J103J98q54j067o64
2963b986M13J040R48n70Q3k1j142j205P70J256R51r9j468k72M20m3M73R74Q52
2982C74k16j300j91J87J691R78k52L2M12m37q76L81J951J159m79r79k16J88k19
3001B188j63J298R54q23j308j118K41P87L09k33j15l37j221q01K16O12L28J35
3019I49q08j028n98M7N19M84J25k11J99q79j263R21J541l2m54l69j87P9m70L24
3039a111J595P66j547j069N96L66J5j46N45J041p16j796O0J161P79n88K9L91o50
3058b79q31n70P23J679k50p46n62j07n64N72P61J65l59l11k39j00m54P20Q46L13
$$ plain form
2926 365 712 2639 4160 2758 2137 1309 1295 299 285 1027 2500 2404 227 -1051 -969 -618 -222 117 615
2945 615 93 -1126 -2319 -2381 -1282 -127 -383 -980 -1543 -2800 -2481 -2277 -1702 -599 -401 -1255 -2322 -2986
2963 -2986 -2573 -1533 -585 -1155 -1072 -1093 -2235 -3440 -2670 -1414 -463 -562 -2030 -2302 -1882 -1925 -1452 -478 374
2982 374 158 -1142 -1333 -1146 545 1523 1271 1303 1715 1278 402 783 2734 3893 3414 2435 2219 2407 2188
3001 2188 2025 3323 4277 3454 2146 1028 1269 2056 2365 2132 2017 1680 459 -342 -126 486 814 949
3019 949 141 -887 -1485 -1438 -919 -435 -310 -521 -322 -1201 -2464 -1543 -2 -34 -488 -857 -1044 -965 -1435 -1111
3039 -1111 484 1250 -297 -1366 -770 -404 -389 -535 10 1051 335 -1461 -1401 -240 539 -49 -20 371 -279
3058 -279 -1110 -1680 -957 722 472 -274 -836 -943 -1507 -935 -174 -9 -368 -679 -918 -1018 -1472 -752 94 407
3078D07q54n36P51l96j14N16L48O89o79q53J19J082R0k4N40O01n51p74L4Q61P98
3099B055m21o69J90L51o61k97O66O52p33k32m89k33K60m47K04J03l6p98m45P2
3119i08j2P54J17n62k34l9K5L55J18K53J2K91j52m49J64P34j81J88K11O2j39n70
3141C8J0R26M20o66o19J57R7q5m86L73Ln9o15n30M89R5j59k49Q6J85l62m98j25
3164a574N79Q11q36j02N27k9j48j5O14L74n9k73l75N64J89k66O77Q7l78M8K08
3185F23j35P3J60k2j55P3m95L93jj70J82l5m4k63k31l0M54j59r73J40P10K2l54
3208b37n66Q79l1m81l88K14Q21m78q31M21J016m74m77L54N17k00m74k36N90N79
3228E18n39M1L16j19j54J71N3L98J68j76R1K31l00j70N65n6k03k12L50k36k25
$$ plain form
3078 407 -447 -983 -232 -628 -742 -226 122 811 132 -721 -602 480 570 546 1086 1687 1136 362 396 1257 2055
3099 2055 1634 965 1155 1506 845 548 1214 1866 1133 901 412 179 439 -8 196 299 263 -535 -980 -908
3119 -908 -920 -166 -49 -611 -845 -884 -859 -504 -386 -133 -121 170 18 -431 -267 467 286 474 685 747 608 38
3141 38 48 974 1394 728 109 266 363 278 -208 165 168 109 -506 -1036 -547 -452 -611 -860 -774 -589 -951 -1449 -1574
3164 -1574 -995 -184 -1020 -1122 -595 -624 -772 -787 -173 201 142 -131 -506 58 247 -19 658 745 367 415 623
3185 623 488 561 721 699 544 617 122 515 514 344 526 491 447 184 -47 -77 377 218 -755 -615 95 117 -237
3208 -237 -803 76 45 -436 -824 -610 211 -267 -1098 -677 339 -135 -612 -258 259 59 -415 -651 -61 518
3228 518 -21 20 336 217 63 234 287 685 853 677 768 999 699 529 1094 1038 835 623 973 737 512
3249E12j96O61Qo95l83J47O28p21k29L31O46r48p86K44K88j58M3j80K61M0o44
3270a131n50Q55N54m28j11MK62k49Q0J00N27J78l92k62M8M27j76K26M55l40p8
3291ao62M13M9J26L66R9n15o35K16L11K19M13j04j13l07m93J66Q34M78n35o2k1
3313B42L68n37j05K05J399o00r30N38L93k65k19J22J99K77k96q94J26L90N1j85
3333B79N9j94k84k91j7M36M39k08l09j95m83p3M86O17j43k94J29p80K00L07J42
3354a77J70N18q07l84L67k05J06L29O36l13n08o32N08J30N79k02J79k03p58R6
3374e71K32N06L87k45j44k25K00p87M03J163rk18o78J7N6K36M47J83K22k30r52
3395gl57N50N4K01L00m15p73j77j26K28N59k65K65o57m81n62N98M81L99l6p61
$$ plain form
3249 512 316 977 985 290 -93 54 682 -39 -268 63 709 -239 -1025 -781 -493 -651 -608 -788 -527 -487 -1131
3270 -1131 -1681 -826 -272 -700 -811 -807 -545 -794 -714 -614 -87 91 -301 -563 -515 -88 -264 -38 417 77 -1
3291 -1 -663 -250 -201 -75 291 390 -125 -760 -544 -233 -14 399 295 182 -125 -618 -452 382 860 325 263 242
3313 242 610 73 -32 173 1572 972 42 580 973 708 489 611 810 1087 791 -103 23 413 464 279
3333 279 338 144 -140 -431 -448 -12 427 219 -90 -285 -768 -841 -355 262 119 -175 -46 -826 -626 -319 -177
3354 -177 -7 511 -296 -680 -313 -518 -412 -83 553 240 -268 -900 -392 -262 317 115 294 91 -667 -571
3374 -571 -339 167 554 309 165 -60 140 -647 -244 919 910 692 14 31 87 323 770 953 1175 945 -7
3395 -7 -364 186 240 441 741 326 -447 -624 -750 -522 37 -228 37 -620 -1101 -1663 -1065 -584 -185 -221 -982
3416i82N4n8j48P11P39j77k57n37M22r7K44J81N27O32n22q82O7N15L52J24K58
3437A166K17o05j046O7Q01N16O8o47p9o01j07K39N28J99J35o75m70o2j43J97N78
3458B76O31r19n07J30k52jP51m0M41p07n73k50L74K19M92J10j4m69n21K17N27
3479h5N36N8j69j11m0p51j63J128N29L12q03l07l87K32M58L33Q89r25p53k44J62
3500a01o9N27O24m19n40p28k98J51M54N57l55j32o80m86L98nM33K65r9k35l79
3521a117o16P2P98Q36j33m53Mj01M6K04Q68L06J83r36l69O25L53j13O45K73k98
3542A077q58m00o2J076N9O8l36J66q42j96M08N52L55o27n64p5J71l87P24L93j20
3563E82o22k99j19J07Q0O15K14k1n52o40J65R2O77M15Om94m80n71J12O59O66n04
$$ plain form
3416 -982 -928 -986 -1134 -423 316 139 -118 -655 -233 -330 -86 95 622 1254 732 -150 -83 432 784 908 1166
3437 1166 1383 778 -268 -201 600 1116 1184 537 458 -143 -250 -11 517 716 851 176 -294 -356 -499 -302 276
3458 276 907 -12 -519 -389 -641 -642 109 69 510 -197 -770 -1020 -646 -427 65 175 161 -308 -829 -612 -85
3479 -85 451 509 340 229 189 -562 -725 403 932 1244 441 134 -253 -21 437 770 1659 734 -19 -263 -101
3500 -101 -170 357 981 562 22 -706 -1004 -853 -399 158 -197 -329 -1009 -1495 -1097 -1102 -669 -404 -503 -738 -1117
3521 -1117 -1733 -1661 -863 -27 -160 -613 -609 -710 -664 -460 408 714 897 -39 -408 217 570 457 1102 1375 1077
3542 1077 219 -181 -243 833 892 960 624 790 -52 -248 160 712 1067 440 -124 -199 -28 -415 309 702 582
3563 582 -40 -339 -458 -351 -271 344 558 537 -15 -655 -490 -398 279 694 700 206 -274 -845 -733 -74 592 88
3585H8j81m23n3m52O26P48J20k65m21k71K41m90L06P06O25q33j73k28K34J91M28
3606E23J89K06m86q30K56L76Q87l42j03n7l36q42L92O83L12j02m85l03k12k69
3626e43K61L31N31n12m52l40P5J92M8R56L62j174n98j64M01L08%M16P1o95l57
3647h83m7K68K80LMK49n05m65j2P83N22j67k18m26r3R5r9Q39K12k9o11J89Q6o0
3671h5L61O53N1k28n97L11K10J3J00M80Om41j54k57K44J28P9J9j10n81k78J90
3693A14O43m7J3n05k32j62k17P4M72N39l61m59o97M92M9J53Q1L18l2n49k73l0
3715f16O10j04K48l5l68n83M27k28N39L81m48j08m88j35J37J90J82M52n70k65
3735g82o3L20l64L92M34q7m32J26k62Q4L44N9N91j92m38m16M80O62j9J77m12J51
$$ plain form
3585 88 -93 -516 -569 -1021 -395 353 473 208 -213 -484 -243 -733 -427 279 904 71 -102 -330 -96 95 523
3606 523 712 918 432 -398 -142 234 1121 779 676 619 283 -559 -167 516 828 726 241 -62 -274 -543
3626 -543 -282 49 580 68 -384 -724 -649 -457 -409 547 909 -265 -863 -1027 -626 -318 -318 98 169 -526 -883
3647 -883 -930 -662 -382 -379 -375 -126 -631 -1096 -1108 -325 197 30 -188 -614 -707 -612 -711 128 340 311 -300 -111 -25 -85
3671 -85 276 929 980 752 155 466 676 689 789 1269 1275 834 680 423 667 795 874 893 783 202 -76 114
3693 114 757 710 723 218 -14 -176 -393 -319 153 692 331 -128 -825 -333 -284 -131 -50 268 236 -313 -586 -616
3715 -616 -6 -110 138 103 -265 -848 -421 -649 -110 271 -177 -285 -773 -908 -771 -581 -399 53 -517 -782
3735 -782 -845 -525 -889 -497 -63 -150 -582 -456 -718 -634 -290 -231 360 168 -270 -686 -206 456 437 614 202 353
3757C53M4k70k22M37N41o00l37O31q7p47L56K06L54K4n06k7P7j27L09L19J43n00
3779C71m99J27N41R9RN3QOo61J78P50l14l6J22q3o00k17J67K55N2J13o41J22N4
3803b4l28J24M41L77p85m09O2L73p2l3k49R3K11l28K67n7j70L79j38l4P7l87j39
3826g49L32L29l41r9K43j74j20K63j26K65J6n81j32M87K06n51P19m3J40m4m06
3847c66L67l8o0M35J85k32l05O7N22N3J32k36L36n77N5J8K05L22n37k9l2m5l34
3870i4L63j50kL94m75l8K44J95q32L22K68nk23j18LJ6RL25m5J02j25k81M06l75
3894a16N06l65j55K15K33m31k03R54o65j22K33K8k01l96K67k2K3n2m6j09J7l9
3916d46K30m0j91J63K54r7M6J92k22N3J17P9j44J8K99m14K10J66j64m2m4J46j08
$$ plain form
3757 353 397 127 -95 342 883 283 -54 577 490 -257 99 305 659 683 177 150 227 100 409 728 871 371
3779 371 -128 -1 540 639 648 701 709 715 54 232 982 668 632 754 671 71 -146 21 276 328 441 -200 -78 -24
3803 -24 -352 -228 213 590 -195 -604 -542 -169 -241 -274 -523 -430 -219 -547 -280 -337 -507 -128 -266 -300 -223 -610 -749
3826 -749 -417 -88 -429 -528 -285 -459 -579 -316 -442 -177 -161 -742 -874 -387 -181 -732 -13 -56 84 40 -366
3847 -366 1 -37 -97 338 523 291 -14 53 575 628 760 524 860 283 338 356 561 883 346 317 285 240 -94
3870 -94 269 119 117 511 36 -2 242 437 -395 -73 195 190 -33 -151 -148 -132 -123 202 157 259 134 -147 259 -116
3894 -116 390 25 -130 85 318 -113 -316 638 -27 -149 84 112 -89 -485 -218 -240 -217 -269 -315 -424 -407 -446
3916 -446 -216 -256 -447 -284 -30 -127 -81 111 -111 -58 59 138 -6 12 311 -103 107 273 109 67 23 169 61
3939F1J14j60l29M90M3k82k0J1J41P1k80M93N4o18k25K53J84J53j52K32j23j13
3961bO9m84L63K20j92P6Q4j52n1j8K20K6M5m17L40J07o78J27O14p2j09p6l56Q9
3985b27J45k10N09o3j48l36K85J78J16j86P8o9J45k74jM32Pj35L6K14l91m44O5
4008b74M27J64j85l74J35J38j45J13P3J56j79n62K11P3J8K6J48j83K51n34K06
4029b97K74n6j65M98J38n98j84P06j40K85Qj51j37j93j76K87L85j81Q2j68j13
4050A04j77j13M32j9J85p1o91m5N20k36k0J94j40J13l3l58M03L62l43K53j89l77
4072b46R0j02O5P97n40j69J96j02k40J03K78M2Ln09l6q6M47j68n0M39k90l42r1
4095e11J63J87Q2K55k35J33k74j25J72O71j80j44j02j00N5k90L47Q6M35j88l38
$$ plain form
3939 61 175 15 -314 176 219 -63 -83 -72 69 140 -140 353 407 -211 -436 -183 1 154 2 234 111 -2
3961 -2 67 -417 -54 166 -26 50 134 -18 -69 -87 133 159 204 -213 127 234 -444 -317 297 225 116 40 -316 -227
3985 -227 -82 -292 217 154 6 -330 -45 133 249 63 141 72 217 -57 -58 374 381 246 282 496 105 -339 -274
4008 -274 153 317 132 -242 -107 31 -114 -1 72 228 49 -513 -302 -229 -211 -185 -37 -220 31 -503 -297
4029 -297 -23 -79 -244 254 392 -206 -390 316 176 461 469 318 181 -12 -188 99 484 303 385 217 104
4050 104 -73 -186 246 227 412 341 -350 -395 125 -111 -131 63 -77 36 3 -355 48 410 67 320 131 -246
4072 -246 -156 -258 -193 604 64 -105 91 -11 -251 -148 130 172 175 -334 -370 -456 -9 -177 -227 212 -78 -420 -511
4095 -511 -348 -161 -79 176 -59 74 -200 -325 -153 518 338 194 92 -8 47 -243 104 190 625 437 99
4116I9r0j25j19L16N36k77n41R0k41j43O00k52K77j04J6m55K03L05n5L00k6j60
4138A54l37M1K37L47K06k69k08k10n2J53k1M20K00k66o47J29j5p3L17M96l05m70
4160a73l05L86R2j44K9K18J50n66m36N19K44n4k8Q8J05m73K74k5k7L79j82r5J89
4183A65n76J82j36O59J8k49k69j15K01j50j85O65J29r19K56k78J88o6L83l40K59
4204a78j14n39M49K34J83p7M3j45L55k95J83J04M48k92l26J98k60k9K7J051m67
4225E53k78k0k88J29K15j01K99J04k5p19j61N62L7RJ22P8m20j96r0M47K74l64
4247A67J01q6n1m49J19J6O32r3l43j28r8n8L2K22O4k30j31k32j76L60R7M04k05
4270f6j26m18J2N13j40J59N5m89L33k24K43N0L23%m17J49l88J85J19m7L71L47
$$ plain form
4116 99 9 -116 -235 81 617 340 -201 -111 -352 -495 105 -147 130 26 42 -413 -210 95 40 340 314 154
4138 154 -183 -142 95 442 648 379 171 -39 -91 62 41 461 661 395 -252 -123 -138 -211 106 602 297 -173
4160 -173 -478 -92 0 -144 -115 103 253 -313 -749 -230 14 -40 -68 20 125 -348 -74 -99 -126 253 71 -24 165
4183 165 -411 -229 -365 294 312 63 -206 -321 -120 -270 -455 210 339 -580 -324 -602 -414 -480 -97 -437 -178
4204 -178 -292 -831 -382 -148 35 -42 1 -144 211 -84 99 203 651 359 33 231 -29 -58 -31 1020 553
4225 553 275 255 -33 96 311 210 509 613 588 -131 -292 270 307 316 438 516 96 -100 -190 257 531 167
4247 167 268 182 131 -318 -199 -183 449 356 13 -115 -213 -271 -239 -17 47 -183 -314 -546 -722 -362 -265 139 -66
4270 -66 -192 -610 -598 -85 -225 -66 -11 -500 -167 -391 -148 -98 225 225 -192 -43 -431 -246 -127 -174 197 544
4292E44m11r5k28J93J15J19Q8n9l61k93J50L01lO2p0J14m83kj15M00P9p2K80m85
4316b32M9r0K81K67K63n24L4J7J95j82j88N28K14l06l53o7N93k80j18L04r4l04
4338Go5j61L77j79l8J19L21m01n77M99LK80k79j02O1N2r0L2N42P9k09m35K13o1
4362a2l68J69L36P1j79j74K1L2p1J78L8J48n70L0j69K66O00l43M1jl48j76j79
4385f60Q13O5m27K46P3o9j27J8J79J22J34m98J32J69l89K37J40K71m19n8J13j50
4407h5K4m32P12n4k61m80J02M94j32P6R7l82K23K0k61N89J36l15j17p9j07J11
4429a21K41k9K67j91L14n28M98j82k61M18l15K11m29o6J8L40l72J27M51n10j67
4450b86K25j15L46n45K43N5r9Q4l40K92J45Q3j85k15K44j11K32K71j61K62l23
$$ plain form
4292 544 133 38 -190 3 118 237 325 266 -95 -388 -238 63 60 122 52 166 -317 -319 -434 -34 45 -27 253 -232
4316 -232 -183 -273 8 275 538 14 48 65 260 78 -110 418 632 326 -27 -94 499 219 101 405 311 7
4338 7 -58 -219 158 -21 -59 60 381 -20 -597 -98 -95 185 -94 -196 -135 -83 -173 -141 401 480 271 -164 49 -12
4362 -12 -380 -211 125 196 17 -157 -136 -104 -175 3 41 189 -381 -351 -520 -254 346 3 44 43 -305 -481 -660
4385 -660 153 218 -209 37 110 41 -86 -68 111 233 367 -131 1 170 -219 18 158 429 10 -48 65 -85
4407 -85 -61 -493 219 165 -96 -576 -474 20 -112 -36 61 -321 -98 -78 -339 250 386 71 -46 -125 -232 -121
4429 -121 120 91 358 167 481 -47 451 269 8 426 111 322 -107 -173 -155 185 -187 -60 391 -119 -286
4450 -286 -61 -176 170 -375 -132 -77 -176 -92 -432 -140 5 88 -97 -312 -68 -179 53 324 163 425 102
4471A02L9L3J16J33l22k2L47k58l23K41R8Q2R4l50O0l57j27L01O2L36j57l03j73
4494c48J79P0K2J62Pq7O2k08j28K47L9r5L83r3l84J7l3J56j02L49l01R9l11J95
4518a03kL34l18j94K99m44J45j1L94j35k44K25q4K27j76p4L0N54k58k8J6K20k45
4541A28O2N09j93l31k33%R9K53j58j65L31n73J99K17kk56k84J80P1L0j62jK24
4564e5q8j27M10n07J76K41j04J64o3j37L3N5j72K07K59J4m72M91k81L20P4j46
4586B92l80L89K22l28k41J6j35K5J83p5K99k40p8k85M20om02K41L61k56l96L73
4608aK01k67J45MK1J50k02l37K63J24k96J80J7o8K39n35J66J3K61k33j01M88k81
4631d9j04P6l0O3j55M75k63P6n58M74L02l13L63k02r4J16O5Q0l36M51k07l42L19
$$ plain form
4471 102 141 174 290 423 101 79 426 168 -155 86 184 266 360 10 70 -287 -414 -113 -51 285 128 -175 -348
4494 -348 -169 -99 -77 85 92 5 67 -141 -269 -22 17 -78 305 212 -172 -155 -188 -32 -134 215 -86 13 -298 -103
4518 -103 -105 229 -89 -283 16 -428 -283 -294 100 -35 -279 -54 -138 89 -87 -161 -131 423 165 137 153 373 128
4541 128 190 699 506 175 -58 -58 41 294 136 -29 302 -271 -72 145 143 -113 -397 -217 -146 -116 -278 -279 -55
4564 -55 -143 -270 140 -367 -191 50 -54 110 47 -90 -57 -2 -174 33 292 306 -166 325 44 364 438 292
4586 292 -88 301 523 195 -46 -30 -165 -140 43 -32 267 27 -51 -336 84 78 -324 -83 278 22 -374 -1
4608 -1 200 -67 78 82 103 253 51 -286 -23 101 -195 -15 2 -66 173 -362 -196 -183 78 -155 -256 232 -49
4631 -49 -153 -77 -107 -44 -199 276 13 89 -469 5 307 -6 357 155 61 177 242 322 -14 437 230 -112 207
4654B07m8l8j0j15j12J13j34L2O3Q4nj27J21l49M41K4k78L70J53n16Q0Q3K18K1
4678B78k28J11P8j9l53Q3k74L87k6m5J40n14O84l21J86n15M98j30m8MP3k89J43
4701i7L4o1N1Ol1j70K5K81j70j15J06K44Q4q6l55K65OJ8Q5l64M01j36j02K72n
$$ plain form
4654 207 159 121 111 -4 -116 -3 -137 -105 -42 42 37 -90 31 -318 123 147 -131 239 392 -124 -44 39 257 278
4678 278 50 161 239 220 -133 -50 -324 63 37 -8 132 -382 302 -19 167 -348 150 20 -28 -24 49 -240 -97
4701 -97 -63 -124 -73 -67 -98 -268 -243 38 -132 -247 -141 103 187 101 -254 11 17 35 120 -244 157 21 -81 191 186
$$ [...]
8191D1
##END NTUPLES=NMR FID
##END=
