##TITLE=1H_BAU-j-MN
 CDCl3, 8 sc, 
 3.7.2019
##JCAMPDX= 6.0         $$ Bruker NMR JCAMP-DX V2.0
##DATA TYPE= NMR FID
##DATA CLASS= NTUPLES
##ORIGIN= UXNMR, Bruker Analytische Messtechnik GmbH
##OWNER= root
$$ XWIN-NMR		Version 3.5
$$ Wed Jul  3 15:57:23 2019 Russian Standard Time (UT+4h)  she@DPX200
##.OBSERVE FREQUENCY= 200.13155
##.OBSERVE NUCLEUS= ^1H
##.DELAY= (6, 6)
##.ACQUISITION MODE= SIMULTANEOUS
##.ACQUISITION SCHEME= undefined
##.AVERAGES= 8
##.DIGITISER RES= 18
##SPECTROMETER/DATA SYSTEM= spect
##.PULSE SEQUENCE= zg30
##.SOLVENT NAME= CDCl3
##.SHIFT REFERENCE= (INTERNAL, CDCl3, 0, 15.7039)
##AUDIT TRAIL= $$ (NUMBER, WHEN, WHO, WHERE, WHAT)
$$ ##TITLE= Audit trail, XWIN-NMR		Version 3.5
$$ ##JCAMPDX= 5.01
$$ ##ORIGIN= Bruker BioSpin GmbH
$$ ##OWNER= she
$$ F:/spectra/data/she/nmr/H-F/1/audita.txt
$$ ##AUDIT TRAIL=  $$ (NUMBER, WHEN, WHO, WHERE, WHAT)
(   1,<2019-07-03 15:56:02.68 +0400>,<she>,<DPX200>,
      <created by zg, POWCHK disabled, PULCHK disabled
       configuration hash MD5:
       00 E9 B6 7A A2 85 ED C7 34 08 36 98 17 FE 4E 26
       data hash MD5: 16K
       1F 93 21 AF 7D 29 4A 2B C9 A0 CA E4 39 9B 21 0B>)
$$ ##END=
$$ 
$$ hash MD5
$$ 3B E4 F8 D1 5B 59 16 B3 9A AE 8C E7 10 45 C8 71
##$RELAX= 
##$RELAX= 
##$RELAX= 
##$RELAX= 
##$RELAX= 
##$RELAX= 
$$ Bruker specific parameters
$$ --------------------------
##$DU= <F:/spectra>
##$EXPNO= 1
##$NAME= <H-F>
##$PROCNO= 1
##$TYPE= <nmr>
##$USER= <she>
##$AMP= (0..31)
100 100 100 100 100 100 100 100 100 100 100 100 100 100 100 100 100 100 
100 100 100 100 100 100 100 100 100 100 100 100 100 100 
##$AQSEQ= 0
##$AQ_mod= 1
##$AUNM= <au_zg>
##$AUTOPOS= <>
##$BF1= 200.13
##$BF2= 200.13
##$BF3= 200.13
##$BF4= 200.13
##$BF5= 200.13
##$BF6= 200.13
##$BF7= 200.13
##$BF8= 200.13
##$BYTORDA= 1
##$CFDGTYP= 0
##$CFRGTYP= 5
##$CHEMSTR= <none>
##$CNST= (0..31)
1 1 145 1 1 1 1 1 1 1 1 1 1 1 1 1 1 1 1 1 1 1 1 1 1 1 1 1 1 1 1 1 
##$CPDPRG= <>
##$CPDPRG1= <>
##$CPDPRG2= <>
##$CPDPRG3= <>
##$CPDPRG4= <mlev>
##$CPDPRG5= <mlev>
##$CPDPRG6= <mlev>
##$CPDPRG7= <mlev>
##$CPDPRG8= <mlev>
##$CPDPRGB= <>
##$CPDPRGT= <>
##$D= (0..31)
0 1.2 0 0 0 0 0 0 0 0 0 0.03 0 0 0 0 0 0 0 0 0 0 0 0 0 0 0 0 0 0 0 0 
##$DATE= 1562154961
##$DBL= (0..7)
120 120 120 120 120 120 120 120 
##$DBP= (0..7)
150 150 150 150 150 150 150 150 
##$DBP07= 0
##$DBPNAM0= <>
##$DBPNAM1= <>
##$DBPNAM2= <>
##$DBPNAM3= <>
##$DBPNAM4= <>
##$DBPNAM5= <>
##$DBPNAM6= <>
##$DBPNAM7= <>
##$DBPOAL= (0..7)
0.5 0.5 0.5 0.5 0.5 0.5 0.5 0.5 
##$DBPOFFS= (0..7)
0 0 0 0 0 0 0 0 
##$DE= 6
##$DECBNUC= <off>
##$DECIM= 24
##$DECNUC= <off>
##$DECSTAT= 4
##$DIGMOD= 1
##$DIGTYP= 9
##$DL= (0..7)
0 120 120 120 120 120 120 120 
##$DP= (0..7)
150 150 150 150 150 150 150 150 
##$DP07= 0
##$DPNAME0= <>
##$DPNAME1= <>
##$DPNAME2= <>
##$DPNAME3= <>
##$DPNAME4= <>
##$DPNAME5= <>
##$DPNAME6= <>
##$DPNAME7= <>
##$DPOAL= (0..7)
0.5 0.5 0.5 0.5 0.5 0.5 0.5 0.5 
##$DPOFFS= (0..7)
0 0 0 0 0 0 0 0 
##$DQDMODE= 0
##$DR= 18
##$DS= 0
##$DSLIST= <SSSSSSSSSSSSSSS>
##$DSPFIRM= 0
$$ [...]
##$SUBNAM2= <"">
##$SUBNAM3= <"">
##$SUBNAM4= <"">
##$SUBNAM5= <"">
##$SUBNAM6= <"">
##$SUBNAM7= <"">
##$SUBNAM8= <"">
##$SUBNAM9= <"">
##$SW= 24.9336996594482
##$SWIBOX= (0..15)
0 0 2 0 0 0 0 0 0 0 0 0 0 0 0 0 
##$SW_h= 4990.01996007984
##$TD= 16384
##$TD0= 1
##$TE= 0
##$TE2= 300
##$TE3= 300
##$TEG= 300
##$TL= (0..7)
0 120 120 120 120 120 120 120 
##$TP= (0..7)
150 150 150 150 150 150 150 150 
##$TP07= 0
##$TPNAME0= <>
##$TPNAME1= <>
##$TPNAME2= <>
##$TPNAME3= <>
##$TPNAME4= <>
##$TPNAME5= <>
##$TPNAME6= <>
##$TPNAME7= <>
##$TPOAL= (0..7)
0.5 0.5 0.5 0.5 0.5 0.5 0.5 0.5 
##$TPOFFS= (0..7)
0 0 0 0 0 0 0 0 
##$TUNHIN= 0
##$TUNHOUT= 0
##$TUNXOUT= 0
##$USERA1= <user>
##$USERA2= <user>
##$USERA3= <user>
##$USERA4= <user>
##$USERA5= <user>
##$V9= 5
##$VALIST= <valist>
##$VCLIST= <CCCCCCCCCCCCCCC>
##$VD= 0
##$VDLIST= <DDDDDDDDDDDDDDD>
##$VPLIST= <PPPPPPPPPPPPPPP>
##$VTLIST= <TTTTTTTTTTTTTTT>
##$WBST= 1024
##$WBSW= 4
##$XGAIN= (0..3)
0 0 0 0 
##$XL= 0
##$YL= 0
##$YMAX_a= 568783
##$YMIN_a= -607743
##$ZGOPTNS= <>
##$ZL1= 120
##$ZL2= 120
##$ZL3= 120
##$ZL4= 120
##$ABSF1= 10
##$ABSF2= 0
##$ABSG= 5
##$ABSL= 3
##$ALPHA= 0
##$AQORDER= 0
##$ASSFAC= 0
##$ASSFACI= 0
##$ASSFACX= 0
##$ASSWID= 0
##$AUNMP= <proc_1d>
##$AZFE= 0.1
##$AZFW= 0.1
##$BCFW= 1
##$BC_mod= 2
##$BYTORDP= 1
##$COROFFS= 0
##$CY= 11.3945322036743
##$DATMOD= 1
##$DC= 2
##$DFILT= <>
##$DTYPP= 0
##$F1P= 18.9103706918063
##$F2P= -1.10871071338519
##$FCOR= 0.5
##$FTSIZE= 0
##$FT_mod= 4
##$GAMMA= 1
##$GB= 0.15
##$INTBC= 1
##$INTSCL= 1
##$ISEN= 128
##$LB= 0.24
##$LEV0= 0
##$LPBIN= 0
##$MAXI= 10000
##$MC2= 0
##$MEAN= 0
##$ME_mod= 0
##$MI= 1.114404
##$NCOEF= 0
##$NC_proc= 0
##$NLEV= 6
##$NOISF1= 3.799351
##$NOISF2= 2.8
##$NSP= 1
##$NTH_PI= 0
##$NZP= 0
##$OFFSET= 15.70392
##$PC= 1
##$PHC0= -8498.476
##$PHC1= 13.60097
##$PH_mod= 1
##$PKNL= yes
##$PPARMOD= 0
##$PSCAL= 0
##$PSIGN= 0
##$REVERSE= no
##$SF= 200.130013532006
##$SI= 16384
##$SIGF1= 3
##$SIGF2= 2
##$SINO= 400
##$SIOLD= 16384
##$SREGLST= <1H.CDCl3>
##$SSB= 0
##$STSI= 0
##$STSR= 0
##$SW_p= 3612.71676300578
##$SYMM= 0
##$S_DEV= 0
##$TDeff= 0
##$TDoff= 0
##$TI= <>
##$TILT= no
##$TM1= 0
##$TM2= 0
##$TOPLEV= 0
##$USERP1= <user>
##$USERP2= <user>
##$USERP3= <user>
##$USERP4= <user>
##$USERP5= <user>
##$WDW= 1
##$XDIM= 8192
##$YMAX_p= 0
##$YMIN_p= 0
$$ End of Bruker specific parameters
$$ ---------------------------------
##NTUPLES= NMR FID
##VAR_NAME=  TIME,          FID/REAL,        FID/IMAG
##SYMBOL=    X,             R,               I
##VAR_TYPE=  INDEPENDENT,   DEPENDENT,       DEPENDENT
##VAR_FORM=  AFFN,          ASDF,            ASDF
##VAR_DIM=   8192,          8192,            8192
##UNITS=     SECONDS,       ARBITRARY UNITS, ARBITRARY UNITS
##FACTOR=    0.0002004,     1,               1
##FIRST=     0,             0,               0
##LAST=      1.6414764,     0,               0
##MIN=       0,             -607743,         0
##MAX=       1.6414764,     568783,          0
$$ Real data points
##PAGE= N=1
##DATA TABLE= (X++(R..R)), XYDATA
$$ [...]
2237f670l12J1384p47j1065K078J0553k876j0656M203J0503m640r479N707R402
2251G385o450q119P166P896p196o365Q033O083q833n454R243N053r137l878Q993
2266D420K203r656j556R976J225j0139j408R187o75q656J610Q882k878r563K507
2281d521Q770k813p991L802O866n089o886N692O806n592o042N789N146o578m245
2296f886P378M347o953l212O948K670p533j349Q311K089p826r22P181M3o667J693
2312f88P579j694p689J439O835j422n832L135N170m715o349M344N817m062n183
2327c315L679L022n564l224N628K939n862l519M760J887n270j005N738J115o188
2342e179o36N381N85m578P68N873p17n168J096N339n87l882K493M287k696m368
$$ y = [-6670, -6982, 4402, 3655, -7410, -5332, 5221, 2345, -8311, -4108, 6395, 1755, -7724, -2017, 7385, 935, -7184, -18, 7878, 682, -5683, 2350, 8433, -400, -5854, 3389, 8442, -695, -4573, 4420, 6623, -3033, -4589, 5387, 6612, -3527, -4935, 4252, 3577, -5079, -3469, 5413, 2535, -7028, -4521, 4249, 1436, -6555, -2753, 4113, -976, -7862, -2170, 4636, -956, -6998, -1209, 3937, -2641, -6886, 492, 4839, -2114, -5326, 1622, 4292, -3241, -4590, 3721, 5810, -2016, -2938, 4243, 4286, -2381, -688, 6891, 5197, -2492, -1053, 5782, 4360, -1472, 1663, 6833, 2118, -4231, 113, 5930, 1868, -3315, 364, 3386, -2178, -5402, 226, 3165, -2697, -6216, -1456, 431, -4839, -5844, -106, 1009, -5179, -5815, -434, 151, -4427, -3659, 2214, 1497, -3671, -2575, 2764, 2177, -1705, 788, 5075, 2379, -1989]
2358a989L019M455j901l089K304K181l668k262L974K677l619l159K510J119l271
2373g19n91L663K42m546j628L842O65l373J31K790j006l470O52L491m09l084J145
2390b205K762j552k577J984K541j389k110K012J665k060j420K475J872j923j266
2405a191J937O92k060p7K583P28k881n99K215O44j704M16J485n07k590Q21K157
2422B069j9j733r8J129q86j085J277J291j304j661N22J194o95r76P40N34j400
2439a101o09J111O94j300n89Q58K83o42j89R81k23r25J85J190P6j031K09O49M17
2458D4n38L89N18l63n20M05J119J3p25j33N88N7JL03N04q98k38O00O07k13m43
2479A077j61P5l16J88N72k96o25m94N22j03r5j09j91l66m08J60M16No36m69N11
$$ y = [-1989, 1030, 5485, 3584, 495, 2799, 4980, 1312, -950, 3024, 5701, 2082, -1077, 1433, 2552, -719, -1310, 2353, 2595, -1951, -3579, 263, 928, -2445, -2314, 476, -530, -4000, -3348, 143, -266, -3350, -2205, 557, -995, -3572, -1588, 953, -436, -2546, -534, 1131, -929, -2349, 126, 1998, 75, -1191, 746, 1438, -622, -699, 1884, 2612, -269, -868, 1347, 1991, 287, 703, 2188, 1681, -909, -88, 2069, 2050, 317, 219, 1348, 462, -623, 654, 1945, 641, -1020, -498, 696, 1, -975, -235, 299, -1101, -1710, -599, 95, -1205, -1794, -936, -653, -1295, -1484, -503, -726, -1651, -1466, -276, -200, -1231, -1022, -373, 44, -494, -105, 413, 50, -470, -65, 1054, 1067, 342, 209, 797, 854, 855, 1158, 1662, 764, 526, 1126, 1733, 1520, 1077, 916, 991, 675, 863, 1435, 1139, 514, 20, 542, 439, 344, 235, 44, -322, -730, -570, -154, -149, -785, -1254, -743]
2500g43j09J19j21n4l63j94K63N01o8l33j20R5N91p1L74k49Q3l8Q0N40J78j38
2522B23k59J82J78M52Q2j43m61l6M38M97l03j53q1k55J93j0L12l02m57o3K40M4
2544C18M0ol52k84r3K50L42k91k88l5J1j22L17R2o54m9j7M37K70n42p8J62k32
2567h04J27N83J70m20n58L06Q45j15j89O3K45m30O6P46L74m73k16K95L24k25J87
2588I01O5q5k98J59N59Np85k38O09J51l65L9R2p66q63O87P54l13p57j91L30n69
2610h79k75R70K39j335o76N95O63l72l84N45O3q00K9J176L87r83k48J051J73p85
2630h46L34J106k65r98R19J083m52j151P47J295l85r40P49M78j086m36J251J284
2648B687j507j345Q64N31j112K8J376j26j985r81J691P45j319n40R92l89j682
$$ y = [-743, -852, -733, -854, -908, -1271, -1465, -1202, -701, -769, -1102, -1222, -1127, -536, -607, -233, -482, -399, -437, -357, 183, 361, 223, -36, 146, 324, 776, 858, 715, 254, 218, 656, 1153, 850, 697, 616, 361, 554, 544, 856, 554, 97, 34, 274, 318, 358, 352, 0, -284, -377, -127, 215, -76, -364, -399, -388, -510, -193, -101, -755, -804, -821, -384, -114, -656, -734, -572, -804, -677, -94, 76, -344, -902, -596, 249, 134, -55, 8, 253, -177, -111, 635, 1009, 536, 320, 615, 939, 714, 901, 966, 881, 583, 742, 1301, 1306, 521, 283, 892, 1043, 678, 717, 809, 43, -820, -133, 621, 308, -449, -640, -310, -879, -1154, -184, 55, -1280, -1956, -1361, -698, -1070, -1454, -909, -846, -1646, -1617, -441, -54, -1037, -1285, -234, -61, -846, -512, 594, 329, -669, 250, 1333, 881, -270, 477, 1772, 1387, 447, 1196, 1674, 588, 152, 1403, 2687, 1180, -165, 699, 1230, 118, 146, 1522, 1396, -589, -1570, 121, 866, -453, -993, -1, -390, -2072]
2665b072N54J798m53j949P2J713p83j109J125J512j159j338J226J318j194j158
2681a897J550J763j427r35J455P41j566l54K607N89j996r80K070M20j385j57K059
2698B557n85k566M20K313k5k169M50J489j139j866J490J719j734k006J208J614
2714A170j575j458J558J174k067j185K205J185k536r48K641N50k216l82K191L49
2730F56k687L07K851r3k871J94K556l21k171J112J986j344k635J650K730j387
2746E33k240J268J828j800j586K481J742k526k013K496J678k009j192K725N18
2761A903k737l95L020M15k918k05K814o6k707K35L019r44k836J001K841j530k749
2778a839J130K791j732k234J579J892k493k013K843K045k758k185K624J432k361
$$ y = [-2072, -1518, 280, -173, -2122, -2050, -337, -1120, -2229, -1104, 408, -751, -2089, -863, 455, -739, -1897, -347, 1416, -11, -946, 509, 1250, -316, -670, 1937, 2526, 530, -450, 1620, 2040, 655, 498, 2557, 1972, -594, -174, 2139, 2114, -55, 395, 1884, 745, -1121, 369, 2088, 354, -1652, -444, 1170, -405, -1863, -305, 869, -1198, -2383, -178, 1007, -1529, -2477, 164, 714, -1502, -1884, 307, 656, -2031, -1724, 1127, 1034, -1837, -1643, 913, 592, -1579, -467, 1519, 175, -2460, -810, 1920, 533, -1707, -439, 1389, -411, -1997, 484, 2226, -300, -2313, 183, 1861, -148, -1340, 1385, 1903, -834, -1229, 1791, 2206, -712, -917, 1897, 1831, -876, -641, 2378, 1434, -1402, -401, 2440, 910, -1839, -709, 2082, 350, -1884, -305, 1587, -906, -2919, -76, 1969, -789, -2974, -350, 1082, -1279]
2793a279o67L059M23l256p15L603Q22k910j28K827n01k998J048L651p80l391M77
2810g15K931q83k765J730K347j915k712J892K550k105k401K346K012k942j723
2825b353K434J489k532j320K936J117l418q59L190M53k603j43K777o22l356O56
2841b154L694n6l607M23K535r25k437K024K566j701l420J521K809j180j620J857
2857C29J589k958j726L026K495k473j589K562P86k954j06L535O93l305q07L150
2873B247L3k765O68L199n80l646M02K869j136k437J370K709k230l416J282K815
2889A384j147k301K038R94l067k001L310K506k359k020J853L02k535M18L983O93
2905B051m008j339K757J015j841J057K965j379m164J044L798K21k613R79J866
$$ y = [-1279, -1946, 1113, 1536, -1720, -2435, 1168, 1990, -920, -1048, 1779, 1278, -1720, -672, 2979, 2199, -1192, -715, 2216, 1333, -1432, 298, 2645, 730, -1982, -90, 2460, 355, -2046, 300, 2312, -630, -2353, 81, 1570, -962, -2282, 654, 1771, -1647, -2506, 684, 1137, -1466, -1609, 1168, 546, -2810, -2154, 1540, 1484, -2123, -1700, 835, -90, -2527, -503, 2063, 362, -3058, -1537, 1272, 92, -1528, 329, 1918, -1040, -2766, 260, 2755, 282, -1307, 1255, 2041, -913, -1019, 2516, 3209, -96, -903, 2247, 2280, -485, 183, 3382, 2802, -844, -442, 2427, 1291, -1146, 224, 2933, 703, -2713, -1431, 1384, 237, -2064, -26, 968, -2099, -4100, -790, 1716, -643, -2663, -810, -508, -3043, -2625, 1358, 2051, -1957, -3296, -539, 476, -1365, -308, 2657, 1278, -2886, -1842, 1956, 2177, -436, 543, 2409]
2920B409j973k745K327L359j261k707J103J265k447j010K963K029k844k156J744
2935E6O33k083L85L163L46l689j873K614R49j553O01K465j790l726L22L854P65
2952A439k139M00P85k328j826K958L369j373l037K50J334j240m9L065J203k966
2968a55k567K046J874j031P2K199n15l382n56L109J272j784J03J490j330k612
2984a767R16L166J49k327k60J063j398j555K205K524j541k487R6J362j153k61
3000a268K484Q35k670k525J452K003p37p4J234p68k882L22K807J197j358r40Q59
3017b9o39j540J538K604m38k382j27J423j83q74J360J525j675j657R12J575p24
3034F69o58J465J79j488j207J390J059j155m23J291m34j672j83J802M35j078o50
$$ y = [2409, 436, -2309, 18, 3377, 2116, -591, 512, 1777, -670, -1680, 1283, 3312, 468, -1688, 56, 689, -1394, -1009, 2154, 2500, -1189, -3062, -448, 501, -1052, -451, 2014, 224, -3502, -3180, 674, 1439, -700, -300, 485, -1843, -3669, -711, 2658, 1285, -1752, -1502, -168, -1408, -1457, 1608, 2811, -155, -2722, -676, 1198, 167, 239, 2438, 1923, -1459, -2015, 1094, 2366, 582, 685, 2175, 845, -1767, -851, 2315, 2464, 137, -123, 940, -458, -2013, 192, 2716, 1175, -1312, -1216, 146, -1007, -1268, 1216, 2051, -619, -3144, -1692, 311, -426, -500, 734, -34, -2916, -2594, 213, 1410, 52, -888, -29, -668, -2208, -670, 1934, 1496, -886, -1013, 410, 227, -647, 713, 2238, 563, -1094, -182, 1393, 669, 11, 1476, 1655, 167, -1040, 350, 1409, 254, -169, 1122, 688, -984, -1167, 635, 1070, -8, -658]
3051f58N61l31j176J023J636o33j734J59Q89k73o59J386P76j451j449J293J367
3068G26m89p14N24J83p74l41J303O65q60p06N93N50j051L06Q80Oj225n3Q11P9
3088D13o49J09O45k42o78M03K68j76o65P29M89o20p17M18Q30K5p18M94K73r99
3108c68o0R06L63n90m52K73N1j30R4L79j22o11j66N08L01m11l54K81j6l73K76
3129b21N20l71o21L3L36J27j31N2K40l60j68N36K17k45k17M1L19R2k10M92m2m17
3151BJ15M29K60l32j40j9J20L5K51l9j04j94l27M19R3m26j65o4q7m3K4K69k56
3174a79o22m7K42J14j06j03j11k00J0N05r4j52k81Q7J23L20k7L41j80n7K08L12
3196A03L78q1p4m6K36L25J04l7M2j97J81P9Q2N4k7m49n6J48K61k19m15l34J95
$$ y = [-658, -97, -428, -1604, -581, 1055, 422, -1312, -1153, -264, -537, -1196, 190, 966, -485, -1934, -641, 726, 237, -477, 47, 230, -544, -885, 418, 1083, 223, -483, 110, 660, -391, -85, 795, 801, -424, -477, 334, 413, -236, -127, 518, 276, -402, 1, 269, 93, -572, 157, 646, 26, -691, -273, 557, 582, -136, 358, 631, -368, -428, 478, 841, 251, -201, 72, 123, -7, 87, 466, 344, -267, -433, 75, 376, -35, -389, -108, -124, -497, -221, 299, -72, -693, -660, -324, -197, -328, -276, -36, -396, -564, -28, 189, -56, -273, -232, 87, 179, -31, 461, 419, 2, 117, 546, 806, 474, 334, 315, 435, 470, 721, 682, 578, 384, 57, 476, 569, 143, -22, -86, -173, -216, -192, 77, -179, -801, -848, -606, -492, -598, -701, -812, -1012, -1002, -497, -591, -743, -1024, -937, -814, -494, -521, -180, -360, -417, -209, 103, 481, 400, 326, 280, 516, 841, 945, 908, 950, 753, 934, 1013, 1095, 1149, 1122, 673, 617, 765, 1026, 807, 392, 58, 253]
3219B53j6j29j63j70j81k16J40L4M8j47k73O4J79L96j87k07j06K81K03N7r0R6
3241a34qo4K39K84l52K20m38j5L42J13j07j23J7K0j06K71o4J18k80k36J16K37
3263E0j45L6j81K17Q6O2M8L2q8k72J75L13P2k6K3m06P5M45J73m01k99K9J1Q1p5
3288C5J81k42l05q7J64Q6j27l10J86j18j01L16J30k68o0j40L00K20j07j18R5L14
3310D4j98L30K97m18J06M3L81O7oj40Q1j76m4M87M9o08n0J74J76j65l4k4k39l83
3334b50j47M91J50o61j03K22l4j42J48K03O0o15J09O37j53m96R0M70j41k17J84
3355a95K14m16k7M42K25l00j55J87J67l86K40O23j92o16j72N48L87n13J2M19k44
3376B48n54J19P85J91q68j0L39o3l54K02P38o24n48L92K27j3m60M29Q9o67m0N34
$$ y = [253, 237, 108, -55, -225, -406, -622, -482, -448, -400, -547, -820, -756, -577, -181, -368, -575, -681, -400, -197, -140, -230, -134, -142, -206, 33, 317, -35, 185, -253, -268, 74, 187, 80, -43, -26, -6, -112, 159, 95, 213, -67, -303, -187, 50, -95, -59, -240, -23, 63, 125, 173, 205, 117, -155, 20, 333, 405, 379, 402, -4, 71, 516, 689, 288, -11, 18, 29, 110, 35, 216, -26, -331, -418, -254, -168, -295, -605, -419, -537, -638, -322, -192, -460, -520, -660, -360, -140, -247, -365, -270, 44, -154, 176, 473, 55, 161, 204, 585, 652, 646, 506, 587, 411, 367, 854, 903, 295, 245, 419, 595, 430, 396, 372, 133, -250, -397, 94, 244, -417, -520, -298, -332, -474, -326, -123, -63, -678, -569, 68, -85, -581, -491, -21, -162, -379, -195, 19, -397, -424, 18, 243, -57, -212, -25, 142, -244, -4, 619, 427, -189, -361, 187, 574, 61, 73, 492, 248, -306, -187, 598, 789, -79, -89, 250, 187, -167, 35, 773, 149, -399, -7, 220, 207, -253, 176, 265, -402, -442, 92]
3398I2l4l34l66N67M6n49l09O39M58n67j94Q31m29n31J5P79L27r11J97L71k24
3419a26l94O25N86l76q50J19R26j17k52M81J55o53k90Q00O27q01j78K06J01n50
3439C9K73O99q4p52m95P17L60n36o8N04k72q80p3R95k60m62j57M95m34q65M24
3460h32Q36m34n70N18J40r07l16J164M89p30n61L68J16j61K19J215j09r83p14
3479a252R53O12N7N04L25r49r95N68J289M62o89k13J55m75m06R43Q41l66j455
3498i1MK10k59O7R12K62j037j024K07O09l02j5N64l4j326m08R94O05n3j51L78
3519A12n74q62J19J464Q07p21k70J01p03l39J098J568k43j395l80K85o0oJ359
3538A360J55j049j298L2R29K93n5M23l90j395k69R53O53m07j36K91n33p69M00
$$ y = [92, 58, -276, -642, -75, -29, -578, -887, -248, 210, -357, -551, 280, -149, -680, -665, 114, 441, -470, -273, 98, -126, -520, 105, 691, 315, -535, -416, 510, 393, 141, 622, 777, 124, -166, 634, 1261, 460, 282, 488, 589, 39, 312, 1011, 927, 175, -320, 397, 757, 221, 153, 657, 385, -495, -568, 427, 167, -295, -452, 43, -391, -1256, -832, 4, -430, -1000, -482, -342, -1249, -1565, -401, 88, -642, -1203, -835, -719, -880, -661, 554, 445, -538, -1252, -299, 313, 370, 874, 1199, 250, -745, -177, 1112, 1574, 885, 672, 827, 352, -54, 889, 1730, 1364, -91, -87, 123, -136, -69, 843, 1105, 68, -956, -749, -140, -442, -457, 107, 73, -1253, -1661, -667, -62, -115, -266, 112, -462, -1324, -1205, 259, 1066, 345, 75, 176, -527, -866, 232, 1800, 1557, 162, -218, 67, 7, 1, 1360, 1515, 466, -832, -800, 129, 422, 367, 790, 400, -995, -1264, -311, 342, -65, -201, 90, -443, -1212, -812]
3557h12P96N28n64k39L46n52m99M56J458j7r74k83R5j56M6J023P45q72j565L39
3577g01M25J63L18M37l8j133o53M37Q86j35K2K20l25r40O1Q63N60l80j94K72l69
3598b04m50K55R11K59k41l05K12m40m33P18J037j00n40o51K10n44L49J098M05
3617A546p15j118k95M45J22N44M91n53j073o99O40O19J86j06j8n75j048K10J250
3636a47L57m94k70Rm56l11O73J012L06o84m37k04j60L83J214N63m91r46k74L43
3656a4R7R60P47k48j210p65M05P03M23K76m93p80r70J66J256M43l0q02m79n28
3676h43j71N12J157j83j010o94K22J06K91N87K32m75p98lM57J24M38L39k00n14
3696d26m39L20M73P07m4j20m07o35rJ100M07j26m16l78l13L2N97O85J12r51m07
$$ y = [-812, -16, 512, -52, -291, 55, -497, -996, -540, 918, 901, -73, -356, -261, -417, -371, 652, 1397, 525, -1040, -701, -276, -113, 205, 642, 604, -529, -1182, -745, 141, 6, 28, 248, -77, -1017, -956, -93, 467, 87, -107, 165, -204, -654, -399, 512, 771, 530, 225, 437, -3, -436, 282, 1319, 1219, 679, 28, 238, -306, 43, 1141, 1546, 831, -287, -582, -137, -15, 529, 1020, 467, -606, -1305, -665, -46, 140, 34, 16, -559, -1607, -1397, -147, 210, -284, -554, -545, -1001, -1312, -639, 373, 679, -5, -442, -646, -806, -423, 791, 1354, 863, -83, -357, -14, 83, 1043, 1790, 1542, 332, -433, -28, 675, 1098, 1374, 881, 101, -869, -703, 553, 996, 966, 164, -315, -843, -1014, -502, 655, 472, -538, -1232, -1010, -904, -613, -26, 206, -269, -1067, -1070, -613, -489, -51, 288, 88, -426, -865, -545, -72, 635, 591, 471, 64, -571, -580, 520, 927, 801, 385, 7, -306, -274, 323, 1008, 1120, 169, -238]
3717b38l6M73M23K68j3q16m42K0O97K00j05J63o35j85l14M54L83j20j36k03l75
3738e37N7j57L64L44l83m9j34k58k50L60K67M36n05k88K11J15q0M19N97k33o98
3759d02n9N19L51J55N6j43k99L6R6N05J49k80m07nJ55J47M5R6k45l63M9J71k38
3782H9J0J38l42n5k40K42j85J82l97L99l02k9j14%J92j57L83j92k04k38P2M92
3804b56J58M1k97J2K5J96L37J54j46l04j2R5L20J97J4k9k80j41N14q6R0o6k24
3827C12j29j7L83k07j01j79j3J96j50j59r0N6j73m7J36L2J6l82J08k0L44j47k83
3850e14N4J35J11R8n4J17j64P2J53J69Mj53l9P9O4J46J33l42O2j46K71O5J74l96
3874I9k84p3J28J39K03l10k2j20o4R3J51r0j07J43j30L08N4j63O7J02m4o6K89
$$ y = [-238, -274, 199, 622, 890, 877, 61, -381, -361, 336, 536, 431, 594, -41, -226, -540, -86, 297, 177, 41, -162, -537, -480, -637, -273, 71, -312, -361, -495, -753, -1003, -643, -376, 60, -445, -733, -522, -407, -487, -68, 529, 296, -402, -461, 58, 409, 564, 620, 477, 178, 214, 310, 815, 964, 684, 277, 272, 427, 574, 619, 715, 470, 107, 156, 327, 89, 99, 237, -105, -160, -400, -158, -343, -161, -558, -159, -461, -490, -604, -604, -412, -569, -186, -378, -582, -820, -748, -256, -98, -57, -354, -342, -317, -121, 216, 370, 224, -80, -92, 3, 323, 520, 534, 505, 225, 84, 598, 512, 602, 536, 312, 183, 166, 549, 342, 241, 62, 49, 245, 95, -64, -154, -98, -271, -318, -182, -150, -134, -516, -408, -428, -84, -231, -514, -460, -325, -214, -116, -170, -53, -217, -145, 8, 177, 181, 28, -11, 68, 132, 278, 411, 69, 131, -15, 256, 321, 495, 99, -185, -258, -130, 9, 212, -98, -120, -240, -304, -211, -60, -150, -257, -114, -244, 64, 118, -45, 22, 124, 80, 14, 303]
3897C03p1q2l9KK96m6R6k82j64L5J70P7l18Q7l22L6J69j93k2l8k70k5L7K62j26
3922d28j12r3o8L98M3R7k19J59P3L91o1O7R4j67O9j2L73R6n0l58J55J80qj67K24
3947F76j45j05n9O1J29l37k53j68J59J24K6k76k17j64J52O6J09n1j01l12J22J52
3969d12J36k05K5m2PJ42L0J91k44P9J39L6J06M3Rl01L29K17j01J71l8l1J7J2M38
3994G53l03j7j74k8K41p6j17Om3p5K8J27J05l03k39k3J8M9J02j76p7j44N5J88
4018a23l6l51R3J7j7j63J63j18J69j67kK21J63l81L3L17J18K31k78L13l45KJ91
4041E0J84K54k89k3J81r8J78J02Pj19m40K62J60p6J4l0p3k69J19K01q9l41m6K41
4065F0P8k58o3K9k11J13j69L05J79l63l12M65j30l2J91J23l85M1K56K34r1m31
$$ y = [303, 232, 150, 111, 113, 409, 363, 459, 177, 13, 48, 218, 295, -23, 64, -258, -222, -53, -246, -268, -306, -576, -601, -564, -302, -428, -540, -633, -701, -303, -260, -163, -382, -223, -150, 241, 180, 247, 341, 174, 243, 231, 604, 700, 650, 292, 447, 627, 619, 452, 676, 531, 426, 367, 428, 557, 220, -33, -201, -42, 82, 108, -168, -385, -549, -397, -331, -222, -273, -374, -686, -564, -412, -276, -481, -456, -498, -491, -349, -319, -128, -372, -293, -154, -118, -12, 31, 40, -261, 68, 285, 184, 355, 317, 286, 303, 315, 753, 450, 433, 259, 231, 472, 396, 279, 285, 242, 167, 195, 322, 427, 124, -115, -138, -120, -71, 31, -145, -222, -366, -311, -123, -159, -510, -417, -400, -417, -580, -417, -535, -366, -533, -535, -314, -151, -532, -499, -182, -64, 167, -111, 202, -143, -141, 50, 234, 488, 199, 176, 357, 259, 437, 539, 546, 427, -13, 249, 409, 333, 347, 317, 244, -25, 94, 295, 206, -135, -181, 60, 138, -120, -183, -154, -365, -252, -421, -116, 63, -300, -612, -147, -277, -309, -118, 5, -380, -339, -83, 151, 60, -371]
4087c71K77j43J29P1K45j47M7k60J59L05J03l64K12J80m28O3K21M9k48j66K43
4108A77J7l3l2L59j03l69PK96j79j12J34Oo6j44k65J65j19R5J89N0m97k49J88
4131d85L30j7J11j5k95n59K12O12K81l65n6Kj2j87M07O70l03n85j25L40K63j7
4153B07J70K23m06l06Q5N16j5l3J62j65o07l27O86M20j99j48r3k2q96L02P34J41
4175D29l71m04K10k87k21M80Q35j77r58k15L2M87K58L74R7p38n83L27N17J69j62
4196I9J53j96o60q2Q85N44k92n96M9l43k43N02O51m1n37m92M13Jl94O95N64k44
4218D36r16j21N32K16k11P16J86n72q47M92O10K44j82P1l14n53j62Q10P55n37
4238F53n62J9o13j53M85Q00J62j078m96Q9K73M3K36N90n59q49j99P81O00m66J21
$$ y = [-371, -94, -237, -108, -37, 208, 61, 108, -152, 7, 312, 415, 51, 263, 443, 15, 78, 299, 348, 100, -66, 177, 194, 161, 129, 488, 385, 16, 23, 319, 140, 28, 162, 168, 102, -42, -307, -142, -261, -166, 23, 73, -424, -673, -485, -155, -172, -61, -76, -371, -930, -718, -106, 175, -190, -246, -244, -256, -443, -36, 634, 331, -254, -379, -39, 224, 207, 377, 600, 194, -112, -27, 489, 474, 441, 603, 438, -169, -496, 190, 610, 411, 263, 170, 148, -748, -446, 288, 429, 58, -346, -136, -423, -644, -164, 671, 494, -464, -679, -647, -160, 98, 472, 569, -169, -752, -425, 92, 261, 99, 252, 56, -604, -686, 199, 743, 451, -145, -96, -439, -682, -180, 471, 430, -107, -599, -186, -185, -579, 116, 680, 436, -480, -601, -69, 147, -64, 652, 838, 266, -581, -89, 521, 765, 583, 654, 340, -213, -375, 435, 1190, 653, 91, 110, -503, -656, -171, 629, 791, -287, -783, -694, -421, -378, -142, 448, -111, -960, -1159, -378, 222, -244, -123]
4259a23L99n60p57M54J001o6j17J14k25n21k46Q89J012m29m43k33j34k94N41R15
4279A177K65j095q85K21K27J53N75O05n82j392l44J024M18J0j16p3q52p86Q46
4298f04J182n8p52k82J1l20MP66Q24n69r24k3L94k49L97R58J26j062n85J22K99
4319c45J08O56O84o69j288l77J244P45L7K2M9j124q21P46J333L02n81o20l12m67
4339f78N3J447N61o07j157j61K25J0N26O46k70j087o05N55L26J73K83J43n47r34
4359a098N2J033J65M6r3J2o50p96P48J138r4l33l43nl82N9J221O25p76r35k00
4380f06L45K70M51P68j93j194p20O54R41L4m1k6n13p43K00Q03L78n17j89o2j64
4401a24l92M57Q26k63r70J10Q5M4m33N72N90n87m39K7M08l73J90N14o8n21l06
$$ y = [-123, 276, -284, -1041, -587, 414, 348, 231, 345, 120, -401, -647, 242, 1254, 825, 382, 149, 15, -279, 262, 1177, 1442, 347, -538, -317, -90, 63, 638, 1243, 661, -731, -1075, -51, 367, 377, 261, 188, -664, -1450, -604, 578, 520, -232, -514, -503, -823, -819, -53, 771, 202, -722, -745, -351, -600, -203, 755, 881, -181, -766, -644, -345, -237, 419, 1103, 434, -854, -1231, 13, 758, 795, 817, 866, -258, -1079, -333, 1000, 1302, 721, 101, -211, -678, -625, 822, 1383, 776, -381, -542, -317, -307, 219, 865, 595, -492, -1097, -542, -216, -43, 240, 383, -164, -1098, -1046, -13, 152, 198, 105, 117, -533, -1329, -581, 557, 463, 130, -213, -218, -600, -541, 680, 1305, 529, -406, -606, -261, 9, 460, 1228, 1035, -159, -879, -225, 716, 750, 709, 683, 170, -573, -373, 430, 808, 291, 102, 40, -124, -516, -59, 767, 504, -466, -356, -271, -227, -660, -88, 502, -85, -524, -497, -89, -462, -272, 242, 174, -347, -653]
4422f53M9P26o5M8L62l65p15J23P61L22n92R7K6k97j31N82M56m48n23M0M22O9
4444B94k14L34K64n30l77K96L26k90k3J28J92m41J5K58q2l64J39L35k9n43j49
4465d61L77J65k23j50M47k27m61M2N71K0k25j13K81p6j91K61M32k63o61L22L07
4486A74j41j45J97J03k99j2M15J7l78r1M42j01r9m0J80j30o8k9L07J20o51J05
4508a24J04NJ80M6K1l65j18J57L23r5k03r8P1%k01K33L40n12m8J92P2j42K85p8
4532D5j82j8p8K96Nk82k06K84Q4P7m4P2pl69K52L87l53j2q8J68j8L02J38o1m57
4557f5K7K93O8P7k99J91k24k40M79j6N7k37q8J54J46j59j13j28k44K0K14K33k26
4580h0j12q1P0l5K7J03j77Mk22L45J19j98Q8p4j45L16P8P3q8r4l9OK73q2K74k73
$$ y = [-653, -604, 122, 57, 105, 467, 102, -613, -490, 271, 593, 1, 98, 124, -173, -304, 278, 734, 286, -237, -197, 225, 294, 80, 414, 678, 148, -229, 67, 393, 103, 80, 208, 400, -41, -26, 232, 150, -214, -75, 260, 231, -312, -461, -84, 81, -142, -292, 155, -72, -533, -491, 80, 100, -125, -238, 43, -33, -224, 37, 469, 206, -455, -133, 174, 33, -112, 85, 188, -111, -123, 292, 309, -69, -160, 282, 181, 82, 42, 222, 92, 24, -5, 302, 422, -229, -124, -20, -15, 165, 211, 232, -133, -251, -94, 229, 134, -69, -167, -96, -96, -297, -64, 276, -236, -284, -92, -20, -162, 123, 45, -137, -155, -233, 63, 68, -214, -420, -136, -52, 25, -19, 53, 46, -323, -71, 316, -37, -49, -137, 31, 13, 315, 453, 392, -65, -38, 255, 323, 400, 101, 292, 68, -172, 307, 291, 348, 111, 23, 177, 323, 164, 51, -77, -321, -301, -87, 146, -80, -192, -273, -203, -238, -211, -108, -285, -281, -503, -158, -39, -237, -149, -223, -368, -52, 26, 99, 11, -83, -122, -116, 157, 75, 349, 76]
4606G6L0J14K5R4o9k31q1L62K09k39j01M3o9K3Q8O3r9j89L6k48L18Oj29n6o1N
4632h0p0K98j17nk46P8N2n5J45k07j34J2K96m1n9j90LK90j17K46n6lj83Q3J4J48
4658A02l3j95R4P6J38L1K09l04k2O5Jn6Q7R9p0j40K23K33l4m54j04J97k54L37
4682B26j09j60j77r6L17o9J6r5k70J33r2K62J75k76k11J05l3K02JL0Rj31J91O
4706d6J78j61o5j63J86J66K88k65Mn2j53M54L8n6j26l39K19J14r7O2J0j65j34
4729a03K01J89k49j03k23L15m4j89J13R9j34k04L19K03j79J52k58lJ0J16J68j39
4751E7k25p3J30J68j80P4j54o6J10K04J18n00M9P1K40j86K40j22j50N6j39L65
4773H7J25k37O0J7m0K48p8q0J84l68J05L62j0l42j5J46j7j04J54M2n1n25J71O38
$$ y = [76, 106, 220, 245, 339, 270, 39, -42, 320, 529, 290, 189, 232, 163, 186, 274, 337, 238, 49, 85, -163, 155, 161, 32, -24, -85, -80, -150, 148, 31, 26, -220, -142, -90, -145, 0, -207, -341, -329, -33, -74, -133, -323, -320, -30, -147, 99, 43, 40, -143, -60, -46, 102, 69, -126, -32, 44, 182, 213, 422, 118, 96, 161, 162, 106, 193, 292, 222, 82, 305, 538, 504, 50, -54, 143, -111, 226, 117, -43, -220, -316, 1, -68, -52, -147, -417, -284, -376, -114, 61, -215, -426, -321, -354, -152, -151, -121, -112, -243, -52, -46, 132, -29, -94, -257, -71, 95, 383, 118, 122, 70, -83, 371, 409, 353, 227, -112, 107, 221, 124, 186, 196, 31, -103, 98, 287, 38, -65, -288, 27, -17, -206, -93, 6, -128, -332, -13, 190, 11, 163, -95, -98, -88, 28, 196, 57, -168, -241, -111, 57, -123, -49, -203, -269, -159, 45, 163, -337, -288, -217, 23, -163, 77, -45, -195, -139, -278, 87, 212, -25, 35, 52, 12, 260, 182, 102, 286, -82, 23, 385, 375, 33, 18, 164, 147, 43, 197, 239, 188, -337, -166, 472]
4797D72k15m88R6j9J11j74M9L74m24k22K66K14j78j90j5J24j90p2N15L29p05Q7
4819b55R4P7r1J90M01k97m48N1M14J27l88J73J64j74j42J66L08j13l90L48M14
4840F29p97j48M99L82l18j74J40k8m31J56M86K57n65m05K16J70j07K03M04m09
4860A60o05O1L64K7p1K24j59l53m74N93O29k18k14j12ln26J47P10J70n20k25p0
4882d65L14p4J51M55L9o95q0N13M0j49m3P31p18l35L9M56K09l05M19J87o05o91
4904f07L76P86O3n24l5o8k93k55Q85K60l98l94j14J73k60p6P33J86q79l22M74
4925b89L18l77J72M72l47n21M3N27j5k76N69J31m03n38L65M87o8k84L88J41n08
4946a3m22O64N30l37n48L37J67n27R8O23O07r30n45L57K18k61J68M52j91p92L7
$$ y = [472, 257, -231, -135, -154, -43, -217, -168, 206, -218, -440, -174, 40, -138, -328, -343, -219, -409, -481, 34, 363, -342, -255, -161, -84, -175, 15, 416, 119, -329, -278, 136, 263, -125, 48, 212, 38, -104, 62, 370, 257, -133, 215, 629, -168, -316, 183, 565, 247, 73, 213, 185, -246, -90, 396, 653, 88, -317, -101, 69, -38, 165, 569, 160, -445, -384, -20, 7, -64, 160, 1, -352, -826, -233, 396, 178, -36, -148, -151, -677, -530, 180, 350, -170, -395, -465, -151, -225, -74, 381, 420, -275, -355, 158, 198, 49, 6, 737, 19, -316, -277, 179, 388, 83, 502, 689, 84, -607, -231, 555, 618, 94, 59, -9, -302, -557, 328, 588, 190, -204, -318, -145, -405, -481, 252, 438, -441, -763, -289, 29, -348, -176, 296, -51, -572, -529, -2, -17, -293, 276, 407, 4, -534, -169, 318, 250, -34, 354, 495, -13, -435, 229, 759, 422, -126, 211, 378, -149, -51, 572, 1179, 249, -296, 61, 279, 18, 186, 638, 447, -345, -308]
4967c08L83j27p6J71K53l89m87J13N13l56l66O84Q5l84l77M25J03j84J9M30p3
4988E2q36N3P70N14l00j79K71l79l14N14N07J98o43m03K77k18P4N18M27o86p66
5009e49M08M48m1k09M30n8p74k81M09K48P8j61K37j16o96j21O03N18l30j26J44
5030F1m00m33L35Q11M62r69k03n9J34k9O25N69o46o56k89N93J83J4K81J88r73
5051d01m23N94P92l04k2l2r8o80R7R16J92m81m04M65k29l83K36P65j36n26k29
5072b91M63j77l41L66N56m04n48j18N13q5m0L91K91o72o46M94M90j93M1M4k11
5093g7o10jR41J61k23o64N17o6l24L24O63n33l72k19O13j4l02M40K01l01n92L45
5115i3L62k73L6J15K96k76m61K53K97k10%K87J3n71k38N77J80k44k14L02o8m42
$$ y = [-308, 75, -52, -128, 43, 296, -93, -580, -467, 46, -310, -676, 8, 93, -291, -668, -243, -140, -324, -305, 125, 52, -784, -731, 39, 553, 253, 74, 345, -34, -348, 166, 673, 871, 228, -175, 102, -116, -42, 476, 903, 217, -549, -141, 307, 266, 57, 487, 429, -345, -626, -217, 31, 109, -52, 185, 69, -627, -748, -145, 373, 43, -83, 61, -339, -772, -437, 374, 836, -133, -336, -395, -261, -290, 335, 904, 258, -398, -687, -94, 89, 103, 384, 572, -401, -824, -230, 562, 258, 236, 204, 106, -574, -477, 439, 631, 150, -254, 211, -18, -401, -165, 600, 464, -62, -291, 172, -5, -346, 20, 576, 172, -376, -494, 19, -66, -106, 285, 576, -96, -742, -248, 242, 49, 90, 134, -77, -687, -688, 253, 414, 191, -473, 44, -22, -346, -22, 641, 108, -264, -483, 130, 116, -186, 254, 455, 154, -438, -93, 269, -4, 32, 147, 443, 167, -294, -41, 256, 46, 46, 333, 346, -225, -463, 114, 294, 50, -164, 138, 70, -372]
5137c72Q5M57k8m31j50L72J27l62M06J64l30n71L71M03n0m15J13J24j75j22M11
5158B7M9m07L9L65J35l82j9M04L0m65R8L59J9l86MK70J67k26j17R1J02j92J61
5181A26K71j54j88m4J33j44J3J20J52l51j68M27L1k42j30Q9J76p7r8L36P2n85
5203b35n5M68J7m59K3K14j0k72K50K87k89l57J35R7J77l03K29J07j19l8K20J18
5225B05k60k21J17K34j8P2j16J75m96K92J81K7r9k0N9k6j12O2K90j87k22m3M26
5248C20j42j52n0J60j59k18K33K26k83k61K26K39j79l18K19m5j39N8K01O4l52
5269c52J28M0R6n8Q3J51j47K0OP8J32j43M0J85j38J96m2q7l2r0J40J38j84J21
5293B81j41J40M7k94L33j92k34N1o1J27k3j17j06K6J64q1J2%k20OL3R1k2O4j8
$$ y = [-372, -287, 170, 142, -289, -439, -67, 60, -302, 104, 268, -62, -633, -262, 141, 91, -324, -211, -87, -262, -384, 27, 76, -331, -292, 73, 208, -174, -193, 211, 241, -224, -126, 233, 252, -134, -130, 140, 307, 81, -36, 55, 157, -35, 126, 397, 243, 55, 11, 144, 0, 13, 133, 285, -66, -234, 193, 224, -18, -148, -59, 117, 40, -58, 278, 350, -235, -290, 178, 195, -264, -241, -27, -37, -309, -59, 228, -61, -418, -283, -186, -9, -312, -83, 24, -95, -133, 87, 205, -55, -276, -159, 75, 57, 129, 13, 188, -308, -16, 165, 192, 93, 73, 132, 106, -6, 56, 346, 159, -63, -106, 320, 178, 26, -24, 136, -23, -241, -8, 218, -65, -326, -100, 139, -40, -358, -139, -184, -323, -265, -64, 0, -352, -224, -184, -88, -146, -63, 88, -59, -39, -33, 45, 177, 34, 74, 259, 121, 317, 275, 188, 156, 66, 206, 344, 160, 281, 140, 280, 327, 33, 366, 174, -60, -9, -70, 57, 34, -83, -189, -163, 1, -80, -68, -68, -288, -282, -249, -158, -180, -116, -134]
5318a34lk61J68P4O5k21P7K46k35M0R6J90l51P0J39k0R5j38q5K15o6n0L11L3k31
5343B4K09j7lj21O4J7J8k23PK65l3j25P4L8m9o0J87k87p4J19J17q2j73p2M9O4
5369f7j04m1kJ14j88J48j77K89j24L6j13J01N8J0p3k6J2R7o8J72j59O1J26J35
5393B17j86L8J26j8NJJ25k15R2J08p5p2K8M9N6k7k32J45J49k10j33o9J26k3n4
5418d9J5J14j36q7j1Lj12oQ6p3n9o2L63j5l8Kk79J57m1k7L81j45j55J56J33o7
5444D8%J2R1j5j85K67oj71K06j60m9K14j50j7k2j83J62J13q0q8j73Q8J16m7K76
5469B47j40m05J0K69J7K39l60M1R8j78J9J75Ok47k47K74K60k11J33J64j22j68
5491a26k8K22j12j67P4L21p4k35K95j91L0lK74M4k03j54L1L41p2k01J36M2m00
$$ y = [-134, -137, -398, -230, -156, -91, -312, -235, 11, -224, -184, -88, 102, -249, -179, -40, -60, 35, -103, -188, 27, -39, -89, 222, 255, 24, 233, 216, 213, 92, 156, 173, 191, -32, -25, 240, 207, 82, 156, 194, 145, 85, 272, -15, -89, 30, 147, 65, -108, -180, -131, -67, -171, -212, -214, -100, -288, -140, -317, -28, -152, -116, -229, -128, -70, -60, -133, -159, -147, -50, -118, 54, -105, -44, 82, 217, 31, 69, 195, 177, 182, 183, 308, 93, 185, 293, 218, 146, 174, 223, 279, 252, 20, 165, 314, 104, -29, -98, 28, 5, -49, -34, 80, -56, -143, -154, -151, -263, -269, -183, -256, -315, -377, -14, -29, -67, -65, -344, -187, -228, -255, 126, -19, -174, -18, 115, 48, 48, 60, 151, 136, -49, 218, 212, 41, 247, 87, 38, 252, 102, 85, 63, -120, 42, 155, 75, -13, -186, -98, 18, -29, 247, 107, -298, -288, -19, -2, 237, -123, -82, 16, -162, -143, 32, 38, -209, -456, -182, 78, -133, 0, 164, 42, -126, -154, 68, -44, -211, -137, 184, 110, -125, 170, -21, 9, 6, 280, 324, 121, -33, -2, 339, 267, 66, 202, 244, -156]
5514a56l30P89K03n69j36M40q9m14J19K99N2n79J3M26j5j75J9K78m04k38M24K88
5536B45k89k42J12K27m7k84L14N2j47j02J58J51m13J75J46J86m10q9L55j39j68
5557b09o9N87r2l06m5L68r4k98J82L74l27m81L77M74j50k07j9K15l87K03K76J52
5579E24m59l04M85K01o16J00L05L6n09k13N64M40o99j67N31l7n52K6M82k7m72
5600c61O5L41n0m28K54N21k56n77J36P12o93M9L16N17o64j73J56N00l38j60O66
5621E33k00o59J23N84N9n86p6N48o7p11K88O69j89o03P0M60k13l23O0P82p47l19
5643e17J58O52l18m51M19M41m48l64M26L25n35l05N59L68n33j80K40K80m54o3
5663c00N53q4o06J79P78k39m46K27P6M6n94L45N79k82o72M61L13q2m92L75J43
$$ y = [-156, -486, 303, 506, -63, -199, 241, 152, -262, -143, 156, 208, -371, -358, 68, 53, -122, -103, 175, -229, -467, -43, 245, -44, -286, -174, 53, 6, -278, 36, 88, -59, -161, -3, 148, -265, -90, 56, 242, -168, -257, 98, -41, -209, -278, 309, 217, -89, -134, 234, 140, -158, 24, 398, 71, -410, -33, 441, 291, 84, 65, 280, -107, 96, 372, 524, 65, -239, 246, 447, -169, -69, 236, 272, -237, -450, 114, 554, -145, -312, 219, 182, -370, -344, 138, 111, -361, -296, 45, -5, -433, -179, 342, 86, -491, -355, 357, -336, -287, 29, 546, -118, -291, -135, 365, 27, -133, 533, 333, -326, -203, 381, 440, -146, -222, 326, 259, -452, -164, 505, 316, -287, -217, 243, 30, -293, -233, 549, -198, -517, -359, 293, -25, -476, -57, 384, -64, -428, -2, 323, -212, -517, 42, 410, -123, -303, -63, 217, -237, -300, 253, 169, -437, -258, 520, 281, -165, 62, 138, 184, -410, -65, 514, 232, -440, 21, 334, 252, -240, 135, 278]
5684B78l17n09N86M55o27j51L70K14m67k6N29R9p57O5O80O8q66J87P72m95m73
5705c85K03M78j64o80L74N96k78m57K31K21k70l15M95K52m13o21P28L18o43K2
5725c08K12L24m60j25N60J74l76j94N60l9n93J00P09k46n08K26N74j82p38K43
5745h7O49l61m09R3N54l41n62L76N16k37o09L64L08l43k74O68j01n27o4M40J92
5766B45m89k44N56Mm53n0P07j92m00J72L87j59m27J44L86j23m48J65O80l65l36
5787b40J21M64j88l83K35K37l67j61N31O9k72j79K50J88k61k93M85k5m37rO02
5808C67N6l43l57N13o8n41K24N55m48k34LN45l95j48L25J40j28n12M05K48k44
5829c7m00L11L90l26k88K55N0N9j04K39K62n90k0L10J75rl63M52k47m74K68M60
$$ y = [278, -39, -548, 38, 493, -134, -285, 85, 299, -168, -194, 335, 434, -323, -258, 422, 490, -376, -189, 583, 88, -385, -182, 296, 132, -548, -174, 422, 144, -313, -82, 139, -131, -446, 49, 301, -112, -733, -5, 313, -330, -308, -96, 228, -232, -357, 203, 377, 1, -193, 367, 328, -265, -165, 544, 298, -210, 16, 590, 408, -330, -87, 562, 201, -208, -115, 439, 98, -464, -88, 428, 191, -418, -54, 254, -89, -363, 305, 204, -323, -387, 53, 245, -244, -488, 68, 72, -381, -431, 276, 84, -316, -144, 243, 84, -343, -199, 187, 64, -384, -219, 461, 96, -240, -119, 345, 157, -226, 9, 246, -121, -282, 249, 318, 46, -133, 117, 305, 44, -249, 236, 211, -226, -235, 367, 423, 80, -277, 236, 168, -373, -149, 406, -42, -276, -273, 272, -123, -271, 54, 194, 66, -446, -41, 207, -37, -437, -126, 264, -62, -350, -95, -45, 14, -90, 149, 411, -179, -199, 111, 286, 277, -86, 366, 119, -355, -87, 373]
5851C73n8l45J7K23m84P7L64J50j54l78J77K71r2k14O2K83l44k27L76J74j88l05
5873b42K46L4k72N3Q3J65k70j90M42j02k93j16M34j39l54L62K13l07r0L48K69
5894B74l04l34J69M42p2m84K75K65k44k31M87J52k17q4N0lJ1KJ92j36k18O7N9
5917A18J01l86L00P0k43k28K05K11k44k73K97K02l16Q3N4J20l07j77J32L56j42
5938f7k08K34J56r6o6J73j35J02k83J79N9r8j02L55P2l73L08j90J81j60m8L99
5960C92m31M9J4m8j3N2M3J39k28k54L94p6k02L1J2K09k66n5K84k0j70j84L60j85
5984a53j21L29j2j12J25k44R7P9o4q5n1J52J93o0K15l71L8k1J54Oj1o4J67k02
6008a6j21J85K22l42q8K30m4rk4R5p2J04K4j20L7R5j85p7K91o1p9O7J1j39J09
$$ y = [373, 315, -30, -13, 210, -274, -197, 167, 317, 163, -215, -38, 233, 141, -73, -11, 272, -72, -299, 77, 251, 63, -242, 4, 38, -234, -181, -98, 67, -203, -393, 49, -53, -346, -462, -28, -167, -521, -159, 54, -253, -343, 5, 274, -30, -364, -195, 247, 175, -309, -34, 231, -13, -244, 243, 395, 178, 94, 144, 141, 152, 154, 346, 210, -8, 59, 118, 219, -167, 133, 203, -40, -268, -63, 148, -96, -369, -72, 130, -186, -103, -49, 71, -236, -413, -281, 75, -67, -275, -41, 115, 19, -47, 126, -9, 93, -190, -11, 48, -50, -152, 203, 275, -98, 210, 20, 201, 41, -7, 392, -39, 10, 24, -24, -37, 15, 58, 197, -31, -285, 109, 33, -169, -138, -126, 83, -183, -238, 46, 26, -144, -328, 32, -153, -274, 55, 43, -69, 56, -188, -91, -12, -76, -161, -212, -60, 133, 73, 288, -83, -45, -66, 88, 94, 83, 19, 186, -16, -137, 48, 270, -72, -160, 70, 26, 17, -7, 88, 16, 120, 144, 24, 61, 156, -29, -106, 185, 124, 45, 112, 123, -16, 93]
6033I3N4m6k52K09j26K06p3j13J69j50q0J17k8%j14R2p0q1K04o8J6j25j82J43
6057b05K48P3j84K23j40k30J66K55j18j43r5J49R6O3J1r4j06R3j15K64j80p9p7
6080a25K44n1j28K41o0l7Qkj22k9q8J30J17j26r9J23K31k03j14j08L27n4j27R3
6104D1j77l2K81n1n3j00l6N0j42L2K15P1k08J0Q4p7J46j06l8N3n5K77k57J68m7
6129D9o2J38n5J2j14m0K73n0m2J52j16k5K2j06L0J6k5J56l61K28j65K86k71K59
6153A89j5o3k75J68p9p1J13JoO2l09l9K31J18Nk60K95j60j35M8K01q5L6j82L50
6178A38k81j16Q4K63k04J42mJ64K8j08O6M2r1k9l8J2j0j02K09j09Q8n7k6n6j28
6203a23J84J01o8k27M5L74j64j29M8P6k37j11J23J63k21O4O5J37k56J15J81m6
$$ y = [93, 147, 101, -151, 58, -68, 138, 65, -48, 121, -29, -109, 8, -20, -20, -134, -42, -112, -193, 11, -57, -41, -166, -348, -205, 43, 116, -68, 155, 15, -215, -49, 206, 88, -55, -150, -1, 95, 158, 169, 75, -31, 62, -53, 211, 31, -48, -125, 119, 68, -60, 181, 121, 84, 92, 90, -32, -61, -149, -19, 98, -28, -127, -4, 227, 24, -90, -198, 129, 75, -52, 41, -136, -168, 113, 62, 9, -91, -127, -77, -219, -187, 28, 99, -109, -99, -15, -92, 54, -52, -90, -37, -92, 185, -72, 96, 49, -13, 125, 70, 82, -32, -72, 201, 151, 109, 261, 145, 120, 142, 36, 66, 82, 57, 213, -148, 80, -85, 201, -70, 189, 174, 111, -164, 4, -75, -146, -33, -32, -38, 24, -285, -324, -93, 25, 30, -230, 65, -95, -230, -182, 19, -66, -30, -212, 138, -143, -259, -175, 88, -116, 26, 22, 186, 214, 106, 172, 214, 123, 94, 56, 68, 58, -44, 165, 56, 144, 87, 61, 5, -123, 61, 162, 94, -133, -88, 286, 122, -7, 41, 117, -120, -231, -108, 55, -166, -102, -37, 100, -156, -41, 140, 94]
6225I4j81m8J17J07j97J22r3O3k83K11M3K28j63k81K14j13n8K72J30j97j48K67
6247A06J96k30j98K1K92k51L9K84j31k44%Q0L21k59k37J32j4k24J64M86l67j97
6269b31r5N34j24l75R5J98j0j95Q1L80j50n53K00L18j77j91K49J92j12k99M03
6290A38J86m51L4K65P1l25j35M57q8k39J19K99J71o25o7L45m1o6r9K41j18m45
6312c73P4P09p9m68j46M10j57k58M01K69l03m57L16R6j57j9K86K9m97q9N19J47
6334B53m41j55N35o7k93l2L84O8o92L25M11j18m91J77N76k86m68M32R0j47l83
6355c22M12M69l83n55O04Rk62q4N08J07m41j08J96K05n17J11Q0K40n31K26K86
6376B50l4n36J89L36o6m83J82M15l55l65M36K95j58m89M86l0j02j85L56Q1m00
$$ y = [94, -87, -135, -18, 89, -108, 14, -79, -16, -299, -88, -45, 183, 20, -261, -47, -160, -218, 54, 184, -13, -161, 106, 302, 72, -126, -105, 187, -64, -25, 259, 128, -116, -116, -36, 285, 26, -211, -79, -93, -317, -153, 333, -34, -231, -326, 208, 84, -291, -196, 2, -8, -203, -122, 258, 108, -445, -245, 73, -104, -295, -46, 146, 34, -265, 138, 324, -127, -93, 172, 243, -82, -217, 240, 152, -87, 32, 331, 502, -123, -190, 155, 114, 48, -51, 190, 72, -373, -299, 410, 331, -137, -283, 127, -30, -288, 113, 382, 79, -378, -62, 34, -123, -142, 144, 173, -324, -413, 106, 253, -188, -343, 192, 125, -168, -200, 184, 252, -440, -115, 296, 178, -313, -136, 440, 154, -314, 118, 208, 61, -322, 90, 559, 176, -379, 225, 234, -28, -112, 396, 503, 62, -46, 150, 355, -162, -51, 29, 269, -262, -36, 250, 216, -320, -131, 205, 139, -344, -162, 253, -102, -467, -31, 264, 106, -383, 103, 73, -29, -214, 142, 223, -177]
6397a77q9L48K43j89l64L52K21m94N2L29K0p18J12N15P6l57J12K30j74l96L99
6418E1M56k02q19N41K13j86m81M98K82l67k45L74J84m36j13L86J01k92k59M54
6438A40J47n66k33P96j61m38J76K94p1m04L69R7j53j28J22L42l04n04O12K30l00
6459F3m20L38K81j74l53M11R0l85J92J61K37o16O5K87J35k43l48M73j53j36j50
6480b45N20j34m24k2N12j72j16J48J87k39k51L68Rj96j94J93K86r9l19L37M3k81
6502h9j48M93Q4n47j26N94q6l18o1K30J33k80J19K25N3n62l9L76R6m66N51k5k99
6525i2nO0M45k84j17j0J60k22j86L09L21m12J9QK43k54r5L67j45k9k93L16K4l94
6549b66L20L32j10m30k00L31J3k14K65J10k25l06K06K5K95j48j18L76m73k04N98
$$ y = [-177, -266, 82, 325, 136, -228, 124, 345, -149, -97, 232, 252, -466, -354, 161, 237, -120, -8, 222, 48, -348, 51, 507, 305, -514, 27, 240, 54, -427, 71, 353, -14, -259, 115, 299, -137, -250, 136, 237, -55, -314, 140, 287, -279, -512, 284, 123, -315, -139, 155, 84, -320, 49, 146, -7, -135, -13, 329, 25, -479, 133, 363, 63, -357, -19, 262, 88, -265, 146, 236, -149, 43, 204, 441, -175, -110, 177, 312, 69, -279, 194, 41, -95, -245, 275, 141, -283, -305, 207, 35, -81, 67, 254, 15, -236, 132, 141, -55, -249, -56, 230, 131, -188, 149, 192, -89, -237, 256, 340, -207, -333, 261, 175, -143, -204, 26, 159, -121, -2, 223, 276, -286, -325, 51, 147, -319, 232, 207, -92, -97, -37, 408, 124, 7, -3, 157, -65, -251, 58, 379, -33, -14, -6, 237, -17, -112, 255, 110, 81, -212, 104, 128, -266, 54, 386, 276, -154, -354, -23, -10, -224, 41, 151, -74, -380, -174, -149, 146, -2, -120, 256, -217, -421, 177]
6570A77o4j41qj43L38j78J08MJ19q7l27M66j45l42L20J83k38j73J41L69k01j72
6592FK06J1k2j81Q3o0LK12n7q3k55j57L29L6K0k71J77M6k34J94k66L66n80K78
6616a99K19J42m62K43J2Mk31R3J23R7r3J8k2J07rq0K27R1j44p9J01j66o9mK63
6641A82J3Or6R4k68M9J15J13k00j28J80N3l7j21K44n2j29n8j27K60q1L2j66jL6
6666h7K5Q5k5j23k4l6O6k7L05o0j57J7o9K80p5j28J49j43l0n2M04k46j13R7J25
6691A58J03j75j7L1K08j95J11k46J9j67K94j16P9n2j87L11j78j1J3J14r1o6j7
6714g7m6J46J11q1j05j04p0K71Lk21j65J34O5O8q2K6J09j94J89rM4j40J80Jj9
6739C4j40K67j9j3l9r6J18Q7J23m07J2K5R7r2J09J96l08J11J07j07j53r2Q6J2
$$ y = [177, 113, -28, -36, -179, 159, -19, 89, 93, 212, 125, -202, 264, 119, -223, 97, 280, 42, -131, 10, 379, 178, 6, 212, 223, 201, 20, 103, 43, 46, 258, 201, 118, -137, -294, 35, 71, 91, -180, -3, 43, -191, 3, -263, 103, -477, -199, 20, 162, -300, -57, -45, -41, -272, -179, -56, 41, -52, -34, -56, 51, 42, -38, 189, 280, 136, 57, 158, -8, -77, -81, 182, 195, 201, 105, 199, -69, -20, 95, 208, 8, -120, 60, 113, 76, -45, 199, 147, 18, -40, -167, 93, 12, 44, -122, -123, -87, -62, 23, -2, -125, -149, -185, -119, -146, 159, 99, -58, -41, -110, 170, 95, -33, 116, -27, -57, -109, 295, 49, -64, 33, 158, 261, 86, 69, 100, 308, 113, 224, -22, -3, -170, 124, 8, 87, 35, -152, 159, -19, -30, -17, 97, 6, -60, -77, -123, 23, 134, 53, -52, -156, -226, 45, 48, -173, -338, -204, -139, -71, -153, -127, -18, -212, -23, -32, 12, -128, 52, 53, 34, -106, 161, 142, 129, 90, -6, 112, 199, 322, -85, -73, -48, 49, -43, 66, 262, -46, 65, 172, 65, -88, -180, -94, -82]
6763h2j9P3J12m0k94J77j35P1J45j00j40K1M04k32j41R0QM1J95j97R9l8o1j81
6787b24L05J31j7J02l20L5J06Q4k16K8O2l4j04J57J09j80J5j71R0J72j28O8l4
6810C6j10o9J91K3K7K25l50J56l3J43k70J0j6M8j85K00Q0j29n7j50K35j01J90
6833I4k00J20P4j94j00J19j5o8K4Q1k3j24J19J06n8j27m4J83J41k50J02J3lN7
6857B7p7J64j71J7K83k31P6j4L8n2r9O7Q2k01j47K42R1K3j77J6L3RJ50l8j08J51
6883A54l47J71K11k67M1J25j77j70N5O2L62l97o9J73k7j0L7K79j92j24j46J49
6905a07P4k7k2P5P3l20J51J92j05j4L6L0L5j98J92rJ78j51m5J04q2p4J49J15l6
6930B14j35j52J65J3j26J93K01l41l09K48j02j2J85p3N6j29O3Q4j50J72n5K06
$$ y = [-82, -101, -28, 84, 44, -250, -73, -208, -137, 8, -92, -232, -211, 193, -39, -180, -90, -82, -41, 154, -43, 56, 18, -43, -224, 81, 212, 195, 297, -23, 12, 118, 202, -14, 14, 76, 42, -62, 95, 204, 24, 39, -132, -42, 130, 2, 70, 36, -74, -143, 48, 71, 98, 323, -27, 129, 96, 239, -31, -21, -37, 11, -174, 26, 106, -23, -80, -230, 5, -96, 94, -106, 14, 88, -106, -206, -87, -102, -170, -146, -65, -88, -212, -93, 13, -45, -172, -216, -33, 108, -142, -40, -27, -30, 27, -50, 114, -57, -40, 243, 12, 88, 74, 112, 60, -39, 28, 110, -91, -238, 4, 95, 118, -59, -43, -10, -1, 149, 111, 3, 154, -193, -22, 189, -78, -37, 88, -89, -259, -204, -142, 220, -177, -246, -73, -100, -110, -73, 206, 14, -110, -256, -107, -33, -60, -82, -7, 66, -254, -103, 89, -16, -30, 6, 36, 71, -127, 65, 56, 234, 83, 38, 142, 60, -14, 135, 250, 214, 79, -73, 92, 105, -21, 172, 373, 32, -277, -29, -131, -143, 42, -31, 25, -104, -41, 43, -107, 65, 10, 216]
6952B16m32j9L23j25J63m2k32J74K6j82kM20l58N0Q9j72P5n1L10j7j02j12l4o6
6976a00J51j26J80K13m24J47J7K4p6J38q8Rj53N8L48j75k67J7J77k1k80J61L66
6999B96k62m2K51l46P0p0L28n4j45n1j27J2Oj27K01J35j40l0K32n6j68J15n2j12
7023a36n0P4J88j09o2pJ35j2k65L62J62l23m8J44J20o2k47K43Nk60K9K28r7rk44
7048b41K94j75j44K38K7J54k09q2J33P7K3k1qp1k75L67J9j28j0j53J16q1J19r8
7072a29J52n4NLK4j31l0K07R4l50k2M09k34p0j3M74j87l18J0K38j02j81L42r9
7096C8j48m6rJ73Nj90K43r2n2m2K1K07j31k9J33j71k6M8L02j80j16o3J47q3p2
7121a33P0M18k95k73P3j37K72k45K20N9o4j61o8L82n9k19K73k32p4o1M31nj32
$$ y = [216, -216, -235, 88, -37, 126, 84, -148, 26, 52, -130, -132, 288, -70, -20, 69, -103, -28, -79, 231, 214, 112, 0, -34, -100, 51, -75, 105, 318, -106, 41, 58, 82, 6, 144, 56, 65, -88, -30, 318, 143, -124, -107, 70, 49, -231, -70, 296, 34, -8, 243, -103, -33, -103, 225, 171, 26, -25, -152, -140, -134, -261, -60, 75, -65, -95, 137, 81, -87, 28, -24, -136, -186, -112, 76, -33, -95, -102, 33, 21, -244, 118, 280, -43, -91, 53, 173, 111, -136, 107, 112, -148, -119, 109, 12, 3, -241, 53, -122, -266, -28, -1, 153, -56, -138, -5, 72, 95, 74, 66, -5, -280, 87, 106, -22, -32, -185, -69, -150, -31, -129, 23, -31, -26, -23, 1, -130, -160, 47, 141, -209, -231, 178, -56, -126, -139, 335, 148, -170, -160, 78, -24, -205, 137, 38, -110, -156, -165, 8, 13, -177, 66, -26, -78, -120, -99, 108, -23, -52, 81, -90, -116, -68, 234, 54, -62, -125, 22, -61, -133, -63, 355, 60, -213, -140, -277, -5, -250, -30, 29, -35, -196, -264, 118, 59, -160, 113, -119, -193, -254, 177, 172, 40]
7144D0k44K60j3R7j76K73k2l06m5K19Pj60K27l6j91j3o3L43p1k52J15K23k90r4
7168a72k0L51r0j23Q5J13l23r0L98%k65k13L81p4l75K69L19r8k18OK73o3p1o5
7192f5K98m03p3K37N9N8j19L9L4k26NJ01L64l62n8J89J38m17J61K82m1L5m06K68
7216I8m5r5q0K39p6m31M85k6j60j60L25j11R8o5p4J48j12m1N2L3j32q0K50Q3k10
7241h7j28L87l20K54j77K51j4k71J78k19N0N9M1J76q5J0J4K09j85j27R2M2k35
7264h5PK12K32j93k79K17k66QR2M6J06l22J06l1P3k13J73J69o6O4k86J40P6j9
7288c9J80m4o0j67o7L67r9l8P3j61M5oK71j18%j25L1J21j86L4R0J24k46j41M11
7313B50l20J14R6l0k29J25m1R8K2k39J81p0j8R1P6p4j53j38J80J56N7k51R0N6
$$ y = [40, -204, 56, 43, 140, -36, 237, 215, -91, -136, 83, 90, -70, 157, 121, -70, -83, -146, 197, 126, -126, -11, 212, -78, -172, -192, 159, 69, -54, 31, 144, -179, -269, 129, 129, -136, -349, 32, -42, -417, -148, 171, 73, -145, -139, 134, 71, 0, -65, 233, -170, -243, -6, 53, 111, -8, 31, 65, -161, -156, -55, 309, -53, -111, 78, 216, -201, -40, 242, 201, 236, -170, 98, 53, -42, -122, 117, 41, -390, 95, 69, -91, -251, 74, -37, 61, -4, -78, 70, -42, -83, -31, 2, -130, -210, 40, 123, -87, -215, 172, -148, 106, -71, 180, 166, -105, 73, -146, -96, -37, 4, 180, 95, 105, 119, 328, 143, 16, 108, 150, -85, -78, 134, 366, 173, -106, 111, -155, -147, -55, -9, 97, -225, -119, -150, -77, -290, -117, 52, -14, 50, -236, -96, -20, -39, 141, 97, 37, -130, -197, 170, 71, 33, 106, -55, -10, -16, 255, 137, 137, 12, 43, 164, -22, 12, 102, 226, -20, -161, 250, -70, 44, 140, 110, -119, 6, -35, 63, 85, -154, 27, -43, -61, 30, 106, 32, -121, -259, -79, 77, 134, -117, -27, 29]
7337B9o4J33k52K01j34J12q7K60l03M4J35n8K20k56J46q8j95K15N4j18j09P9M2
7360Fj08J30k06L06j59j8o7R6m4J12m8n9J63o4m7L3J88k39j0N9j67J73k14P6K36
7385A28j46L3p2M5k84R2N46m22P0j76K10r5K1J41j87R9j81K33j45R7R5q0j36R8
7409a6L9L8j9j02O6k13K07j6K15n6l23k2M56k0k40J49j20L5j30K09j61j13Q8l5
7433h4O0Rm9K1j46lR5J67n1l2K51k08j53P9J22k8N6k4k20M31l75J03q3Q4j92p7
7459b47L4J26J01k7q2J79j56J13j69M9j35J29J25j34QK01j37lK8p6J8M5J15j04
7483Aj5L0j4k7P8r0K31k62J66O0j7m34K83J19N1j08p1L3o1N3L3L5j57L3m7m9j01
7510b47K00j48J46K96l92J37K5j82J9J23M9N6j62K25j61M5Kr1R5O6j57Q3j28r6
$$ y = [29, -35, 98, -154, 47, -87, 25, -62, 198, -105, -61, 74, 16, 236, -20, 126, 38, -157, 58, 112, -6, -115, -36, 6, -102, 28, -178, 128, -31, -49, -116, -20, -64, 48, 0, -59, 104, 40, -7, 26, 214, -25, -35, 24, -143, 30, -184, -108, 128, -18, 15, -57, -12, -296, -204, 342, -80, -10, -186, 24, -71, -50, 91, -96, 3, -178, 55, -90, 7, 102, 22, -114, -16, 23, 61, 42, -60, 6, -207, 0, -16, 199, 143, -180, -202, 254, 234, -6, 143, 23, 58, -72, 137, -24, -137, -49, -84, -24, -15, -64, -43, -189, -192, -97, 70, 19, -13, 238, 30, -123, -44, 78, 50, 106, 82, -138, 293, -82, 21, -62, 22, -170, -247, -213, -87, 14, -13, -95, 84, -72, 41, -128, -79, -214, -85, 40, -94, -86, 115, -22, -25, 3, -73, -55, -10, 105, 1, -14, 16, 2, -25, 53, -37, 194, -68, 98, 158, 141, -293, -10, 109, 160, 52, -19, 14, -47, 6, 39, 74, -83, -50, -97, -146, -247, -47, -195, -49, 247, -145, -8, 17, -165, -146, -23, 26, 82, -80, 145, -16, 29, 31, -60, 35, 101, -56, 27, -101, -197]
7534a97J85L4lp2J15J94k44p2K72k93N0Q7j1J39k69mK4K49k10j09P4J5kl0J74
7559I6j97J39r6M1j65K25K2k22qM3K24j46P3p8L9r4M5n4J22o3J29m4q2o3M7MJ03
7586D0M6J4j19O0m7j7K10q1j46J27M8J39k17m4J02M9k52J20J97k40o5KJ58l62
7610b78K35j73L86l8j92k8J04J67j98j9l2J5L6L3k1l4j37J42j39Q6l3L6J0J44
7634G2r6J46j51Q8k29K50q9j75J0K51k14P1J66p3J35k83J79j43J17p4m8M06k96
7657B0j05K61k75Lj39M02o2k20K61K4j00o9k03K34K8J18j63J04q6j97k6K02j16
7680a04m6J43j28Q9r1O1%o2L8N5R2j95j30J50J05l23L12J2J53k25KQ1O1m8k6K18
7706A94j78j46lN4J68j59q5K42p1p7J4K4Q3j45J18K62l18MmK2k29P8J08J71j27
$$ y = [-197, -12, 22, 19, -53, 62, 256, 12, -60, 212, -81, -31, 56, 45, 184, -85, -89, -65, 184, -26, -135, -61, -46, -48, -78, 96, -101, 38, -58, -17, -182, 43, 65, -157, -165, -122, 102, -44, 29, -49, -10, -104, -59, -113, 9, -54, 75, 31, -51, -114, -67, -63, 40, 86, 100, -19, 41, -6, -23, 187, 106, -40, 87, 135, 274, 57, 13, 115, 164, -88, 32, 229, -11, -76, -74, 84, -278, -43, -216, 170, 132, -60, -88, 16, 183, -15, -34, -66, -51, -15, 18, -3, -37, -174, -32, -171, -85, -118, -82, -72, 72, -24, 122, -29, 59, -170, 80, -9, -184, -174, 77, -137, -66, 100, 27, 162, -121, 58, -85, 32, -42, -90, 316, 20, -85, 176, -99, -96, -235, 167, 105, -115, 146, 170, 70, 1, -202, 32, 60, 178, 15, 119, 33, -164, -190, 12, -104, -150, -7, -135, -46, -137, -76, -76, -138, -100, -45, 47, -148, -278, -128, -23, -346, -34, -22, 131, -94, -92, -11, 50, 2, -24, 194, 16, -130, -133, -79, 89, -70, -155, 87, 16, -61, -47, -23, 60, -85, 33, 295, -23, -19, -23, -1, -230, -152, -44, 127, 0]
7731@r7O9J09j64j7J37kj36M2J96j85J9L6R2r8j31q9M36l12r7J63Q1k03j99M27
7756G7L6r2j44K47M5n2l35L24M5j29n2K6K34j77o2J84j44q4j4K19L5l83K12j2
7780Doj2K0Po3Q2m6J47pm01J73K73k42k02P5K83j59j12J48K74j36j91K73j86n4
7805e8P5n4N5pj79K08k2Mr8O5J0j39J00J69o5j90J4J72N8l04R6L06j78k98K57
7830cJ68l10Q8K24p6j28k09K17J97l97M4J41L00j35L9j59M2k16L09Kr0k54J47
7853e9J35K5l56K23Q7p0o8K61J62m20j28J70P5k29O5Q8J91r9Q3j13J70l53Q9K51
7877A80P3j47m4J21j20k27K14j29J29j01R7Jl11J40J94Q4k31j21k8L91j3k47K08
7900A13mk53l18N15R4l51O7J25R4k20nL51j77J26r8k1j08J01j10L37j52r2j46
$$ y = [0, -97, -28, 81, -83, -100, 37, 35, -101, -59, 137, -48, -29, 7, 99, 1, -130, -219, 217, -95, -192, -29, 52, -151, -350, 77, 113, 21, -123, 124, 169, 117, -218, 106, 151, 22, -30, -4, 230, 53, -9, 175, 31, -53, -67, 152, 187, -196, 16, 4, -2, -14, 6, 13, -50, 32, -14, 133, 126, -275, -102, 171, -71, -273, -198, 85, -74, -186, -38, 236, 100, -91, 182, -4, -58, 17, -37, 18, 11, -168, 40, 18, 22, -76, -11, -1, -140, -40, 129, 64, -126, -112, 60, 118, -186, -90, 216, 38, -260, -3, 165, -145, -57, 167, 91, -37, -246, -29, 168, -229, -185, -44, 256, 121, 160, 1, 43, -173, 136, 138, 48, -206, -59, 76, 101, -255, -32, 55, -15, -83, 178, 340, -80, -208, -38, 37, -192, -127, -39, 152, 53, 136, 23, 193, -160, -71, 180, 253, 106, 62, 183, 63, -164, 50, -79, 50, -51, 46, 47, -264, -124, 70, 154, -77, -198, -226, 165, 152, -95, 113, 109, -144, -462, 53, 147, -204, -137, -12, 82, -138, -143, 208, 31, 157, 59, 38, -70, 31, -79, 258, 106, 14, -132]
7923a32J43kj59J05L63n21J6J23j89K52p4K20O9k98j3K81k9k50J02J06l2j84J86
7946H3J17K7j52j46N8J2j60N5J89K1l95L22j09K43m08L21q8k9l43J98K40L4n5
7969C5mJ09l77J26J53Q4L9j21N0j31k64L02j3J65j55%Kj17J69j45J71j07J36m07
7993c00K91L5r6J16j5Jl4JJ72K16l18J05j14j25L3J73j49J2o5J50J9j84L6O1j63
8018a42R9J30p4L3j02j41N8J05j52K52o2j02J4L9j14J91O6o8K6r0N5o0RP1L8m0
8044C9P6j67o4K14j58n7r7K66J48k34k34K48k1M0J15o8J88j13o7N8P0j28l1n2
8068b9J35l04R6Q1L5L9L0l8k27l2L11K3l68J30J32J53j0k33R0K61l03m6j36L48
8092A38l46J34K51n8n4J3Q6ok11l19K37K47j29J08j04O7j1j63J20K13k45J28%
$$ y = [-132, 11, 9, -150, -45, 318, -203, -187, -64, -253, -1, -75, 145, 214, -84, -97, 184, 155, -95, 7, 113, 81, -103, 83, 200, 227, 75, -71, -13, -1, -161, -106, 83, 104, -291, 31, -78, 165, -243, 78, -10, -39, -382, -184, 56, 90, 35, 31, 140, -237, -111, 42, 126, 165, 44, 94, -37, -301, 1, -12, 153, -2, -2, 0, -117, 52, -93, 78, -29, 107, -300, -9, 26, -70, 46, 31, 32, -2, -1, 171, 387, 69, 174, 60, -65, -32, 141, -8, 4, -61, 89, 108, -76, -40, 21, -142, -43, 87, 13, 46, -56, -197, -139, -34, -186, 66, 4, -98, -84, -45, -159, 32, 98, 30, 56, -34, 21, -39, -30, 41, 79, 39, 115, -52, -116, 98, -60, -117, -214, 52, 200, -34, -268, -20, -41, -1, 114, 46, 234, 121, 54, 112, 182, 54, 23, -29, 106, -198, -102, -21, 14, 53, 83, 45, -182, -214, 97, 120, -248, -118, 14, 167, 157, -76, 14, 275, -28, -74, -210, 138, -208, -74, 177, 119, 65, 78, 164, 158, -53, -372, -135, 112, -17, 91, -13, 54, 43, -120, 0, 213, -32, 96, 96]
8115I6j22j44P1K99j62Oj93J24J99j96M4J05k00J10J44j69j20J00Q2l65J71PK60
8138A47r2R5k34K14r9j33K32j81L1J13r7O6N5k70J08j69K9J79O9r2J03NJ90j27
8162A42k51j13J85K1J33p3k5j9m8K66j93p3O4r5J71Lk32m3RO7r1R0J50R1k56O8
8188e2K6P8M9
$$ y = [96, -26, -170, -99, 200, 38, 44, -149, -25, 174, -22, 22, 127, -73, 37, 181, 12, -108, -8, 74, -291, -120, -113, 147, 55, 150, -84, 130, 31, -102, 130, -51, -20, 93, -4, 62, 117, -153, -45, -214, -185, -6, 63, -29, 74, 79, 269, 142, -109, -222, -37, -16, 117, 44, 19, 0, -48, 218, 25, -48, 16, -79, 92, 95, -137, -180, -171, -104, -195, -105, 45, 136, -120, -52, -26, 52, 101]
8191A01
$$ Imaginary data points
##PAGE= N=2
##DATA TABLE= (X++(I..I)), XYDATA
0@%%%Qj6QqJ6k4L2l2M0n6O4p2R3j15J34j56J84k19K53k89L36l89M45n06N74o53
29c48P40q29R31j047J170j303J451j617J798j992K205k446K708k994L314l673
45a932M078m531N044n641O333p143Q118r319J0835j2812J5513j9453K5754l7410
59b2566O5989k56501l94665N82097K83949l06267j00923L56694j18743n21604
69d32540P7098O60113J07591m45411n6150L00742j71804l43162L17278N55028
79E68783j82135n24590M9682L04809j80262k03190L84805L23526m26079m68428
89c53079K24461L18082k02357j31325L48953Q8394n32334k71338M21645K84672
99A95774k68096j03034K90098o1368m72108O661N43130J42862l73011o6529K70166
$$ y = [0, 0, 0, 0, 8, -8, 0, -8, 8, -16, 16, -16, 24, -32, 32, -40, 53, -62, 72, -84, 100, -119, 134, -155, 181, -208, 237, -269, 305, -348, 392, -437, 494, -553, 617, -686, 765, -852, 946, -1046, 1159, -1287, 1421, -1573, 1741, -1932, 2146, -2385, 2659, -2982, 3351, -3792, 4326, -4993, 5842, -6970, 8543, -10910, 14844, -22566, 43423, -213078, -607743, -25646, 258303, -47964, -148887, 207807, 89064, -432540, -355442, 304671, 412262, -33149, -89299, 211443, 39639, -303523, 13755, 568783, 386648, -137942, -88260, 216549, 36287, -166903, 217902, 541428, 115349, -353079, -128618, 189464, -12893, -144218, 204735, 293129, -239205, -510543, -88898, 195774, -72322, -175356, 114742, 53374, -418734, -412073, 131057, 273919, -99092, -165621, 104545]
110A04545j09669l25837K23475M94673r4028m39807L6934K93008j28014k15037
120a59757K93984L13809l04990l90343J89800K86993j85550j68908K80457J36647
130B92142l92742k38955L21876K17219k62813j25944K69333K5173l73700n9625
140c28036L88768J04413l12831n2853K72340l9189l02491R2387L73225l7802l29123
151a71192M0485K71193q6779k29298J76902K80203j73716k89784J45716K46444
161B10174j46907j83068J99111J66049k46861j92255K30620J76990k13787j35394
171a35328K15998Q4546k56544q3318K62725Q0178k49022n9031K33336J7897k43213
182a31776N838K55756r325k44433K1644K22673n2614k15728Q1274K21299r0867
$$ y = [104545, -5124, -330961, -107486, 387187, 293159, -146648, -109714, 183294, 55280, -159757, 134227, 448036, 143046, -247297, -57497, 229496, 43946, -124962, 155495, 292142, -100600, -339555, -17679, 199540, -63273, -189217, 80116, 105289, -268411, -328036, 60732, 165145, -147686, -200539, 71801, 32612, -269879, -177492, 195733, 157931, -171192, -130707, 140486, 53707, -175591, 1311, 281514, 107798, -181986, -36270, 210174, 63267, -119801, 79310, 245359, -1502, -193757, 36863, 213853, 66, -135328, 80670, 165216, -91328, -174646, 88079, 168257, -80765, -139796, 93540, 111437, -131776, -125938, 129818, 120493, -123940, -102296, 120377, 67763, -147965, -66691, 154608, 63741]
193F3741k18701Q9964J92109j08413j69701J35653J61189j57196j64772J54862
203b1265J48814j52935j19114J66413R7041j83409q4728J95795Q3533j84220o0454
214a14529J84881M0954j81984j5944J92544J0114j83863O031J78995k0221j71952
225g4974L6545J66037m8855j60346N5501J42409p6641j40371Q3668J28850r6327
236A5496j27784R0162J02902j04352r1788J12739P8360j25956p8446J21485O8188
247F1006j15529m8007J19968L3936j23434k0677J31600K2576j19206p311J17509
258E2431n23j07292J9623J12384k1768j03564L2789R9980l7296r1416M5716Q5839
270H6903n0966p8892N5141O7528o4947o4067O7298N6717p2151n4860O5114L9109
$$ y = [63741, -154960, -64996, 127113, 18700, -151001, -15348, 145841, -11355, -176127, -21265, 127549, -25386, -144500, 21913, 118954, -64455, -149183, 46612, 130145, -54075, -114529, 70352, 111306, -70678, -86622, 105922, 116036, -67827, -61796, 117199, 96978, -74974, -38429, 127608, 78753, -81593, -26092, 116317, 39676, -100695, -17027, 111823, 15496, -112288, -22126, 80776, -23576, -115364, -2625, 75735, -50221, -128667, -7182, 61006, -54523, -102530, 17438, 51374, -72060, -92737, 38863, 61439, -57767, -65078, 52431, 51908, -55384, -35761, 76623, 54855, -48709, -15920, 84060, 46764, -44652, 1064, 86903, 35937, -42955, 12186, 79714, 14767, -49300, 17998, 74715, 2564, -52296, 12818, 51927]
282E1927p1566l2219P1970K1588p9673k3477P3838J6765o9841r400O4330j910
294A2332o5558Q491O6894r051o1648J3512N7676j4447m7221K4520M7769k5212
306H057m0785L2447M2608k8677l4691L1897L1999k9706k3251L4322J9853l6229
318G844j8093L5646J5511l4711j5244K8811N756l1320n009K8333j643l3686k836
331b0641K6680r25k6046L32J9462o798k0461Q423K0180q356j9173Q190J8223n236
345f146j1613R344J1465q809p488J3588J1582r579q417R591Q103o463k956Q935
359A1137J474j0420k753J0162L634r438m964M674J171n691n48N121j780q063j180
374g464O294J775m654k855K289R13j110J203L354n59l579R0M694L252j110j419
$$ y = [51927, -19639, -51858, 20112, 41700, -37973, -61450, 12388, 29153, -40688, -50088, 14242, 12332, -53226, -44735, 22159, 13108, -48540, -35028, 22648, 8201, -39020, -14500, 33269, 8057, -32728, -281, 42327, 13650, -21041, 10856, 42855, 13149, -10102, 24220, 44073, 7844, -10249, 25397, 40908, 6197, -9047, 19764, 25520, -5800, -10809, 17524, 15881, -17805, -20641, 6039, 5114, -20932, -20600, -1138, -7936, -28397, -19974, 206, -8150, -27323, -19133, -910, -6146, -17759, -8415, 3050, -5759, -13247, 341, 11923, 2344, -6073, 3518, 11621, 5158, 2202, 11137, 12611, 2191, -562, 9600, 13234, 3796, -1168, 3506, 4677, -1014, -1562, 3559, 1779, -6284, -7464, -1170, 605, -4049, -6904, -4615, -3702, -4812, -3609, -255, -814, -4393, -4303, 391, 3643, 2533, 1114]
390A114L93N59J143K285K484j090l224l7L325J553j390j072m52j877j438J773
406D049J988k765n218j079K373k11k595j077o37k893j610K233J896k020l259K65
422a0560J891J223J472J363j146r25K528M229J076Q6J701J049j034K331N751J037
438A2072m188j051M772J568k833M6K527k582n307J656N287l172p380j87L204l690
454G42m744L119J402p811n508N993L569p477m628N577J898p693p05R816J81j1045
470a7314M69J2357J480r631J378J1445j692r408O802J3804m494j2703O364J4503
484A3360l931r919Q269J0083r954r859J3199J1828j2553j1454J1228Q221j4149
497D369o511J5792M244j9702p027J7581L676j9445l097J8040j380k2026O36K0826
$$ y = [1114, 1507, 2066, 3209, 5494, 7978, 6888, 3664, 3627, 6952, 8505, 7115, 6043, 5591, 3714, 2276, 4049, 6037, 3272, -1946, -3025, -652, -863, -3458, -4535, -5172, -8065, -9675, -7442, -5546, -7566, -10825, -10560, -8669, -7446, -5974, -4611, -5757, -6682, -4154, 75, 1151, 1237, 2938, 3987, 2953, 5284, 11035, 12072, 7884, 6833, 11605, 13173, 10340, 10386, 12913, 10331, 5024, 6680, 11967, 8795, 1415, 1228, 4432, 742, -4002, -883, 519, -7292, -12800, -6807, -3238, -10715, -15343, -9766, -7868, -15561, -16266, -6450, -6269, -17314, -16845, -4488, -3008, -12639, -11261, 184, -1508, -10916, -4114, 9690, 5196, -7507, -1143, 13360, 9429, -490, 7779, 17862, 7908, -1951, 11248, 23076, 10523, -931, 10297, 18518, 4369, -2142, 13650, 17894, -1808, -8835, 8746, 12422, -7023, -10120, 7920, 6540, -15486, -14850, 5976]
511E976l233k1968N099K1630q379k2992R459K3679q773k0365J3238J9602j6612
524c639j9025K1236K3256j7714j9557J8162J5276k0834r723K8803J2527l0702
536a934j5325K6698J1511k4667m138K8027k381l6698j250L5858K256l2069J432
549a2680K7592j1609l2981J4834L7955j1808l5243J1697K9092j7800k5895K7334
561D88L2060k6471l2136K3791K6277k4758j7254L4991J8249m1166k3528L6109
573F652K0494l2157r976L5570l49m8420n141M9123Q588m2276m096L4560j2398
586A74m2227J8792N2992j2972n0739R276L9418j6983l1482L4703M1087l5751m6273
599c9985L1156M1328k6402k5140M0052K2768n1284k8550N0285L0405m2275j8988
$$ y = [5976, 2743, -19225, -14126, 7504, -875, -23867, -14408, 9271, 498, -19867, -6629, 12973, -3639, -22664, -1428, 21828, 4114, -15443, 2719, 17995, -2839, -12562, 16241, 28768, -1934, -17259, 9439, 20950, -3717, -7855, 20172, 17791, -18907, -20157, 15701, 17957, -14112, -12680, 14912, 3303, -29678, -14844, 23111, 11303, -23940, -12243, 16849, -951, -26846, 488, 32548, 6077, -26059, -2268, 24009, -749, -18003, 16988, 35237, -5929, -29457, 6652, 27146, -5011, -14987, 20583, 20234, -28186, -33327, 15796, 24384, -17892, -21988, 12572, 174, -42053, -23261, 29731, 16759, -33980, -24704, 14714, -2269, -33751, 952, 42039, 6288, -39985, -8829, 32499, 6097, -19043, 21009, 43777, -7507, -36057, 14228, 44633, 2358, -16630]
611a6630M2371M346n6013n439O0101R572n5478p245M4492j0278n0851J8832O0204
624C7984j6403o0388J1176M7869j9501l9301L6405M6700m0869n2723L5631M8075
636C4655l0692l1344M2914K6207n5238l0921N6741L4122m8547k4083M6671Q786
648B9271n7859n575O4514Q147o2057p497N3127n875n4576J5979O1740j7716o2435
661d0812J6417N5489k2005m7604L5144N0994l9650n2496L9259M8982l8441l7323
673c2046M7827L2438n6473l4015N7480L2180n4812k3709N4074J1437o3043r189
685c7851O5178O433o4674m771N8647p533o0425J3920O1955j8267o1840K0908N6846
698B8526k6214n2431L4430N3179l6967m8580M1504M5118m3113l7736N1624L7366
$$ y = [-16630, 25741, 30087, -25926, -31365, 28736, 38308, -17170, -24415, 20077, 9799, -41052, -22220, 37984, 21581, -38807, -27631, 20238, 737, -38564, -2159, 44541, 3672, -49051, -13420, 34655, 3963, -27381, 15533, 41740, -13498, -44419, 12322, 46444, -2103, -26186, 20485, 29271, -28588, -34163, 30351, 38498, -23559, -31056, 22071, 16196, -38380, -22401, 39339, 21623, -40812, -24395, 31094, 9089, -38515, -3371, 47623, 7973, -44523, -5264, 43718, 5277, -32046, 15781, 48219, -8254, -42269, 15211, 47391, -7421, -31130, 22944, 34381, -28662, -37851, 27327, 33760, -30914, -35685, 22962, 15429, -44996, -31076, 30879, 12612, -49228, -28320, 28526, 2312, -50119, -15689, 37490, 523, -48057, -6553, 38565, -4548, -42284, 9340, 46706]
710D6706n2026l2937N3758K7838n3162j8109N9200J4092o2302j2574O1189Q444
722D0117n7634J68N7177r461o1669J2041O1236j3957n7375J8562N1086k8417n1889
735d0015L3588N1672l5676m8950L6098M0238m3884l6878M9634L5131n2468l4295
747d5805M9454K4674n2544j6903N8349J3054o2518j3495N8997Q674n4070L406
759b8727N6760j0769o0572J3657O2231j1122n2575J9532M8603k8920m7091L7350
771a643N1831l4394m6682L4942L7704m0662l0566M9033L0796n2652l1619M8026
783A4114K3259m9018j4813N1686Q151n9007j0241N4735M944n1178K073M9502j2167
796A2040n4722J3182N4318j2915m7979J8325M1973k7509m1490L4434M5884l1711
$$ y = [46706, -5320, -38257, 15501, 43339, -9823, -27932, 31268, 45360, -16942, -29516, 31673, 40117, -17517, -17349, 39828, 30367, -31302, -19261, 41975, 28018, -29357, -10795, 40291, 11874, -40015, -6427, 45245, 9569, -39381, -3283, 36955, -6929, -43807, 5827, 40958, -11510, -45805, 3649, 28323, -24221, -41124, 17225, 30279, -32239, -45734, 13263, 21937, -32133, -28727, 28033, 17264, -43308, -29651, 32580, 21458, -31117, -11585, 37018, 8098, -38993, -1643, 50188, 15794, -30888, 4054, 41758, 1096, -29470, 19563, 50359, -2293, -33912, 14114, 37373, -11645, -26458, 25228, 33379, -25628, -35869, 18866, 23810, -27368, -25295, 24207, 12040, -42682, -29500, 24818, 11903, -36076, -17751, 24222, -3287, -44777, -10343, 35541, 3830]
808C830m0716L2019L2759l5776k4342M6367K6827m7837k6224M4606K1673m1405
820h219j0136M7028N076n2580n107N1446M695m6244K659M3245j2220m6971J5056
833a2272M7671j5531m3720J6855L6850k5670l6552L0674L6551l1909l4934K9303
845b684K6646l4337k1630L9876K0368m2610k0992L8226J5407l6444o719M0610
857A5717J815m4834k784M3972K917l6776M060L5210j1507l7129J5534M0443j2982
870A3656l5207J4717K9101j9485k6127K6409K8002k6403k7054K5149K1785k6262
882a719j6097L0632J4279l3073j4368L1146J1091l0170n332L1438J259l4362j537
895a6813L2814k36k9563M411K7459j0250l0074J1543K9888j1008k6920J1540K1448
$$ y = [3830, -36886, -4867, 27892, -7884, -32226, 14141, 40968, -6869, -33093, 11513, 33186, -8219, -18355, 28673, 33749, -18831, -23938, 27508, 32203, -14041, -11382, 31863, 19643, -27328, -12272, 35399, 19868, -23852, -6997, 29853, 4183, -32369, -1695, 34856, 2947, -31987, -2684, 23962, -10375, -32005, 7871, 28239, -14371, -35363, 2863, 18270, -18174, -24893, 15717, 17532, -27302, -30086, 13886, 16803, -19973, -15913, 19297, 7790, -29339, -13805, 26638, 13656, -21551, -6834, 22267, 2782, -23345, 3064, 31066, 4663, -22391, 2758, 24543, -1719, -17816, 12816, 27095, -5978, -20346, 10800, 21891, -8279, -13611, 17827, 19086, -15276, -16813, 16001, 15765, -13798, -9387, 18072, 7822, -22252, -10709, 19179, 8171, -18749, -7209, 14239]
908A4239j6782k0294K0455K1626k1514k0953J9562J6660k0255j1579K3360J0142
920A4667k4920r828K5384Q769k2929m694K3951J826k3993Q01K4969j169k3092
933a0258L764K2451n582k1791P699K0919q547j9172J0046J6995j2194j6640J2820
946E10J5792j3569j4542J3311J1090j5075r565J6524Q353j7372q281J6708O062
959I946j6042l498J6196J313j6843n29J7232l78j6604J368J5294k831j4604M454
973e526J3539o325j3677P250J2941p713j2127P482J0174q165q712R829P916j0836
987c950p333J1174P509r955m975J0540L944j0587j235J1969K059j0943r99J0962
1001H180L44r564J413R998k916r755K982R082l853r242L563P181m965p256M215
$$ y = [14239, -2543, -22837, -2382, 19244, -2270, -23223, -3661, 12999, -7256, -18835, 4525, 14667, -10253, -20081, 5303, 14072, -8857, -13551, 10400, 12226, -11767, -10966, 14003, 12834, -10258, -6494, 15957, 10375, -11416, -3717, 17202, 8655, -10517, -471, 16524, 4330, -12310, 510, 16302, 2733, -11809, 1502, 12592, -2483, -12048, 4476, 12829, -4543, -12824, 3884, 9946, -6096, -9594, 6602, 7915, -8928, -9457, 7775, 7397, -9207, -7839, 7455, 4624, -9980, -5526, 8013, 1688, -11989, -4739, 8202, 489, -11638, -4156, 6018, -2147, -10859, -1030, 6886, -3950, -11283, -109, 7400, -2555, -7530, 3010, 6954, -3633, -4868, 7101, 9160, -1783, -2782, 8180, 8524, -1040, 373, 10371, 7455, -2300, 682, 9764, 5911, -3331, 232, 7413, 2448, -4808, -593]
1016e93N269n954n806N401M774o326n051N322L576n518k400N835J353o331j145
1031g594O906J936n418p31N057%m294J907N595j647m780J476N010o27l790J893
1047H99L083k394k887L285L194k666l233K301K592k016j506K481R49k865r11L075
1063C381J079k588j062J852K88j461J79J381j087k194J61J775o93j822m73L78
1079i06j199q03P84K59j594j715O88Q90m99n88P3J23n49M38J295P10o03j44J213
1098b127J049R34N35M27o0P11J233R68L45L17l1k78L33J020N15o56r87l88L13
1117D173J38p86o62o38j005m16o5L0j105j402p53l9R8j77m18r26k97P5L04P58
1137c113k95n47j57N46P91O69K81j76k25J88J164J017k51m67K85R17J17K3Q95
$$ y = [-593, 4676, -1278, -7084, -1683, 3091, -3235, -8286, -2964, 612, -4906, -7306, -1471, -118, -6449, -7594, -688, 1248, -4170, -4901, 156, 156, -4138, -2231, 3364, 1717, -3063, -1587, 3423, 2796, -994, 899, 3982, 1588, -1299, 1986, 5180, 2514, -719, 1582, 4174, 2158, 652, 3133, 4082, 1217, 306, 3381, 4460, 1872, 810, 2662, 2950, 1489, 1668, 3049, 1962, -232, -71, 1704, 1011, -811, -1284, -906, -2105, -2908, -2124, -1865, -3459, -5174, -4486, -3596, -4095, -4683, -4610, -4487, -5036, -4598, -3303, -2593, -3196, -3340, -2127, -1078, -144, 391, 818, 758, 1469, 2702, 3670, 4015, 4332, 4301, 4023, 4356, 5376, 5891, 5235, 4248, 3860, 4173, 4311, 3525, 2863, 2225, 1220, 804, 739, 769, -336, -1738, -2491, -2530, -2432, -2609, -3027, -3953, -4250, -4175, -3871, -3113, -3408, -3955, -4112, -3566, -2775, -2106, -1825, -2001, -2226, -2038, -874, 143, -108, -575, -290, 627, 744, 767, 1662]
1156A662M20j249l48J748J208j182j093P46J020o90j17J291K46j997o15K226Q51
1173D127j915o24J193l80j637M17J957r04l461l3K792r28k574M11J709k230k813
1190d893K248K695k988l411K360K420k590j886L373J686l763j555M880K317m240
1205c347j180M886J822m010k36N476L14n261J141O247n80n662J132N608j640n138
1221d28K880N234m407o091L989N758m470n712M154L837o263l967P052L894q098
1236b638m026P072L055p126j836Q170P30q829m05R632N03r202O10Q957j633q664
1252e630K605R052l609r157M243Q701n564q508N632P671o764p592P429O454q764
1267c801o243R883O118r531n538J0548M047r824j911J2200J988j1916j321J3372
$$ y = [1662, 2082, 833, 485, 2233, 3441, 2259, 1166, 1912, 2932, 2242, 2125, 3416, 3662, 1665, 1050, 3276, 4127, 2212, 1588, 2781, 2401, 764, 1181, 3138, 2234, -1227, -1260, 1532, 604, -1970, -1559, 150, -2080, -4893, -2645, 50, -2938, -6349, -3989, -1569, -4159, -6045, -2672, -986, -4749, -6304, -1424, 893, -3347, -4527, 359, 2181, -1829, -2065, 3411, 3725, -1536, -395, 5852, 5272, -390, 742, 6350, 4710, -428, 2452, 7686, 3279, -2812, 1177, 6935, 2465, -3247, 907, 4744, -1519, -5486, 1566, 5460, -2638, -6664, 408, 3463, -3663, -5499, 2671, 3401, -5428, -5833, 3799, 4302, -4900, -4290, 4667, 3034, -5630, -3025, 6027, 2418, -6739, -2496, 6205, 641, -7867, -2235, 5436, -1328, -8920, -1491, 4963, -3801, -10044, -161, 5957, -3574, -9112, 1436, 5483, -4341, -6252, 5948, 7936, -3980, -5301, 8071]
1281H071J559j1561P44J1850k250j2156M199J3311m652j3130M170J1279o362j1210
1295f138P466R849j0393j1663R352R377j0919r232J0590O988j3512o837J3620
1308a452N657j4131m556J4953L304j5100j157J6368J890j5193J057J5993j672
1321E961j5035M768J7107m262j5709N459J4617o473j2751R701J3250j1945j4544
1334i856J1167J3186j1424j0647J2322P366j6160q452J7149Q339j6378p836J4967
1347C743L579j6660j592J9497R17j9637j305J7965p17j7116M753J7945o075j9343
1361a4046O112J8157o984j5649J0207J4974j2969j6337J3489J5781j2453j2536
1373a2254J4179R573j8303r147K0339J1014j8189r129J6928M307j8561Q6K3104
$$ y = [8071, 9630, -1931, -1187, 10663, 8413, -3743, 456, 13767, 9115, -4015, 155, 11434, 5072, -6138, 1328, 11177, 784, -10879, -1527, 7850, -3069, -12301, -1711, 5277, -8235, -15072, -1452, 4205, -9926, -14482, 471, 3775, -11325, -12482, 3886, 5776, -9417, -8360, 7633, 5961, -9074, -4306, 12801, 8539, -7170, -1711, 12906, 6433, -6318, 3383, 16633, 4688, -9856, 1311, 14497, 3073, -7574, 4748, 12114, -4046, -12498, 4651, 12990, -3388, -11224, 3743, 7322, -9338, -10930, 8567, 9484, -10153, -11458, 6507, 5790, -11326, -6573, 11372, 5297, -14046, -7934, 10223, 3239, -12410, -2203, 12771, -198, -16535, -3046, 12735, 282, -12254, 1925, 11498, -6805, -15952, 4387, 15401, -2788, -11917, 5011, 9318, -9243, -9157, 13947]
1386A3947J370k3704k603K0504K69j7597O015J9759r091k3254P450K2129o594
1399H600j7501R468J4313j5625j6850J6684J7992j4829j5747J3899J0090j8694
1411h200q763K1918J0403k1186j0406J8405M965j8823p2K3364N41k5051k417K1663
1425F341N38j7562O278K0027j0020k3917Q320K3796n868j7578R461J3926j5880
1438b138j6116J8680J9831j5404j7145J3379J0621j7473o724K3175R241k3786
1450c859j0780J9686O810j8604l20K1920j661k5538n53K3246j32j9808M972J8947
1464A4326r878k2650R559K2870q296j8962J0137J4558j5331j5874J8258J8014
1476A6731j6212j5887J4422J0849j7317o743K2172Q789k2610r687J9536O913j7823
$$ y = [13947, 15317, -8387, -10990, 9514, 9783, -7814, -1799, 17960, 8869, -14385, -6935, 15194, 8600, -8901, 567, 14880, -745, -17595, -911, 17081, 2252, -13495, 404, 10494, -8200, -16963, 4955, 15358, -5828, -16234, 2171, 7136, -11687, -11759, 11605, 12146, -12905, -15322, 6341, 6879, -10683, -4405, 15622, 5602, -18315, -9995, 13801, 7933, -9645, -184, 13742, -2138, -18254, 426, 20257, 4853, -12292, 1087, 11708, -5765, -12489, 10686, 19927, -3859, -14639, 5047, 11857, -6747, -7067, 14853, 13192, -12346, -12899, 10347, 10215, -9593, -4621, 14326, 4448, -18202, -8643, 14227, 5931, -13031, -2894, 11664, -3667, -19541, -1283, 16731, 519, -15368, -946, 9903, -7414, -14157, 8015, 16804, -5806, -15493, 4043, 10956, -6867]
1489f867n87K0620j787k3682N86K2918j90j9536L374J7952q248j9563R399K0250
1503A4639q851j8514R398J5685j2576j4657J4994J4916j5416j3420J5389J1103
1515A2690j6365r035J8956Q571j9100o826J7899M794j8545j292J9818P4k1141
1528i502J40J9498j791j8069M303J7503p843j8566Q087J8329r014j6747R727J4142
1542A0197j2082j3390J3870J2809j4560j1537J4919J0314j5390q156J6540P001
1554A0535j6623m483J7203L621j7551j693J8128J093j6771N15J6455k970j5723
1567h264N119J6596n950j6307N983J4779p250j3039R248J1951j1271j2146J1599
1580A048J1431j1968r898J1905P151j3188o444J4234M962j4917m649J3947K747
$$ y = [-6867, -7454, 13166, 11379, -12303, -11717, 11201, 11011, -8525, -5151, 12801, 4553, -15010, -5611, 14639, 5788, -12726, -3328, 12357, -219, -14876, 118, 15034, -382, -13802, 1587, 12690, -3675, -12710, 6246, 14817, -4283, -11109, 6790, 11584, -6961, -8253, 11565, 11639, -9502, -9362, 10136, 8345, -9724, -5421, 12082, 4239, -14327, -6240, 12089, 3075, -13672, -3945, 10197, -1885, -15275, -1405, 11404, -3156, -14693, 226, 10540, -4850, -13006, 3534, 10535, -6088, -10571, 6632, 10253, -7298, -8991, 9137, 10230, -6541, -6026, 10429, 7459, -8264, -3145, 13451, 7501, -8806, -2823, 11956, 4706, -8333, 915, 12866, 1595, -10551, 1048, 12479, 511, -9387, 2518, 9669, -3519, -9963, 4271, 9233, -5684, -10333, 3614, 6361]
1593F361j4515j699J3973j20j4427J156J3886k687j3786L704J3559m526j2265
1606a1386N653J1777o257r797Q871J0458q815r087J0019R332q794o245J0439N841
1620A2009j1197m210J2261M455j1862l846J0945J691j0967r49J0551j330j2310
1633d759M58J0688k137j1039J934Q451m841r057M700Q482o076q714N762P521n995
1648d622o132O956N775p266m260Q662N220p807l178Q505L345p114j421Q263J444
1663F370p303k33Q280Q2p828N61P422j325o482J770N850l309o412L146O174l694
1679C069o116K788M210l956l778M862L115n842m226N305L493m798k491M642J040
1694A317n219r64N855J028n810j017M730O31m265M52M434j057m559J330N045j344
$$ y = [6361, -8154, -9853, 4120, 4000, -10427, -9271, 4615, 1928, -11858, -8154, 5405, 879, -11386, -5733, 6044, -213, -10010, -1139, 9319, 504, -8583, 1436, 10768, 1974, -4271, 6168, 12009, 812, -3398, 8863, 13318, 1456, -2390, 8555, 10246, -721, -1670, 8881, 7551, -4759, -4301, 6387, 4250, -6789, -4855, 3596, -1245, -10302, -5602, 2880, -3196, -11910, -6148, 1373, -4622, -10754, -3798, 1977, -5289, -9549, -887, 4333, -3474, -6652, 1853, 5198, -1916, -3337, 4926, 6370, -933, -1166, 7114, 7196, -632, -71, 7351, 6026, -456, 1314, 7164, 3855, -2557, 589, 6763, 3069, -3047, -259, 3951, -5, -3783, 1079, 4194, -1648, -5874, -569, 2924, -1874, -4365, 277, 1317, -3902, -4866, 989, 2017, -3793, -4810, -80, 551, -3714, -3262, 1172, 115, -4444, -3114, 1931, 587]
1710E87m306J755L876j543l044K546K798k469k619L428K996k568k330K525J951
1725C583k247j030L218P94l544j194L333J404l140j048K042k86k543M31K742r00
1741A615l341k28K491k68j901N0J393j389j758J432K230j291j941P49J429n31
1757a259p20J282N10j264p11J959J028j158q36J100N80r60K18J562k60j732J76
1774d85J610K41r51j74N50r9n89P07R84o90j220J62J168R6n47K00J37n74P6N69
1794A171Q53r07j026K84J88J85K34j58m34j122K55Q53Q7j122o78J42J28j11J16
1813a062J89p56o61K59O47J48m20l94k6Q5N74N94L8k08l03M85P77L19P7Q3j91
1834B54n2P67Q88j87l89l81N86L13j46J31J80q20m13M59P25k26j019l24K38K93
$$ y = [587, -3719, -1964, 1912, 369, -2675, -129, 2669, 200, -2419, 1009, 4005, 1437, -893, 1632, 3583, 1336, 306, 3524, 4318, 774, -420, 2913, 4317, 1177, 129, 2171, 1885, -658, -227, 2515, 1615, -1726, -1954, 537, 269, -1632, -1582, -189, -1578, -3336, -1904, 326, -965, -2906, -2157, -728, -1259, -1979, -697, -187, -1451, -2162, -203, 825, -333, -1169, -69, 511, -449, -231, 1331, 1071, -661, -485, 1125, 1366, 415, 241, 791, 692, 103, 810, 1794, 1104, -116, 46, 1214, 1310, 763, 963, 1100, 526, 602, 1171, 2024, 1117, 91, 375, 563, 748, 982, 824, 390, -732, -477, 376, 463, -659, -1337, -1195, -1067, -1178, -1062, -873, -1629, -2290, -2031, -1384, -1236, -1656, -2050, -2076, -1991, -1417, -823, -785, -993, -1296, -811, -34, 285, 362, 445, 254, 202, 969, 1857, 1670, 1281, 900, 1486, 1799, 1653, 1784, 1964, 1144, 731, 1190, 1915, 1689, 670, 346, 584, 877]
1854H77l66J93Q2r65q42P64Q09l47p02q4J5m47L46R08k15j394j15R56M74r22j05
1875a080Q20p26q96M65J516n22j806J07J540k77q28N70J007r88j040J631J500
1892I93r27j373J060J492n02q04J897R34k066n45K658J284k107j022K033L91j882
1909A514l3K585p01l422k92K806l46k985j02J904j800k837J230K696k057l355
1925e195J233L017k297k663K728K182k934j812L463K646l299k037M247K722l307
1940a306q65M285J416l949k8N333Q09m658j33M947m95m165R79M823k259n520J853
1957A067N010k609n176K217L974l890m920L656M156m904m884M541L814n002l941
1972f891N110K917n785k054O720J974o806j579P140J982o455K14O717q52o876
$$ y = [877, 511, 704, 786, -179, -1021, -257, 552, 205, -497, -581, -566, -1013, -667, 241, 26, -1368, -1483, -527, -53, -975, -1080, -260, -986, -1882, -1417, 99, -423, -2229, -2122, -582, -859, -1687, -1117, -110, -1098, -2138, -507, 993, 66, -1307, -247, 1245, 743, -61, 1836, 2770, 704, 159, 2817, 4101, 1994, 972, 3005, 3396, 1514, 1481, 4066, 3365, -57, -349, 2457, 2111, -874, -976, 928, -872, -3709, -2479, 217, -1840, -5195, -3962, -945, -3242, -5905, -3177, -995, -3929, -5741, -2278, 368, -2931, -4968, -721, 2001, -1306, -2171, 2114, 3530, -419, -447, 4886, 5695, 1037, 904, 5851, 5356, 1191, 2170, 6993, 4734, -786, 1067, 6077, 3468, -1708, 509, 4483, 593, -4327, -671, 3485, -1419, -6303, -1762, 2052, -2950, -6891, -1781, 1136, -4649, -6703, 17, 1991, -4815, -6394, 746, 2728, -3727, -3513, 3204, 2352, -4524]
1987d524K005Q162j276p310J822O851k986o226M655P025n216p250M658O634n428
2002A596n633O320M955p804n330P527M425p901l427Q001K204r490k495R374J831
2017D153q936m73Q732j372r901J951J0882j363r712J942Q344l952q032O259R935
2032H457o209r847N536Q108n380o068Q024O249r806p480R372O893q140m975Q845
2047C579K729j1151k813J1640L087j0872k479J0035k68j0966J716J1919j389j1844
2061g077J804J0124l264r489N748J1030n892j1177N707R951n847p502Q669P710
2075A0495r993q711J0360Q248q960n960R993L382j2267l609J3265L979j2828l369
2089e975J0869L72j2198J384J2997j958j3975J126J2338k807j1512M837J1401
$$ y = [-4524, -2519, 5643, 4367, -2943, -1121, 5730, 2744, -3482, 1173, 8198, 2982, -4268, 390, 7024, 1596, -4037, 2283, 7238, -566, -5896, 1631, 6056, -1845, -5272, 2729, 4933, -4557, -7052, 2322, 4153, -4783, -5256, 3476, 2104, -7797, -5846, 5036, 3673, -6039, -4097, 4247, 295, -7737, -1478, 8457, 2248, -7599, -2063, 6045, 665, -5403, 2621, 8870, -936, -8416, 956, 7849, -291, -5266, 3579, 6308, -4843, -7656, 3984, 7071, -3801, -6280, 3755, 3487, -7479, -5763, 6156, 4767, -7077, -5273, 4851, 1587, -7902, -2154, 8876, 2984, -8193, -2486, 7465, 1618, -5884, 2785, 10495, 502, -8209, 2151, 10399, 1439, -4521, 5472, 8854, -3413, -7022, 6243, 10222, -2606, -5975, 4894, 5266, -6932, -5548, 7449, 5491, -8484, -7358, 4980, 2173, -9339, -4502, 6899]
2102F899o207j2045O244J1680o736j0242Q710R249r443r182J0318Q837j0072o920
2116h910J1199N681j2045m660J2982N046j2577l772J2423K323j2800l61J3891
2129H420k42j3786L10J3350j543j2188L331J2057n317j2346N676J2413o401j1829
2143h095P152J0185q955r593R847Q746j1010q630J1175P068j1663o253J1793N130
2157F897j2954l776J3269K799j3222j921J3805P65j3162P09J3559j775j2791L500
2171d298J3224m058j2573N317J2588o046j1303P310J0791q512r851R689R171j0205
2185A244r063J0443P656j1214o592J1599M980j2695m552J2581L373j2801k959
2198h000J2297R17j2614K06J2456j257j2791J946J2326k938j1713L928J1174n164
$$ y = [6899, 692, -11353, -5109, 6571, -165, -10407, -1697, 7552, -1891, -11073, -755, 8082, -1990, -8910, 2289, 7970, -4075, -8735, 4247, 9293, -3284, -7056, 5367, 7690, -5110, -5471, 8420, 8178, -5608, -5298, 8052, 6509, -5679, -2348, 9709, 4392, -7954, -2278, 10135, 3734, -8095, -943, 9242, 287, -9306, 541, 9287, -1723, -10353, 822, 7890, -3773, -10026, 1767, 6897, -6057, -9833, 3436, 6235, -6987, -8908, 4897, 5662, -7500, -6791, 6768, 4993, -7798, -4298, 8926, 4868, -7705, -2388, 10200, 4154, -7149, 161, 10952, 2440, -7411, 2278, 11449, 1244, -7819, 2624, 10280, -934, -7526, 4073, 9053, -3642, -8194, 4387, 7760, -5041, -8000, 4297, 5214, -7400, -7194, 5262, 4005, -8786, -6840, 5486, 2548, -9165, -5237, 5937, 773]
2212G73j0611O382J0448p226j0051Q341R284q333p889R244O837r488n904J1069
2226B876N766j0908m587J1171L861j0750j749J1350J399j1779m45J2072l79j1054
2240c156J358J0371k503j0790L496J0433m796j0278M775Q713o085r065O174P685
2254F332p482p866P647O036r113n692R290N079r271m422R072L321r052j553J0269
2269B595J746r957r45R880J377q370J520R091k326q872L017R515k495q173L302
2284I05P054m734o775N167O972n942o880N337N051o290n032O767L900p448m240
2299f188O904K565p640j952P946J346p953j362P447O59o657J241P238j745p594
2314e745J620P697r35n970K318N309l667n274M616O143m144n350L551L990m474
$$ y = [773, -9838, -3456, 6992, -234, -10285, -1944, 7340, -993, -8882, 362, 7199, -2289, -8193, 2876, 8642, -2266, -6853, 4318, 8179, -2571, -4320, 7030, 8429, -3350, -3795, 8277, 7898, -3156, -1798, 8573, 6070, -4720, -1224, 9209, 4413, -5865, -1090, 7623, 1538, -7527, -1353, 6332, -1150, -9016, -1369, 4667, -4446, -10138, -848, 4231, -5040, -9462, -390, 2931, -6121, -7674, 2595, 4341, -5616, -6561, 3319, 4696, -3674, -2154, 6937, 4611, -4261, -1244, 8271, 5776, -2397, 905, 7959, 3225, -3550, 1617, 8589, 2647, -4233, 1104, 6155, -135, -5167, 1600, 5500, -1948, -6188, 716, 3281, -4359, -6311, 1635, 2981, -4972, -6334, 1113, 1772, -4885, -3644, 3594, 1849, -5745, -4125, 3572, 2637, -3333, -1015, 4294, 627, -4647, -31, 6112, 1968, -3382, 169, 4159, -315]
2329c15l152N935K815o081l565N289K499n060j327N408Q81o164j132N975M27m846
2345b413K21N213j141n307R21N462q92m529J720L728k592m097K875M688k281l828
2361b252K156K262k880j865L917K614l987l278L393J936k777o65L531K21m502
2376b176q34M126J131l297k17K605p88l269R87L633o96l230L52K875j299k100
2392b197J421K704j689k385J571J938j907j524K464J520k038j463J871J248j763
2407b29j94K378M24k690o26K541O34j613k41J424n06k008O28K272l44k248k76
2424f74J423n88r72N18J164j307j421O84J536q93j104N29N90q35l04J166N87j264
2442a165o20J153O97o64l58J055j27o22L93R25M6j290J33J268M7p43J94O16m22
$$ y = [-315, -3467, 2468, 5283, -798, -4363, 926, 3425, -1635, -2962, 2446, 3327, -2837, -3969, 2006, 2433, -2413, -2192, 3021, 1880, -3427, -2506, 2956, 2064, -2465, -745, 2983, 391, -3706, -831, 3857, 1576, -2252, -96, 2166, -714, -2579, 1338, 3952, -35, -3313, 80, 2016, -761, -1426, 2105, 2326, -2176, -3010, 1116, 2247, -1050, -1267, 1338, 550, -2719, -1732, 1901, 1205, -2025, -1673, 1202, -97, -2197, -776, 1928, 239, -2146, -575, 1363, -544, -2068, 396, 1916, -122, -1585, 286, 1534, -229, -423, 1955, 2379, -311, -937, 1604, 2238, 625, 384, 1808, 1302, -706, -78, 2194, 1850, -398, -674, 749, 161, -811, -293, 871, -436, -1857, -1173, 363, -530, -1634, -1105, -515, -1350, -1654, -488, 99, -1165, -1785, -632, 65, -599, -957, 98, -29, -651, -258, 667, 713, -577, -444, 824, 871, 128, 322, 938, 516]
2461E16m74L73J067n03r25k62J108q9m66K67J24l88n95O04N69m77n14J92o7k06
2481a46L88L7k24p72r0M81L59l88j27k82L9j81K90P21n77m40o1N18K69k45R9J06
2503b26k05JL57L22J54m37J22K27K46M50o9m95J91L2M75P3j90k13j08j8J42K35
2525A066j25l35n55K38K15J31m61k92j51p7j32J85K68n61o00j12N07Pj49j58k18
2546a309O5kK91K91m19j68J43K83J32N47j79m79J72K44O26m6j04r4K98K20J9M69
2568A000J54m06o29O29N04m6l09j35O1k46P6L16J10n09m98L52L19m21j16n1k52
2589i7k50L12K52j68q35o5P08J25m07MM5m36k59O75P35l17j216J75Q25j9j31M65
2611A21M56j207k36O09J006l44n67K36nm59J96R17P2r56l93R27M09j105L08P21
$$ y = [516, 42, 415, 1482, 979, 54, -208, 900, 811, 345, 612, 736, 348, -247, 357, 926, 449, -65, 127, 60, -146, 242, 279, 55, -717, -807, -326, 33, -355, -482, -764, -725, -906, -616, 105, -472, -912, -973, -455, -186, -431, -332, -226, -431, -430, -73, 249, 403, -34, 88, 315, 561, 1011, 942, 447, 638, 670, 1145, 1218, 1028, 815, 707, 689, 831, 1066, 941, 606, 51, 289, 504, 635, 174, -118, -269, -346, -478, -293, -25, -586, -1186, -1298, -791, -784, -933, -1091, -1309, -1244, -1246, -955, -664, -1083, -1251, -1108, -825, -693, -146, -325, -804, -632, -388, 238, 192, 88, -6, 292, 512, 531, 1000, 1154, 748, 119, 748, 1252, 1206, 897, 762, 823, 577, 653, 969, 1079, 570, 72, 424, 743, 322, 206, 155, -97, -347, -35, 217, 49, -786, -851, -143, -18, -425, -421, -376, -812, -1071, -396, 339, 22, -1194, -1019, -194, -213, -344, 121, 577, -630, -866, -257, 749, 405, -162, 74, 69, -390, -194, 723, 795, -161, -554, 373, 782, -323, -15, 706]
2631G06k74o43K67J300q48j083O53R99l44r05L90Q88j123m82J367Q18j635j091
2649a040J121Q33r01m18R19Oj581o08K003M53j491o24R98j64j107N39J660o31
2667c3j774J49J666j40j448P77J347q87j449J454J382j403j048J541J466j338
2683B62j410J820R14j602m71J964R50k344q60J868R28j541l85J794o08k435N53
2700f03K559l72k199j00J819r03j641J408J646j539k230J294J851j468j529J562
2716d45J512k073j215K323J162k295j120K601R33k350r56K274O27k286J79K710
2732A581k29k810JL057m8k449O12K208j257k388J760K806j378k557J177J948j642
2749C92j382K257J571k802j992K576J897k635j292K324O32k858o16K817O24l219
$$ y = [706, 432, -211, 56, 1356, 508, -575, 78, 1077, 733, -172, 218, 1106, -17, -499, 868, 1686, 51, -1040, 81, 914, 13, -405, 514, 520, -1061, -1669, 334, 787, -704, -1328, -330, -494, -1601, -1062, 598, -33, -1807, -1658, 8, -132, -1580, -803, 544, -343, -1792, -338, 1044, -359, -1407, 134, 1600, 262, -1148, 672, 1586, -16, -487, 1477, 2427, 83, -777, 1091, 2019, 478, 93, 1887, 1279, -1156, -603, 1956, 1584, -615, -715, 1104, 201, -1440, -32, 1614, 75, -2155, -861, 990, -478, -2007, -445, 1067, -1006, -2221, 102, 1264, -1031, -2151, 450, 1383, -967, -1923, 351, 978, -1308, -1129, 1581, 1352, -1458, -1457, 1600, 1552, -897, -285, 1923, 666, -1722, 38, 2844, 1466, -1091, 86, 2034, 392, -990, 1267, 2838, 36, -1956, 620, 2517, -118, -1410, 914, 1546, -1312, -1928, 889, 1513, -1706]
2765a706p54K673L41l087J88K704m84k865P24K810j184k765J388K890j323k339
2781b789J629K391k152j586K750K070k478j989K729K231k284q84K607R17l246
2796h4q63L864P64l052o77K702k01l046R10L185j236l498M04L116j173k649J178
2813c56K442k217k693K173K313k214k325K003K020k300j957K721J969k872j413
2828b706L361P43l046r76L422J052k989n45K673L33l695R48L718o89l400J09K876
2845A189m69k389J501K469k078l307J999L346j400k347J560J462k491j659L450
2860H36K270l036j967K464J395k659m48L116M41l663o47L036O28l052N13K945
2876B172p83l557K70L503q66k495J133K484j997l079J719L325j222k282J249J509
$$ y = [-1706, -2460, 213, 554, -2533, -2345, 359, -125, -2990, -2266, 544, -640, -3405, -2017, 873, -450, -2789, -1160, 1231, -921, -2507, 243, 2313, -165, -2154, 575, 2806, 522, -362, 2245, 3162, -84, -947, 2917, 3681, 629, -48, 2654, 2453, -593, 317, 3502, 2266, -1232, -828, 2288, 1115, -1534, -356, 2086, -131, -2824, -651, 1662, -552, -2877, -874, 1146, -1154, -3111, -390, 1579, -1293, -2706, 655, 1398, -1648, -2624, 798, 1850, -1139, -1684, 989, 1322, -2373, -1425, 2293, 1604, -1796, -1687, 1189, 720, -1669, -168, 2301, 223, -3084, -1085, 2261, 861, -1486, 74, 1536, -955, -2614, 836, 3106, 70, -1897, 567, 1962, -697, -1145, 1971, 2412, -1251, -1898, 1138, 1766, -1286, -773, 2172, 1389, -2168, -1898, 1605, 739, -1756, -623, 1861, -136, -3215, -1496, 1829, 607, -1675, -426, 1083]
2892A083k433j378L442K435l036k438J962J316j876K91L167K80m433r06L460J350
2908B286k206J40K224j447l700J452L935J34l190J08J759j838j962K499L010j867
2924A337l260J002J771j642p66K608J745l411k249K280J461j462l96K638j67l907
2940b418j064L573J416j900j20J576j689l108J534M320p5l023l86J206j268j037
2956b463K985K886k421l391Q34K049m36j46K231N51l361k082K744K409j199r36
2972B54J610m54l056l22M034P70k395p87J275p37j998J263L133o33k621o51J443
2989A28o38j038J915K112j916k959M08J946j11n46J590L88l097j498K361K272
3005A317p30j295Q56n50k004L84L238O01k202r22Q81K47r06J147K378j021k772
$$ y = [1083, -1350, -2728, 714, 3149, 113, -2325, -363, 953, -923, -632, 2535, 2815, -1618, -2524, 936, 2286, 80, 220, 2444, 997, -2703, -1251, 2684, 2818, -372, -264, 1495, -343, -2305, 194, 3204, 1337, -1923, -921, 850, -792, -1558, 1050, 2795, -616, -2865, -585, 876, -586, -982, 1656, 1489, -2418, -3482, 91, 1507, -393, -513, 1063, -626, -3734, -2200, 2120, 2045, -978, -1364, -158, -1426, -2463, 522, 3408, 987, -2404, -1570, 479, 43, -103, 2128, 2679, -682, -2764, -20, 2389, 1190, 254, 1864, 1410, -1646, -1968, 2066, 2836, 441, -346, 929, 192, -1806, -543, 2590, 1957, -664, -1315, 128, -510, -1548, 367, 2479, 563, -2396, -1988, -42, -153, -699, 891, 1279, -1818, -3316, -955, 1317, 587, -708, 148, -402, -2406, -2022, 1216, 1817, -385, -1307, -426, -179, -1085, 62, 2440, 1419, -1353]
3022a353K33K089J66r41R43R23j621j421J149J739n47j196Q86N06j562j018J898
3039H73R62j161r01P45j17j499P8J897K15j748n66N42p2q15R49J163p27j981M0
3058b123J692J10o57N15O41j212r52J404J527o48j029L87M44k86q3J026R97j266
3076D87p58R18O33o42J85O48k06q67L1J156k09q12P3O00m05q47K64N73m49p45
3096c72J96P61r10q97L84P51l65q71M62R3o54j83P18M97n27o15L46N28k15K59
3116f14M75j13p26M72N78M43m15j87M96j12k17P35M31l10l64k6N91j74k51K40
3136I52K13l76m77N35J48l58n44J57L62j50l41P9j1m86j47O26K6p04q4O2K44O
3158b68L0r0m9k44L04J39Q4k69j11N1L33k73K07K82l45n53N89J68r6M6j74j41
$$ y = [-1353, -1120, 969, 1135, 194, 1137, 2060, 439, -982, 167, 1906, 1359, 163, 1049, 1555, -7, -1025, 873, 1835, 674, -227, 518, 401, -1098, -1020, 877, 1092, -656, -1222, -680, -752, -1567, -618, 545, -182, -2163, -2123, -431, -321, -978, -463, 178, -1034, -1986, -582, 945, 297, -732, -345, 99, -187, -270, 756, 1753, 487, -271, 647, 1280, 638, 823, 1471, 1265, 398, 429, 1585, 1376, 564, 637, 1237, 832, -15, 249, 822, 373, -372, -176, 585, -325, -1222, -838, -87, -452, -1323, -861, -768, -1422, -1605, -887, -390, -917, -1532, -1186, -658, -873, -614, -139, -252, -978, -506, 72, 515, 100, -87, 409, 297, 80, 815, 1246, 936, 572, 546, 1137, 963, 712, 952, 1165, 789, 312, 847, 995, 637, 93, 250, 612, 462, 121, 200, 189, -297, -444, 182, 208, -496, -580, -518, -274, -268, -238, -328, -377, -621, -317, -178, -94, -363, -474, -423, -90, -363, -156, 126, -219, -772, -183, -15, -111, -65, -239, -380]
3180c80l3K92L16Q1n84j17L06m3M47j72r8K98k49J75J88J3k13l08K33M17m3p3
3202D53j60j36j57M23Rj47l42j14k4J91P6K0j26m56r5K85J44l3l55k65L00K3O6
3225d20R7Nj60m8K83K9K04j8k18q4J82N27j00r6K47l97J77J99KJ53r1k19mJ77
3249D27M79m36R8q5k32J45M42k16j37q1o8jP4j3k96k41j29K83k0J5j90j77l24
3272f83K03J07n2k44o8k53K04K19Q5l00l53M3M88J95k49K46j03j08J58M41J50
3293A26j01l08N46l6J34LK12j05o5P4M23j5k29k2NR1l0l2L7k63l85l0O47l29l73
3318b5p7r3j01j61M91l50k55l60K48M42j31k21J79j44l40J76O39k2m20k46M23
3339c48K72n7k37M78j33k00K9P51m77k20L85q4J21m33M65R1l19j15L92L03m36
$$ y = [-380, -413, -121, 195, 276, -308, -425, -119, -162, 285, 113, 15, 313, 64, 239, 427, 440, 227, -81, 152, 569, 526, 453, 293, 157, 0, 423, 432, 285, -57, -171, -195, -4, 72, 92, -34, -490, -585, -300, -156, -189, -544, -809, -509, -486, -420, -323, -318, -478, -526, -243, -214, -10, -28, -246, -330, -148, 379, 279, 183, 430, 33, 210, 409, 411, 564, 473, 254, 250, 427, 906, 470, 568, 483, 251, 396, 838, 622, 485, 404, 336, 335, 409, 396, 100, -141, -270, 13, -7, 8, -182, -359, -683, -480, -373, -425, -669, -737, -990, -786, -567, -482, -782, -1135, -1092, -604, -409, -658, -412, -515, -623, -465, -24, 126, 25, -283, 263, 227, 361, 364, 576, 471, 406, 480, 903, 888, 659, 637, 642, 733, 703, 671, 708, 445, 60, 30, 677, 348, -25, -102, -195, -296, -457, 34, -316, -571, -931, -683, -241, -372, -593, -414, -558, -898, -722, -83, -105, -525, -771, -348, -76, -133, -370, 108, -25, -225, -196, 555, 78, -142, 243, 159, 280, -153, 312, 403, 84, -31, 361, 664, 228]
3360B28l64M72J25j63K32L09p0q19p0O91L22k76k96L08l17m58K86P74n21o93k12
3381e12P18j00l88J73K89o83n26L85N64l84n17L41J57m26j92N79L8m19k15N62
3401e56M98n30j18O50J89m46N7N44Q0n08K76Q99l3q32k5N60j86j51K71N81n96
3422F24p65L52N73j82l78J63P4q90j1N66N70o21p27J93M66o29J7N46mp55j44P81
3444a81L26m27j29N26k21m94K61R27j13l55k19O38l25o03R18M97m43n25J94L75
3464F27o04k93O79N86q46p58K45N57l43K5P88j36j301l98J052P69m49r7K76p16
3484c37q63P58J289K30j118k09l9k4k49Q34J050j005j251K45O05j92k0N73J43
3503D20j074q51O43J023l75r0L43k35j091q5J160N48k36l05J39q72l03O70J565
$$ y = [228, -136, 336, 461, 298, 530, 839, 769, -50, -120, 571, 893, 617, 321, 629, 312, -146, 140, 914, 393, -300, -512, 206, 106, -282, -109, 180, -503, -1029, -644, -80, -464, -981, -640, -483, -909, -1101, -522, -484, -903, -1118, -556, -58, -588, -706, -56, 133, -313, -256, 288, 368, -140, 136, 1035, 1002, 170, 145, 705, 519, 368, 639, 1220, 624, -141, 211, 784, 602, 224, 387, 461, -429, -440, 126, 696, 75, -652, -459, 7, -622, -605, -59, -63, -818, -962, -181, 145, -282, -411, 115, -106, -600, -339, 588, 475, 120, -99, 539, 214, -389, 529, 1026, 583, 58, 252, 627, 23, -270, 409, 995, 149, -609, -364, 193, -150, -125, 663, 527, -774, -1172, -120, 649, 200, 103, 379, -337, -1200, -442, 847, 1077, -41, -250, -289, -313, -562, 272, 1322, 317, -934, -689, -84, -276, -296, 277, 420, -654, -1505, -862, 161, -214, -304, 39, -196, -1287, -1372, -212, 336, 100, -205, -66, -938, -1241, -571, 994]
3522I94m6q50n79L47j3L7J131R52j001j194k50O87N02L07L77r8j166r17P56J342
3542A318M3m42J57n69j004QR86P71r71o13R6k44n63L56R77J37j076n44M96l69
3562a050l47Q68N74k22j039m01N59L53J69O66N36p98j309P70O85N69j3J98k4r00
3582a56m87J196J087l88l38m8l21m67J75R90Q4n91m64J00j07n98K90O87j6q65
3602b37m05Q2j98k59O71N37j88j155j21L06K63L52N83J74j052r13M72J029L63
3621C04J66j8m66o85j81J142R58l73k69l13k44n41N09J164K44r12n27M1k12RO96
3642D92O95n82p73o49L59K19L62Q38j41p72r81k80J106M69K93Q0o04j033n42J169
3662b75Q41L31n79n58q35j48O19J178M89p30r20k63J43L52Q52K91m67r60k68N39
$$ y = [994, 948, 98, -481, -134, -147, -110, 1021, 1973, 972, -222, -472, 215, 717, 1024, 1401, 1303, 137, -780, -24, 1318, 1361, 919, 1076, 507, -497, -489, 497, 1268, 297, -316, -220, -464, -1027, -671, 306, 443, -633, -1177, -681, -1050, -1397, -529, 45, -177, -1216, -1617, -1058, -705, -536, 130, 666, -132, -1441, -671, 14, 583, 570, 768, 744, -156, -643, 553, 1640, 1252, 914, 866, 545, 78, 253, 1243, 1327, 736, 272, 372, 265, -333, -43, 644, 628, -237, -642, -560, -758, -1017, -346, 191, 3, -1152, -1273, -967, -704, -352, 231, 405, -647, -1560, -1088, -59, 304, 470, 452, -14, -699, -880, 262, 1220, 847, 578, 265, 21, -520, -11, 1153, 1397, 485, -42, -1, -213, -204, 492, 1187, 605, -168, -817, -458, -239, 123, 961, 820, 48, -933, -1213, -107, 362, 655, 735, 131, -902, -1444, -275, 566, 897, 318, -240, -1075, -1223, -604, 574, 1063, 333, -587, -850, -707, -355, 497, 788, 321, -639, -907, -368]
3682c68L55J5N83J15r10m76K00O57K86J7j24k29n60k47P44P28J3l27l11m10j17
3703c66K97J028r7l48n07l12J04L19O12L54o55q48l35K62N73M4L23j86p66l99
3723i03N44L40J23j17j97k04l08J26K35N86j84m36Jj08P2N0M44J39j16l78j1K50
3745e2k49N76L65j01m51j38J27K86R0J55P3n40k80J69K92L07p4k83l04j35j9M50
3767B64K8k3m61k64N3M19j29J74l5l19j48K97J37kp5J42j08j81p3L11o2J35k2
3790E8q4K05m00J54j9J71q0kl7k17r3R9K36K1l8l72J4PJ86J93L56k03k62J56K97
3815C46J67r8l4j60Q1l4J93J00o8l7O1j54J27rj16n9k66M6J18l88J25l19J42m5
3839b81k43ok70M4J26j34M5J14k24k3J77OL17O7k8K0j14L19K07J72r4j00J98L3
$$ y = [-368, -13, 2, 585, 700, -210, -686, -486, 171, 457, 474, 350, 121, -439, -686, 58, 786, 799, 472, 161, -249, -366, -69, 959, 862, 514, 7, -305, -201, 118, 730, 1084, 429, -419, -754, -492, 81, 125, 448, 262, -504, -903, -359, -19, 104, -13, -210, -414, -722, -596, -361, 225, 41, -395, -394, -502, -430, -380, 64, 203, 87, -291, -302, -52, -301, 275, 640, 539, 88, -50, 77, 363, 453, 608, 681, 141, -139, 30, 322, 629, 555, 272, -32, -167, -186, 264, 292, 269, -192, -456, -403, 16, -113, 61, 26, -293, -441, -144, -7, -9, -84, 58, -50, -231, -304, 7, -55, 80, 58, -26, 179, -221, -67, -86, 85, 5, 3, -34, -251, -344, -245, -9, 12, -26, -398, -384, -377, -191, 2, 358, 155, -107, 49, 346, 513, 415, 381, 221, 302, 268, 461, 561, 493, 456, 517, 363, 490, 481, 365, 306, 40, 86, 204, -184, -59, -378, -236, -281, -524, -530, -800, -756, -630, -764, -719, -605, -829, -852, -675, -669, -352, -285, -313, -293, -407, -88, 119, 291, 197, 97, 295, 328]
3863C28K87j2L34k30j24k3K96kJ5k28l13J3k3K21j01m1l40J7k9J19j11k80l3k76
3887e36Q2K84J2m88l9K71k9j89M7K3J7L3m6K42k9n5O6O1o7M09o3k51K70p4J22
3912G3K91j15Q3J6no6J74K98l9k86L0J4J62k47J9K5k27m2L7J71r9k69qr8m5J50
3938cl18q2j75J60P5J26q8j74j7p2K83J87m1k51J0J71J95J04j72P2M0K66j39J07
3962B64J07j47P6m2l5K11J32l88j36O6j10K96j85k07L5J33O9j34k8ko3j21J63
3985d6j0J09p8Kr3P0J17Q6M2l35J43P8J22J33k27rj94J45jN2O8k40k09J19Q8M7
4011b1k21J28k70J17O4N6j49R0l65K01J94n1L2O3m2q4J44K93K26l22j22K96OL6
4035B99j1J81j09k53K09K31j55j28r1Q1J17l11K90j02k88r2O1K15j17n5j94n7
$$ y = [328, 615, 603, 937, 707, 583, 560, 856, 854, 869, 641, 328, 341, 318, 539, 438, 397, 57, 74, 45, 164, 53, -227, -260, -536, -454, -170, -158, -646, -685, -414, -443, -632, -585, -562, -545, -512, -558, -316, -345, -400, -334, -273, -340, 69, 6, -245, 25, -49, 73, 364, 249, 332, 348, 343, 277, 451, 749, 710, 424, 454, 468, 630, 383, 402, 427, 200, 158, 195, 366, 267, -2, -10, -108, -153, -3, -321, -403, -578, -418, -343, -217, -305, -479, -496, -568, -285, -98, -139, -390, -380, -209, -14, 90, -82, -10, 30, 296, 157, 264, 371, 224, 300, 258, 223, 434, 566, 178, 42, 108, -2, 294, 109, -98, -63, 70, 139, 5, -23, -25, -88, -209, -46, -56, 53, -25, -23, -116, -46, 71, 157, 199, -136, 7, 85, 207, 340, 113, 104, -90, 55, 54, 106, 174, -66, -275, -156, -68, -21, -242, -114, -384, -267, -203, -147, -296, -206, -571, -370, -176, -227, -195, -132, -174, -258, -114, 179, 405, 83, -39, 257, 263, 299, 288, 469, 360, 107, 316, 547, 392, 264, 173, 254, 371, 60, 350, 248, -40, -132, -71, 144, 27, -28, -222, -279]
4057b79o4n4L11P9n32l0L69R1N8k70K05k14O2%J67N3j56K8J64J80l03J69j34R3
4081gm3N0K00Qj08k88M80k21L7P6K2k39p0M05K05l33n7M7j98K29L8K19j58k69
4105B5k3R6J95k84J73K73J9p41J70M63l07J42j01J79l28l08k3L00j71r0K91r0
4127a40n49k77N06J59J73l10J24j21m03L93N56J35n00k2r4L48L63K45J30l37l21
4148E8M3M91R3p3J33m1l72l85L14M88r6m41oQ6m19N5N5N59l75m25N0o2m82K60
4172d92M68J30n16n35K63O8N6N05L94l38r33k5Q13L88Q8p6n4m01o82L84J065L60
4194I30q51p1m5l19L21P05M12n56n92M2K24k46L62N70j77p54k73K68L63l61M18
4215C70L49n65o50k06O91K97j84O2j41k95q47O98Q14J81n29l93k9o11N6J064N38
$$ y = [-279, -343, -397, -86, -7, -539, -569, -200, -109, -51, -321, -116, -330, -268, -268, -101, -48, -204, -176, -12, 168, -135, 34, -100, -7, -50, 0, 200, 208, 100, -188, 292, 71, 108, 184, 206, -33, -103, 302, 507, 174, 117, 164, -34, 195, 233, 452, 294, 25, 2, 98, 293, 9, 182, 455, 474, -267, -97, 366, 59, 201, 100, 279, -49, -357, -380, -80, -251, -341, -50, -140, -689, -966, -460, -301, -128, -438, -314, -435, -838, -445, 111, 246, -254, -276, -370, -22, 341, 586, 716, 379, 58, 101, 592, 685, 612, 745, 704, 332, -53, 261, 749, 653, 212, 206, 292, -127, -72, -17, 542, 167, -258, -208, -270, -752, -492, -24, 106, -410, -945, -682, -614, -558, -53, 341, 3, -930, -955, -142, 246, 334, 258, 204, -197, -879, -495, 570, 930, 79, 8, -37, -356, -35, 670, 1082, 526, -66, -24, 200, -46, 316, 886, 709, -45, -318, -50, 313, -48, 370, 719, 154, -496, -702, -11, 286, 102, 164, 23, -272, -1119, -421, 393, 574, 45, -348, -377, -988, -932, 132, 670]
4236F70o41q04j7K20P7N95N10k72q32l82N17O58J8M2J79o02n35J51R86N18o57
4257C99M4J57o42m19Q24N05j1o41k59J90m59k1O40N98o52q64r4N10JL15N68j55
4279E34j275m95N77P31R9K15Q6o80j169P49R73M33o50j89J5p27q1Q03J154l04
4299G99j211j87M24j74J42P91K41n68r25R6N11J00L85L06r9j058m01P52N08j16
4319C16K13r9n24j018N82J247M31n82j77m03p92j72J313Q26k49j008p07K89J7
4338d97L23R24M19j324j070K07O95K58K33K49m33q41m09Q78Q21j31l25p8k03r39
4358a243M68J240K07m78k62o9l84k85R35J045m24p86j53K3L1L12N59O49j300j032
4378i47M01P59M58K9J4k90j117k45R47P18k55k32l30l90l53O33P84k1n57n60K99
$$ y = [670, 29, -775, -792, -572, -495, 100, 610, 338, -494, -876, -359, 299, 317, 359, 538, -64, -599, -448, 538, 1056, 399, 443, 600, -42, -461, 363, 868, 857, 216, -43, 147, -312, -333, 307, 905, 253, -611, -705, -195, -194, 121, 689, 534, -741, -1236, -659, 72, 171, 386, 472, -208, -1377, -628, 345, 778, 128, -61, -46, -773, -854, -51, 1103, 799, -412, -599, -175, -349, -207, 584, 825, 257, -668, -572, -61, 39, 424, 730, 631, -427, -828, -76, 432, 316, 529, 430, -94, -1112, -530, 717, 1148, 566, 389, -14, -806, -978, 335, 1161, 912, -96, -803, -514, -497, -174, 750, 1169, -155, -1225, -1018, -323, -65, 168, 417, -16, -857, -1266, -388, 433, 302, -23, -101, -304, -1243, -775, 465, 672, 194, -68, -137, -521, -806, 129, 1174, 750, -36, -189, -166, -135, 177, 736, 1385, 85, -947, -546, 213, 671, 700, 714, 424, -693, -938, 9, 727, 472, 240, -90, -480, -833, -200, 584, 563, 6, -554, -255]
4399b55k15l1O55M16o97n58O4M41Qj16K89K53m74o41L47Q23k56k84L90L65n98
4420g4n94O17O08k71ll7p9o22M01O25M4m42j60n3n0j0N47L90n34o04J20M66m1
4443B44j48J78J99o39k00K75K92j67l99J14M08n45j2J23K65m18N1J93L05m18l16
4464f15L52L23m40J08M53l34l26J81N81l0n01J58J92p6J6J65L03l24l70M19L95
4485F30l32l33M18o5k24j04K51J56k45l00K97K99m01j59Q6J75l21K01N8J20n06
4506b99n4K97O1j69J47j24l36n3M90M9j19j37R6J43l38N8K37J00m11k91P00m7
4528@k07L6K61J53m46K47J81J90m19N1K61j00j0o5M74m19n9K64J97k21m24N9N7
4551F1K99j49o5m5l22PL16j29O4k80o5K34k13J14L3j88K4j5K53lm2k71K41j41
$$ y = [-255, -470, -501, 154, 570, -127, -685, -621, -180, -172, -288, 1, 254, -220, -861, -514, 309, 53, -231, 159, 524, -74, -668, -51, 557, 286, 283, 246, 167, -455, -54, 571, 615, 173, 13, -40, -90, -100, 447, 837, 303, -301, -181, 285, 244, 96, 274, 473, -166, -366, -91, 201, 34, -365, -251, 157, -388, -400, -277, -12, -430, -379, -186, 119, -299, -615, -263, 60, -380, -272, 181, -153, -479, -298, 283, 253, -248, -90, 102, 26, 42, 207, 510, 186, -184, 235, 630, 298, -35, 383, 318, 94, -10, 241, 397, 152, -148, 149, 448, 47, -112, -26, 149, -172, 29, 87, 207, -299, -353, -56, 5, -164, -17, -141, -477, -530, -40, 9, -110, -247, -151, -8, -346, -288, -51, 49, -362, -653, 47, 0, -207, -171, 90, 243, -203, 44, 225, 415, -4, 47, 308, 208, 198, 133, 607, 188, 129, 393, 590, 369, -55, 4, 61, 360, 211, 146, 101, -221, -214, 102, -27, 37, -243, -308, -74, -287, -173, -140, -328, -304, -319, -66, -69, -111, -382, -141, -282]
4575b82J52J32P4j12j29M0L9J14O5O1j63O6J6J75O0k12rl8J07J44l2n0j85K21
4599B54J5P1L8k25m2j90P1J68o3m7Q7l75J11Q8m7P7j53J4N8O7o7K36k66j76R2
4624b04J84k92M57j95k23mK85K1j12J7l22J57J94J15R5l36K55k89J36J91N3k70
4646h7j95P5M21n3N6j8k29K2J73L5J46j27l09J01K03m0O2j91K4j72L75J04m0k26
4670A10m9j03m1J0J87j15k31R9p4P4P4q3q4j50K1J55K74ml85o9r0L34L9j15Qo9
4696b77L06m8P8P0k94J53k5P1M15r9j74j39nJ55J78r0Oj20J1o8J66K6m7j19k38
4721a08K42J45n4m6k20o6k71M08O2j17r8j20n1J67K0k5r8J13r1J35J60l57M4n7
4745b83K98p3k33K73k15rJ57J81N2k40N2K33k62R7P6K45k39j28O5K60M6j16j7
$$ y = [-282, -130, 2, 76, -36, -165, -125, -86, 28, 93, 154, -9, 57, 73, 248, 308, 96, 87, 49, 156, 300, 268, 218, 33, 254, 269, 340, 378, 153, 111, -79, -8, 160, 97, 50, 137, -238, -127, -39, -86, -9, -162, -148, -90, -23, -90, 146, -120, -296, -204, -20, -312, 145, -50, -273, -277, 8, 29, -83, -66, -388, -231, -37, 78, 173, -163, 92, -197, -61, 130, 183, -87, -282, -207, 214, 161, 217, 199, -30, -8, 165, 200, 346, 219, -90, 11, 214, 174, 236, 45, 69, -103, 272, 376, 336, 110, 61, -42, -83, -73, 114, -1, -232, -133, -207, -133, -59, -142, -226, -376, -355, -200, 74, 70, -315, -384, -474, -140, -101, -216, -208, -277, 29, -19, 59, 129, -165, -12, -37, 34, 449, 350, 176, 37, 32, 187, 365, 275, 281, 161, 172, 104, 270, 296, 249, 130, -108, 134, 279, 225, 179, -41, -107, -378, 30, 92, -25, -123, -243, -294, -127, -107, -132, -230, -117, -208, -73, 87, -270, -226, -283, 15, -58, -291, -18, -233, -242, -85, 96, 148, -92, -40, 193, -69, 28, 104, 349, 110, -18, 47, 307, 353, 237, 220]
4768B20j9j03P7J68O2j67j04K02k8j38nQ7jk51j84L08J04l01j62K45M0j28r7J56
4792a9p4l84J40M33k98l02L02N0m9j7K93n8j78l24N42K18k95j22K14k08r5M19
4814A88L48l5n50j7K02K29p3k61N33l64n89K52L87J56m50r3J69j00k88M71K71
$$ y = [220, 201, 98, 175, 343, 405, 238, 134, 336, 308, 170, 165, 252, 251, 0, -184, 124, 228, -73, -235, 10, 50, -78, -175, -19, -93, -477, -337, 96, -202, -504, -202, -152, -201, -218, 75, 17, -161, -485, 57, 275, -20, -142, 72, -136, -231, 188, 536, 501, -49, -66, 136, 365, 292, 31, 564, 200, -389, -137, 250, 406, -44, -137, 32, -68, -356, 115, 386]
$$ [...]
8191f2
##END NTUPLES=NMR FID
##END=
