##TITLE=1H_BAU-j-LNO2
 CDCl3, 8 sc, 
 1.7.2019
##JCAMPDX= 6.0         $$ Bruker NMR JCAMP-DX V2.0
##DATA TYPE= NMR FID
##DATA CLASS= NTUPLES
##ORIGIN= UXNMR, Bruker Analytische Messtechnik GmbH
##OWNER= root
$$ XWIN-NMR		Version 3.5
$$ Mon Jul  1 14:14:00 2019 Russian Standard Time (UT+4h)  she@DPX200
##.OBSERVE FREQUENCY= 200.13155
##.OBSERVE NUCLEUS= ^1H
##.DELAY= (6, 6)
##.ACQUISITION MODE= SIMULTANEOUS
##.ACQUISITION SCHEME= undefined
##.AVERAGES= 8
##.DIGITISER RES= 18
##SPECTROMETER/DATA SYSTEM= spect
##.PULSE SEQUENCE= zg30
##.SOLVENT NAME= CDCl3
##.SHIFT REFERENCE= (INTERNAL, CDCl3, 0, 15.7039)
##AUDIT TRAIL= $$ (NUMBER, WHEN, WHO, WHERE, WHAT)
$$ ##TITLE= Audit trail, XWIN-NMR		Version 3.5
$$ ##JCAMPDX= 5.01
$$ ##ORIGIN= Bruker BioSpin GmbH
$$ ##OWNER= she
$$ F:/spectra/data/she/nmr/H-F/1/audita.txt
$$ ##AUDIT TRAIL=  $$ (NUMBER, WHEN, WHO, WHERE, WHAT)
(   1,<2019-07-01 14:12:52.96 +0400>,<she>,<DPX200>,
      <created by zg, POWCHK disabled, PULCHK disabled
       configuration hash MD5:
       00 E9 B6 7A A2 85 ED C7 34 08 36 98 17 FE 4E 26
       data hash MD5: 16K
       B1 0D 4F 70 6A 44 7B 49 32 15 26 6C F7 92 88 BA>)
$$ ##END=
$$ 
$$ hash MD5
$$ BC 11 EC BB 56 FC F3 DC 86 F0 41 16 EF 08 5D B0
##$RELAX= 
##$RELAX= 
##$RELAX= 
##$RELAX= 
##$RELAX= 
##$RELAX= 
$$ Bruker specific parameters
$$ --------------------------
##$DU= <F:/spectra>
##$EXPNO= 1
##$NAME= <H-F>
##$PROCNO= 1
##$TYPE= <nmr>
##$USER= <she>
##$AMP= (0..31)
100 100 100 100 100 100 100 100 100 100 100 100 100 100 100 100 100 100 
100 100 100 100 100 100 100 100 100 100 100 100 100 100 
##$AQSEQ= 0
##$AQ_mod= 1
##$AUNM= <au_zg>
##$AUTOPOS= <>
##$BF1= 200.13
##$BF2= 200.13
##$BF3= 200.13
##$BF4= 200.13
##$BF5= 200.13
##$BF6= 200.13
##$BF7= 200.13
##$BF8= 200.13
##$BYTORDA= 1
##$CFDGTYP= 0
##$CFRGTYP= 5
##$CHEMSTR= <none>
##$CNST= (0..31)
1 1 145 1 1 1 1 1 1 1 1 1 1 1 1 1 1 1 1 1 1 1 1 1 1 1 1 1 1 1 1 1 
##$CPDPRG= <>
##$CPDPRG1= <>
##$CPDPRG2= <>
##$CPDPRG3= <>
##$CPDPRG4= <mlev>
##$CPDPRG5= <mlev>
##$CPDPRG6= <mlev>
##$CPDPRG7= <mlev>
##$CPDPRG8= <mlev>
##$CPDPRGB= <>
##$CPDPRGT= <>
##$D= (0..31)
0 1.2 0 0 0 0 0 0 0 0 0 0.03 0 0 0 0 0 0 0 0 0 0 0 0 0 0 0 0 0 0 0 0 
##$DATE= 1561975972
##$DBL= (0..7)
120 120 120 120 120 120 120 120 
##$DBP= (0..7)
150 150 150 150 150 150 150 150 
##$DBP07= 0
##$DBPNAM0= <>
##$DBPNAM1= <>
##$DBPNAM2= <>
##$DBPNAM3= <>
##$DBPNAM4= <>
##$DBPNAM5= <>
##$DBPNAM6= <>
##$DBPNAM7= <>
##$DBPOAL= (0..7)
0.5 0.5 0.5 0.5 0.5 0.5 0.5 0.5 
##$DBPOFFS= (0..7)
0 0 0 0 0 0 0 0 
##$DE= 6
##$DECBNUC= <off>
##$DECIM= 24
##$DECNUC= <off>
##$DECSTAT= 4
##$DIGMOD= 1
##$DIGTYP= 9
##$DL= (0..7)
0 120 120 120 120 120 120 120 
##$DP= (0..7)
150 150 150 150 150 150 150 150 
##$DP07= 0
##$DPNAME0= <>
##$DPNAME1= <>
##$DPNAME2= <>
##$DPNAME3= <>
##$DPNAME4= <>
##$DPNAME5= <>
##$DPNAME6= <>
##$DPNAME7= <>
##$DPOAL= (0..7)
0.5 0.5 0.5 0.5 0.5 0.5 0.5 0.5 
##$DPOFFS= (0..7)
0 0 0 0 0 0 0 0 
##$DQDMODE= 0
##$DR= 18
##$DS= 0
##$DSLIST= <SSSSSSSSSSSSSSS>
##$DSPFIRM= 0
$$ [...]
##$SUBNAM2= <"">
##$SUBNAM3= <"">
##$SUBNAM4= <"">
##$SUBNAM5= <"">
##$SUBNAM6= <"">
##$SUBNAM7= <"">
##$SUBNAM8= <"">
##$SUBNAM9= <"">
##$SW= 24.9336996594482
##$SWIBOX= (0..15)
0 0 2 0 0 0 0 0 0 0 0 0 0 0 0 0 
##$SW_h= 4990.01996007984
##$TD= 16384
##$TD0= 1
##$TE= 0
##$TE2= 300
##$TE3= 300
##$TEG= 300
##$TL= (0..7)
0 120 120 120 120 120 120 120 
##$TP= (0..7)
150 150 150 150 150 150 150 150 
##$TP07= 0
##$TPNAME0= <>
##$TPNAME1= <>
##$TPNAME2= <>
##$TPNAME3= <>
##$TPNAME4= <>
##$TPNAME5= <>
##$TPNAME6= <>
##$TPNAME7= <>
##$TPOAL= (0..7)
0.5 0.5 0.5 0.5 0.5 0.5 0.5 0.5 
##$TPOFFS= (0..7)
0 0 0 0 0 0 0 0 
##$TUNHIN= 0
##$TUNHOUT= 0
##$TUNXOUT= 0
##$USERA1= <user>
##$USERA2= <user>
##$USERA3= <user>
##$USERA4= <user>
##$USERA5= <user>
##$V9= 5
##$VALIST= <valist>
##$VCLIST= <CCCCCCCCCCCCCCC>
##$VD= 0
##$VDLIST= <DDDDDDDDDDDDDDD>
##$VPLIST= <PPPPPPPPPPPPPPP>
##$VTLIST= <TTTTTTTTTTTTTTT>
##$WBST= 1024
##$WBSW= 4
##$XGAIN= (0..3)
0 0 0 0 
##$XL= 0
##$YL= 0
##$YMAX_a= 298709
##$YMIN_a= -274442
##$ZGOPTNS= <>
##$ZL1= 120
##$ZL2= 120
##$ZL3= 120
##$ZL4= 120
##$ABSF1= 10
##$ABSF2= 0
##$ABSG= 5
##$ABSL= 3
##$ALPHA= 0
##$AQORDER= 0
##$ASSFAC= 0
##$ASSFACI= 0
##$ASSFACX= 0
##$ASSWID= 0
##$AUNMP= <proc_1d>
##$AZFE= 0.1
##$AZFW= 0.1
##$BCFW= 1
##$BC_mod= 2
##$BYTORDP= 1
##$COROFFS= 0
##$CY= 11.3945322036743
##$DATMOD= 1
##$DC= 2
##$DFILT= <>
##$DTYPP= 0
##$F1P= 18.9103706918063
##$F2P= -1.10871071338519
##$FCOR= 0.5
##$FTSIZE= 0
##$FT_mod= 4
##$GAMMA= 1
##$GB= 0.15
##$INTBC= 1
##$INTSCL= 1
##$ISEN= 128
##$LB= 0.24
##$LEV0= 0
##$LPBIN= 0
##$MAXI= 10000
##$MC2= 0
##$MEAN= 0
##$ME_mod= 0
##$MI= 1.114404
##$NCOEF= 0
##$NC_proc= 0
##$NLEV= 6
##$NOISF1= 3.799351
##$NOISF2= 2.8
##$NSP= 1
##$NTH_PI= 0
##$NZP= 0
##$OFFSET= 15.70392
##$PC= 1
##$PHC0= -8658.757
##$PHC1= 13.80097
##$PH_mod= 1
##$PKNL= yes
##$PPARMOD= 0
##$PSCAL= 0
##$PSIGN= 0
##$REVERSE= no
##$SF= 200.130013532006
##$SI= 16384
##$SIGF1= 3
##$SIGF2= 2
##$SINO= 400
##$SIOLD= 16384
##$SREGLST= <1H.CDCl3>
##$SSB= 0
##$STSI= 0
##$STSR= 0
##$SW_p= 3612.71676300578
##$SYMM= 0
##$S_DEV= 0
##$TDeff= 0
##$TDoff= 0
##$TI= <>
##$TILT= no
##$TM1= 0
##$TM2= 0
##$TOPLEV= 0
##$USERP1= <user>
##$USERP2= <user>
##$USERP3= <user>
##$USERP4= <user>
##$USERP5= <user>
##$WDW= 1
##$XDIM= 8192
##$YMAX_p= 0
##$YMIN_p= 0
$$ End of Bruker specific parameters
$$ ---------------------------------
##NTUPLES= NMR FID
##VAR_NAME=  TIME,          FID/REAL,        FID/IMAG
##SYMBOL=    X,             R,               I
##VAR_TYPE=  INDEPENDENT,   DEPENDENT,       DEPENDENT
##VAR_FORM=  AFFN,          ASDF,            ASDF
##VAR_DIM=   8192,          8192,            8192
##UNITS=     SECONDS,       ARBITRARY UNITS, ARBITRARY UNITS
##FACTOR=    0.0002004,     1,               1
##FIRST=     0,             0,               0
##LAST=      1.6414764,     0,               0
##MIN=       0,             -274442,         0
##MAX=       1.6414764,     298709,          0
$$ Real data points
##PAGE= N=1
##DATA TABLE= (X++(R..R)), XYDATA
$$ plain form
0 0 0 0 0 0 -8 8 -8 8 -16 16 -24 24 -33 40 -48 58 -73 88 -103 120 -141 164 -188 219 -251 288 -328 373
28 373 -423 481 -538 604 -679 760 -846 943 -1048 1169 -1294 1433 -1590 1762 -1948 2155
44 2155 -2389 2652 -2947 3279 -3665 4115 -4642 5275 -6051 7028 -8308 10051 -12594 16663
58 16663 -24219 43064 -188016 -219032 161658 12023 -113711 -13436 23352 -256329 -274442
69 -274442 87860 280791 19610 -130587 18931 53839 -129057 -34981 285398 275488 -66953
80 -66953 -135146 81831 95676 -61869 59331 283894 136463 -181058 -129775 116949 82664
91 82664 -69490 52365 186464 -30278 -254084 -70273 174643 69330 -87836 26532
101 26532 87138 -132823 -216592 60634 227317 19532 -134068 2846 51127 -120941 -104161
$$ packed form
0@%%%%qJ6j6J6k4L2m0M8n7P3q8J06j31J61j91K23k61L05l52M07m70N39o16P01
28C73p96R04j019J142j283J439j606J789j991K217k463K727l023L352l710M103
44B155m544N041n599O226o944P780q757R917j1326J3079j5336J8359k2645K9257
58A6663m0882O7283k31080l1016L80690j49635j25734J00275L6788k79681j8113
69b74442L62302J92931k61181j50197J49518L4908j82896R4076L20379r910l42441
80f6953o8193K16977J3845j57545J21200K24563j47431l17521N1283K46724l4285
91H2664j52154J21855J34099k16742k23806J83811K44916j05313j57166J14368
101B6532O0606k19961q3769K77226J66683k07785j53600J36914M8281j72068J6780
$$ plain form
112 -104161 156028 175408 -101245 -170229 42652 85646 -72955 -31996 149136 60556 -176114
123 -176114 -113628 124557 96777 -82281 -23692 121526 4684 -159746 -25923 156354
133 156354 38898 -122856 -8516 116995 -21915 -133666 25952 139267 -22296 -133144
143 -133144 12004 91385 -60160 -109595 69756 120108 -68585 -130307 31589 70301 -72850
154 -72850 -65363 95771 68721 -115306 -98747 80716 75778 -71166 -47646 74071 9423
165 9423 -120167 -30465 125327 51289 -97416 -39568 72305 -1180 -85927 21507 113596
176 113596 -677 -95922 14188 103855 2881 -66747 38731 93245 -19638 -62179 58769
187 58769 95439 -26849 -56498 64162 83298 -39697 -59982 46439 48742 -52907 -35788
$$ packed form
112a04161K60189J9380k76653o8984K12881M2994j58601M0959J81132q8580k36670
123a76114O2486K38185k7780j79058N8589J45218j16842j64430J33823J82277
133A56354j17456j61754J14340J25511j38910j11751J59618J13315j61563j10848
143a33144J45148P9381j51545m9435J79351N0352j88693o1722J61896L8712j43151
154g2850P487J61134k7050j84027J6559J79463m938j46944K3520J21717o4648
165I423j29590Q9702J55792p4038j48705N7848J11873p3485q4747J07434R2089
176A13596j14273r5245J10110Q9667j00974o9628J05478N4514j12883m2541J20948
187E8769L6670j22288k9649J20660J9136j22995k0285J06421K303j01649J7119
$$ plain form
198 -35788 71853 40679 -84225 -68275 42408 24525 -66973 -32797 48718 -6385 -92356
209 -92356 -28108 64936 7688 -77088 -23556 47922 -7620 -61708 10812 67603 -5229 -55568
221 -55568 20914 66478 -12351 -54248 23101 62617 -1918 -22154 42193 42277 -41043 -45980 42350
234 42350 58716 -17666 -36082 17290 10988 -41866 -13765 56068 25878 -59188 -51402 16021
246 16021 13826 -24563 2071 38977 -6453 -59397 -18729 39923 13939 -29615 -853 32480
258 32480 -4055 -32085 11592 40630 -2405 -28216 13064 32919 -11054 -30368 13058 34437
270 34437 -119 -13478 15659 11558 -32020 -28033 25946 35866 -7493 -20425 4366 846 -21700
283 -21700 -2831 30720 10532 -33555 -25872 13939 15103 -8916 -3823 9757 -12558 -33540 -6082
$$ packed form
198c5788J07641l1174j24904J5950J10683j7883r1498L4176Q1515n5103q5971
209i2356O4248R3044n7248q4776N3532P1478n5542n4088P2520N6791p2832n0339
221e5568P6482M5564p8829m1897P7349L9516o4535k0236O4347Q4q3320m937Q8330
234D2350J6366p6382j8416N3372o302n2854K8101O9833l0190q5066P786O7423
246A6021k195l8389K6634L6906m5430n2944M0668N8652k5984m3554K8762L3333
258C2480l6535k8030M3677K9038m3035k5811M1280J9855m3973j9314M3426K1379
270C4437l4556j3359K9137m101m3578L987N3979R920m3359j2932K4791l520k2546
283b1700J8869L3551k0188m4087P683L9811J164k4019N093J3580k2315k0982K7458
$$ plain form
296 -6082 23926 3347 -25744 -12525 9825 735 -9889 3578 7645 -15292 -21604 10060 31051
309 31051 11238 -7634 2162 9816 625 6050 27177 23282 -3980 -8509 14643 24386 11663
322 11663 5775 10889 3973 -10517 -5345 11623 8427 -8499 -7388 5079 -279 -16118 -16750 -8446
336 -8446 -9249 -10398 -762 3579 -11374 -26181 -17594 1976 6974 -565 -6095 -11689 -18577 -10784 12748
351 12748 24207 9865 -10019 -15337 -8743 2339 14773 21237 11625 -5927 -11087 1638 14144
364 14144 13427 6874 1910 -3158 -4164 4009 12521 9553 -452 -4695 -1638 1086 -676 -4093 -4920
379 -4920 -3846 -1746 1760 2336 -4790 -13319 -13114 -5136 2011 3485 -719 -7102 -9045 -3825 4250 7669
395 7669 3137 -4949 -7586 -1115 7470 11025 8278 1531 -3813 -1433 5923 9536 5123 -2724 -6799
$$ packed form
296f082L0008k0579k9091J3219K2350r090j0624J3467M067k2937o312L1664K0991
309C1051j9813j8872R796P654r191N425K1127l895k7262m529K3152R743j2723
322A1663n888N114o916j4490N172J6968l196j6926J111J2467n358j5839o32Q304
336h446q03j149R636M341j4953j4807Q587J9570M998p539n530n594o888P793K3532
351A2748J1459j4342j9884n318O594J1082J2434O464r612j7552n160J2725J2506
364A4144p17o553m964n068j006Q173Q512k968j0005m243L057K724j762l417q27
379d920J074K100L506N76p126q529K05P978P147J474m204o383j943N220Q075L419
395G669m532q086k637O471Q585L555k747o747n344K380P356L613m413p847m075
$$ plain form
410 -6799 -1847 7830 12196 6707 -4375 -12832 -11243 647 11546 10924 767 -9589 -11798 -3716
424 -3716 8395 12917 5903 -5749 -11849 -6891 4710 12723 11557 3473 -5789 -8239 -2144 4823
438 4823 5058 2350 1351 280 -1115 -33 1135 -1795 -4812 -1717 4244 3486 -4558 -9080 -5092 349
454 349 2413 3924 774 -11281 -19330 -9669 6200 9665 1752 -6008 -11664 -14985 -8304 7216 12820
469 12820 -558 -13901 -8875 2912 5154 5956 9645 3651 -10190 -7935 11221 17886 5235 -2441
483 -2441 4129 6335 691 4118 12704 4296 -12567 -6896 13910 13711 -3879 -6294 1577 -5049 -12384
498 -12384 2115 15149 -768 -19562 -8218 10065 3281 -8959 612 7634 -9334 -16366 6875
511 6875 18177 -4248 -15486 6214 16010 -4427 -11452 7968 9420 -12211 -7641 22592 20344
$$ packed form
410f799M952R677M366n489j1082q457J589J1890J0899o22j0157j0356k209Q082
424c716J2111M522p014j1652o100M958J1601Q013j166q084r262k450O095O967
438D823K35k708r99j071j395J082J168k930l017L095N961p58q044m522L988N441
454C49K064J511l150j2055q049R661J5869L465p913p760n656l321O681J5520N604
469A2820j3378j3343N026J1787K242Q02L689n994j3841K255J9156O665j2651p676
483b441O570K206n644L427Q586q408j6863N671K0806j99j7590k415P871o626p335
498a2384J4499J3034j5917j8794J1344J8283o784j2240R571P022j6968p032K3241
511F875J1302k2425j1238K1700R796k0437p025J9420J452k1631M570L0233k248
$$ plain form
524 20344 -14623 -19089 10380 14865 -6261 -309 20003 1375 -28603 -8277 30141 18525 -16870
537 -16870 -12637 7255 -7970 -22387 7894 30538 -5366 -39369 -12300 18042 -3853 -22335
549 -22335 4329 13945 -23802 -33164 12901 29937 -11598 -27752 8964 19138 -15709 -14644 28976
562 28976 26890 -19026 -14417 33731 28449 -17595 -8466 35432 21608 -21368 -3266 37644 13098
575 13098 -29116 -1740 39103 4677 -41576 -10999 29804 -1705 -33697 3546 25724 -27327
587 -27327 -54534 3762 38663 -11755 -43020 -1146 13986 -31312 -29062 37407 40351 -35060
599 -35060 -50029 15659 31736 -14243 -4816 45986 18026 -50848 -26090 51013 39966 -22775
611 -22775 -9592 35711 1899 -45582 2981 62125 14976 -47389 -9775 36666 -8947 -44959
$$ packed form
524B0344l4967m466K9469M485k1126N952K0312j8628k9978K0326L8418j1616l5395
537a6870M233J9892j5225j4417L0281K2644l5904l4003K7069L0342k1895j8482
549b2335K6664R616l7747r362M6065J7036m1535j6154L6716J0174l4847J065M3620
562B8976k086m5916M609M8148n282m6044R129M3898j3824m2976J8102M0910k4546
575A3098m2214K7376M0843l4426m6253L0577M0803l1509l1992L7243K2178n3051
587b7327k7207N8296L4901n0418l1265M1874J5132m5298K250O6469K944p5411
599c5060j4969O5688J6077m5979R427N0802k7960o8874K4758P7103j1047o2741
611b2775J3183M5303l3812m7481M8563N9144m7149o2365L7614M6441m5613l6012
$$ plain form
623 -44959 14578 52760 -11433 -52887 4144 34660 -24329 -42361 29112 47756 -28683 -51933
635 -51933 16986 33703 -26195 -22301 46630 31703 -51407 -42280 41894 42103 -22801 -10606 43387
648 43387 8016 -56205 -11059 67284 31368 -43227 -14041 41699 989 -44235 13657 60778
660 60778 -6968 -61606 399 49993 -8733 -47079 14982 42182 -29036 -53316 22411 42544
672 42544 -36260 -52499 27669 40821 -36085 -42379 29992 23946 -49633 -32250 48604 29967
684 29967 -52759 -36421 39000 19021 -45827 -12378 49769 3445 -64124 -15146 54206 9218
696 9218 -50137 -1997 46934 -9811 -54331 10431 55967 -7288 -45683 21432 55503 -13842
708 -13842 -41945 31203 58227 -9979 -26221 42526 47509 -27069 -26415 55184 58187 -20426 -26757
$$ packed form
623d4959N9537L8182o4193m1454N7031L0516n8989j8032P1473J8644p6439k3250
635e1933O8919J6717n9898L894O8931j4927q3110R127Q4174K09o4904J2195N3993
648D3387l5371o4221M5146P8343l5916p4595K9186N5740m0710m5224N7892M7121
660F0778o7746n4638O2005M9594n8726l8346O2061K7200p1218k4280P5727K0133
672D2544p8804j6239Q0168J3152p6906o294P2371o046p3579J7383Q0854j8637
684B9967q2726J6338P5421j9979o4848L3449O2147m6324o7569M8978O9352m4988
696I218n9355M8140M8931n6745m4520O4762M5536o3255l8395O7115L4071o9345
708a3842k8103P3148K7024o8206j6242O8747M983p4578O54Q1599L003p8613o331
$$ plain form
721 -26757 35691 25158 -35811 -9548 59343 25411 -57892 -38442 32122 12405 -42003 -10731
733 -10731 33518 -19523 -75238 -19579 45052 879 -54400 -15074 22722 -26952 -54249 14296
745 14296 50935 -15829 -53232 7778 38100 -17996 -32472 32969 44985 -24197 -36205 30757
757 30757 39566 -22975 -21801 43283 35243 -35570 -30641 34883 27833 -28035 -9213 43891 10610
770 10610 -53002 -21921 44848 23441 -30797 -8524 29525 -9980 -47962 6623 57388 7311
782 7311 -47857 -12400 26963 -7863 -27446 24684 43448 -22037 -53487 4832 38832 -5462
794 -5462 -24130 20699 24876 -31923 -35232 29003 39359 -17702 -24844 24928 21308 -29581 -18294
807 -18294 38646 29974 -23463 -14357 31259 12195 -34403 -8155 44854 21516 -30960 -13728
$$ packed form
721b6757O2448j0533o0969K6263O8891l3932q3303J9450P0564j9717n4408L1272
733a0731M4249n3041n5715N5659O4631m4173n5279L9326L7796m9674k7297O8545
745A4296L6639o6764l7403O1010L0322n6096j4476O5441J2016o9182j2008O6962
757C0757Q809o2541J174O5084q040p0813M929O5524p050n5868J8822N3104l3281
770A0610o3612L1081O6769k1407n4238K2273L8049l9505l7982N4585N0765n0077
782G311n5168L5457L9363l4826j9583N2130J8764o5485l1450N8319L4000m4294
794e462j8668M4829M177n6799l309O4235J0356n7061p142M9772l620n0889J1287
807a8294N6940q672n3437R106M5616j9064m6598K6248N3009k3338n2476J7232
$$ plain form
819 -13728 24568 -1753 -33022 7234 43442 -2416 -49200 -14994 25786 -730 -24328 11281
831 11281 25474 -27049 -49816 6112 39222 -3301 -28263 6959 15436 -26557 -26333 28335 34312
844 34312 -20083 -30563 15380 20695 -19689 -14053 30273 19607 -29196 -19694 26527 15262 -26916
857 -26916 -10171 32096 12507 -30082 -12113 25361 5176 -26146 2481 34790 939 -36164
869 -36164 -4969 31849 6463 -19670 8261 24452 -14033 -30572 14841 39000 -1411 -26168
881 -26168 4479 18373 -13002 -16252 23967 25473 -22237 -29446 14792 22890 -13705 -15232 17260
894 17260 8693 -27710 -14708 26365 15398 -25207 -15810 20217 8251 -23277 -6191 24344
906 24344 2446 -27668 -2263 28287 2326 -27178 -2145 24339 -208 -21623 4913 21565
$$ packed form
819a3728L8296k6321l1269M0256L6208m5858m6784L4206M0780k6516k3598L5609
831A1281J4193n2523k2767N5928L3110m2523k4962L5222Q477m1993K24N4668N977
844C4312n4395j0480M5943N315m0384N636M4326j0666m8803R502M6221j1265m2178
857b6916J6745M2267j9589m2589J7969L7474k0185l1322K8627L2309l3851l7103
869c6164L1195L6818k5386k6133K7931J6191l8485j6539M5413K4159m0411k4757
881b6168L0647J3894l1375l250M0219J506m7710p209M4238Q098l6595j527L2492
894A7260q567l6403J3002M1073j0967m0605R397L6027j1966l1528J7086L0535
906B4344k1898l0114K5405L0550k5961k9504K5033K6484k4547k1415K6536J6652
$$ plain form
918 21565 -9188 -24316 10510 27165 -7551 -24919 5432 18048 -9789 -13700 17221 16213
930 16213 -20378 -20481 17514 21114 -11781 -13860 12769 8115 -17344 -4560 26094 11831 -22562
943 -22562 -12181 19284 10990 -12785 -482 18065 -1637 -20918 2176 24670 2153 -21851
955 -21851 -4573 13940 -2923 -15217 5238 12996 -13818 -23620 4257 15797 -9052 -19476
967 -19476 1047 6245 -12690 -11007 12199 9478 -16407 -14711 11710 13115 -7674 -5077 13645
980 13645 7191 -9854 1605 21230 9131 -11444 -1077 18278 9414 -6244 2377 12958 -195
993 -195 -10437 5712 16256 -2524 -16917 -2492 9333 -1521 -7692 2752 2110 -14467 -14434 6252
1007 6252 11672 -5691 -12862 -1576 1369 -6277 -1007 11531 4423 -13087 -9459 8059 9160 -1409
$$ packed form
918B1565l0753j5128L4826J6655l4716j7368L0351J2616k7837l911L0921j008
930A6213l6591j03L7995L600l2895k079K6629m654k5459J2784L0654j4263l4393
943b2562J0381L1465q294k3775J2303J8547j9702j9281K3094K2494k2517k4004
955b1851J7278J8513j6863j2294K0455P758k6814r802K7877J1540k4849j0424
967a9476K0523N198j8935J683K3206k721k5885J696K6421J405k0789K597J8722
980A3645o454j7045J1459J9625j2099k0575J0367J9355q864j5658Q621J0581j3153
993a95j0242J6149J0544j8780j4393J4425J1825j0854o171J0444o42j6577L3K0686
1007F252N420j7363p171J1286K945p646N270J2538p108j7510L628J7518J101j0569
$$ plain form
1021 -1409 -748 4879 -1461 -8043 1489 11683 3291 -8742 -3781 5708 2298 -3858 1011 3704 -4103
1036 -4103 -6849 3110 7627 -1816 -7692 -935 4363 1032 -651 2679 667 -6127 -3594 6876 8472
1051 8472 -722 -4721 -714 1066 376 3744 6148 -206 -7267 -3758 5037 6037 422 -2862 -3032
1066 -3032 -4124 -2901 2683 4845 -1803 -8358 -5979 -250 1567 420 -1336 -4603 -6921 -3776 2467
1081 2467 4846 622 -4168 -3981 -620 2450 4622 4643 1064 -2313 -3 5207 6819 4464 1431 -8
1097 -8 835 3213 4791 3960 464 -2291 -1099 2136 2819 95 -3126 -4492 -3317 301 2392 303
1113 303 -3921 -6102 -4218 417 3610 2353 -1961 -4911 -3860 881 5393 5308 824 -3475 -3785 -443
1129 -443 4398 6194 2862 -2665 -4564 -2000 2447 4098 1469 -2857 -4483 -3490 -400 2592 2041 -2657
$$ packed form
1021a409O61N627o340o582R532J0194q392j2033M961R489l410o156M869K693p807
1036d103k746R959M517r443n876O757N298l331j683L330k012o794K533J0470J596
1051H472r194l999M007J780o90L368K404o354p061L509Q795J000n615l284j70
1066c032j092J223N584K162o648o555K379N729J817j147j756l267k318L145O243
1081B467K379m224m790J87L361L070K172K1l579l377K310N210J612k355l033j439
1097hQ43K378J578q31l496k755J192L235O83k724l221j366J175L618K091k089
1113C03m224k181J884M635L193j257m314k950J051M741M512q5m484m299l10L342
1129d43M841J796l332n527j899K564M447J651k629m326j626R93L090K992n51m698
$$ plain form
1145 -2657 -5487 -3444 309 1699 744 -1365 -3220 -2857 124 3538 3196 -1211 -3759 -1176 2304 2949
1161 2949 2473 1644 -1458 -3149 699 5674 4246 -1347 -3427 -457 1943 2386 3395 2698 -2130 -5386
1177 -5386 -242 6304 4310 -2154 -3283 -1197 -1331 311 4448 3536 -4655 -8582 -1962 4726 2688
1192 2688 -1602 -1673 -2611 -5978 -2880 5858 5651 -4369 -7704 -631 2972 457 1176 4286 -107 -6684
1208 -6684 -2070 8083 6443 -2976 -2883 3886 2618 -2069 2744 7299 -660 -7474 511 9142 2985
1223 2985 -5556 -1705 3579 -1186 -3671 4308 6227 -5994 -10866 1333 8397 -761 -6072 388
1237 388 599 -7710 -4564 8131 6148 -8715 -10266 2862 5541 -3585 -2773 5342 -491 -10994 -2893
1252 -2893 11984 5856 -8992 -5491 6106 2678 -4674 3074 9703 -2004 -11414 1384 14030
$$ packed form
1145b657k830K043L753J390r55k109j855L63K981L414l42m407k548K583L480O45
1161B949m76q29l102j691L848M975j428n593k080K970K400M43J009o97m828l256
1177e386N144O546j994o464j129K086j34J642M137r12q191l927O620O688k038
1192B688m290p1r38l367L098Q738k07j0020l335P073L603k515P19L110m393o577
1208f684M614J0153j640r419R3O769j268m687M813M555p959o814P985Q631o157
1223B985q541L851N284m765k485P979J919j2221m872J2199P064r158n311O460
1237C88K11q309L146J2695j983j4863j551J3128K679r126Q12Q115n833j0503Q101
1252b893J4877o128j4848L501J1597l428p352P748O629j1707r410J2798J2646
$$ plain form
1265 14030 4053 -7677 -140 6868 -2444 -5814 7996 11277 -5857 -12244 3433 10538 -2139
1278 -2139 -7168 3766 3837 -9763 -7831 9274 7997 -10683 -11040 6051 5885 -8098 -4941 8255
1292 8255 2108 -11869 -2567 14158 5840 -11566 -4584 11621 5608 -6707 2196 12011 -1725
1305 -1725 -12992 3578 17411 1724 -13654 -2357 7718 -4026 -9036 6553 9838 -11809
1317 -11809 -19139 1793 12099 -4508 -11647 2711 3611 -12942 -9159 13847 13035 -10113 -11454
1330 -11454 9132 10639 -5123 -739 16363 8917 -10761 -2798 18466 10811 -9524 -1916 15644
1343 15644 5384 -12124 -1214 13594 -553 -15515 -182 14253 -4224 -21392 -5311 10429
1355 10429 -4023 -15010 1333 7260 -15258 -22017 4987 17010 -5785 -17243 619 5726
$$ packed form
1265A4030r977j1730P537P008r312l370J3810L281j7134o387J5677P105j2677
1278b139n029J0934P1j3600J932J7105j277j8680l57J7091j66j3983L157J3196
1292H255o147j3977R302J6725q318j7406O982J6205o013j2315Q903R815j3736
1305a725j1267J6570J3833j5687j5378J1297J0075j1744n010J5589L285k1647
1317a1809p330K0932J0306j6607p139J4358R00j6553L783K3006q12k3148j341
1330a1454K0586J507j5762M384J7102p446j9678P963K1264p655k0335P608J7560
1343A5644j0260j7508J0910J4808j4147j4962J5333J4435j8477j7168J6081J5740
1355A0429j4452j0987J6343N927k2518o759K7004J2023k2795j1458J7862N107
$$ plain form
1367 5726 -11584 -7965 17886 15921 -14270 -17346 10210 15342 -4439 -1088 18590 7912 -17298
1380 -17298 -5948 22881 15643 -9578 -2413 17415 4554 -15603 619 22380 5285 -16930
1392 -16930 -880 16717 -4226 -22218 755 19401 -3313 -20828 -1447 8653 -15006 -21520
1404 -21520 9704 20529 -11537 -26182 -500 10348 -9864 -7729 20371 14769 -21748 -21241 15822
1417 15822 22389 -3260 -2665 17682 4706 -22490 -5680 29961 19153 -14946 -9554 13628 -106
1430 -106 -20367 1989 26294 1084 -27779 -7929 15501 -4667 -21171 5548 22321 -8163
1442 -8163 -27335 1103 18380 -7119 -15425 16757 22920 -15019 -24653 11741 22949 -5437 -7549
1455 -7549 19997 11175 -25609 -17590 24719 23610 -13301 -13852 11774 -505 -26025 -3013 31703
$$ packed form
1367E726j7310L619K5851j965l0191l076K7556N132j9781L351J9678j0678k5210
1380a7298J1350K8829p238k5221P165J9828j2861k0157J6222K1761j7095k2215
1392a6930J6050J7597k0943j7992K2973J8646k2714j7515J9381J0100k3659o514
1404b1520L1224J0825l2066j4645K5682J0848k0212K135K8100n602l6517N07L7063
1417A5822O567k5649N95K0347j2976k7196J6810L5641j0808l4099N392K3182j3734
1430a06k0261K2356K4305k5210k8863J9850K3430k0168j6504K6719J6773l0484
1442h163j9172K8438J7277k5499q306L2182O163l7939r634L6394J1208k8386k112
1455g549K7546q822l6784Q019M2309j109l6911n51K5626j2279k5520K3012L4716
$$ plain form
1468 31703 9278 -30120 -15909 15506 1787 -18215 6473 25969 -6814 -32243 -60 27928
1480 27928 1904 -18522 8662 21366 -11864 -23195 14278 26602 -9369 -19651 13990 18531
1492 18531 -17408 -19743 17253 18314 -17356 -15747 17137 9496 -25792 -14084 24159 13514 -22717
1505 -22717 -12402 17785 3039 -22709 600 29191 3284 -28235 -4746 24773 3837 -17751
1517 -17751 7753 24214 -8288 -25134 10235 28751 -4961 -21514 9078 19034 -12945 -18138
1529 -18138 16131 18417 -18890 -20751 15837 15701 -19903 -17710 15600 9313 -22093 -10788 20761
1542 20761 5285 -27368 -10198 22927 7846 -20957 -4218 19773 -1051 -21736 5710 28759
1554 28759 204 -23475 2794 23586 -759 -14737 12350 21335 -10831 -19995 13453 23143
$$ packed form
1468C1703k2425l9398J4211L1415j3719k0002K4688J9496l2783k5429L2183K7988
1480B7928k6024k0426K7184J2704l3230j1331L7473J2324l5971j0282L3641M541
1492A8531l5939k335L6996J061l5670J609L2884p641l5288J1708L8243j0645l6231
1505b2717J0315L0187j4746k5748K3309K8591k5907l1519K3489K9519k0936k1588
1517a7751K5504J6461l2502j6846L5369J8516l3712j6553L0592R956l1979n193
1529a8138L4269K286l7307j861L6588j36l5604K193L3310o287l1406J1305L1549
1542B0761j5476l2653J7170L3125j5081k8803J6739K3991k0824k0685K7446K3049
1554B8759k8555k3679K6269K0792k4345j3978K7087Q985l2166r164L3448R690
$$ plain form
1566 23143 -8651 -17154 11062 13999 -14672 -13300 16589 11898 -19971 -14955 15920 9786 -18806
1579 -18806 -11129 14890 4067 -19581 -4931 18517 1273 -22539 -4369 19513 2615 -17960
1591 -17960 -523 15553 -4862 -17530 7197 19973 -6238 -19935 4232 16271 -4975 -12136
1603 -12136 9601 11795 -13040 -13507 14225 16353 -9929 -11936 11011 9953 -9854 -3103 17715
1616 17715 7785 -15005 -5100 17938 9660 -10457 -2220 13426 1212 -13011 2476 16672 -1399
1629 -1399 -17546 -1767 12106 -3026 -14246 263 6778 -10695 -15968 3300 8785 -10695 -16710
1642 -16710 1273 6568 -8511 -9692 6291 4969 -10994 -6505 12780 10524 -6617 -4066 11080
1655 11080 8719 -2119 4665 15667 5835 -7164 2411 16627 8701 -4276 1004 8253 -846
$$ packed form
1566B3143l1794q503K8216K937k8671J372K9889m691l1869N016L0875o134k8592
1579a8806P677K6019j0823k3648J4650K3448j7244k3812J8170K3882j6898k0575
1591a7960J7437J6076k0415j2668K4727J2776k6211j3697K4167J2039k1246p161
1603a2136K1737K194k4835m67K7732K128k6282k007K2947j058j9807O751K0818
1616A7715r930k2790R905K3038q278k0117Q237J5646j2214j4223J5487J4196j8071
1629a399j6147J5779J3873j5132j1220J4509O515j7473n273J9268N485j9480o015
1642a6710J7983N295j5079j181J5983j322j5963M489J9285k256j7141K551J5146
1655A1080k361j0838O784J1002r832j2999R575J4216p926j2977N280P249r099
$$ plain form
1668 -846 -6955 4461 9652 -4902 -13905 -2994 4255 -4705 -9828 -1712 -773 -11583 -11619 1668 3641
1683 3641 -8708 -10752 308 2356 -5064 -3037 5479 2450 -5834 -907 9860 7068 -2359 -327
1697 -327 7484 5406 570 5204 9252 1353 -4749 2759 9540 3622 -3150 -508 1729 -2465 -3259
1712 -3259 3027 3397 -5417 -9320 -2428 2175 -1997 -4397 -1607 -2909 -7034 -3947 3239 2528 -4249
1727 -4249 -5321 -226 1813 433 1739 3721 584 -2808 1148 6867 5316 306 381 2580 2068 1797
1743 1797 4290 4082 -649 -3023 466 3617 1723 -1722 -2012 -1866 -2725 -1664 996 11 -4394 -5709
1759 -5709 -2264 216 -388 -1740 -2298 -3200 -2947 -244 2621 1592 -1759 -2824 -329 2317 3182 2829
1775 2829 1287 -1162 -1089 2219 4618 3881 829 -980 -638 1203 3085 3392 1341 -1453 -2438 -227
$$ packed form
1668h46o109J1416N191j4554r003J0911P249q960n123Q116R39j0810l6J3287J973
1683C641j2349k044J1060K048p420K027Q516l029q284M927J0767k792r427K032
1697c27P811k078m836M634M048p899o102P508O781n918o772K642K237m194p94
1712c259O286L70q814l903O892M603m172k400K790j302m125L087P186p11o777
1727d249j072N095K039j380J306J982l137l392L956N719j551n010P5K199n12k71
1743A797K493k08m731k374L489L151j894l445k90J46q59J061K660r85m405j315
1759e709L445K480o04j352n58r02K53K703K865j029l351j065K495K646Q65l53
1775B829j542k449P3L308K399p37l052j809L42J841J882L07k051k794r85K211
$$ plain form
1791 -227 2479 2477 380 -1740 -2364 -1362 904 1772 316 -2148 -3040 -1977 254 1144 -348 -2381 -3271
1808 -3271 -2381 -282 737 -132 -2476 -3502 -2439 -260 1212 388 -1869 -3115 -1894 600 2125 1945
1824 1945 -494 -1961 -867 1471 3261 3301 1253 -968 -592 1825 4030 4029 1876 -551 -653 1305 3315
1841 3315 3558 1816 -901 -1846 -54 2306 2566 995 -1431 -2663 -1797 872 1940 569 -2092 -3251
1857 -3251 -2168 24 960 179 -1389 -3142 -2971 -563 1606 492 -2199 -3000 -1870 -322 746 854
1873 854 -529 -2620 -2599 -21 2466 1477 -1080 -1753 -867 204 1798 3087 1384 -1686 -1709 1420 3795
1890 3795 2949 1070 229 -277 -108 2185 4512 2599 -1771 -2357 800 2130 1170 557 -10 -2736 -3620
1907 -3620 -377 2757 414 -3888 -4207 -1571 -1012 -1398 109 24 -3748 -5128 -497 3145 621 -2609
$$ packed form
1791b27K706kk097k120o24J002K266Q68j456k464q92J063K231Q90j492k033q90
1808c271Q90K099J019q69k344j026J063K179J472q24k257j246J221K494J525j80
1824A945k439j467J094K338J790M0k048k221L76K417K205jk153k427j02J958K010
1841C315K43j742k717r45J792K360K60j571k426j232Q66K669J068j371k661j159
1857c251J083K192R36p81j568j753J71K408K169j114k691q01J130J548J068J08
1873H54j383k091K1K578K487r89k557o73Q86J071J594J289j703l070k3L129K375
1890C795q46j879q41n06J69K293K327j913m370n86L157J330r60o13n67k726q84
1907c620L243L134k343m302l19K636N59l86J507q5l772j380M631L642k524l230
$$ plain form
1923 -2609 -1537 -18 -766 269 3619 2937 -2150 -2944 2394 4823 1584 12 2164 1659 -1297 1157
1939 1157 5784 3482 -2805 -2103 3548 3698 -378 17 2441 -330 -3904 592 5483 767 -5931 -3215
1955 -3215 2234 423 -2584 352 1312 -4787 -6981 642 5450 -850 -6308 -2544 701 -2907 -2205
1970 -2205 4648 3907 -5479 -6570 2899 5892 -336 -1352 3836 1905 -4552 -954 7981 5360 -4181
1985 -4181 -2625 5484 2887 -4275 -611 6005 511 -6590 -349 6182 -1194 -8601 -1412 6085 -312
2000 -312 -6522 -359 3190 -5020 -7110 4997 9119 -3328 -9261 479 5020 -1877 -1228 8274 4802
2015 4802 -9139 -7944 7391 9533 -2045 -3184 4380 -98 -9696 -1417 11900 5141 -9841 -6163
2029 -6163 4834 375 -7147 1319 9417 -1975 -12062 -1380 8986 -378 -8013 2838 9260
$$ packed form
1923b609J072J519p48J035L350o82n087p94N338K429l239j572K152n05k956K454
1939A157M627k302o287P02N651J50m076L95K424k771l574M496M891m716o698K716
1955c215N449j811l007K936R60o099k194P623M808o300n458L764L245l608P02
1970b205O853p41r386j091R469K993o228j016N188j931o457L598Q935k621r541
1985d181J556Q109k597p162L664O616n494p101O241O531p376p407P189P497o397
2000c12o210O163L549q210k090J2107M122j2447n933R740M541o897O49R502l472
2015D802j3941J195J5335K142j1578j139P564m478r598Q279J3317o759j4982L678
2029f163J0997m459p522Q466Q098j1392j0087J0682J0366r364p635J0851O422
$$ plain form
2042 9260 -3438 -9504 3696 9281 -3058 -5952 7937 9381 -6613 -8755 7185 10174 -2848
2055 -2848 -3126 8558 4057 -10921 -4733 13537 9887 -7590 -6093 6191 625 -9171 2019 13963
2069 13963 480 -15970 -6040 9060 1376 -8496 1256 7435 -8321 -15839 2354 12561 -3349
2082 -3349 -12611 1039 6094 -8036 -9032 8553 9531 -9305 -10603 7867 8876 -7844 -6325 10599
2096 10599 6994 -9981 -4643 12296 5265 -11287 -2907 13515 4222 -11864 -2707 11303 923
2109 923 -10961 1873 12852 -2670 -14566 1218 13594 -722 -10452 3399 9303 -6681 -9771
2122 -9771 9456 13547 -6396 -11856 6108 10133 -5156 -4965 11188 7045 -11962 -7787 12834
2135 12834 9745 -9066 -6025 9168 2653 -11397 -1158 13939 2200 -14480 -3575 11708
$$ packed form
2042I260j2698o066J3200N585j2339k894J3889J444j5994k142J5940K989j3022
2055b848k78J1684m501j4978O188J8270l650j7477J497J2284n566r796J1190J1944
2069A3963j3483j6450R930J5100p684r872R752O179j5756p518J8193J0207j5910
2082c349r262J3650N055j4130r96J7585R78j8836j298J8470J009j6720J519J6924
2096A0599l605j6975N338J6939p031j6552Q380J6422r293j6086R157J4010j0380
2109I23j1884J2834J0979j5522j1896J5784J2376j4316r730J3851N904j5984l090
2122i771J9227M091j9943n460J7964M025j5289J91J6153m143j9007M175K0621
2135A2834l089j8811L041J5193o515j4050J0239J5097j1739j6680J0905J5283
$$ plain form
2147 11708 1599 -11098 418 10686 -3604 -13041 3121 12195 -4369 -13103 3314 10457 -5604
2160 -5604 -10639 5207 7935 -8811 -9360 8873 8618 -10337 -10545 7489 7161 -8272 -4906 9699
2174 9699 2826 -13125 -4472 13278 6112 -10294 -4106 8877 998 -9305 2463 13552 -257
2187 -257 -13098 -70 12047 664 -8453 3342 9082 -5101 -10067 5705 10953 -4854 -10232
2200 -10232 4380 8034 -5786 -7641 6418 6092 -8638 -6732 8635 6237 -9139 -6806 7803
2213 7803 5213 -6975 -2255 8813 1504 -9981 -1008 12437 4461 -8218 -1640 8184 632 -6196
2227 -6196 4252 10738 -2179 -10459 1454 9624 -533 -6625 2516 5093 -6209 -7957 5367
2240 5367 7057 -6605 -9204 2953 4361 -6312 -5503 4943 2343 -8740 -4733 7346 3916 -7503
$$ packed form
2147A1708j0109j2697J1516J0268j4290r437J6162R074j6564q734J6417P143j6061
2160e604n035J5846K728j6746n49J8233k55j8955k08J8034l28j5433L366J4605
2174I699o873j5951Q653J7750p166j6406O188J2983p879j0303J1768J1089j3809
2187b57j2841J3028J2117j1383r117J1795N740j4183m966J5772N248j5807n378
2200a0232J4612L654j3820j855J4059l26j4730J906J5367k398j5376K333J4609
2213G803k590j2188M720J1068p309j1485Q973J3445p976j2679O578R824p552o828
2227f196J0448O486j2917q280J1913Q170j0157o092R141K577j1302j748J3324
2240E367J690j3662k599J2157J408j0673Q09J0446k600j1083M007J2079l430j1419
$$ plain form
2254 -7503 -4447 6148 3192 -5149 -249 7521 452 -7675 697 9801 2574 -6073 -606 5571 -571
2269 -571 -4381 3741 6904 -2958 -8163 1201 6630 -1239 -5055 1609 2620 -5231 -4902 4802 4922 -4855
2285 -4855 -6006 2670 3586 -3045 -2315 4231 1912 -5128 -1663 6624 3622 -4495 -2056 4984 2777
2300 2777 -2625 848 4821 -481 -5195 855 6658 1262 -4921 -1595 2380 -1166 -3027 2189 3314
2315 3314 -4306 -7042 82 3998 -896 -3557 -92 37 -4175 -2660 4189 3809 -3256 -4263 1696
2330 1696 3110 -754 27 3676 1495 -3082 -321 5261 3267 -1959 -970 3050 1833 -1182 531
2345 531 3007 -108 -3205 223 3989 477 -3591 -1476 1615 -143 -1397 1279 1332 -2883 -4026 839
2361 839 3748 287 -2855 -1200 -111 -1676 -639 2939 2034 -3368 -4359 225 2301 395 -710 224
$$ packed form
2254g503L056J0595k956q341M900P770p069q127Q372R104p227q647N467O177o142
2269e71l810Q122L163r862n205R364N429p869l816O664J011p851L29R704J20r777
2285d855j151Q676R16o631P30O546k319p040L465Q287l002q117K439P040k207
2300B777n402L473L973n302m714O050N803n396o183L326L975l546j861N216J125
2315C314p620k736P124L916m894k661L465J29m212J515O849l80p065j007N959
2330A696J414l864P81L649k181m577K761N582j994n226R89M020j217l015J713
2345E31K476l115l097L428L766l512m068K115L091j758j254K676N3m215j143M865
2361H39K909l461l142J655J089j565J037L578r05n402r91M584K076j906j105R34
$$ plain form
2377 224 -1251 -3265 -970 3239 2319 -2119 -2721 32 914 -91 1090 2185 -465 -2770 -167 3121
2393 3121 1848 -854 -531 1226 145 -335 1407 2161 -623 -2080 775 2776 541 -1356 -244 524
2409 524 -410 -3 1788 1164 -1934 -2399 860 2566 611 -1059 -574 -856 -1477 275 2475 962 -2504
2426 -2504 -2984 -362 825 337 -83 -731 -2527 -3039 -528 2117 1046 -1848 -2244 -972 -283 393 1615
2443 1615 1245 -1219 -1826 556 2777 2005 548 342 532 623 1565 2766 2341 -21 -725 1228 2435
2460 2435 1683 595 -16 -525 -445 831 1750 510 -1664 -2035 -753 382 336 -362 -1296 -2390 -2330 -381
2478 -381 935 -140 -2009 -2523 -1686 -522 333 328 -737 -2175 -1950 -169 1425 1012 -628 -1416 -993 14
2496 14 1267 1645 340 -1055 -1177 -2 1497 1745 502 -769 -1084 -93 1160 1770 616 -943 -1210
$$ packed form
2377B24j475k014K295M209r20m438o02K753Q82j005J181J095k650k305K603L288
2393C121j273k702L23J757j081m80J742P54k784j457K855K001k235j897J112P68
2409E24r34M07J791o24l098m65L259J706j955j670M85k82o21J752K200j513l466
2426b504m80K622J187m88m20o48j796n12K511K645j071k894l96J272O89O76J222
2443A615l70k464o07K382K221p72j457k06J90R1R42J201m25k362p04J953J207
2460B435p52j088o11n09Q0J276R19j240k174l71J282J135m6o98r34j094O0J949
2478c81J316j075j869n14Q37J164Q55nj065j438K25J781J594m13j640p88M23J007
2496A4J253L78j305j395j22J175J499K48j243j271l15R91J253O10j154j559k67
$$ plain form
2513 -1210 -225 1083 1650 1010 -399 -1175 -305 1193 1889 1456 115 -854 31 1388 2062 1698 503 -740
2531 -740 -345 1073 2027 1502 -53 -1147 -1117 143 916 631 -761 -2023 -2221 -1062 262 -49 -1124
2548 -1124 -2312 -2422 -1327 285 603 -572 -1836 -1781 -519 831 1485 970 -303 -853 85 1764 2730
2565 2730 1639 65 -241 437 1428 2152 1884 392 -1112 -930 547 1410 382 -1143 -1806 -1620 -1143
2582 -1143 -29 142 -1410 -3008 -2403 -568 -98 -654 -1222 -1743 -1962 -1015 885 1729 -49 -1805 -997
2599 -997 1081 1682 1419 1340 506 -1001 -297 2347 3197 1019 -616 -123 608 868 1599 2031 534 -1799
2617 -1799 -1124 1503 2029 105 -615 19 -586 -729 919 2096 -204 -2376 -900 1452 1079 -396 -193
2634 -193 -12 -1383 -1198 1459 2312 -922 -3110 -1037 908 -95 -479 485 -521 -3060 -2313 1524 1913
$$ packed form
2513a210R85J308N67o40j409p76Q70J498O96m33j341r69Q85J357O74l64j195j243
2531g40L95J418R54n25j555j094L0J260P73k85j392j262j98J159J324l11j075
2548a124j188j10J095J612L18j175j264N5J262J350O54n15j273n50R38J679R66
2565B730j091j574l06O78R91P24k68j492j504J82J477Q63j028j525o63J86M77
2582a143J114J71j552j598O05J835M70n56n68n21k19R47J900Q44j778j756Q08
2599i97K078O01k63p9q34j507P04K644Q50k178j635M93P31K60P31M32j497k333
2617a799O75K627N26j924p20O34o05j43J648J177k300k172J476K352l73j475K03
2634a93J81j371J85K657Q53l234k188K073J945j003l84R64j006k539P47L837L89
$$ plain form
2651 1913 -1132 -2549 -730 -122 -1153 20 2123 97 -3040 -1217 2408 1813 -880 -194 1371 183
2667 183 -723 1864 3399 311 -2221 635 3569 1560 -628 730 1438 -1013 -842 2983 3111 -1587
2683 -1587 -3441 -178 1757 -189 -839 865 -851 -4408 -2959 2075 1668 -2851 -3422 -752 -1362 -2963
2699 -2963 -237 2353 -892 -4541 -1990 2138 871 -1817 84 2094 -479 -2036 1747 3749 -28
2714 -28 -2125 1746 3925 363 -1254 1740 2269 -860 -558 3654 3049 -2099 -2866 1780 2817 -342
2730 -342 -500 1943 -363 -3716 -650 4328 2663 -2377 -1975 1300 344 -1117 1709 3795 -368 -4223
2746 -4223 -500 3827 1451 -1729 392 1583 -1709 -2449 1904 3314 -1746 -3867 211 2008 -1152
2761 -1152 -2523 520 568 -3293 -2703 1935 1473 -3621 -3642 687 876 -2352 -1503 1181 -949 -4083 -1373
$$ packed form
2651A913l045j417J819O08j031J173K103k026l137J823L625n95k693O86J565j188
2667A83r06K587J535l088k532K856K934k009k188J358P08k451J71L825J28m698
2683a587j854L263J935j946o50J704j716l557J449N034m07m519n71K670o10j601
2699b963K726K590l245l649K551M128j267k688J901K010k573j557L783K002l777
2714b8k097L871K179l562j617K994N29l129L02M212o05n148p67M646J037l159
2730c42j58K443k306l353L066M978j665n040M02L275r56j461K826K086m163l855
2746d223L723M327k376l180K121J191l292p40M353J410n060k121M078J797l160
2761a152j371L043M8l861N90M638m62n094k1M329J89l228Q49K684k130l134K710
$$ plain form
2778 -1373 3219 1142 -3473 -1957 1474 108 -1709 1197 3056 -905 -3519 781 4300 1251 -1605
2793 -1605 639 2110 -319 -537 3393 3768 -1350 -2709 1803 3851 475 -841 1586 850 -2302 -675
2809 -675 3657 2558 -2505 -2896 837 1396 -1115 -138 2111 -405 -3890 -1194 3303 1524 -2259 -1121
2825 -1121 1463 -231 -1690 1050 3106 -210 -2749 327 3062 472 -2054 425 2136 -486 -1514
2840 -1514 1392 1714 -2176 -2746 1337 2769 -751 -2632 -630 -102 -2089 -816 2599 1027 -3854 -3976
2856 -3976 276 1888 -507 -334 900 -1700 -4084 -1006 3637 2356 -2027 -2073 87 -452 -1359 1397
2872 1397 3209 -452 -3783 -902 2318 780 -1096 816 1740 -913 -2134 1063 2589 -147 -1165
2887 -1165 1728 2753 -613 -1849 1225 2629 469 346 2584 1402 -2439 -1693 2910 3763 374 -1115
$$ packed form
2778a373M592k077m615J516L431j366j817K906J859l961k614M300L519l049k856
2793a605K244J471k429k18L930L75n118j359M512K048l376j316K427p36l152J627
2809f75M332j099n063l91L733N59k511R77K249k516l485K696M497j779l783J138
2825a121K584j694j459K740K056l316k539L076K735k590k526K479J711k622j028
2840a514K906L22l890n70M083J432l520j881K002N28j987J273L415j572m881j22
2856c976M252J612k395J73J234k600k384L078M643j281m383m6K160n39r07K756
2872A397J812l661l331K881L220j538j876J912R24k653j221L197J526k736j018
2887a165K893J025l366j236L074J404k160j23K238j182l841P46M603Q53l389j489
$$ plain form
2903 -1115 -57 -768 -2141 786 4359 1749 -3640 -3718 -129 951 -45 1342 1558 -2503 -5122 -1351
2919 -1351 3215 2244 -1252 -1200 -430 -2379 -2231 1816 3567 -408 -3466 -1075 762 -707 -782 1790 1672
2936 1672 -1997 -2934 352 1379 -1136 -1021 1872 1456 -2393 -2415 1073 1668 -379 611 2751 184 -3248
2953 -3248 -1217 3466 3395 365 -178 530 -1405 -1945 2176 5262 1625 -3207 -2463 375 309 553 2713
2970 2713 1882 -3050 -4918 -346 3126 1335 -843 -343 -1146 -3393 -1871 2889 3085 -1535 -3122 -455
2986 -455 223 -1186 31 2387 662 -2711 -1725 1632 1328 -1272 -227 2009 510 -2077 -445 1959
3002 1959 242 -1250 921 2312 -500 -2676 -271 2156 590 -645 677 391 -2492 -2276 1813
3017 1813 2934 -379 -2279 -726 123 -1080 365 2822 1206 -2612 -2194 1455 2409 727 508 1233
$$ packed form
2903a115J058p11j373K927L573k610n389p8L589J080r96J387K16m061k619L771
2919a351M566r71l496N2P70j949J48M047J751l975l058K391J837j469p5K572j18
2936A672l669r37L286J027k515J15K893m16l849k2L488N95k047R90K140k567l432
2953c248K031M683p1l030n43P08j935n40M121L086l637m832P44K838o6K44K160
2970B713q31m932j868M572L472j791k178N00q03k247J522M760J96m620j587K667
2986d55O78j409J217K356j725l373R86L357l04k600J045K236j499k587J632K404
3002A959j717j492K171J391k812k176K405K427j566j235J322k86k883K16M089
3017A813J121l313j900J553Q49j203J445K457j616l818M18L649R54j682k19P25
$$ plain form
3033 1233 -280 -1668 890 3610 1875 -1343 -880 1189 575 -385 874 1156 -1469 -2642 -100 1732
3049 1732 -439 -2290 -1153 -424 -1570 -1334 764 276 -2436 -2507 323 1268 -480 -944 -6 5 -1056
3066 -1056 124 2255 1236 -1228 -619 1638 1600 258 509 1183 206 -631 976 2133 475 -1335 -355
3083 -355 1107 666 -184 381 199 -1219 -1204 1059 1723 -423 -1574 -930 -152 -137 147 939 -543 -2439
3101 -2439 -1868 536 1172 -291 -1099 -961 -1243 -1202 337 1434 -86 -1882 -1238 280 830 482 421 300
3119 300 -607 -438 1082 1935 903 -330 190 948 973 1112 1392 704 -333 205 1546 1875 729 -274
3137 -274 -37 448 579 862 997 -143 -1229 -698 630 863 -119 -896 -1257 -1117 -696 143 332 -941 -1913
3156 -1913 -1736 -577 136 -209 -792 -1283 -1558 -829 376 736 -258 -1053 -719 -79 584 1003 571 -137 -508
$$ packed form
3033A233j513j388K558K720j735l218M63K069o14r60J259K82k625j173K542J832
3049A732k171j851J137P29j146K36K098m88k712p1K830R45j748m64R38J1j061
3066a056J180K131j019k464O09K257l8j342K51O74r77q37J607J157j658j810R80
3083c55J462m41q50N65j82j418J5K263O64k146j151O44P78J5K84P92j482j896
3101b439N71K404O36j463q08J38k82M1J539J097j520j796O44J518N50l48o1j21
3119C00r07J69J520Q53j032j233N20P58K5J39K80o88j037N38J341L29j146j003
3137b74K37M85J31K83J35j140j086N31J328K33r82p77l61J40M21Q39J89j273r72
3156a913J77J159P13l45n83m91k75P29J205L60r94p95L34O40O63M19m32p08l71
$$ plain form
3175 -508 -212 1024 1275 645 -327 -497 10 579 1040 698 -417 -920 -558 424 828 498 -348 -855 -587
3194 -587 182 1013 677 -123 -735 -461 372 1084 916 121 -580 -602 357 1049 1111 0 -594 -707 -80 626
3214 626 579 -12 -860 -1138 -568 487 485 -89 -800 -1044 -424 406 729 183 -430 -779 -280 613 1256 825 75
3235 75 -495 -42 949 1440 984 229 -263 -104 634 1298 1094 -66 -625 -685 10 722 444 -507 -1241 -1299 -531
3256 -531 -36 -123 -775 -1637 -1742 -1024 -108 156 -512 -1361 -1413 -619 175 575 62 -621 -744 -21 900 1187 746
3277 746 48 -259 120 1085 1537 1090 152 -384 -48 728 1142 777 -32 -694 -887 89 809 482 -482 -995
3297 -995 -1015 -143 397 500 -11 -760 -808 -188 959 848 217 -367 -275 105 948 1147 548 -186 -431 53 874
3318 874 983 202 -506 -728 -373 63 665 -36 -1184 -1433 -853 -246 78 -215 -897 -1314 -1251 -363 442 355
$$ packed form
3175e08K96J236K51o30r72j70N07N69M61l42j115n03L62R82M04l30q46n07K68
3194e87P69Q31l36q00o12K74Q33P12j68p95p01k2R59O92O2j111n94j13O27P06
3214F26m7n91q48k78N70J055kn74p11k44O20Q30L23n46o13l49M99Q93O43m31p50
3235G5n70M53R91M91m56p55m92J59P38O64k04j160n59o0O95P12k78r51p34n8P68
3256e31M95q7o52q62j05P18R16K64o68q49n2P94P94M00n13o83j23P23R21K87m41
3277G46o98l07L79R65M52m47r38n36L36P76M14l65q09o62j93R76P20l27r64n13
3297i95k0Q72N40J03n11p49m8O20J147j11o31n84R2L80Q43J99n99p34k45M84Q21
3318H74J09p81p08k22L55M36O02p01j148k49N80O07L24k93o82m17O3Q88Q05q7
$$ plain form
3338 355 -498 -1057 -635 182 635 768 340 -360 -238 503 1279 1175 646 14 236 738 1184 1423 930 251
3358 251 -57 634 1358 1156 322 -144 -470 -95 452 678 57 -1176 -1591 -1077 -138 -120 -755 -1344 -1793 -1762
3378 -1762 -1055 -228 -372 -1301 -1834 -1178 -328 30 -75 -262 -552 -545 141 1191 1139 259 76 492 940 1140
3398 1140 1333 834 78 -160 729 1520 1218 299 -392 -256 182 560 940 542 -643 -1050 -112 871 859 261
3418 261 -249 -496 -503 103 1132 958 -262 -931 -353 497 440 458 218 -144 -763 -114 737 296 -566 -846 -176
3439 -176 136 73 86 1 -829 -966 -144 1144 523 -859 -1068 -588 -180 190 717 166 -1108 -1769 -548 706
3459 706 596 -333 -645 -879 -1040 -357 818 885 -498 -1007 -239 462 279 230 527 156 -238 142 1031 680
3479 680 -416 -435 605 678 209 55 53 -646 -914 223 1354 281 -1194 -1136 -442 7 276 877 425 -909
$$ packed form
3338C55q53n59M22Q17M53J33m28p00J22P41P76j04n29o32K22N02M46K39m93o79
3358B51l08O91P24k02q34m66l26L75N47K26o21j233m15N14R39J8o35n89m49L1
3378a762P07Q27j44r29n33O56Q50L58j05j87k90PO86J050n2q80j83M16M48K00
3398A140J93m99p56k38Q89P91l02r19o91J36M38L78L80l98j185m07R38R83j2n98
3418B61n10k47pO06J029j74j220o69N78Q50n7J8k40l62o19O49Q51m41q62k80O70
3439a76L12o3J3q5q30j37Q22J288o21j382k09M80M08L70N27n51j274o61J221J254
3459G06j10r29l12k34j61O83J175O7j383n09P68P01j83m9K97l71l94L80Q89l51
3479F80j096j9J040P3m69j54ko99k68J137J131j073j475N8O94M49K69O01m52j334
$$ plain form
3499 -909 -1400 -58 1368 1035 136 138 -25 -419 425 1535 1561 -75 -443 401 989 522 224 688 196 -408
3519 -408 301 1179 310 -1046 -769 387 629 -37 35 -371 -1270 -1392 141 1487 434 -1213 -1581 -942
3537 -942 -600 -63 972 551 -1493 -2195 -936 256 159 19 68 -790 -1723 -1329 340 793 -165 -333 -53
3556 -53 -376 -1085 -217 974 969 267 247 516 -448 -995 512 2239 1706 248 -511 -708 -686 237 2396 2722
3576 2722 346 -1945 -1690 -160 1209 2178 2223 97 -2483 -2535 98 2285 2207 885 -652 -2054 -2161
3593 -2161 -108 2377 2219 -86 -1594 -1787 -1338 -364 1214 1879 135 -1861 -2105 -804 -119 244 1066
3610 1066 748 -906 -2108 -1366 30 617 933 1202 -141 -1930 -2082 -229 1609 1744 977 -304 -1532
3627 -1532 -1987 -275 2123 2815 792 -1053 -1621 -1396 236 2236 2616 684 -1577 -1943 -269 1188
$$ packed form
3499i09m91J342J426l33q99Kj63l94Q44J110K6j636l68Q44N88m67k98M64m92o04
3519d08P09Q78q69j356K77J156K42o66P2m06q99j22J533J346j053j647l68O39
3537i42L42N37J035m21k044p02J259J192r7j40M9q58r33L94J669M53r58j68K80
3556e3l23p09Q68J191np02k0K69r64n47J507J727n33j458p59j97K2R23K159L26
3576B722k376k291K55J530J369R69M5k126k580n2K633K187p8j322j537j402j07
3593b161K053K485j58k305j508j93M49R74J578O65j744j996k44J301O85L63Q22
3610A066l18j654j202P42J396N87L16K69j343j789j52J853J838J35p67j281j228
3627a532m55J712K398O92k023j845n68K25J632K000L80j932k261l66J674J457
$$ plain form
3643 1188 1828 1411 297 -1634 -1983 -419 1325 1402 205 -484 -987 -1210 -579 738 864 -12 -720 -782
3661 -782 -413 -512 -231 441 531 -126 -474 -336 -514 -261 491 1114 731 -450 -977 -498 54 763 1004 695
3681 695 -530 -1446 -664 676 1309 790 56 -713 -1080 -391 855 1220 702 -564 -959 -505 193 753 787
3700 787 151 -552 -756 159 560 408 -6 -234 -311 -221 72 263 -86 -384 -252 115 296 -244 -477 -382 -437
3721 -437 47 289 24 -641 -1069 -490 51 508 106 -499 -774 -633 48 658 846 183 -624 -474 211 947
3741 947 1183 768 119 -335 141 768 1296 869 249 -111 -27 453 542 607 223 -374 -237 101 195 9 -367
3762 -367 -619 -537 -328 -168 -353 -633 -993 -700 -230 70 -180 -702 -883 -677 -23 233 241 -434 -822 -669 -21
3783 -21 607 475 4 -507 -566 -118 641 862 431 -210 -399 -28 616 895 723 202 -147 71 426 1027 824
$$ packed form
3643A188O40m17j114j931l49J564J744P7j197o89n03k23O31J317J26q76p08o2
3661g82L69r9K81O72R0o57l48J38j78K53P52O23l83j181n27M79N52P09K41l09
3681F95j225r16P82J340O33n19p34p69l67O89J246L65n18j266l95M54O98N60L4
3700G87o36p03k04R15M01j52m14k28p7R0K93J91l49k98J32L67J81n40k33R5n5
3721d37M84K42k65o65m28N79N41M57m02o05k75J41O81O10J88o63q07J50O85P36
3741I47K36m15o49m54M76O27N28m27o20l60Q4M80Q9O5l84n97J37L38R4j86l76
3762c67k52Q2K09J60j85k80l60K93M70L00k50n22j81K06O54K56Qo75l88J53O48
3783b1O28j32m71n11n9M48P59K21m31o41j89L71O44K79j72n21l49K18L55O01k03
$$ plain form
3804 824 187 -190 78 335 620 563 52 -197 -319 -15 330 18 -403 -752 -514 -245 56 -37 -527 -767 -805
3825 -805 -160 185 94 -314 -595 -668 -3 489 419 80 -450 -469 45 696 727 208 -218 -385 -253 464 699 429
3847 429 -257 -474 -194 250 370 307 -171 -627 -465 -29 537 185 -239 -560 -357 55 361 254 -33 -370
3867 -370 -269 19 525 446 -35 -298 -235 316 507 595 102 -317 -322 148 600 496 158 -300 -404 -107 157 408
3889 408 71 -509 -645 -382 72 117 -124 -635 -792 -621 -16 154 -150 -501 -691 -393 64 364 178 -6
3909 -6 -269 -166 394 841 789 386 11 15 593 887 813 491 60 40 313 723 785 162 -159 -368 -133 242 314
3932 314 -201 -576 -757 -613 -7 40 -413 -779 -897 -686 -272 -11 -169 -579 -811 -508 -58 247 62 -342
3952 -342 -577 -387 113 440 329 -119 -283 -201 255 623 687 321 -155 -67 484 880 744 421 51 90 386
$$ packed form
3804H24o37l77K68K57K85n7n11k49j22L04L45l12m21l49K38K69L01r3m90k40l8
3825h05O45L45r1m08k81p3O65M92p0l39n30j9N14O51L1n19m26j67J32P17K35k70
3847D29o86k17K80M44J20o3m78m56J62M36N66l52m24l21K03M12L06j07k87l37
3867c70J01K88N06p9m81k63O3N51J91Q8m93m19nM70M52j04l38m58j04K97K64K51
3889D08l37n80j36K63M54M5k41n11j57J71O05J70l04l51j90K98M57L00j86j84
3909fk63J03N60M47n2m03l75MN78K94p4l22m31k0K73M10O2o23l21k09K35L75P2
3932C14n15l75j81J44O06M7m53l66j18K11M14K61j58m10k32L03M50L05j85m04
3952c42k35J90N00L27j11m48j64Q2M56L68O4l66m76Q8N51L96j36l23l70L9K96
$$ plain form
3973 386 594 735 340 -22 -231 -35 538 373 142 -342 -523 -285 98 175 -61 -407 -672 -440 42 100 -198
3994 -198 -531 -693 -544 5 201 -36 -619 -651 -250 -69 247 295 -152 -552 -488 43 515 238 -171 -374 -249
4015 -249 134 414 521 301 -325 -111 450 698 669 395 -117 19 436 771 878 435 96 -155 237 377
4035 377 408 338 -203 -476 -363 51 278 -244 -670 -669 -622 -372 -75 -196 -506 -927 -635 -104 249 -90 -286 -432
4057 -432 -342 59 291 441 -95 -320 -227 314 553 385 216 -161 -185 177 596 750 90 -372 -274 129 264
4078 264 356 206 -170 -669 -420 177 390 110 -361 -453 -205 -141 144 177 -107 -463 -219 194 304 13 -98
4099 -98 -29 -50 168 311 334 -50 -261 33 619 399 39 -153 -193 -292 22 590 425 -418 -1001 -466 85 255
4121 255 90 -56 -596 -1252 -744 265 550 -84 -655 -635 -464 -126 380 817 187 -494 -501 305 556 315 507
$$ packed form
3973C86K08J41l95l62k09J96N73j65k31m84j81K38L83P7k36l46k65K32M82N8k98
3994a98l33j62J49N49J96k37n83l2M01J81L16M8m47m00O4N31M72k77m09k03J25
4015b49L83K80J07k20o26K14N61K48k9k74n12J36M17L35J07m43l39k51L92J40
4035C77L1p0n41k73J13M14K27n22m26JM7K50K97j21l10m21K92N31L53l39j96j46
4057d32R0M01K32J50n36k25R3N41K39j68j69l77k4L62M19J54o60m62R8M03J35
4078B64R2j50l76m99K49N97K13k80m71r2K48O4K85L3k84l56K44M13J10k91j11
4099i8O9k1K18J43K3l84k11K94N86k20l60j92m0r9L14N68j65q43n83N35N51J70
4121B55j65j46n40o56N08J009K85o34n71K0J71L38N06M37o30o81pQ06K51k41J92
$$ plain form
4142 507 468 87 -4 324 685 406 267 567 597 63 -332 -22 197 45 91 133 -44 -955 -1076 -163 323 26
4164 26 -630 -789 -1072 -1227 -358 528 421 -701 -1236 -766 -220 143 718 736 -229 -967 -346 753 921 621
4184 621 483 281 -342 -155 761 1045 406 -121 91 206 -121 -43 480 511 -137 -323 274 285 -458 -330 399
4205 399 517 -198 -344 -108 -306 -480 204 875 335 -949 -852 -192 184 29 487 180 -787 -1390 -342 659
4225 659 379 -401 -433 -572 -938 -625 546 707 -304 -920 -195 113 -192 -30 562 380 -316 -117 660 664
4245 664 12 193 706 680 -69 260 520 251 -110 436 963 255 -699 -355 414 317 126 338 33 -999
4265 -999 -1108 -31 772 233 -611 -526 -604 -879 -423 556 500 -621 -1083 -270 142 -62 -71 446 33 -789 -399
4286 -399 361 360 -302 56 463 162 -184 43 387 155 -91 482 777 -17 -585 -87 703 261 100 305 196
$$ packed form
4142E07l9l81r1L28L61k79j39L00L0n34l95L10K19j52M6M2j77r11j21R13M86k97
4164B6o56j59k83j55Q69Q86j07j122n35M70N46L63N75J8r65p38O21J099J68l00
4184F21j38k02o23J87R16K84o39n27K12J15l27P8N23L1o48j86N97J1p43J28P29
4205C99J18p15j46K36j98j74O84O71n40j284R7O60L76j55M58l07r67o03J048J001
4225F59k80p80l2j39l66L13J171J61j011o16P25L08l05J62N92j82o96J99P77M
4245F64o52J81N13k6p49L29K60k69l61N46N27p08r54L44P69r7j91K12l05j032
4265i99j09J077Q03n39q44Q5p8k75M56R79n6j121m62Q13M12k04rN17m13q22L90
4286c99P60jo62L58M07l01l46K27L44k32k46N73K95p94n68M98P90m42j61K05j09
$$ plain form
4307 196 -839 -780 485 875 160 -471 -477 -475 -317 118 845 375 -704 -908 -104 421 124 360 358 -302 -688
4328 -688 -71 794 505 -98 -72 77 -107 -289 200 406 -181 -439 -20 359 -230 -621 -68 206 -109 -357
4348 -357 -134 -37 -538 -585 313 509 -84 -373 -118 126 -11 315 685 333 -385 -248 436 639 218 246 215
4369 215 -102 -125 232 725 314 -410 -103 332 306 124 112 187 -466 -382 172 619 -88 -697 -493 -48 -163 -45
4391 -45 126 -248 -883 -824 -134 423 -53 -490 -372 -470 -548 64 538 289 -274 -456 80 164 272 252 383 122
4413 122 -58 151 684 437 108 317 513 153 27 94 302 57 51 503 303 -97 -539 -119 403 391 26
4434 26 -25 -388 -758 -360 410 563 -143 -689 -663 -428 -94 243 392 -182 -835 -829 -219 285 164 -50 -363 -563
4456 -563 -637 111 601 483 -250 -294 -81 154 207 382 463 128 -177 90 635 378 84 315 271 156 -16 203
$$ packed form
4307A96j035N9J265L90p15o31oKJ58M35P27m70j079k04Q04N25k97K36ko60l86
4328f88O17Q65k89o03K6J49j84j82M89K06n87k58M19L79n89l91N53K74l15k48
4348c57K23R7n01m7Q98J96n93k89K55K44j37L26L70l52p18J37O84K03m21K8l1
4369B15l17k3L57M93m11p24L07M35k6j82j2P5o53Q4N54M47p07o09K04M45j15J18
4391d5J71l74o35N9O90N57m76m37J18r8p8O12M74k49n63j82N36Q4J08k0J31k61
4413A22j80K09N33k47l29K09J96l60j26O7K08k45oM52k00m00m42M20N22j2l65
4434B6n1l63l70L98P70J53p06n46K6K35L34L37J49n74o53OO10N04j21k14l13k00
4456e63p4P48M90j18p33m4K13K35N3J75Q1l35l05K67N45k57k94K31m4j15j72K19
$$ plain form
4478 203 254 -54 53 359 406 62 -370 16 91 148 186 231 -312 -610 -320 138 399 -77 -366 -507 -412 -310
4500 -310 -22 282 -286 -758 -756 -142 56 -141 -57 -234 -353 -267 47 387 200 -291 -232 3 232 235 249 215 -174
4523 -174 -82 309 456 308 -66 -16 3 95 317 294 50 -305 -217 258 298 -35 -111 -181 -87 50 190 308 -122
4546 -122 -346 -200 191 317 115 51 -66 -167 -140 106 364 71 -364 -321 -87 -79 -3 21 -243 -392 -298 62 107
4569 107 -107 -360 -446 -206 76 100 135 -96 -384 -138 219 351 107 -78 -28 61 164 364 360 184 -75 -87 367
4592 367 353 310 105 -119 -112 99 308 443 50 -240 -164 34 221 90 16 -263 -299 -94 162 89 -170 -265 -382
4615 -382 -342 -42 100 -30 -223 -354 -246 146 214 37 -194 -103 -114 147 283 138 -81 -251 -157 214 366 212
4637 212 -13 -279 -81 209 288 300 185 -153 -164 133 249 353 120 90 -201 31 322 293 51 -34 -149 -40
$$ packed form
4478B03N1l08J07L06M7l44m32L86P5N7L8M5n43k98K90M58K61m76k89j41R5J02
4500c10K88L04n68m72KO14J98j97Q4j77j19Q6L14L40j87m91N9K35K29LJ4l4l89
4523a74R2L91J47j48l74N0J9R2K22k3k44l55Q8M75M0l33p6p0R4J37J40J18m30
4546a22k24J46L91J26k02o4j17j01K7K46K58k93m35M3K34QP6K4k64j49R4L60M5
4569A07k14k53q6K40K82K4L5k31k88K46L57J32k44j85N0Q9J03K00mj76k59j2M54
4592C67j4m3k05k24PK11K09J35l93k90P6J98J87j31p4k79l6K05K56p3k59r5j17
4615c82M0L00J42j30j93j31J08L92O8j77k31R1j1K61J36j45k19j70R4L71J52j54
4637B12k25k66J98K90P9J2j15l38j1K97J16J04k33l0k91K32K91k9k42q5j15J09
$$ plain form
4659 -40 170 303 81 -209 -225 -247 -50 147 -208 -262 -341 -218 -116 -40 -48 -332 -464 -292 -3 57 -135 -258 -221
4682 -221 -304 -117 166 79 -42 -282 33 139 256 276 160 -124 -81 183 526 494 67 28 83 209 319 389 261
4705 261 -94 -224 45 563 212 35 -59 -265 -81 70 236 -11 -309 -567 -340 -147 -68 -332 -276 -456 -586
4726 -586 -258 -13 -58 -362 -566 -186 3 124 88 95 -45 -136 100 521 476 91 46 282 280 335 403 365 -124 -130 241
4751 241 387 305 9 -102 -23 -173 19 325 139 -288 -329 -14 141 -2 53 -28 -240 -318 44 544 258 -268
4773 -268 -200 53 5 -148 268 107 -220 -397 148 339 -34 -343 -147 -61 -85 -111 324 -18 -314 -226 109 335
4795 335 -48 -167 3 -97 -253 -32 437 65 -453 -325 73 254 -4 -27 44 -244 -191 185 508 163 -107
4816 -107 3 214 218 63 280 351 28 -214 484 523 60 -120 42 251 -20 131 229 -73 -349 -448 148 91
$$ packed form
4659d0K10J33k22k90j6k2J97J97l55n4p9J23J02P6qk84j32J72K89O0j92j23L7
4682b21q3J87K83q7j21k40L15J06J17K0j16k84M3K64L43l2m27l9N5J26J10P0j28
4705B61l55j30K69N18l51j77r4k06J84J51J66k47k98k58K27J93P9k64N6j80j30
4726e86L28K45m5l04k04L80J89J21l6Pj40r1K36M21m5l85m5K36kN5O8l8m89oL71
4751B41J46q2k96j11P9j50J92L06j86m27m1L15J55j43N5q1k12p8L62N00k86n26
4773b68O8K53m8j53M16j61l27j77N45J91l73l09J96Q6k4k6M35l42k96Q8L35K26
4795C35l83j19J70j00j56K21M69l72n18J28L98J81k58k3P1k88N3L76L23l45k70
4816a07J10K11Mj55K17P1l23k42O98L9m63j80J62K09k71J51R8l02k76r9N96n7
$$ plain form
4838 91 -238 -420 -430 -415 -367 39 355 -144 -630 -504 78 97 -90 206 118 -390 -354 220 715 358 -7 96
4860 96 79 19 -6 550 407 87 -141 193 116 -210 -31 369 227 -22 -173 24 -99 -351 88 655 438 -337
4882 -337 -461 -211 -64 89 379 437 -205 -805 -567 164 485 272 29 -279 -724 -728 14 465 215 -409 -544
4903 -544 -468 -434 -267 264 410 -176 -406 -231 -92 -17 104 399 346 -84 -273 -61 141 253 547 820 455
4924 455 -213 -359 220 688 760 681 355 -160 -638 -170 858 957 416 -200 -402 -716 -491 471 753 274 -576
4945 -576 -898 -630 -364 40 428 264 -544 -1142 -742 -278 87 57 286 -132 -683 -786 -127 421 366 403 269
4966 269 -143 -561 -411 645 914 615 168 1 -437 -395 382 1126 1094 35 -506 -609 -171 351 871 747
4986 747 0 -1001 -935 14 503 553 486 -119 -829 -1028 -252 692 541 -102 -408 -620 -710 -543 463 631 48
$$ packed form
4838I1l29j82j0J5M8M06L16m99m86J26N82J9j87K96q8n08L6N74M95l57l65J03
4860I6j7o0k5N56j43l20k28L34p7l26J79M00j42k49j51J97j23k52M39N67k17p75
4882c37j24K50J47J53K90N8o42o00K38P31L21k13k43l08m45mP42M51k50o24j35
4903e44P6L4J67N31J46n86k30J75J39P5J21K95n3m30j89K12K02J12K94K73l65
4924D55o68j46N79M68P2p9l26n15m78M68J028R9n41o16k02l14K25R62K82m79q50
4945e76l22K68K66M04L88j64q08n98M00M64L65l0K29m18n51j03O59N48n5L7j34
4966B69m12m18J50J056K69k99m47j67m38M2P77P44l2j059n41j03M38N22N20j24
4986G47p47j001O6R49M89N0o7o05p10j99P76R44j51o43l06k12r0J67J006J68n83
$$ plain form
5007 48 -509 -325 -272 -317 94 633 562 -245 -442 -93 66 101 399 680 182 -554 -470 71 306 208 510 291
5029 291 -445 -799 -113 750 524 -142 -199 -180 -542 -301 514 725 -52 -706 -378 102 3 -6 543 291 -348 -461
5051 -461 332 509 -90 -246 -77 -50 -310 -147 349 140 -384 -345 299 196 -272 -111 132 -237 -265 -40 367
5072 367 -189 -641 -213 303 21 -220 87 158 -276 -513 241 436 -120 -404 212 433 -176 -266 432 313 -279
5093 -279 54 625 384 -330 -330 451 307 -33 201 248 -106 -269 96 722 248 -317 -175 148 -118 -314 392
5114 392 393 -108 -723 -202 336 -22 -183 19 42 -521 -514 271 360 -326 -441 -109 72 -349 -101 176 -41 -442
5136 -442 -85 314 261 -254 -11 392 -31 -90 130 566 73 -164 347 645 294 -128 185 317 86 201 523
5157 523 418 -262 -160 208 550 -63 -103 -11 -81 -382 -107 449 220 -421 -488 -5 46 -168 -83 168 -291 -423
$$ packed form
5007D8n57J84N3m5M11N39p1q07j97L49J59L5K98K81m98p36Q4N41K35r8L02k19
5029B91p36l54O86Q63k26o66n7J9l62K41Q15K11p77o54L28M80r9rN49k52o39j13
5051d61P93J77n99j56J69K7k60J63M96k09n24L9O44j03m68J61K43l69k8K25M07
5072C67n56m52M28N16k82k41L07P1m34k37P54J95n56k84O16K21o09r0O98j19n92
5093b79L33N71k41p14%P81j44l40K34M7l54j63L65O26m74n65J42L23k66j96P06
5114C92Jn01o15N21N38l58j61K02K3n63PP85Q9o86j15L32J81m21K48K77k17m01
5136d42L57L99n3n15K43M03m23n9K20M36m93k37N11K98l51m22L13J32k31J15L22
5157E23j05o80J02L68L42o13m0R2p0l01K75N56k29o41o7M83N1k14Q5K51m59j32
$$ plain form
5179 -423 -92 198 -13 -316 -231 -98 -189 -207 52 174 -132 -571 33 196 -68 -191 36 63 -117 26 300
5200 300 286 -64 -214 320 401 28 45 100 72 -128 178 440 248 -180 -83 161 94 76 113 -8 -92 -261 47
5223 47 264 -9 -271 8 11 -105 -32 82 57 -254 -355 -38 180 29 -244 -79 -92 -174 88 136 -11 -169 -126
5246 -126 2 187 82 24 84 -8 43 198 362 258 -37 -49 67 135 130 182 91 -72 -69 249 250 16 -164 -21 31
5271 31 -21 135 53 -38 -333 -124 -81 247 15 -57 -98 -135 -31 21 86 91 -149 -218 51 149 89 -50 -227 -252 -82
5296 -82 11 88 -191 -208 -159 -128 -83 -16 -99 -196 -202 -16 115 55 12 -185 -37 -27 160 161 200 186 81 190 314 434
5322 434 257 129 136 188 255 244 289 39 -101 -47 -19 76 126 -129 -198 -230 -146 76 15 -251 -282 -120 -312 -103 64
5347 64 -126 -258 -379 -32 41 -22 -100 -154 -243 -19 -96 255 98 -99 -82 165 157 268 272 65 158 19 207 160 94
$$ packed form
5179d23L31K90k11l03Q5J33r1j8K59J22l06m39O04J63k64j23K27K7j80J43K74
5200C00j4l50j50N34Q1l73J7N5k8k00L06K62j92m28R7K44o7j8L7j21q4j69L08
5223D7K17k73k62K79Lj16P3J14k5l11j01L17K18j51k73J65j3q2K62M8j47j58M3
5246a26J28J85j05n8O0r2N1J55J64j04k95j2J16O8nN2r1j63LL18Jk34j80J43N2
5271C1n2J56q2r1k95K09M3L28k32p2m1l7J04N2O5Nk40o9K69R8o0j39j77k5J70
5296h2R3P7k79j7M9L1M5O7q3r7oJ86J31o0m3j97J48J0J87JL9j4j05J09J24J20
5322D34j77j28PN2O7j1M5k50j40N4K8R5N0k55o9l2Q4K22o1k66l1J62j92K09J67
5347F4j90j32j21L47P3o3p8n4q9K24p7L51j57j97J7K47qJ11Mk07R3j39J88m7o6
$$ plain form
5372 94 -33 16 -99 98 189 160 -9 -142 -45 -4 233 -17 -7 -116 -123 16 -37 112 -53 -219 -87 -44 54 -54
5396 -54 6 -65 -233 -36 165 134 75 -61 -132 -43 62 -23 26 -105 -168 -202 40 78 160 -121 -76 -127 74 5 -76 -34
5422 -34 56 0 -28 220 201 55 -196 86 89 343 206 81 -19 -10 103 311 227 102 59 -23 9 104 99 74 -108 -116
5448 -116 -149 -187 -28 -57 -174 -333 -173 -2 -55 -109 -281 -372 -92 -17 98 -13 -4 -138 -120 52 314 238 58 9
5472 9 0 172 237 315 55 -166 -41 -93 238 186 -115 -160 -43 -28 -9 68 62 -26 -50 -117 80 123 -56 -164 33 89
5498 89 -21 113 -8 8 -188 -35 264 221 4 -75 28 -64 -22 54 45 -291 -289 -123 166 31 -57 -76 -155 -192 -134
5523 -134 116 24 -144 -206 -5 -10 88 43 52 40 -162 -30 258 250 12 -128 182 145 55 185 403 76 -114 101
5547 101 488 232 -10 95 168 175 59 112 280 -66 -129 -101 179 -6 -142 -229 -128 -271 -257 109 -189 -442 -316
$$ packed form
5372I4j27M9j15J97R1k9j69j33R7M1K37k50J0j09pJ39n3J49j65j66J32M3R8j08
5396e4O0p1j68J97K01l1n9j36p1Q9J05q5M9j31o3l4K42L8Q2k81M5n1K01o9q1M2
5422c4R0n6k8K48j9j46k51K82LK54j37j25j00RJ13K08q4j25m3q2L2R5nk5j82q
5448a16l3l8J59k9j17j59J60J71n3n4j72r1K80P5J15j11Rj34J8J72K62p6j80m9
5472IrJ72O5P8k60k21J25n2L31n2l01m5J17J5J9P7oq8k4o7J97M3j79j08J97N6
5498H9j10J34j21J6j96J53K99m3k17p9J03r2M2P6rl36KJ66K89j35q8j9p9l7N8
5523a34K50r2j68o2K01nR8m5Rj2k02J32K88qk38j40L10l7r0J30K18l27j90K15
5547A01L87k56k42J05P3Pj16N3J68l46o3K8K80j85j36q7J01j43J4L66k98k53J26
$$ plain form
5570 -316 -197 -70 -250 -298 -64 -224 -352 -120 141 -62 -346 -159 44 111 -5 169 221 -54 -210 261 641
5591 641 171 -148 127 235 149 128 369 473 -164 -284 262 402 304 -17 92 -21 -430 -126 441 327 -193
5612 -193 -195 -15 -57 -247 25 302 54 -331 -235 210 -73 -493 -38 320 -13 -474 -89 88 -227 -207 116 365
5634 365 -340 -565 -30 161 -1 83 301 74 -467 -347 533 488 72 -57 205 -77 -291 245 842 376 -390
5655 -390 -217 237 139 -29 433 448 -49 -596 -34 446 199 -163 57 -35 -314 -372 66 413 -94 -386 141
5676 141 68 -404 -326 285 189 -312 -357 127 -28 -484 -202 468 215 -350 -172 234 -41 -258 162 444 -160
5697 -160 -650 -225 423 211 20 277 117 -422 -460 348 509 88 -182 158 185 -270 -65 566 370 -459 -302
5718 -302 285 221 -137 -62 343 31 -425 -65 337 26 -347 -84 339 -84 -296 -100 284 -221 -276 116 324
$$ packed form
5570c16J19J27j80m8K34j60j28K32K61k03k84J87K03O7j16J74N2k75j56M71L80
5591F41m70l19K75J08q6k1K41J04o37j20N46J40r8l21J09j13m09L04N67j14n20
5612a93kJ80m2j90K72K77k48l85R6M45k83m20M55L58l33m61L85J77l15K0L23K49
5634C65p05k25N35J91j62Q4K18k27n41J20Q80m5m16j29K62k82k14N36N97m66p66
5655c90J73M54r8j68M62J5m97n47N62M80k47l62K20r2k79n8M38L47n07k92N27
5676A41p3m72P8O11r6n01m5M84j55m56K82O70k53n65J78M06k75k17M20K82o04
5697a60m90M25O48k12j91K57j60n39l8Q08J61m21k70L40K7m55K05O31j96q29J57
5718c02N87o4l58P5M05l12m56L60M02l11l73K63M23m23k12J96L84n05n5L92K08
$$ plain form
5739 324 -425 -509 -5 186 -101 -307 12 -7 -466 -222 364 394 -260 -322 -85 110 -248 16 348 -61 -481
5760 -481 -189 596 254 -30 77 393 -68 -133 295 628 7 -121 166 342 16 -51 202 251 -177 -320 218
5781 218 304 -253 -306 65 192 -87 -141 237 -192 -503 -230 218 63 -405 -265 -53 -86 -247 2 264 -203
5802 -203 -631 -43 267 -35 -189 -62 88 -134 -209 273 372 -44 -117 132 189 -38 2 334 187 -46 -107 261
5824 261 315 -96 72 77 156 69 142 209 -123 -287 20 294 88 -265 -133 18 -27 -81 185 285 -208 -397 -72
5847 -72 195 143 -97 -25 -97 -222 -113 221 178 -168 -238 50 36 65 20 162 61 -136 -51 -34 -26 -82 26 89 85 -68
5873 -68 -17 79 -64 -122 203 250 -8 -181 5 110 1 73 170 16 -242 -248 73 246 164 14 -25 -165 -105 106
5897 106 225 103 -189 -36 -124 -53 -19 99 -40 -175 -217 -75 -9 11 -99 -104 -34 -101 -12 24 -109 -94 -45 121 158
$$ packed form
5739C24p49q4N04J91k87k06L19j9m59K44N86L0o54o2K37J95l58K64L32m09m20
5760d81K92P85l42k84J07L16m61o5M28L33o21j28K87J76l26o7K53M9m28j43N38
5781B18Q6n57n3L71J27k79n4L78m29l11K73M48j55m68J40K12l3j61K49K62m67
5802b03m28N88L10l02j54J27J50k22p5M82R9m16p3K49N7k27M0L32j47k33o1L68
5824B61N4m11J68NP9q7P3O7l32j64L07K74k06l53J32J51m5n4K66J00m93j89L25
5847g2K67n2k40P2p2j25J09L34m3l46p0K88j4K9m5J42j01j97Q5J7Qn6J08O3mj53
5873f8N1R6j43n8L25M7k58j73J86J05j09P2R7j54k58oL21J73q2j50l9j40O0K11
5897A06J19j22k92J53q8P1L4J18j39j35m2J42O6K0j10nP0o7Q9L6j33J5M9J66L7
$$ plain form
5922 158 21 -7 5 -9 165 162 173 99 26 113 298 260 224 17 53 31 44 165 243 -18 -165 -88 -48 144 50 137
5948 137 -165 -138 -149 54 78 111 4 -175 -128 -24 122 154 -41 -26 -49 96 97 -93 59 -185 -147 6 77 -78
5972 -78 -119 -183 -209 -66 -20 -139 -123 -313 -194 -59 19 46 -53 -90 -159 66 112 23 77 -58 24 171 255 343 15 33
5998 33 115 117 333 228 170 -4 -119 30 65 167 97 -3 -98 -44 -2 126 -93 -67 -234 -225 -40 -14 10 -85 -193
6023 -193 -208 -71 56 -13 -14 -34 -129 -138 86 154 100 9 -164 88 218 184 37 -47 -108 -23 217 200 142 17 -1 -64
6049 -64 72 227 -183 -56 -166 9 51 2 119 -134 -224 -146 -120 19 75 -241 -191 -130 -71 85 -115 -43 -101 -24
6073 -24 61 146 112 53 -126 -75 28 34 110 -67 -87 -132 26 86 76 -82 -182 -89 -123 42 113 -10 -189 -261 -61 -23
6099 -23 12 14 -73 -125 -146 150 67 52 114 52 79 -2 221 150 20 -125 -106 103 184 41 25 -83 -114 -95 0 15 88
$$ packed form
5922A58j37k8J2j4J74lJ1p4p3Q7J85l8l6k07L6k2J3J21P8k61j47P7M0J92r4Q7
5948A37l02K7j1K03K4L3j07j79M7J04J46L2j95J5k3J45Jj90J52k44L8J53P1j55
5972g8m1o4k6J43M6j19J6j90J19J35P8K7r9l7o9K25M6q9N4j35Q2J47Q4Q8l28J8
5998C3Q2KK16j05n8j74j15J49L5J02p0j00r5N4M2J28k19K6j67RJ85K6K4r5j08
6023a93j5J37J27o9jk0r5rK24O8n4r1j73K52J30l4j47q4o1Q5K40j7n8j25j8o3
6049f4J36J55m10J27j10J75M2m9J17k53r0P8K6J39N6l16N0O1N9J56k00P2n8P7
6073b4Q5Q5l4n9j79N1J03OP6j77k0m5J58O0j0j58j00R3l4J65P1j23j79p2K00L8
6099b3L5Kq7n2k1K96q3j5O2o2K7q1K23p1j30j45J9K09Q1j43j6j08l1J9R5J5P3
$$ plain form
6126 88 -268 -291 -132 17 23 -66 -217 -146 -233 -95 104 -73 -49 -23 -102 58 110 41 16 -77 -27 139 241 11 -45
6151 -45 3 61 58 43 148 -55 -66 54 181 184 -31 -206 -7 35 74 120 173 -26 -121 -112 137 149 5 42 -35 -197
6177 -197 -72 220 172 -72 -170 -248 35 -81 -217 -43 -171 -341 -321 -81 179 -53 -315 -7 -19 -103 117 145
6199 145 -157 -220 -34 157 46 -92 -71 92 -109 -64 170 352 -59 -98 -21 265 234 -47 76 52 -3 54 379
6222 379 357 35 -163 140 136 184 196 186 -159 -108 88 222 55 -246 -108 -91 -94 -209 42 93 -267 -544 -182 79
6246 79 -47 -186 -110 -163 -345 -216 225 73 -252 -217 31 177 -55 13 -37 35 -130 38 317 239 -213 -42 209
6269 209 176 -49 79 276 -49 -138 50 416 185 -188 -33 126 -57 -31 248 184 -245 -241 63 300 20 -78
6291 -78 -53 -31 -319 -94 237 57 -303 -333 15 40 -285 -3 223 -183 -281 67 339 32 -245 -111 112 -61
$$ packed form
6126H8l56k3J59J49Oq9j51P1q7J38J99j77K4K6p9J60N2o9k5r3N0J66J02k30n6
6151d5M8N8lj5J05k03j1J20J27Lk15j75J99M2L9M6N3j99r5RK49J2j44L7p7j62
6177a97J25K92m8k44r8p8K83j16j36J74j28j70K0K40K60k32k62L08j2q4K20K8
6199A45l02o3J86J91j11j38K1J63k01M5K34J82m11l9P7K86l1k81J23k4n5N7L25
6222C79k2l22j98L03mM8J2j0l45N1J96J34j67l01J38J7lj15K51N1l60k77L62K61
6246G9j26j39P6n3j82J29M41j52l25L5K48J46k32O8n0P2j65J68K79p8m52J71K51
6269B09l3k25J28J97l25q9J88L66k31l73J55J59j83K6K79o4m29ML04K37k80r8
6291g8K5K2k88K25L31j80l60l0L48K5l25K82K26m06r8L48K72l07k77J34K23j73
$$ plain form
6313 -61 -215 108 143 -151 -124 216 288 -79 -119 -23 68 59 180 331 134 -156 -151 284 338 53 107 39 -22 -166 295
6338 295 520 141 -403 -243 168 36 -67 231 11 -176 -374 -19 360 -64 -150 16 -49 -202 -197 157 113 -335
6360 -335 -123 -60 16 -247 -28 90 -49 -144 24 110 -145 -251 52 291 81 -23 66 -89 -215 -53 280 379
6382 379 -52 -280 -5 206 121 190 206 -5 -321 -160 172 328 60 -24 32 -183 -127 114 358 105 -208 -95
6404 -95 208 8 -50 100 23 -124 -121 58 123 -127 -77 109 182 -114 -198 -55 -94 -124 -119 373 11 -213 -349 -34
6428 -34 43 251 239 90 -182 -296 -44 264 289 15 0 -47 -108 145 319 178 -52 -195 -73 34 78 12 235
6451 235 3 -83 12 64 145 21 -142 12 87 -29 -50 -49 -117 -38 138 144 -36 -234 -196 -75 101 166 32 -150 -412
6476 -412 -159 32 179 86 -15 -277 -252 -73 205 218 179 -173 -172 -59 164 252 169 32 -26 -118 111 224 177 150
$$ packed form
6313f1j54L23L5k94K7L40P2l67m0R6R1rJ21J51j97k90NM35N4k85N4o8o1j44M61
6338B95K25l79n44J60M11j32j03K98k20j87j98L55L79m24q6J66o5j53NL54m4m48
6360c35K12O3P6k63K19J18j39r5J68Q6k55j06L03K39k10j04Q9j55j26J62L33R9
6382C79m31k28K75K11q5O9J6k11l16J61L32J56k68q4N6k15N6K41K44k53l13J13
6404i5L03k00n8J50p7j47LJ79O5k50N0J86P3k96q4J43l9l0NM92l62k24j36L15
6428c4P7K08j2j49k72j14K52L08K5k74j5m7o1K53J74j41k30j43J22J07M4o6K23
6451B35k32q6R5N2Q1j24j63J54P5j16k1Jo8P9J76Oj80j98L8J21J76O5j34j82k62
6476d12K53J91J47r3j01k62K5J79K78J3l9l52JJ13K23Q8q3j37n8r2K29J13m7k7
$$ plain form
6500 150 35 21 -15 130 257 78 9 1 -63 108 11 34 -7 -191 -173 -5 -23 -184 -144 -157 23 10 -130 -310 -187
6525 -187 -229 -71 56 -79 -271 -231 -145 50 104 123 -11 -54 -332 -8 210 135 129 -78 -30 -18 219 367 257 16
6549 16 -105 7 148 192 273 50 134 -53 47 94 144 -22 -114 29 -50 104 80 -117 -40 -143 56 -21 74 -119
6573 -119 -150 -156 -37 -12 -38 -193 -270 -180 36 -2 18 -124 -183 -284 -84 92 192 15 -201 -249 -105 14 140 165
6597 165 22 -71 -137 -75 227 255 -43 118 -24 -11 153 271 31 -80 41 87 201 57 20 -53 -73 26 116 39
6621 39 88 -216 -107 34 181 59 -40 -230 -282 -28 7 122 -64 -182 -24 -28 -56 -75 -93 -161 -205 -129 118 36 -67
6646 -67 -73 -23 -131 95 91 263 -80 -201 -32 117 200 35 134 -20 -163 -117 255 86 -6 -308 -45 -21 74 38
6670 38 -160 -109 -164 20 195 110 -122 -58 -252 -136 45 74 -10 -89 -182 -56 143 135 132 -2 -199 -180 -113 128 102
$$ packed form
6500A50j15j4l6J45J27j79o9qo4J71r7K3m1j84J8J68j8j61M0j3J80j3j40j80J23
6525a87m2J58J27j35j92M0Q6J95N4J9j34m3k78L24K18p5ok07M8J2K37J48j10k41
6549A6j21J12J41M4Q1k23Q4j87J00M7N0j66r2J43p9J54k4j97P7j03J99p7R5j93
6573a19l1oJ19K5k6j55p7R0K16l8K0j42n9j01K00J76J00j77k16m8J44J19J26K5
6597A65j43r3o6O2L02K8k98J61j42J3J64J18k40j11J21M6J14j44l7p3k0R9R0p7
6621C9M9l04J09J41J47j22r9j90n2K54L5J15j86j18J58mk8j9j8o8m4P6K47q2j03
6646f7oN0j08K26mJ72l43j21J69J49Q3j65R9j54j43M6L72j69r2l02K63K4R5l6
6670C8j98N1n5J84J75q5k32O4j94J16J81K9q4p9r3J26J99qlj34j97J9O7K41k6
$$ plain form
6695 102 -88 -186 -67 141 9 64 -146 -52 -70 1 87 76 -58 -170 -104 -52 2 171 37 -37 -104 -16 133 78 -15
6720 -15 -84 -30 -104 134 118 73 -105 -89 136 174 120 51 -47 -56 69 216 159 159 -25 -216 -117 18 88 75 -198 -156 -134
6747 -134 60 207 125 -151 -184 -285 66 -7 -12 94 -160 -191 -73 119 117 -62 -129 -88 -17 105 120 -8 -65 -93 90
6772 90 187 124 114 19 -56 6 193 315 100 -17 -58 80 120 142 132 -1 -121 -98 136 110 41 19 -175 -197 -74
6797 -74 179 121 5 -249 -268 101 118 30 -17 -105 -198 5 148 111 -15 -129 -257 -9 49 136 -30 -102 -233 -87
6821 -87 235 102 39 -105 -22 32 -1 146 169 -2 -126 39 156 346 46 -22 140 200 -14 168 130 42 -271
6844 -271 -6 288 229 108 -123 -5 -163 86 55 116 -197 -332 -198 59 43 -5 -79 -240 -277 -245 64 63 -95
6867 -95 -129 -155 -99 -50 104 88 -114 3 -87 127 5 -4 -70 -37 24 14 151 97 -183 -244 120 131 71 162 63 66 -114
$$ packed form
6695A02j90r8J19K08j32N5k10R4j8P1Q6j1j34j12O6N2N4J69j34p4o7Q8J49n5r3
6720a5o9N4p4K38j6m5j78J6K25L8n4o9r8rJ25J47n7%j84j91R9J35P0j3k73M2K2
6747a34J94J47q2k76l3j01L51p3nJ06k54l1J18J92kj79o7M1P1J22J5j28n7k8J83
6772I0R7o3j0r5p5O2J87J22k15j17m1J38M0K2j0j33j20K3K34k6o9k2j94k2J23
6797g4K53n8j16k54j9L69J7q8m7q8r3K03J43l7j26j14j28K48N8Q7j66p2j31J46
6821h7L22j33o3j44Q3N4l3J47K3j71j24J65J17J90l00o8J62O0k14J82l8q8l13
6844b71K65K94n9j21k31J18j58K49l1O1l13j35J34K57j6m8p4j61l7L2L09jj58
6867i5l4k6N6M9J54j6k02J17r0K14j22ro6L3O1j0J37n4k80o1L64J1o0R1r9Lj80
$$ plain form
6894 -114 160 241 203 -100 -150 -26 89 162 146 140 -147 -122 -59 102 105 -37 16 -62 -209 -35 69 31 -181 -242 59
6919 59 72 -22 -324 -42 -129 -164 -153 122 -38 -244 -134 0 90 108 13 7 -186 -34 185 375 311 -138 -50 36 174
6944 174 301 93 98 -149 -191 183 326 77 38 -15 -103 -52 -75 172 83 -263 -124 43 72 -67 -61 171 -54 -211
6968 -211 33 113 51 -131 -182 39 167 91 165 -111 -330 -186 199 287 77 -153 -147 46 -98 100 118 110 -253 -131
6992 -131 172 177 36 -37 65 -3 34 233 184 -33 -231 56 121 201 40 -14 -83 -237 -81 138 245 -72 -219
7015 -219 -110 176 -74 107 222 -37 -261 -146 251 169 -120 -53 -67 -151 -243 117 186 35 -299 -108 145 8
7037 8 -83 -6 -14 -1 -87 160 131 -167 -122 77 100 95 120 -3 -208 -125 84 301 22 -237 -122 -69 -58 206 280 55
7063 55 -108 -265 -11 314 200 -28 -134 -37 -114 104 344 259 -132 -363 -155 17 26 91 -11 -169 -199 -6 55
$$ packed form
6894a14K74Q1l8l03n0J24J15P3j6ok87K5O3J61Lj42N3p8j47J74J04l8k12o1L01
6919E9J3r4l02K82q7l5J1K75j60k06J10J34R0J8r5oj93J52K19J90o4m49Q8Q6J38
6944A74J27k08Nk47m2L74J43k49l9n3q8N1k3K47q9l46J39J67K9j39OK32k25j57
6968b11K44Q0o2j82n1K21J28p6P4k76k19J44L85Q8k10k30OJ93j44J98J8ql63J22
6992a31L03Nj41p3J02o8L7J99m9k17j98K87O5Q0j61n4o9j54J56K19J07l17j47
7015b19J09K86k50J81J15k59k24J15L97q2k89O7j4q4r2L60O9j51l34J91K53j37
7037Hr1P7qJ3q6K47k9k98M5J99K3nK5j23k05Q3K09K17k79k59J15N3J1K64P4k25
7063E5j63j57K54L25j14k28j06R7p7K18K40q5l91k31K08J72RO5j02j58l0J93O1
$$ plain form
7086 55 33 -106 -142 -81 -6 -4 165 18 -160 -175 100 161 -81 -39 -24 -45 -16 103 305 34 -276 -250 53 218 102
7111 102 -11 -1 -193 -170 117 287 47 -185 -92 85 50 254 219 -79 -288 -172 244 283 -7 -77 52 -151
7133 -151 -90 99 254 80 -241 -181 113 135 -63 44 21 -187 -126 91 277 -124 -277 -259 52 -47 -114 9 -151
7156 -151 -293 21 187 102 -118 -262 -149 -17 -33 168 190 -84 -156 -61 213 110 89 -9 25 -115 -39 269 337
7179 337 -46 -67 28 113 125 -24 82 4 -237 93 229 146 -196 -132 69 -17 -102 108 -82 -191 -321 -68 252
7202 252 -48 -80 -112 -125 -133 27 229 156 -256 -185 90 364 133 42 -6 -140 -197 108 419 237 -223 -131 68 19
7226 19 104 223 128 -53 -229 124 152 182 -177 -239 93 -53 -46 190 -68 -213 -209 215 247 -26 -68 73 -204 -145
7250 -145 126 176 -87 -294 -147 197 114 63 52 47 -302 -294 121 178 -133 -358 -151 96 -43 79 243 17 -102
$$ packed form
7086E5k2j39l6O1P5KJ69j47j78j5K75O1k42M2J5k1K9J19K02k71l10K6L03J65j16
7111A02j13J0j92K3K87J70k40k32R3J77l5K04l5k98k09J16M16L9k90p0J29k03
7133a51O1J89J55j74l21O0K94K2j98J07k3k08O1K17J86m01j53J8L11r9o7J23j60
7156a51j42L14J66q5k20j44J13J32j6K01K2k74p2R5K74j03k1r8L4j40P6L08O8
7179C37l83k1R5Q5J2j49J06p8k41L30J36q3l42O4K01q6q5K10j90j09j30K53L20
7202B52l00l2l2j3qJ60K02p3m12P1K75K74k31r1m8j34n7L05L11j82m60R2J99m9
7226A9Q5J19r5j81j76L53K8L0l59o2L32j46PK36k58j45MM24L2k73m2J41k77N9
7250a45K71N0k63k07J47L44q3n1j1nl49QM15N7l11k25K07K47j39J22J64k26j19
$$ plain form
7273 -102 -238 99 189 64 -56 -28 21 -111 181 240 124 -165 -55 330 127 22 11 -2 -147 -163 68 251
7295 251 -5 -244 70 107 11 78 168 -180 -231 -193 228 247 -90 -139 -170 -136 -98 132 -32 -98 -387 -229 49 98
7319 98 -5 -219 -33 -164 -78 226 273 -104 -109 -56 188 204 99 -11 -30 -19 102 274 255 146 -66 145 143 118
7343 118 152 184 -48 -192 15 268 217 -57 -181 -170 -172 16 90 -34 -319 -410 -156 182 27 -73 -142 -252 -230
7366 -230 -32 219 126 -224 -301 -89 171 160 141 177 -77 -292 140 275 201 -17 -57 38 -44 7 76 21 -10 -120
7390 -120 -28 118 215 -80 -46 -29 79 69 86 104 -138 -98 108 124 272 82 -133 -66 -82 168 196 68 -234 -248
7414 -248 -113 33 41 96 -50 -291 -188 -49 199 27 -109 -166 -101 -25 175 -15 13 -110 -32 119 227 198 100
7437 100 2 -116 -16 206 302 -15 -89 -4 169 200 127 19 -84 -135 -79 174 178 -117 -159 -204 22 -2 -13 21 -42
$$ packed form
7273a02j36L37R0j25j20K8M9j32K92N9j16k89J10L85k03j05j1j3j45j6K31J83
7295B51k56k39L14L7r6O7R0l48n1L8M21J9l37m9l1L4L8K30j64o6k89J58K78M9
7319I8j03k14J86j31Q6L04M7l77nN3K44J6j05j10j9J1J21J72j9j09k12K11kk5
7343A18L4L2k32j44K07K53n1k74j24J1kJ88P4j24k85r1K54L38j55j00o9j10K2
7366b30J98K51r3l50p7K12K60j1j9L6k54k15M32J35p4k18m0R5q2N1O9n5l1j10
7390a20R2J46R7k95L4J7J08j0J7J8k42M0K06J6J48j90k15O7j6K50K8j28l02j4
7414b48J35J46QN5j46k41J03J39K48j72j36n7O5P6K00j90K8j23P8J51J08k9r8
7437A00r8j18J00K22R6l17p4Q5J73L1p3j08j03n1N6K53Mk95m2m5K26k4j1L4o3
$$ plain form
7462 -42 -314 -131 -44 -2 93 -66 -147 -121 69 136 156 -52 -219 -84 87 145 118 2 -178 -169 40 71 63 132 -151
7487 -151 -145 -32 73 136 45 -16 -225 -207 67 94 -16 -153 -230 7 97 163 91 -54 -149 -11 147 255 102 -73
7511 -73 107 -63 173 180 251 21 -97 -67 171 197 166 -48 -85 -142 124 133 125 -107 -363 -111 -76 1 -54 -60 -281 -289 -245
7538 -245 21 -59 -226 -187 -39 -146 117 31 25 -180 -310 43 187 153 1 10 -146 -61 168 209 281 -50 -160 51
7562 51 285 193 205 51 -21 -28 119 212 226 57 -143 18 119 261 299 60 -30 -206 52 184 125 -110 -44 -181
7586 -181 -141 -98 23 -124 -195 -220 -248 1 -77 -199 -243 -213 -253 -89 197 35 -278 -298 -50 185 107 127 -35 -134
7610 -134 -82 340 385 369 -44 -226 57 128 209 484 200 -161 -93 104 281 244 53 25 -126 -131 130 151 59 -246
7634 -246 -306 31 75 -48 -150 -196 -177 -292 18 248 -48 -248 -150 -48 170 62 152 -150 -143 -137 155 281 7
$$ packed form
7462d2k72J83Q7M2R5j59q1K6J90O7K0k08j67J35J71N8k7j16j80RK09L1qO9k83
7487a51OJ13J05O3r1o1k09J8K74K7j10j37p7K37R0O6p2j45r5J38J58J08j53j75
7511g3J80j70K36PP1k30j18L0K38K6l1k14l7n7K66Rqk32k56K52L5P7n5ok21qM4
7538b45K66q0j67L9J48j07K63q6ok05j30L53J44l4j52Rj56Q5K29M1P2l31j10K11
7562E1K34r2J2j54p2pJ47R3J4j69k00J61J01J42L8k39r0j76K58J32n9k35O6j37
7586a81M0M3J21j47p1k5k8K49p8j22m4L0m0J64K86j62l13k0K48K35p8K0j62r9
7610a34N2M22M5j6m13j82K83P1Q1K75k84l61O8J97J77l7j91k8j51nK61K1r2l05
7634b46o0L37M4j23j02m6J9j15L10K30k96k00R8J02K18j08R0l02POK92J26k74
$$ plain form
7657 7 -104 -37 -95 32 113 179 -33 -183 -154 215 350 167 77 -71 -107 66 185 268 -78 -86 -66 10 115 148 8
7682 8 -211 -109 -65 36 95 -27 -98 -153 -9 101 138 107 -91 -184 20 141 224 119 -223 -135 -104 59 276 161
7706 161 -111 -129 -181 -20 53 26 136 -119 -145 76 137 -14 -74 31 -141 -77 25 258 96 -150 -131 92 109
7729 109 3 22 -1 -143 15 189 285 -74 -141 -266 1 177 203 36 -112 -371 -303 45 255 103 -237 -236 -228
7752 -228 -79 88 220 67 -225 -253 117 -44 -113 17 -40 -321 -202 15 155 30 -163 67 208 61 15
7773 15 -25 85 -85 -127 336 225 -72 -140 230 290 186 134 254 -95 -254 -91 402 275 -216 -320 -74 -166
7795 -166 -125 205 301 -118 -442 -247 144 74 15 96 63 -377 -269 185 364 -22 -389 -47 -29 -180 -66 251
7817 251 -4 -256 -273 245 55 -198 -4 211 150 -286 -74 129 -108 -132 163 468 15 -286 -187 164 64
$$ packed form
7657Gj11O7n8J27Q1O6k12j50K9L69J35j83r0j48l6J73J19Q3l46qK0P6J05L3j40
7682Hk19J02M4J01N9j22p1n5J44J10L7l1j98r3K04J21Q3j05l42Q8L1J63K17j15
7706A61k72j8n2J61P3k7J10k55k6K21O1j51o0J05j72O4J02K33j62k46J9K23J7
7729A09j06J9k3j42J58J74R6l59o7j25K67J76K6j67j48k59O8L48K10j52l40JQ
7752b28J49J67J32j53k92k8L70j61o9J30n7k81J19K17J40j25j93K30J41j47m6
7773A5m0J10j70m2M63j11k97o8L70O0j04n2J20l49j59J63M93j27m91j04K46r2
7795a66M1L30R6m19l24J95L91p0n9Q1l3m40J08M54J79l86l67L42J8j51J14L17
7817B51k55k52j7N18j90k53J94K15o1m36K12K03k37k4K95L05m53l01R9L51j00
$$ plain form
7838 64 160 411 305 -263 -518 99 486 200 25 92 -155 -484 -128 348 446 -220 -387 -79 -13 -172 40 382
7860 382 -43 -473 -123 367 217 -231 62 79 -184 -318 -23 181 -114 -184 172 258 -187 -394 -40 239 -203
7881 -203 -40 297 112 -499 -274 461 395 -29 -25 -63 -297 -274 205 592 113 -453 -332 -14 65 141 376 287 -479
7904 -479 -685 -82 455 132 -110 -16 -61 -471 -162 471 445 -129 -392 89 234 -141 38 304 99 -258 -110
7925 -110 212 62 -332 -60 228 -58 -191 -243 58 -110 -257 120 294 -341 -528 -207 238 -26 19 119 10
7946 10 -527 -393 339 434 20 -236 -89 -25 -52 171 492 213 -287 -176 195 191 -7 63 138 -91 -300 77 472
7969 472 -3 -283 -85 154 -7 -5 199 145 -197 -230 111 375 -144 -201 2 101 -19 -133 212 -46 -257 -228
7991 -228 197 86 -279 -165 1 53 -209 107 204 -74 -430 -119 78 125 -69 -43 19 -238 -225 283 250 -181
$$ packed form
7838F4R6K51j06n68k55O17L87k86j75O7k47l29L56M76R8o66j67L08O6j59K12L42
7860C82m25m30L50M90j50m48K93J7k63j34K95K04k95p0L56Q6m45k07L54K79m42
7881b03J63L37j85o11K25P35o6m24Ml8k34K3M79L87m79n66J21L18P9P6K35q9p66
7904d79k06O03N37l23k42R4m5m10L09O33k6n74k63M81J45l75J79K66k05l57J48
7925a10L22j50l94K72K88k86j33n2L01j68j47L77J74o35j87L21M45k64M5J00j09
7946A0n37J34P32R5m14k56J47O4k7K23L21k79n00J11L71mj98P0P5k29k09L77L95
7969D72m75k80J98K39j61KK04n4l42l3L41K64n19n7K03R9j20j14L45k58k11K9
7991b28M25j11l65J14J66N2k62L16R7k78l56L11J97M7j94K6O2k57J3N08l3m31
$$ plain form
8013 -181 -335 -32 192 104 103 88 -175 -256 -109 212 268 -129 -229 -58 -58 -119 94 182 -179 -455 -225 114 104 -72
8037 -72 -59 -101 -191 -226 111 239 -19 -250 -139 173 106 -148 15 -63 -261 10 311 178 -40 -138 -30 127 110
8060 110 285 68 -37 -191 6 202 108 23 -150 -7 4 -122 219 150 -151 -235 -147 141 89 14 62 -69 -24
8083 -24 32 287 236 -154 -310 -27 85 -13 47 21 -308 -341 -11 118 175 -134 -170 -86 39 60 77 10 -245 -203 -4
8108 -4 118 204 65 -119 -152 -90 76 274 99 -5 -182 -93 148 130 41 -12 -87 -86 127 313 73 -143 30 53
8132 53 94 135 81 4 12 -137 102 188 135 -142 -171 -43 13 85 154 -6 -133 -146 -11 69 81 -24 -204 -135 -26 145
8158 145 132 19 -167 -138 25 59 207 -51 -61 -123 -188 141 132 173 -93 -157 -48 77 195 64 12 -88 -18 64
8182 64 115 197 23 -70 -3 91 268 248 128
$$ packed form
8013a81j54L03K24q8jj5k63q1J47L21N6l97j00J71%o1K13Q8l61k76K30L39j0j76
8037g2J3m2r0l5L37J28k58k31J11L12o7k54J63p8j98K71L01j33k18r8J08J57j7
8060A10J75k17j05j54J97J96r4q5j73J43J1j26L41o9l01q4Q8K88n2p5M8j31M5
8083b4N6K55n1l90j56K83J12r8O0k6l29l3L30J29N7l09l6Q4J25K1J7o7k55M2J99
8108dJ22Q6j39j84l3O2J66J98j75j04j77Q9K41j8q9n3p5JK13J86k40k16J73K3
8132E3M1M1n4p7Qj49K39Q6n3k77k9J28N6P2O9j60j27j3J35Q0J2j05j80O9J09J71
8158A45j3j13j86K9J63L4J48k58j0o2o5L29rM1k66o4J09J25J18j31n2j00P0Q2
8182F4N1Q2j74r3O7R4J77k0j20
8191A28
$$ Imaginary data points
##PAGE= N=2
##DATA TABLE= (X++(I..I)), XYDATA
$$ plain form
0 0 0 0 0 0 0 0 0 0 0 0 0 -8 8 -6 8 -8 8 -12 14 -16 21 -22 24 -30 34 -37 41 -48 56 -60 66 -75 85 -93 102
35 102 -115 128 -143 156 -173 193 -210 234 -260 289 -322 359 -402 454 -512 585 -677 794 -947
54 -947 1159 -1470 1971 -2858 4769 -10533 61519 298709 93920 -143196 -17752 87103 -94950
67 -94950 -120360 183002 270794 -56539 -227448 -15303 85519 -84823 -66965 169680 112353
78 112353 -214190 -230194 58188 97283 -103154 -62511 124468 402 -250277 -129265 165311
89 165311 123008 -84629 -14592 127171 -33854 -197825 18682 262535 117801 -91392
99 -91392 8675 112375 -53219 -119728 131715 250694 -6692 -183167 -19007 84973
109 84973 -59613 -69412 139793 120232 -173166 -232499 15769 90180 -74572 -66306 95789
$$ packed form
0@%%%%%%%%%%%qJ6j4J4j6J6k0K6l0L7m3M6n4O4p1P8q9J04j16J26j41J60j78J95
35A02k17K43k71K99l29L66m03M44m94N49o11O81p61Q56r66J097j262J471j741
54i47K106k629L441m829P627j5302P2052K37190k04789k37116J25444J04855j82053
67i4950k5410L03362Q7792l27333j70909K12145J00822j70342J7858K36645n7327
78A12353l26543j6004K88382L9095k00437M0643J86979j24066k50679J21012K94576
89A65311m2303k07637P0037J41763j61025j63971K16507K43853j44734k09193
99i1392J00067J03700j65594o6509K51443J18979k57386j76475J64160J03980
109H4973j44586r799K09205j9561k93398n9333K48268P4411j64752Q266J62095
$$ plain form
120 95789 11462 -214546 -141102 111585 90126 -100337 -53232 99613 -218 -156644 -17044
131 -17044 179598 72239 -97968 2736 126520 -8238 -113456 64791 203044 47190
141 47190 -85487 34900 106728 -39924 -80023 113424 173058 -27830 -116179 32798 79083
152 79083 -56272 -50804 106699 71303 -131659 -131611 51298 62056 -76598 -54939 63417 -10013
164 -10013 -158719 -81929 82415 29410 -105171 -42020 70097 -13728 -116317 -12402 97986
175 97986 3303 -88469 13558 94408 -12593 -80889 39589 112587 397 -62511 39000
186 39000 73335 -40148 -57220 76216 99975 -34413 -70019 35206 47131 -50345 -36429
197 -36429 68864 40660 -80260 -57813 61633 45842 -57872 -36810 46519 3223 -74920
$$ packed form
120I5789q4327k26008P3444K52687k1459j90463M7105J52845r9831j56426J39600
131a7044J96642j07359j70207J00704J23784j34758j05218J78247J38253j55854
141D7190j32677J20387P1828j46652m0099J93447N9634k00888q8349J48977M6285
152G9083j35355N468J57503l5396k02962M8J82909J0758j38654K1659J18356p3430
164a0013j48706P6790J64344n3005j34581O3151J12117q3825j02589J03915J10388
175I7986r4683r1772J02027Q0850j07001o8296J20478P2998j12190o2908J01511
186C9000L4335j13483j7072J33436K3759j34388l5606J05225J1925r7476J3916
197c6429J05293k8204j20920K2447J19446j5791j03714K1062Q3329m3296p8143
$$ plain form
208 -74920 -9859 80583 16131 -76851 -21614 60506 9832 -53544 3914 51923 -22193 -68239
220 -68239 18974 75219 -5275 -62561 254 34556 -29089 -43080 35503 48229 -35500 -52115
232 -52115 26122 41578 -27062 -32206 35199 32499 -33144 -21526 47309 34778 -28085 -6721
244 -6721 56759 32054 -33071 -14923 40284 23829 -13515 18714 52513 963 -53074 -12961
256 -12961 42015 16028 -23746 -2364 11631 -31751 -45732 11795 38568 -15441 -54002 -22665
268 -22665 785 -21583 -20608 19111 16952 -34301 -41638 7371 21358 -13552 -16828 16108 14321
281 14321 -14828 -2891 30486 16909 -19816 -8814 27729 21061 -10416 -4222 19419 7291
293 7291 -12373 6993 26892 -525 -30155 -11325 16987 7330 -8609 2288 8324 -12231 -20629
$$ packed form
208g4920O5061R0442o4452r2982N5237Q2120n0674o3376N7458M8009p4116m6046
220f8239Q7213N6245q0494n7286O2815L4302o3645j3991P8583J2726q3729j6615
232e2115P8237J5456o8640n144O7405k700o5643J1618O8835j2531o2863K1364
244f721O3480k4705o5125J8148N5207j6455l7344L2229L3799n1550n4037M0113
256a2961N4976k5987l9774K1382J3995m3382j3981N7527K6773n4009l8561L1337
268b2665K3450k2368R75L9719k159n1253p337M9009J3987l4910l276L2936j787
281A4321k9149J1937L3377j3577l6725J1002L6543o668l1477O194K3641j2128
293G291j9664J9366J9899k7417k9630J8830K8312r657j5939J0897O036k0555q398
$$ plain form
306 -20629 3886 16669 -6283 -20771 -659 14310 1158 -5677 5732 2810 -14741 -9031 16872
319 16872 18648 -6114 -15660 -432 9897 7096 9994 13740 -2931 -23369 -12522 17847 25889
332 25889 9987 -1056 -4608 -11602 -10211 8542 21135 7351 -13727 -14925 -2551 2481 1104
345 1104 3506 1262 -11994 -18544 -7593 2454 -1961 -6002 -481 2926 -2389 -6738 -5061 -3276
359 -3276 -2232 4864 14834 13451 23 -7135 364 10653 14731 14735 8710 -2912 -8865 485 15901
374 15901 19955 9016 -6323 -13830 -10631 -1556 6777 7380 -2647 -14442 -15234 -6241 145 -1074
388 -1074 -8103 -15038 -15279 -7601 1199 3094 -2906 -11112 -12473 -4819 3499 5105 780 -5050 -6772
403 -6772 -483 9827 14037 9016 135 -4841 -1054 8009 14097 13126 7906 2803 1815 5663 8558
$$ packed form
306b0629K4515J2783k2952j4488K0112J4969j3152o835J1409k922j7551N710K5903
319A6872J776k4762r546J5228J0329k801K898L746j6671k0438J0847L0369Q042
332B5889j5902j1043l552o994J391J8753J2593j3784k1078j198J2374N032j377
345A104K402k244j3256o550J0951J0047m415m041N521L407n315m349J677J785
359c276J044P096R970j383j3428p158P499J0289M078Mo025j1622n953R350J5416
374A5901M054j0939j5339p507L199R075Q333O03j0027j1795p92Q993O386j219
388a074p029o935k41P678Q800J895o000q206j361P654Q318J606m325n830j722
403f772O289J0310M210n021q881m976L787R063O088r71n220n103r88L848K895
$$ plain form
418 8558 6154 1629 350 1839 4066 4336 322 -5082 -6581 -2971 1349 872 -6355 -14186 -14524 -6808
434 -6808 3074 7712 1566 -12915 -20609 -13214 1123 10332 10579 2435 -9245 -13481 -2868 12998
448 12998 17606 7547 -4215 -6603 -2164 4991 13875 16617 5616 -7431 -6480 3065 5566 2637
462 2637 2948 2678 -1828 -3072 3160 5131 -4098 -9803 -926 7750 2238 -4547 -880 922 -4660 -1169
478 -1169 10921 8119 -9443 -13879 846 9790 4350 2004 5418 -2545 -14599 -5523 14185 10222
492 10222 -10437 -11792 2469 2173 -5382 2115 7866 -9864 -24685 -7234 14265 4610 -14745
505 -14745 -10623 -1570 -11477 -13947 7748 13623 -14960 -29401 -4347 13933 504 -5518 9760
518 9760 6613 -17875 -13505 20850 26043 -2936 -7077 18659 18933 -5209 1738 28955 18206 -11005
$$ packed form
418H558k404m525j279J489K227K70m014n404j499L610M320m77p227p831l38P716
434f808R882M638o146j4481p694P395J4337R209K47q144j1680m236J0613J5866
448A2998M608j0059j1762k388M439P155Q884K742j1001j3047R51R545K501k929
462B637L11k70m506j244O232J971r229n705Q877Q676n512o785L667J802n582L491
478a169J2090k802j7562m436J4725Q944n440k346L414p963j2054R076J9708l963
492A0222k0659j355J4261k96p555P497N751j7730j4821J7451K1499r655j9355
505a4745M122R053r907k470K1695N875k8583j4441K5054J8280j3429o022J5278
518I760l147k4488M370L4355N193k8979m141K5736K74k4142O947K7217j0749k9211
$$ plain form
532 -11005 1117 30137 14657 -16900 -2582 26393 11227 -15929 -1683 15050 -12768 -33159
544 -33159 2601 31473 -1918 -35195 -13442 5581 -18408 -22834 17188 23324 -26509 -42927
556 -42927 3143 25051 -6248 -13513 18364 11388 -32340 -21802 33980 33395 -15995 -14884 25100
569 25100 13273 -26354 -5553 38748 15957 -28898 -5685 35832 6998 -34880 -2318 39257
581 39257 5446 -32939 1501 29921 -13411 -37661 17329 46624 -9964 -44642 1052 24706
593 24706 -18188 -24128 31607 31372 -40055 -49642 20268 34549 -22707 -26311 23113 6594 -51732
606 -51732 -25388 45905 25914 -44480 -30547 26788 5263 -41731 -2847 49351 3247 -52836
618 -52836 -5622 50070 5595 -40491 9850 49841 -5844 -39632 22449 54746 -8989 -36315
$$ packed form
532a1005J2122K9020j5480l1557J4318K8975j5166k7156J4246J6733k7818k0391
544c3159L5760K8872l3391l3277K1753J9023k3989m426M0022O136m9833j6418
556d2927M6070K1908l1299p265L1877o976m3728J0538N5782n85m9390J111L9984
569B5100j1827l9627K0801M4301k2791m4855K3213M1517k8834m1878L2562M1575
581C9257l3811l8385L4440K8420m3332k4250N4990K9295n6588l4678M5694K3654
593B4706m2894n940N5735k35p1427r587O9910J4281n7256l604M9424j6519n8326
606e1732K6344P1293j9991p0394J3933N7335k1525m6994L8884N2198m6104n6083
618e2836M7214N5692m4475m6086N0341L9991n5685l3788O2081L2297o3735k7326
$$ plain form
630 -36315 30375 53612 -16142 -37059 31549 46477 -20412 -25205 43351 36204 -41473 -34447 43919
643 43919 36428 -36935 -27291 35366 11548 -51467 -16087 51444 10446 -63417 -27311 39410
655 39410 3165 -50602 -3690 43126 -16543 -64208 2369 53014 -10351 -55617 6907 44681
667 44681 -17573 -41846 29469 48519 -30177 -46430 37053 54789 -23885 -35893 36758 36940
679 36940 -34208 -20898 55488 34179 -51442 -35248 45622 30149 -39066 -15022 43924 473
691 473 -65306 -14910 56292 9370 -57832 -14465 38499 -11875 -54324 9584 54300 -12971
703 -12971 -58647 6248 45950 -16374 -42794 29206 53471 -21714 -45284 25203 41071 -25911
715 -25911 -27219 47587 43460 -39516 -42483 33056 35615 -25972 -12532 45723 11999 -61786 -28179
$$ packed form
630c6315O6690K3237o9754k0917O8608J4928o6889m793O8556p147p7677P026P8366
643D3919p491p3363R644O2657k3818o3015L5380O7531m0998p3863L6106O6721
655C9410l6245n3767M6912M6816n9669m7665O6577N0645o3365m5266O2524L7774
667D4681o2254k4273P1315J9050p8696j6253Q3483J7736p8674j2008P2651J82
679C6940p1148J3310P6386k1309q5621J6194Q0870j5473o9215K4044N8946m3451
691D73o5779N0396P1202m6922o7202M3367N2964n0374m2449O3908M4716o7271
703a2971m5676O4895L9702o2324k6420P2000K4265p5185k3570P0487J5868o6982
715b5911j308P4806m127q2976k967P5539K559o1587J3440N8255l3724p3785L3607
$$ plain form
728 -28179 55250 36483 -31979 -14312 30785 -9212 -51697 9678 70817 15450 -52018 -14080
740 -14080 35258 -2555 -29899 28200 53970 -20730 -60735 6355 46489 -7796 -31520 23308
752 23308 29974 -40090 -49612 23760 38388 -26327 -33369 26303 20158 -45999 -35571 36343 31143
765 31143 -31280 -20800 32948 8717 -45876 -10474 55271 26969 -36900 -17044 29945 1951
777 1951 -33452 13749 55757 127 -55397 -12683 36138 2027 -28447 12669 29880 -29271
789 -29271 -52805 10814 43747 -9412 -38057 6143 19593 -28338 -30189 30312 35747 -25474
801 -25474 -32860 23540 27366 -22687 -16838 35571 26067 -26480 -14339 36695 21453 -27894 -7806
814 -7806 42036 19286 -31040 -9806 33885 9172 -27604 5461 40296 -1423 -42941 -4660
$$ packed form
728b8179Q3429j8767o8462J7667M5097l9997m2485O1375O1139n5367o7468L7938
740a4080M9338l7813k7344N8099K5770p4700m0005O7090M0134n4285k3724N4828
752B3308O666p0064r522P3372J4628o4715p042N9672o145o6157J0428P1914n200
765C1143o2423J0480N3748k4231n4593L5402O5745k8302o3869J9856M6989k7994
777A951l5403M7201M2008n5630n5524M2714M8821l4111l0474M1116J7211n9151
789b9271k3534O3619L2933n3159k8645M4200J3450m7931j851O0501N435o1221
801b5474p386N6400L826n0053N849N2409r504n2547J2141N1034j5242m9347K0088
814g806M9842k2750n0326K1234M3691k4713l6776L3065L4835m1719m1518L8281
$$ plain form
826 -4660 36785 4474 -27975 4486 25139 -18359 -37933 13655 38857 -11415 -39181 2387
838 2387 20893 -18142 -24390 21415 23178 -30119 -35794 16149 24011 -21192 -22956 19592 14038
851 14038 -29579 -18097 28592 15986 -29572 -14665 30427 14991 -26587 -8780 29771 10195
863 10195 -23134 2901 35396 3130 -32775 -956 36748 9808 -21104 4188 23211 -11967
875 -11967 -28555 14555 35902 -7347 -33344 302 18734 -11803 -18994 17605 19080 -26645
887 -26645 -32517 13480 22915 -15345 -18742 15890 10776 -25505 -15239 24879 15328 -23153 -11994
900 -11994 25100 12310 -22804 -7772 25815 8834 -20779 802 28039 583 -28636 131
912 131 31370 6491 -20377 727 17116 -10192 -22227 14167 30344 -7882 -29376 1223
$$ packed form
826d660M1445l2311l2449L2461K0653m3498j9574N1588K5202n0272k7766M1568
838B387J8506l9035o248M5805J763n3297n675N1943P862m5203j764M2548n554
851A4038m3617J1482M6689j2606m5558J4907M5092j5436m1578J7807L8551j9576
863A0195l3329K6035L2495l2266l5905L1819L7704k6940l0912K5292J9023l5178
875a1967j6588M3110K1347m3249k5997L3646J8432l0537p191L6599J475m5725
887b6645n872M5997R435l8260l397L4632n114l6281J0266M0118r551l8481J1159
900a1994L7094j2790l5114J5032L3587j6981k9613K1581K7237k7456k9219K8767
912A31L1239k4879k6868K1104J6389k7308j2035L6394J6177l8226k1494L0599
$$ plain form
924 1223 18020 -7354 -12837 16330 14781 -22527 -22858 16792 22321 -10757 -14392 12276 8260 -18414
938 -18414 -7697 23425 11974 -20889 -10652 20020 9609 -17434 -5287 17182 1117 -19176
950 -19176 479 20340 -2187 -24086 -3157 18082 -442 -17877 -55 10742 -11009 -18003
962 -18003 9656 19076 -8996 -20752 3236 13118 -4982 -6848 13004 9887 -13912 -10120 17616
975 17616 17632 -7604 -8749 10525 7400 -8551 1358 18460 4067 -17757 -6311 15153 6828
988 6828 -10943 -4085 6721 -4942 -14178 3002 14601 -3832 -18565 -3786 9475 -1252 -7984
1001 -7984 4239 6874 -8562 -9738 8890 12765 -4347 -9373 4610 8147 -2757 -2379 8703
1014 8703 4099 -9586 -4692 10726 7044 -8271 -7659 2848 1225 -4678 1166 6608 -3844 -13836
$$ packed form
924A223J6797k5374n483K9167j549l7308l31L9650N529l3078l635K6668m016k6674
938a8414J0717L1122j1451l2863J0237L0672j0411k7043J2147K2469j6065k0293
950a9176J9655J9861k2527k1899K0929K1239j8524j7435J7822J0797k1751o994
962a8003K7659R420k8072j1756K3988R882j8100j866J9852l117k3799L792K7736
975A7616J6k5236j145J9274l125j5951R909J7102j4393k1824J1446K1464q325
988F828j7771O858J0806j1663r236J7180J1599j8433j4733J4779J3261j0727o732
1001g984J2223K635j5436j176J8628L875j7112n026J3983L537j0904L78J1082
1014H703m604j3685M894J5418l682j5315O12J0507j623n903N844N442j0452r992
$$ plain form
1028 -13836 -4081 9094 5218 -4772 -2975 970 -3579 -3164 7769 10521 -1705 -8852 -549 7417
1042 7417 4977 2569 4765 2260 -4581 -2266 8053 9227 -643 -4690 -30 2062 22 1676 3624
1057 3624 -2142 -8283 -4304 3085 2327 -4149 -6128 -3818 -3616 -3583 -406 441 -5137 -8925 -4164 2038
1073 2038 1527 -1640 -2762 -2696 -2177 1070 4845 4226 -458 -2555 1423 6327 6851 4545 2391 -229
1089 -229 -102 4342 8431 6515 448 -3054 -1732 2227 4880 4246 -353 -5168 -6392 -2426 2913 3585
1105 3585 -993 -5612 -7027 -4552 20 2689 559 -3900 -5915 -4000 20 2690 1545 -2012 -4215
1120 -4215 -3018 146 2685 1687 -1427 -3016 -1375 893 2298 1620 -1337 -3319 -1570 2415 4447
1135 4447 2909 -814 -2571 -323 3157 5265 4893 1893 -1818 -1520 3577 7458 5888 1442 -1674
$$ packed form
1028a3836R755J3175l876r990J797L945m549M15J0933K752j2226p147Q303P966
1042G417k440k408K196k505o841K315J0319J174r870m047M660K092k040J654J948
1057C624n766o141L979P389p58o476j979K310K02L3L177Q47n578l788M761O202
1073B038n11l167j122O6N19L247L775o19m684k097L978M904N24k306k154k620
1089b29J27M444M089j916o067l502J322L959K653o34m599m815j224L966N339O72
1105C585m578m619j415K475M572K669k130m459k015J915M020K670j145l557k203
1120d215J197L164K539r98l114j589J641K268J405o78k957j982J749L985K032
1135D447j538l723j757K248L480K108l72l000l711K98N097L881j570m446l116
$$ plain form
1150 -1674 -1779 642 4353 5664 2289 -3541 -5506 -1351 2863 2181 -993 -3429 -5821 -5748 -926 3475
1166 3475 663 -5943 -7341 -3408 -238 169 236 -551 -4390 -6229 -717 5394 2823 -3284 -3320 8
1182 8 36 613 3978 3572 -2325 -4491 1933 6469 2340 -2516 -525 2085 -307 621 5607 3710 -4950
1199 -4950 -5145 3914 6881 523 -2267 408 -883 -3853 1551 8922 3636 -7867 -6676 3391 4797
1214 4797 -322 1354 3694 -3729 -8771 1295 10719 3497 -6906 -3756 2594 -647 -2694 4638
1228 4638 6101 -5583 -10678 1209 8136 -1203 -6936 385 2081 -6484 -5020 6014 4498 -9123
1242 -9123 -9202 4542 6357 -4621 -5109 4313 1763 -7371 -763 11593 4590 -9563 -3608 10539
1256 10539 7164 -2845 2158 8932 -101 -7167 5500 16059 3323 -9962 -1192 9115 1340
$$ packed form
1150a674j05K421L711J311l375n830j965M155M214o82l174k436k392P3M822M401
1166C475k812o606j398L933L170M07O7p87l839j839N512O111k571o107l6L328
1182HK8N77L365m06n897k166O424M536m129m856J991K610k392R28M986j897q660
1199d950j95R059K967o358k790K675j291k970N404P371n286j1503J191J0067J406
1214D797n119J676K340p423n042J0066R424p222j0403L150O350l241k047P332
1228D638J463j1684n095J1887O927r339n733P321J696q565J464J1034j516j3621
1242i123p9J3744J815j0978m88R422k550r134O608J2356p003j4153N955J4147
1256A0539l375j0009N003O774r033p066J2667J0559j2736j3285Q770J0307p775
$$ plain form
1269 1340 -4458 5678 6858 -9638 -13936 3794 10906 -4101 -12328 -2012 515 -10420 -8053
1282 -8053 7621 4887 -14403 -14280 4597 6987 -7130 -5429 7443 1999 -11681 -2511 14684
1295 14684 7205 -9610 -2811 13251 6562 -7048 1604 13309 1633 -9723 4386 16402 79
1308 79 -13808 181 12721 234 -8813 3716 7640 -9937 -14081 7695 15716 -4988 -14875
1321 -14875 954 6396 -7391 -5590 13273 9417 -14295 -13821 9749 12527 -5744 -5720 9269 3062
1335 3062 -14420 -5045 16316 7980 -14255 -7582 11557 3377 -13056 -2104 13426 287 -15004
1348 -15004 256 15621 -885 -16954 55 16370 1093 -12067 3221 11775 -7816 -14290
1360 -14290 10523 19596 -5686 -17756 2304 10660 -6687 -7382 13916 10798 -17520 -17951 11330
$$ packed form
1269A340n798J0136J180j6496m298J7730P112j5007q227J0316K527j0935K367
1282h053J5674k734j9290J23J8877K390j4117J701J2872n444j3680R170J7195
1295A4684p479j6815O799J6062o689j3610Q652J1705j1676j1356J4109J2016j6323
1308G9j3887J3989J2540j2487r047J2529L924j7577m144K1776Q021k0704r887
1321a4875J5829N442j3787J801J8863l856k3712M74K3570K778j8271K4J4989o207
1335C062j7482R375K1361q336k2235O673J9139q180j6433J0952J5530j3139j5291
1348a5004J5260J5365j6506j6069J7009J6315j5277j3160J5288Q554j9591o474
1360a4290K4813R073k5282j2070K0060Q356j7347o95K1298l118k8318m31K9281
$$ plain form
1373 11330 15572 -8069 -8899 10849 4213 -17780 -6412 20542 11023 -15901 -8475 14511 4660
1386 4660 -15477 -1300 19540 2992 -18664 -1840 17571 -1906 -20364 1853 20972 -1342
1398 -1342 -19650 494 13485 -8318 -15970 12789 21674 -10456 -24282 3923 17315 -4262
1410 -4262 -7841 16182 11283 -22151 -19541 18166 22306 -8691 -12196 9503 1801 -22041 -6179
1423 -6179 26170 12679 -22985 -15560 12798 3746 -16990 2317 25113 1040 -26079 -3857
1435 -3857 22787 3981 -14996 9036 25508 -3973 -23025 6113 24879 -1304 -13722 14151
1447 14151 19478 -17330 -25933 11883 23129 -8957 -17137 8528 3411 -28929 -18977 22673 18567
1460 18567 -22297 -23830 6372 1543 -21210 -1025 29822 6067 -32505 -14241 23000 11720
$$ packed form
1373A1330M242k3641q30J9748o636k1993J1368K6954r519k6924P426K2986r851
1386D660k0137J4177K0840j6548k1656J6824J9411j9477j8458K2217J9119k2314
1398a342j8308K0144J2991k1803p652K8759Q885l2130j3826K8205J3392k1577
1410d262l579K4023m899l3434K610L7707M140l0997l505K1699p702k3842J5862
1423f179L2349j3491l5664P425K8358r052k0736J9307K2796k4073k7119K2222
1435c857K6644j8806j8977K4032J6472k9481j9052K9138J8766k6183j2418K7873
1447A4151N327l6808q603L7816J1246l2086q180K5665n117l2340R952M1650m106
1460A8567m0864j533L0202m829k2753K0185L0847k3755l8572J8264L7241j1280
$$ plain form
1472 11720 -11834 7383 25814 -4689 -27238 6418 34996 7155 -17654 7019 21721 -9332
1484 -9332 -21056 15286 27450 -9688 -22633 10484 16785 -17909 -20357 16956 18625 -18741 -20128
1497 -20128 13239 8726 -23619 -12205 24927 12898 -26076 -16387 17610 6885 -19359 368
1509 368 26316 -61 -31000 -5331 26899 6124 -19543 2241 19700 -9673 -25465 10241
1521 10241 28937 -6280 -25258 6037 19247 -11141 -17492 16203 19490 -17085 -19506 17498
1533 17498 19164 -16232 -14722 19683 14993 -17782 -8849 22933 9942 -22136 -5909 26734 9891
1546 9891 -21581 -5666 20670 2063 -20380 2981 23867 -4792 -28436 -685 21896 -3842
1558 -3842 -21897 2960 14236 -14975 -23061 10349 19297 -13920 -23265 7499 14455 -12593 -13080
$$ packed form
1472A1720k3554J9217J8431l0503k2549L3656K8578k7841k4809K4673J4702l1053
1484i332j1724L6342J2164l7138j2945L3117O301l4694k448L7313J669l7366j387
1497b0128L3367m513l2345J1414L7132j2029l8974R689L3997j0725k6244J9727
1509C68K5948k6377l0939K5669L2230k0775k5667K1784J7459k9373j5792L5706
1521A0241J8696l5217j8978L1295J3210l0388o351L3695L287l6575k421L7004
1533A7498J666l5396J510L4405m690l2775Q933L1782j2991l2078J6227L2643j6843
1546I891l1472J5915K6336j8607k2443K3361K0886k8659k3644K7751K2581k5738
1558c842j8055K4857J1276k9211q086L3410Q948l3217r345L0764O956k7048m87
$$ plain form
1571 -13080 16017 12897 -17672 -11672 21092 16373 -13769 -7479 19570 10723 -13164 155 23452
1584 23452 6512 -18205 -1021 22860 5411 -17029 -807 16217 -3652 -18693 3697 16412
1596 16412 -9539 -23316 1235 13807 -9140 -18503 3254 8516 -14501 -15564 11050 12354 -14239
1609 -14239 -15133 10817 12214 -8889 -5026 15406 7418 -13304 -2211 21333 11674 -10791 -3013
1622 -3013 15134 5477 -9104 4111 16935 -1085 -17129 -75 15433 -370 -13960 -566
1634 -566 7202 -8721 -14200 4605 9661 -10529 -16791 1899 8382 -7185 -10016 5396 4995 -10665
1648 -10665 -6951 11425 8859 -8956 -6483 9887 7870 -4600 270 11460 3360 -8771 830
1661 830 14483 5765 -8046 -1478 8604 1250 -6035 3755 8994 -4165 -11079 1520 9321 -1144
$$ packed form
1571a3080K9097l120l0569O000L2764m719l0142O290K7049q847k3887J3319K3297
1584B3452j6940k4717J7184K3881j7449k2440J6222J7024j9869j5041K2390J2715
1596A6412k5951j3777K4551J2572k2947r363K1757N262k3017j063K6614J304k6593
1609a4239q94K5950J397k1103L863K0432p988k0722J1093K3544r659k2465P778
1622c013J8147r657j4581J3215J2824j8020j6044J7054J5508j5803j3590J3394
1634e66P768j5923n479J8805N056k0190o262J8690O483j5567k831J5412m01j5660
1648a0665L714J8376k566j7815K473J6370k017j2470M870J1190q100j2131R601
1661H30J3653q718j3811O568J0082p354p285R790N239j3159o914J2599P801j0465
$$ plain form
1675 -1144 -8268 78 3259 -5677 -6125 5361 5516 -7856 -9754 2665 5392 -3924 -4379 2608 -248
1690 -248 -7796 -2929 7424 3366 -7520 -5374 3510 2287 -3140 635 5061 -1704 -6771 1392 9029
$$ packed form
1675a144p124Q346L181q936m48J1486J55j3372j898J2419K727r316m55O987k856
1690b48p548M867J0353m058j0886K146Q884j223n427L775M426o765n067Q163P637
$$ [...]
8191a20
##END NTUPLES=NMR FID
##END=
