##TITLE=1H_BAU-j-FPPPh
 CDCl3, 8 sc, 
 4.3.2019
##JCAMPDX= 6.0         $$ Bruker NMR JCAMP-DX V2.0
##DATA TYPE= NMR FID
##DATA CLASS= NTUPLES
##ORIGIN= UXNMR, Bruker Analytische Messtechnik GmbH
##OWNER= root
$$ XWIN-NMR		Version 3.5
$$ Mon Mar  4 15:29:44 2019 Russian Standard Time (UT+4h)  she@DPX200
##.OBSERVE FREQUENCY= 200.1316
##.OBSERVE NUCLEUS= ^1H
##.DELAY= (6, 6)
##.ACQUISITION MODE= SIMULTANEOUS
##.ACQUISITION SCHEME= undefined
##.AVERAGES= 8
##.DIGITISER RES= 18
##SPECTROMETER/DATA SYSTEM= spect
##.PULSE SEQUENCE= zg30
##.SOLVENT NAME= CDCl3
##.SHIFT REFERENCE= (INTERNAL, CDCl3, 0, 15.7039)
##AUDIT TRAIL= $$ (NUMBER, WHEN, WHO, WHERE, WHAT)
$$ ##TITLE= Audit trail, XWIN-NMR		Version 3.5
$$ ##JCAMPDX= 5.01
$$ ##ORIGIN= Bruker BioSpin GmbH
$$ ##OWNER= she
$$ F:/spectra/data/she/nmr/H-F/1/audita.txt
$$ ##AUDIT TRAIL=  $$ (NUMBER, WHEN, WHO, WHERE, WHAT)
(   1,<2019-03-04 15:27:06.18 +0400>,<she>,<DPX200>,
      <created by zg, POWCHK disabled, PULCHK disabled
       configuration hash MD5:
       00 E9 B6 7A A2 85 ED C7 34 08 36 98 17 FE 4E 26
       data hash MD5: 16K
       48 0D C8 B7 1A 2A 72 B8 FA 8E 0F 15 3A F5 62 57>)
$$ ##END=
$$ 
$$ hash MD5
$$ 6A 82 8A 7A 1A 4B 08 6B 0D 93 AF D9 60 37 65 29
##$RELAX= 
##$RELAX= 
##$RELAX= 
##$RELAX= 
##$RELAX= 
##$RELAX= 
$$ Bruker specific parameters
$$ --------------------------
##$DU= <F:/spectra>
##$EXPNO= 1
##$NAME= <H-F>
##$PROCNO= 1
##$TYPE= <nmr>
##$USER= <she>
##$AMP= (0..31)
100 100 100 100 100 100 100 100 100 100 100 100 100 100 100 100 100 100 
100 100 100 100 100 100 100 100 100 100 100 100 100 100 
##$AQSEQ= 0
##$AQ_mod= 1
##$AUNM= <au_zg>
##$AUTOPOS= <>
##$BF1= 200.13
##$BF2= 200.13
##$BF3= 200.13
##$BF4= 200.13
##$BF5= 200.13
##$BF6= 200.13
##$BF7= 200.13
##$BF8= 200.13
##$BYTORDA= 1
##$CFDGTYP= 0
##$CFRGTYP= 5
##$CHEMSTR= <none>
##$CNST= (0..31)
1 1 145 1 1 1 1 1 1 1 1 1 1 1 1 1 1 1 1 1 1 1 1 1 1 1 1 1 1 1 1 1 
##$CPDPRG= <>
##$CPDPRG1= <>
##$CPDPRG2= <>
##$CPDPRG3= <>
##$CPDPRG4= <mlev>
##$CPDPRG5= <mlev>
##$CPDPRG6= <mlev>
##$CPDPRG7= <mlev>
##$CPDPRG8= <mlev>
##$CPDPRGB= <>
##$CPDPRGT= <>
##$D= (0..31)
0 1.2 0 0 0 0 0 0 0 0 0 0.03 0 0 0 0 0 0 0 0 0 0 0 0 0 0 0 0 0 0 0 0 
##$DATE= 1551698825
##$DBL= (0..7)
120 120 120 120 120 120 120 120 
##$DBP= (0..7)
150 150 150 150 150 150 150 150 
##$DBP07= 0
##$DBPNAM0= <>
##$DBPNAM1= <>
##$DBPNAM2= <>
##$DBPNAM3= <>
##$DBPNAM4= <>
##$DBPNAM5= <>
##$DBPNAM6= <>
##$DBPNAM7= <>
##$DBPOAL= (0..7)
0.5 0.5 0.5 0.5 0.5 0.5 0.5 0.5 
##$DBPOFFS= (0..7)
0 0 0 0 0 0 0 0 
##$DE= 6
##$DECBNUC= <off>
##$DECIM= 24
##$DECNUC= <off>
##$DECSTAT= 4
##$DIGMOD= 1
##$DIGTYP= 9
##$DL= (0..7)
0 120 120 120 120 120 120 120 
##$DP= (0..7)
150 150 150 150 150 150 150 150 
##$DP07= 0
##$DPNAME0= <>
##$DPNAME1= <>
##$DPNAME2= <>
##$DPNAME3= <>
##$DPNAME4= <>
##$DPNAME5= <>
##$DPNAME6= <>
##$DPNAME7= <>
##$DPOAL= (0..7)
0.5 0.5 0.5 0.5 0.5 0.5 0.5 0.5 
##$DPOFFS= (0..7)
0 0 0 0 0 0 0 0 
##$DQDMODE= 0
##$DR= 18
##$DS= 0
##$DSLIST= <SSSSSSSSSSSSSSS>
##$DSPFIRM= 0
$$ [...]
##$SUBNAM2= <"">
##$SUBNAM3= <"">
##$SUBNAM4= <"">
##$SUBNAM5= <"">
##$SUBNAM6= <"">
##$SUBNAM7= <"">
##$SUBNAM8= <"">
##$SUBNAM9= <"">
##$SW= 24.9336934301222
##$SWIBOX= (0..15)
0 0 2 0 0 0 0 0 0 0 0 0 0 0 0 0 
##$SW_h= 4990.01996007984
##$TD= 16384
##$TD0= 1
##$TE= 0
##$TE2= 300
##$TE3= 300
##$TEG= 300
##$TL= (0..7)
0 120 120 120 120 120 120 120 
##$TP= (0..7)
150 150 150 150 150 150 150 150 
##$TP07= 0
##$TPNAME0= <>
##$TPNAME1= <>
##$TPNAME2= <>
##$TPNAME3= <>
##$TPNAME4= <>
##$TPNAME5= <>
##$TPNAME6= <>
##$TPNAME7= <>
##$TPOAL= (0..7)
0.5 0.5 0.5 0.5 0.5 0.5 0.5 0.5 
##$TPOFFS= (0..7)
0 0 0 0 0 0 0 0 
##$TUNHIN= 0
##$TUNHOUT= 0
##$TUNXOUT= 0
##$USERA1= <user>
##$USERA2= <user>
##$USERA3= <user>
##$USERA4= <user>
##$USERA5= <user>
##$V9= 5
##$VALIST= <valist>
##$VCLIST= <CCCCCCCCCCCCCCC>
##$VD= 0
##$VDLIST= <DDDDDDDDDDDDDDD>
##$VPLIST= <PPPPPPPPPPPPPPP>
##$VTLIST= <TTTTTTTTTTTTTTT>
##$WBST= 1024
##$WBSW= 4
##$XGAIN= (0..3)
0 0 0 0 
##$XL= 0
##$YL= 0
##$YMAX_a= 361760
##$YMIN_a= -369937
##$ZGOPTNS= <>
##$ZL1= 120
##$ZL2= 120
##$ZL3= 120
##$ZL4= 120
##$ABSF1= 10
##$ABSF2= 0
##$ABSG= 5
##$ABSL= 3
##$ALPHA= 0
##$AQORDER= 0
##$ASSFAC= 0
##$ASSFACI= 0
##$ASSFACX= 0
##$ASSWID= 0
##$AUNMP= <proc_1d>
##$AZFE= 0.1
##$AZFW= 0.1
##$BCFW= 1
##$BC_mod= 2
##$BYTORDP= 1
##$COROFFS= 0
##$CY= 11.3945322036743
##$DATMOD= 1
##$DC= 2
##$DFILT= <>
##$DTYPP= 0
##$F1P= 18.9103706918063
##$F2P= -1.10871071338519
##$FCOR= 0.5
##$FTSIZE= 0
##$FT_mod= 4
##$GAMMA= 1
##$GB= 0.15
##$INTBC= 1
##$INTSCL= 1
##$ISEN= 128
##$LB= 0.24
##$LEV0= 0
##$LPBIN= 0
##$MAXI= 10000
##$MC2= 0
##$MEAN= 0
##$ME_mod= 0
##$MI= 1.114404
##$NCOEF= 0
##$NC_proc= 0
##$NLEV= 6
##$NOISF1= 3.799351
##$NOISF2= 2.8
##$NSP= 1
##$NTH_PI= 0
##$NZP= 0
##$OFFSET= 15.70392
##$PC= 1
##$PHC0= -8867.88
##$PHC1= 33.20014
##$PH_mod= 1
##$PKNL= yes
##$PPARMOD= 0
##$PSCAL= 0
##$PSIGN= 0
##$REVERSE= no
##$SF= 200.130013532006
##$SI= 16384
##$SIGF1= 3
##$SIGF2= 2
##$SINO= 400
##$SIOLD= 16384
##$SREGLST= <1H.CDCl3>
##$SSB= 0
##$STSI= 0
##$STSR= 0
##$SW_p= 3612.71676300578
##$SYMM= 0
##$S_DEV= 0
##$TDeff= 0
##$TDoff= 0
##$TI= <>
##$TILT= no
##$TM1= 0
##$TM2= 0
##$TOPLEV= 0
##$USERP1= <user>
##$USERP2= <user>
##$USERP3= <user>
##$USERP4= <user>
##$USERP5= <user>
##$WDW= 1
##$XDIM= 8192
##$YMAX_p= 0
##$YMIN_p= 0
$$ End of Bruker specific parameters
$$ ---------------------------------
##NTUPLES= NMR FID
##VAR_NAME=  TIME,          FID/REAL,        FID/IMAG
##SYMBOL=    X,             R,               I
##VAR_TYPE=  INDEPENDENT,   DEPENDENT,       DEPENDENT
##VAR_FORM=  AFFN,          ASDF,            ASDF
##VAR_DIM=   8192,          8192,            8192
##UNITS=     SECONDS,       ARBITRARY UNITS, ARBITRARY UNITS
##FACTOR=    0.0002004,     1,               1
##FIRST=     0,             0,               0
##LAST=      1.6414764,     0,               0
##MIN=       0,             -369937,         0
##MAX=       1.6414764,     361760,          0
$$ Real data points
##PAGE= N=1
##DATA TABLE= (X++(R..R)), XYDATA
$$ [...]
2084A209q96k89M14j041j017J958K37r71M14J07j255K75Q55m51Q54o5r92K14J58
2103b82o18N9J193o34m35K72r88l08J475j23j170J184j63j098M1P36J97P07k11
2122a66p37N29P67q32R14J157n95j53N31n74M49J255o43k19N94j34j154O60K93
2141A942K24R2q84p61Q59k43j122P82L14j349K2m4m27l04O36n15k44K34p18n43
2161b049N79L00j71N5k98p21R89k78k78P78M31j170L66J076j81m4O16k28m5J87
2181h6l33Q9Q52n0n94R26n04p72P49j56p54J035L11j473L27P81q39K33M69o2P2
2202B21N72o82J79R91l91m52J532q74M8P79m93j97N94J04j143N55N35o13l02K55
2222A218n35N6r7r13L45J1p66k67P99m64j046Q02l72l7K21l40l85O41J40m77R4
$$ plain form
2084 1209 313 24 438 -603 -1620 338 575 -396 18 125 -1130 -855 0 -451 403 338 -654 -440 -282
2103 -282 -900 -841 352 -282 -717 -445 -1433 -1741 -266 -389 -1559 -375 -538 -1636 -1595 -859 -662 45 -166
2122 -166 -903 -374 393 -439 475 1632 1037 884 1415 841 1290 2545 1902 1683 2277 2143 989 1649 1942
2141 1942 2166 2258 1374 613 1472 1229 107 889 1203 -146 -124 -168 -595 -899 -263 -778 -1022 -788 -1506 -2049
2161 -2049 -1470 -1170 -1341 -1286 -1584 -2305 -1316 -1594 -1872 -1094 -663 -1833 -1467 -391 -572 -616 0 -228 -273 -86
2181 -86 -419 -330 522 472 -122 804 300 -472 277 121 -633 402 713 -760 -433 348 -491 -258 211 149 221
2202 221 793 111 290 1281 890 438 1970 1096 1144 1923 1430 1233 1827 1931 788 1343 1878 1265 963 1218
2222 1218 683 739 642 -271 74 85 -681 -948 -149 -613 -1659 -857 -1229 -1266 -1045 -1385 -1770 -1129 -989 -1466 -1372
2243a372K59nL88j42p1L10K05r46Q05Q97o28n79R27J8l81O61n39k01O86j6m16
2264a40j2L14k87J3M10l53M49k90n74L42Q76p65j42Q32j24q65P20K29k02Q24k09
2285A046p31P94j56p64R91Q0n15N07k05j016O25O18r37J50L14m87m80L75j51l49
2305b91M87r50p1P01o74n20J058mp44L12j18o76R81J80o53N66M61q36l26R45J21
2326e1r1L02n37J35M07l67k26R50j95j037Q22o6m21O47Q9o80K97Qm88K34P05j66
2348B71k34L78p94J10Q87n57p2J237l51j039N43L71n02P21P4p96N41l77n97M15
2368B29O46n85j00N14j145K99P1m87N35M27p98p48P64p4n67P49P5o45M32l85p35
2389a528R42N02l14p4O33r70J23N21k55N59O05o01m53Q55j90j49R98l49k27M25
$$ plain form
2243 -1372 -1113 -1118 -730 -872 -943 -633 -428 -1374 -569 328 -300 -879 48 66 -315 346 -193 -394 292 276 -140
2264 -140 -152 162 -125 -112 298 -55 394 104 -470 -128 748 -17 -159 673 549 -316 404 633 431 1255 1046
2285 1046 315 1109 953 189 1180 1260 745 1252 1047 31 656 1274 337 487 801 314 -166 209 58 -291
2305 -291 196 -754 -825 -124 -798 -1318 -260 -264 -1008 -696 -814 -1490 -509 -329 -982 -416 45 -791 -1117 -172 -51
2326 -51 -142 160 -377 -242 165 -202 -428 522 327 -710 112 46 -375 272 361 -319 -22 -14 -502 -268 437 271
2348 271 37 415 -379 -269 618 61 -11 1226 875 -164 379 750 248 969 1043 247 788 411 -186 229
2368 229 875 290 190 704 -441 -142 -71 -558 -23 404 -394 -1142 -378 -452 -1019 -270 -195 -840 -408 -793 -1528
2389 -1528 -586 -84 -398 -472 161 -809 -686 -165 -420 139 744 143 -310 545 355 206 1204 855 628 1053
2409A053p10K47P98K77o48J20K80n53l66O41j76LN08q36m78J45j60o15J280k47
2429E63o35k72m25m5P55l76o28N99n55j175P34N47m56L61p8p07m7O95n09P5J205
2450c74l87n91J27j36L95R65k2m07L62no13P13P71k04O43p4q94O08M38j4K80Q07
2472B388j071k50j4k97K23Q71m88n28P21q56o37Q67M24m80l8p1q46J25lj74M58
2493C24K16m94m81O1l17N45K81l27k59K16o93m57J445Qn95p6m04n53l6K48K31
2514a117K93L50j439J02O21k60K17L73J57l00K46l93p9J195N29n12K50j76o67
2533f10Q99L58o1R51m33r19m2R60o78P38N11o57k21R4n86M47M65l17n82M70m84
2554C03o14O93M28n55L79k74q90K22L77k40K96P68q95k24k71k68J66J015n98L57
$$ plain form
2409 1053 343 590 1388 1665 1017 1137 1417 864 498 1139 963 966 1474 638 160 305 145 -470 810 563
2429 563 -72 -344 -769 -814 -59 -435 -1063 -464 -1019 -2194 -1460 -913 -1369 -1008 -1086 -1793 -1840 -1145 -1654 -1579 -374
2450 -374 -761 -1352 -1225 -1361 -966 -1 -23 -430 -68 -73 -686 27 798 594 1237 1163 269 877 1315 1301 1581 2388
2472 2388 1317 1067 1053 756 979 1850 1362 834 1555 699 62 929 1353 873 835 764 -82 43 40 -134 324
2493 324 540 46 -435 -374 -691 -146 135 -192 -451 -235 -928 -1385 60 68 -527 -603 -1007 -1560 -1596 -1348 -1117
2514 -1117 -824 -474 -1913 -1811 -1190 -1450 -1233 -860 -703 -1003 -757 -1150 -1229 -34 495 -17 233 57 -610
2533 -610 289 647 586 1537 1104 185 143 1103 425 1163 1674 1017 796 890 304 751 1216 899 317 787 303
2554 303 -311 382 810 255 634 360 -530 -308 69 -171 125 893 -2 -226 -497 -765 -599 416 -182 175
2574A75K63j047k07Q63J54o8O25q06o60M20K79K4O34L89j157R8K58r94J186L37
2594G66m18j91J24p73k90Q81M86l62K13m24q66O06J2k77Q14J2q32n84K68j24L40
2615f19K28mp6k8o89J8J101j49l21M45o83l97N33J76L6Q20j92j119O34L39j48
2636i5P11M57m31j35N11o01K79J183m04j48J46l33l88O61k0m06Q59q02p53L36
2656F27K6k20K36j81n25p1n1r50O39Q93q93j1K59j203K8P18j56M80l55j52q47
2677a709O22K50n28J027J65o77j36J25l27P29J021q52OL46j061N12P48M13J85
2696H59o2m47r7K72k10J31J078j64q55n9J62j98R53P9j156M50j3p36R0O42j90
2717E29k89J62p24j65L19l11J76P54n14p41j31K06k92P64J25m76K39l94n05N39
$$ plain form
2574 175 438 -609 -816 47 201 133 758 -48 -708 -288 -9 15 649 1038 -119 -21 237 -757 429 766
2594 766 348 157 281 -492 -782 99 585 223 436 12 -854 -248 -236 -513 301 313 -519 -1103 -835 -959 -619
2615 -619 -391 -395 -471 -499 -1188 -1170 -69 -218 -539 -94 -777 -1174 -641 -465 -429 391 199 -920 -286 53 -95
2636 -95 616 1073 642 507 1018 417 696 1879 1475 1327 1473 1140 752 1413 1393 987 1846 1044 291 627
2656 627 653 433 669 488 -37 -108 -159 -1109 -470 423 -470 -481 -222 -1425 -1397 -679 -835 -355 -710 -862 -1709
2677 -1709 -1087 -837 -1365 -338 -173 -850 -986 -861 -1188 -459 562 -290 -284 62 -999 -487 261 674 859
2696 859 797 350 253 525 315 446 1524 1360 505 446 608 410 1363 1442 286 736 723 -13 77 719 529
2717 529 240 402 -322 -487 -168 -479 -303 451 -63 -804 -935 -729 -1021 -257 -132 -608 -369 -763 -1268 -729
2737g29O96l24L06j12n21M57J46j57O69P90o04n91N13K81j83P67L9q53J51m63
2757B78j03N56L68p50J79j83r35M29n4k26K32O7q36m70Q03l34l62N56K14m45j45
2778a161j38o6R97K38k99K85R1m75M33O63k80O51M5p60K25N09o3k28R51o17j97
2799H04l54L65m52P58J87j092P19o02n24j64J044m70L7J43r69J11M77q21L60L61
2819h2l03k43m03o2K46N99j64l19L61l11l90O87p6K66P3j09n50R1N60o5j14O60
2841C52l76o09P57J30k71N31j83j92M10k63o41J247K35k94m2L8q18K44N26k27
2861E54L06P24j286j26L63k37J77K08m53j32J73o14o21J090o9n70O7l17o40K55
2881a148N33o72P59k07n74j82P24j32K6K52M20r8K03j73L0J245m98n08Q87j21
$$ plain form
2737 -729 -33 -357 -51 -163 -684 -227 -81 -238 431 1221 617 26 539 820 637 1404 1443 590 741 278
2757 278 175 731 1099 349 528 345 -590 -161 -215 -441 -209 -142 -978 -1448 -645 -979 -1341 -785 -571 -1016 -1161
2778 -1161 -1299 -1365 -368 -130 -429 -144 -53 -528 -95 568 288 939 984 224 449 958 895 667 1618 1001 804
2799 804 450 815 363 1121 1308 216 935 333 -191 -355 689 219 256 399 -570 -459 18 -803 -443 -82
2819 -82 -385 -628 -1031 -1093 -847 -248 -412 -731 -370 -681 -1071 -384 -460 -194 -121 -230 -780 -689 -129 -194 -308 352
2841 352 -24 -633 124 254 -17 514 331 139 549 286 -355 892 1127 833 791 829 11 255 781 554
2861 554 860 1584 298 172 535 298 475 683 230 98 271 -343 -964 126 57 -513 -446 -763 -1403 -1148
2881 -1148 -615 -1287 -528 -735 -1309 -1491 -767 -899 -873 -621 -201 -299 -96 -269 -239 1006 508 0 887 766
2901G66k33K23N78J27MK9o33K58L25m58N22N3q09K79M3o09N7M83n87m26K27J30
2923C49o86K70l4N2l56k33l46Q8L53p82J81O22p86q6P97n51Q7L42m94J33N53l33
2945h60m04N47K34NN7l92l6Q13K02q08P41J91o84k8O09m19K05L19m50K79M58n14
2967F5k19M68K65J36J18m49P1M02M26p10P08J82p68M55N49o16N15J52o61K12L09
2988A610n42n2O26p71k43L72l14n76L03j61p39L92l61o23L46P7l80k77J31o39
3008a821L81j70j59J66M15k95k44M72m80J51N20r7j32O39J41n10N54J97l06M25
3028a53K29k64O36k14l25M67L90l71P9L69m19n94Q41k57k16K66m44j6L12r9K6
3049B43j54M44n05K12q6M8P01n9o43K80N54m50j63N57O0m41O22n14K78P4K42p46
$$ plain form
2901 766 533 756 1334 1461 1465 1494 861 1119 1444 986 1508 1561 752 1031 1074 465 522 1005 418 -8 219 349
2923 349 -337 -67 -101 -49 -405 -638 -984 -896 -543 -1325 -1144 -522 -1308 -1394 -597 -1148 -1061 -719 -1213 -1080 -527 -860
2945 -860 -1264 -717 -483 -478 -421 -813 -849 -36 166 -642 99 290 -394 -422 187 -232 -27 292 -158 121 579 65
2967 65 -154 314 579 715 833 384 455 857 1283 573 1281 1463 695 1150 1699 1083 1598 1750 1089 1301 1610
2988 1610 1068 1016 1642 871 628 1000 686 110 413 252 -487 -95 -456 -1079 -733 -656 -1036 -1313 -1182 -1821
3008 -1821 -1440 -1610 -1769 -1603 -1188 -1483 -1727 -1255 -1735 -1584 -1064 -1161 -1293 -654 -513 -1023 -469 -272 -578 -153
3028 -153 76 -188 448 234 -91 376 766 395 474 843 424 -170 671 414 198 464 20 4 316 217 243
3049 243 89 533 28 240 154 202 903 844 201 481 1035 585 422 979 1039 598 1220 706 984 1058 1300 554
3071E54N48q3l08j46J7p93P30l55q59N44l2k81l01J73m05r5K30n69M5L25l1k48
3093a340M52L3k22M8K97j9N00o5k71O39N0k48J54O85n52l2M99j24m4j24k71j78
3115a33N36p13K25m5K19l61J41k18m07L68m9l54K80M37n61K25J94k1K01K86l05
3136e5L61P47p70Q3O15pk36O89k68J0M22r9l90J92J49m13po0m77j9J10r07K17
3159a13L04j053j9K90l19p00N20l05J31M9r2l51N40Q0n51Q78K72j58m69N19L16
3180b31j0P32n70N31M83m71l4J40M50l99N69k29NR7j48k87L91j7o08N7r6p56L75
3203b6qn61L59J84q71mN45j70k42K66j5j10M43n03L89L40l06J0L70L8m72K41K85
3226A82j09L32m2o76N4O48o15j30O73l42m93M16k49J85M77j64m58M10k36l72L45
$$ plain form
3071 554 1102 1019 711 565 582 -211 519 164 -695 -151 -183 -464 -765 -592 -997 -1092 -862 -1431 -1386 -1061 -1092 -1340
3093 -1340 -888 -855 -1077 -1029 -732 -751 -251 -316 -587 52 102 -146 8 693 141 109 608 484 440 316 45 -133
3115 -133 403 -310 -85 -130 89 -272 -131 -349 -756 -388 -437 -791 -511 -74 -635 -410 -216 -237 -36 250 -55
3136 -55 306 1053 283 366 981 974 738 1427 1159 1169 1591 1492 1102 1294 1443 1030 1023 963 486 467 577 -330 -113
3159 -113 191 -862 -881 -591 -910 -1610 -1090 -1395 -1264 -1215 -1307 -1658 -1118 -1038 -1589 -711 -439 -597 -1066 -547 -231
3180 -231 -241 491 -79 452 935 464 430 570 1020 621 1190 961 966 1063 915 628 1019 1002 394 451 355 -401 -26
3203 -26 -34 -595 -236 -52 -923 -927 -382 -552 -794 -528 -543 -653 -210 -713 -324 16 -290 -280 90 128 -344 -103 182
3226 182 73 405 363 -313 -259 389 -226 -356 317 -25 -518 -102 -351 -166 311 147 -311 99 -137 -509 -164
3247a64K85J07M5R7m81L94N23q44K26M62n56L09J64N4J29J00l4m58M16j43m31
3268B00J69J83l82J02k45j54L74l68k90K96K27o93j60M03n38M73l4m81K60M38
3288b20o56j5M75j12K76k75O9r3J78J97P3L85l5m97L84O2rM54K13p96K42L89n82
3311A07K61M03m78NJ34m63k37J50J10q6J83r8n29J58L88m39N95k8j41m01L17l29
3333d18l8P41o54l3M80m33KK35J21k70N00n49l1M27m0J51K60P0l55L50j38k45
3355A33M02J05k90j95K20j5k58L55J10k43j63m18l6O07j87n00K22J64p26K97k12
3376f28j99J99M49l76R0L5k64J22L21J9m6K47m40j12M72p9j37J052j19n42k4O90
3398G30j43j32K94l11J76J6n06M53J38J33m58J76k76L3J5j10m43P69o55l59K42
$$ plain form
3247 -164 121 228 273 370 -111 283 806 -38 188 650 94 403 567 621 750 850 816 358 774 631 200
3268 200 369 552 170 272 27 -127 247 -121 -411 -115 112 -581 -741 -338 -876 -403 -437 -918 -658 -220
3288 -220 -876 -891 -416 -528 -252 -527 -458 -551 -373 -176 -103 282 247 -250 134 196 187 641 854 58 300 689 107
3311 107 368 771 293 298 432 -31 -268 -118 -8 -94 89 -9 -538 -380 8 -431 164 136 -5 -406 -89 -418
3333 -418 -456 285 -369 -402 78 -355 -353 -118 3 -267 233 -316 -347 80 40 191 451 521 166 516 378 133
3355 133 535 640 350 155 375 360 102 457 567 324 161 -257 -293 314 127 -373 -151 13 -713 -416 -628
3376 -628 -827 -628 -179 -555 -465 -430 -694 -572 -251 -232 -278 -31 -471 -583 -111 -190 -327 725 606 64 40 730
3398 730 587 455 749 438 614 630 124 577 715 848 390 566 290 323 338 228 -215 554 -101 -460 -218
3419b18J23k75K29Qn18M22k10L3k81P48m48l28K89q8m3L10j27j6N12n46N8R5K50
3442b1j20K49q3N7J86r0j60J88L84l83j98L84k68N7R0J18N5K45n29r1M12q7K93
3465F88k72r0p4KJ69n55P37Qn27k69K32m98N9O62k76Q7l74j57p2M46j32n31Q59
3488A22p20j04L61k11L48J03K30n52N6N3j82K26N75m7o7Q8l01KN60l25PM96k57
3511D61n20R8j92N7L54ll05l50J91l29L44J39k84k23p8q1j43M90j32o9M23k99
3533d51k59N12M1m56N15K27k99K23j54J40L89J45l24J90J96q6K8R7j97r7K30m26
3555A84j08M49J21m64M27k38l47J78Mk06K72R1k80j17k8O7J52j11L09j19J28o55
3577b91r3M48O4k41K08P6n92N52l56l56P67n8l96K2J09l00L12m3k70K37l79J2
$$ plain form
3419 -218 -95 -370 -141 -133 -651 -229 -439 -406 -687 61 -387 -715 -426 -514 -557 -247 -374 -390 122 -424 -366 -271 -21
3442 -21 -141 108 25 82 268 178 18 206 590 207 9 393 125 182 272 390 445 690 161 70 482 395 688
3465 688 416 326 252 254 423 -132 605 613 86 -183 49 -449 -390 272 -4 83 -291 -448 -520 -74 -206 -737 122
3488 122 -598 -702 -341 -552 -204 -101 129 -423 -367 -314 -496 -270 305 258 191 279 -22 -20 540 215 222 718 461
3511 461 -59 39 -153 -96 258 255 -50 -400 -209 -538 -194 -55 -339 -562 -640 -721 -864 -374 -506 -575 -152 -451
3533 -451 -710 -198 -157 -613 -98 129 -170 53 -101 39 428 573 249 439 635 549 577 674 477 380 610 184
3555 184 76 525 646 182 609 371 24 202 206 0 272 363 83 -34 -62 5 157 46 355 236 364 -291
3577 -291 -384 64 128 -113 95 171 -421 131 -225 -581 186 128 -268 -246 -137 -437 -125 -168 -438 -201 -580 -568
3599e68K74m2q5j02L9J20k37L9K05n6J80Q0r1PJ09j19L41K35j01K51m93L48M0
3622C74K94j98Rl3k22J3L97j77r9M47m56n3L49n17l60O81P2j92k65m4j54L28O
3645B00k16k85M63l88J82J18k74M3J03k54n9L02K6m91N56Q5k45M6m35l7L50K08
3667bl39K76J07m27k43N06l88M53n9np9K86l18O1O98l77k04K68j15J69j6J34k5
3690C61P9k21k80M45j94N13n8J37m23Ln5k37L45K15l67l41N60j48j95j24j39J6
3712a08m36M67m84K81j48k33K51k8n09P05k35j36J65j29j77M7L28ql38N16J8r1
3734b82K07l43j61M86J92l40N05J96j87m12N43p7L01J77p3k88J82k9m82R79j38
3755I56l78O7j34l3M26j52n04K83M2m09R3j05l9K26P3m53O4L1j59J13J6l8k48
$$ plain form
3599 -568 -294 -336 -421 -523 -484 -364 -601 -562 -357 -413 -233 -153 -244 -237 -128 -247 94 329 228 479 -14 334 374
3622 374 668 470 479 446 224 237 634 457 358 805 349 296 645 128 -232 449 521 329 64 20 -134 194 200
3645 200 -16 -301 162 -226 -44 74 -200 -157 -54 -308 -367 -65 -39 -530 26 111 -134 -88 -523 -560 -210 -2
3667 -2 -341 -65 42 -385 -628 -122 -510 -57 -116 -121 -200 86 -232 -171 527 150 -54 214 99 268 252 386 361
3690 361 440 219 -61 384 190 703 645 782 359 362 307 70 415 630 263 -78 482 334 139 15 -124 -108
3712 -108 -544 -77 -561 -280 -428 -661 -410 -438 -947 -242 -477 -613 -448 -577 -754 -707 -379 -387 -725 -209 -191 -282
3734 -282 -75 -418 -579 -93 99 -241 264 460 273 -139 404 327 628 805 732 444 626 597 115 1094 956
3755 956 578 645 511 478 904 752 248 531 573 164 257 152 113 339 412 -41 23 54 -105 8 24 -14 -262
3778b62J71n67J38J52j90M7L48j1o70L73K65J8J06m42K54L8Nj73p2L82N2l16J41
3801b13k85M27J75j27j7j11J80l02M36j1k10J93p8k5J14L29n48P5L25j90Q6j4
3823B09J7k03O26l00r0J01k27l28J33L30j93K58K47m30K08k56p4N18n14L67j80
3844B19J2k44J25K24L0l10j16K4k23L81k99m7L06P6l26K30K69n17K48K26p32L33
3866a11M6l37L14J55k52l8J94l64k2K77k34j4J75m6j78K58l88M96J20k69j85J57
3888b46L42l36O5M56k69k08L58r5J6J27k8p0L99m38k3N9J57j9N6m0R3q0J39l63
3912E2M9J06l23q7K91o35L94K28pq7K34k67j74L40J31k62J25r6K0L09j12m53M51
3935B27q4n02P08j69J2j16j70j01K10M85q07M37j60P7k32J35N6k88L58l89J69
$$ plain form
3778 -262 -91 -658 -520 -368 -558 -511 -163 -174 -844 -471 -206 -188 -82 -524 -270 -232 -227 -400 -472 -90 -38 -354 -213
3801 -213 -498 -71 104 -23 -40 -151 29 -273 163 152 -58 135 57 32 146 475 -73 2 327 137 223 209
3823 209 226 23 649 349 259 360 133 -195 -62 268 75 333 580 150 358 102 28 546 32 399 219
3844 219 231 -13 112 336 366 56 -60 -36 -259 122 -177 -224 82 158 -168 62 331 -186 62 288 -444 -111
3866 -111 -65 -402 -88 67 -185 -223 -29 -393 -415 -138 -372 -386 -211 -257 -435 -177 -565 -69 51 -218 -403 -246
3888 -246 96 -240 -175 281 12 -196 162 67 83 210 182 112 511 73 50 109 266 247 303 263 356 276 415 52
3912 52 101 207 -116 -203 88 -547 -153 75 68 -19 215 -52 -226 114 245 -17 108 12 32 341 229 -224 227
3935 227 143 -359 349 180 192 76 -94 -195 15 500 -307 130 -30 47 -185 -50 6 -282 76 -313 -144
3956a44P2j09r0K16j07j16M32j03pj07J41l16K26J99j96R7j39J64o9L80R8l45
3978A77L6p8J34J92ln59O3J49l6k21J5L3J66K14n81j16M42l89K67L80o39J72j40
4001c22J75j13%J06KJ21N99l18k87M09l83j1J43l25l3O56k55q5J66k29N4J48j62
4024E6k54J77l41m6K16J88l82J49K03j98k34M90l51K71J82l09J31J52o2o7M15
4045C86m36P5L47j95k54K9J11k26L54l48k0O29j39l90K35j12m57J81L84j27j24
4066i7M89m89J0J06j22L33j94m9K01M5J96l32K3r3j91M95j18r9K48l2k99P8k9
4089H0r7rLJ91l48N2l8l0L98q7r2R4j25o5jK81l22J20j31J0j66J78J13j99N5j2
4115a47lM87n67M43M7m33l0Q8J3j86K03L3K81j00Rk05k8J96k59p3M09k89L53p3
$$ plain form
3956 -144 -72 -181 -271 -55 -162 -278 154 51 44 -63 78 -238 -12 187 -9 88 -51 113 44 424 522 177
3978 177 213 135 269 461 458 -101 -38 111 75 -146 -131 -98 68 282 -299 -415 27 -362 -95 285 -354 -182 -322
4001 -322 -147 -260 -260 -154 -152 -31 568 250 -37 372 -11 -22 121 -204 -237 419 164 79 245 16 70 218 56
4024 56 -198 -21 -362 -408 -192 -4 -386 -237 -34 -232 -466 24 -327 -56 126 -183 -52 100 38 -29 386
4045 386 -50 25 372 177 -77 -48 63 -163 191 -157 -177 452 313 -77 158 46 -411 -230 154 27 -97
4066 -97 392 -97 -87 19 -103 230 36 -13 188 233 429 97 120 27 -164 331 213 114 362 330 31 109 80
4089 80 -17 -26 -23 168 -180 -128 -166 -196 202 115 23 117 -8 -73 -74 207 -115 5 -126 -116 -282 -104 9 -190 -135 -147
4115 -147 -150 337 -230 213 260 -173 -203 -115 -102 -288 -85 -52 229 129 138 -67 -95 101 -158 -231 178 -111 242 169
4139A69k23L1J99p7%j06p2K0L69j96o0K52m93L34l4n4k79P7L41L0j70N0p8N18
4163E48k34m02l7K34m04J27Q6K84k66q3P3j13p2K35l94K78L3j98m1K26q0M07J16
4186C23l99K97k72K26j92K45l81K15R6k70L27j72M0r1K73R5m49p9J79J4l1j71
4208a77n4r6N16j72m27N88l72q8R2j30J40Q2l22J78N03j18n55J37J47OJ19k08
4230b11J53j51L77m44M33K26o24Q9q4K8J56K13k63P6M05j12k28K7P8j86J48Qp8
4253C6o1N32m86N06R4q22L90J60j97r5K70l37J98O7l55n5M51j23k55K05Q9k80
4275f8K0n6J19J01j41l05K15K18l11J41Mo36N51l0k9k07L12j53k3K75k41j79L17
4298a06K55j04K56j50m26N83l98Rq7K99m6o9K19k29LJ92k12L3J83k60l05N14m0
$$ plain form
4139 169 -54 -23 176 99 99 -7 -79 -59 310 114 54 306 -187 147 113 59 -220 -143 198 228 58 108 30 548
4163 548 314 -88 -125 109 -295 -168 -82 202 -64 -147 -74 -187 -259 -24 -418 -140 -107 -305 -346 -120 -200 207 323
4186 323 -76 221 -51 175 -17 228 -153 62 158 -112 215 43 83 -8 265 360 -89 -168 11 25 -6 -177
4208 -177 -231 -327 189 17 -410 178 -194 -282 -190 -320 -180 -98 -420 -242 261 143 -412 -275 -128 -122 -3 -211
4230 -211 -58 -209 168 -276 157 383 -241 -152 -236 -208 -52 161 -102 -26 379 267 39 66 144 -42 106 114 36
4253 36 -25 507 21 527 621 -201 189 349 152 57 327 -10 188 255 -100 -155 296 173 -82 123 212 -68
4275 -68 -48 -104 15 116 -25 -330 -115 103 -208 -67 -63 -699 -148 -178 -207 -414 -102 -255 -278 -3 -244 -423 -106
4298 -106 149 45 301 151 -275 308 -90 -81 -168 131 85 16 235 6 9 201 -11 22 205 -55 -360 154 114
4321A14p0J34j6j31L36k72K10j0j45M6l81M38l43N4J06j9k10J99J85j31L44k01
4343B37j52K2m46N51j24l45R7L96ok50l38J06K82k02K74q7P9m10J15M2L51o6j99
4366g3L70p4k27k4k23L65r6o8o9J90q8j45P0O4l33K56j20m2j08M32l63L85k46
4389a67j68p7L78l78K57K46l94j17M51k48r7M84j38M8K50k88M4rR7J84m45N15
4411D28k8N6n3j46N8l3j86L7j35L25l56j3L77m12K18j19k70N20j35m67K61j34
4433b07Q2j2%j05K45J78k38j67K07l0q0j00Jq7K72J77k51K69j25N4J79k49pQK27
4458B41m83M74j89m03M73j36L4j21K76j52l11K69N0k28J06j86K83M8Q4M6j52K2
4480D5k22K04M7Q3j59J83O1m1N5k35j47J87J70j27J14j2l26J94Q6k61K55N7j88
$$ plain form
4321 114 44 178 162 31 367 95 305 295 150 196 -185 253 -90 -36 70 51 -159 40 225 94 438 237
4343 237 85 107 -339 212 88 -257 -160 236 230 -20 -358 -252 30 -172 102 15 94 -316 -201 -159 192 126 -73
4366 -73 297 223 -4 -28 -251 114 18 -50 -119 71 -17 -162 -92 -28 -361 -105 -225 -267 -375 57 -306 79 -167
4389 -167 -335 -412 -34 -412 -155 91 -303 -420 31 -217 -314 170 32 80 330 42 86 77 174 358 -87 428
4411 428 400 456 403 257 315 282 96 133 -2 323 -33 -46 331 -81 137 18 -252 268 133 -334 -73 -207
4433 -207 -125 -137 -137 -242 3 181 -57 -224 -17 -47 -127 -227 -226 -313 -41 136 -115 154 29 83 262 13 6 14 241
4458 241 -242 232 43 -360 113 -23 11 -110 166 14 -297 -28 22 -206 -100 -286 -3 45 129 175 23 45
4480 45 -177 27 74 157 -2 181 242 201 256 21 -126 61 231 104 218 206 -120 74 160 -101 154 211 23
4503B3k41J06o4L24j69o6o9K54Q4m40J7L40j59q2K26j87jp7L15j58K0Q1k54K57
4527H0M3m49L05Q9j02P5j05j4J53k26K90k7J33j32J86m31N54o8k3k05O9J66k11
4550A50K21k67p0Q8q2l60K96J05m29K27mn1N1L8r6l29N55j70P9P4o1r7m2M51m7
4575B30K18m84j60J52J88M0l75M81m02J73J54j06J51j5k6j69J34k91k19J73M32
4596B79k49q9K84n06J06L03j26j04L3mj70J68j35j34J92Q6Q4pr5o2R4K15m1j55
4620c3K5J40M4k58L19K60j38l63L24K37l16L1N5k82j32M05m69J12r2j1J90k58
4642b10M7k00K71j13M3K68m9l39J46j0j02J27R5j12j6J70K77Q2j10k13Q2J60l13
4665a9N8J62q4P8J49k8k21J06J62o79L41J38m8J46k54k6J83j18k14L31j0m69j26
$$ plain form
4503 23 -218 -112 -176 148 -21 -87 -156 98 182 -258 -241 99 -60 -142 84 -103 -104 -181 134 -24 -4 77 -177 80
4527 80 123 -326 -21 68 -34 41 -64 -78 75 -151 139 112 245 113 299 -132 422 354 331 126 195 361 150
4550 150 371 104 34 122 40 -320 -24 81 -348 -121 -125 -176 -125 -87 -183 -512 43 -127 -48 26 -35 -132 -174 277 230
4575 230 448 -36 -196 -44 144 184 -191 290 -112 61 215 109 260 245 219 50 184 -107 -326 -153 279
4596 279 30 -59 225 -281 -175 128 2 -102 -69 -73 -243 -75 -210 -344 -152 -66 18 11 -84 -146 -52 163 122 -33
4620 -33 -8 132 176 -82 237 497 359 -4 320 557 241 272 327 45 -87 318 -151 -39 -131 -142 48 -210
4642 -210 -163 -363 -92 -205 -162 106 57 -282 -136 -146 -248 -121 -26 -138 -154 16 293 375 265 52 134 294 -19
4665 -19 39 201 117 195 344 316 95 201 363 -316 25 163 115 261 7 -19 164 46 -168 163 153 -316 -442
4688d42O47j12l26L70j4l35M9J44o6J37L38k75K54r5l94R8M3LQ4M7M2l98K14k37
4712b24L57l6r5l53L11N9k4J19j81o6n2N38n77O35n17l47N14J54k99j59L40m26
4734c29K20L03j91Rr7L55o78L75J52k58l8L14k51O4K28j32J16R2m91M5L45qj45
4757@k57J54M06j95M3m9l4l27J04K09pk33L87k2k37j75J83q0K82p6l54K79J34
4780A35k4K1R8l83P0o3m27L17L47j89k37j06L96j10K27k24k0R0pQ9j78L28j22
4803B8K7P3l0J37J3n4r7J59k07O6r8J38J5Q7j96R4K8k2l79L66j07k52K81L92m61
4828AJ25m98N32k78n1J3L49k09j9J81n8J38k08K18j93m43N31j25k86L2J21N8L8
4851c1K2J47l52M67k83K22jk23J87K45m85K0K66N1m69L00m3j03L98l17k23J56
$$ plain form
4688 -442 205 93 -233 137 123 -212 -163 -19 -85 52 390 115 369 274 -120 -22 21 24 108 155 197 -201 13 -224
4712 -224 133 97 2 -351 -40 19 -5 114 -67 -133 -185 353 -224 411 -106 -453 61 215 -84 -243 97 -329
4734 -329 -109 194 3 12 -85 270 -408 -33 119 -139 -177 137 -114 -50 178 46 162 254 -237 -192 153 145 0
4757 0 -257 -103 303 108 151 102 68 -259 -155 54 47 -186 201 179 -58 -233 -50 -130 152 76 -278 1 135
4780 135 111 132 230 -153 -83 -146 -573 -256 91 -98 -335 -441 -45 -155 72 -152 -172 -82 -89 0 -178 150 28
4803 28 55 128 98 235 248 194 97 256 49 115 17 155 170 257 61 155 183 161 -218 148 41 -211 70 462 1
4828 1 126 -372 160 -118 -169 -156 193 -16 -35 146 88 226 18 236 43 -400 131 6 -280 -248 -127 -69 -31
4851 -31 -9 138 -214 253 -30 192 191 -32 155 400 -85 -65 201 252 -217 83 40 -63 335 18 -205 -49
4873d9N77p11K40k31N00k32J92l66J50L91l39m65M87k15K51j9j57pM5R0l95j36
4895c99J76K84j14j5k62L04K11r8k74K97j05k94M58R8l70J3O4l6K04P4m95N89
4917C10j15r4k00O8o9N2R0J17k85L26m59P9J90k35k4J73K0P3K22q6k34K31l5m1
4941G4L13k09m64K21m2m20N26P6m4q0M39l05j08K57j56j46j11J1L14j6Ml26j75
4964c67K85Qmq2PQ4J33J4l00M88n67K92k6J45j18L86l84P8J99n62K56pJ45k59
4988a56K64o1j69M5M67l84K60k64n4K22l1j30m6J0l74K70K41k41R1R6j66k69O52
5011B73n36K20O2k00J31j6P8J12J4j2k30L9J76m55N98l05J54k84J80j3j36J54
5033Dk30P5K08l14N2K76j57j4K08j19m6K47M5k70N02m27j12j0L67l09k9L36j31
$$ plain form
4873 -49 528 -183 57 -174 326 94 286 -80 70 461 122 -343 144 -71 180 161 4 -3 42 132 -263 -399
4895 -399 -223 61 -53 -68 -330 -26 185 87 -187 110 5 -289 169 267 -103 -90 -26 -62 142 216 -279 310
4917 310 195 101 -99 -31 -100 -48 42 159 -126 200 -259 -180 10 -225 -249 -76 -56 17 239 153 -81 150 115 74
4941 74 387 178 -286 -65 -107 -527 -1 75 31 -49 390 85 -23 234 78 -68 -179 -168 146 130 134 -192 -367
4964 -367 -82 -74 -78 -160 -153 -69 64 78 -222 266 -301 -9 -35 110 -8 378 -6 72 271 -291 -35 -42 103 -156
4988 -156 108 47 -122 -77 390 6 266 2 -52 170 139 9 -37 -27 -401 -131 110 -131 -40 56 -110 -379 273
5011 273 -263 -43 19 -181 -50 -66 12 124 138 126 -104 -65 111 -344 254 -51 103 -181 -1 -14 -150 4
5033 4 -226 -151 57 -257 -205 71 -86 -100 108 -11 -57 190 235 -35 467 40 -72 -82 285 -24 -53 283 152
5056A52m5K38k36j20J85P8j83l2J95k96R8J61j01j9K56n86L98k0k72J92m9k6l53
5079c85L71j27QL88l70P1k6nm5J37K5jj15N9O1r6J31l16L79l50n0L66r1r2j66
5104b39K32j76l01O8Q7J80K24p5j63L16l64K30l1L2k25N32k62j26K49m49M25r2
5126G2J91j11QJ4k6l22K18K50l66R8J19J32n6Kl44J49Q0j03L47l47p5o8K28k76
5150a86j07K11J63k88L13k99R4j61L48l97N5K88j58M76l74mK3J94j41j00j19L3
5172a36M26m37L7N4J97L3j92K94o92O4L55K8j32R2k04j18K25j0J33L4j67k7k75
5195d18J55Q1J26Q2k66L18K1p4n5K47Jl45J64l9j11L10M4j15p5K93k23J89l38
5218b8N3K61j04j16J75J46k52l36L20j33K42k56K97n57M82k15m1QJ69k80J90N3
$$ plain form
5056 152 107 345 109 -11 174 252 69 37 232 -64 34 195 94 75 331 -255 143 123 -149 43 -6 -32 -385
5079 -385 -14 -141 -133 255 -115 -44 -70 -75 -120 17 42 41 -74 -15 46 -50 81 -235 144 -206 -256 110 19 -73 -239
5104 -239 -7 -183 -484 -416 -329 -149 75 0 -163 153 -211 19 -12 20 -205 327 65 -61 188 -261 164 72
5126 72 263 152 160 174 148 -174 44 294 -72 26 145 277 221 223 -121 28 108 5 352 5 -70 -138 90 -186
5150 -186 -293 -82 81 -207 106 -193 -99 -260 88 -309 -254 34 -124 352 -22 -26 -3 191 50 -50 -169 -136
5172 -136 290 -147 -110 -56 141 174 -18 276 -416 -352 3 31 -101 -9 -213 -331 -106 -116 17 51 -116 -143 -418
5195 -418 -263 -182 -56 26 -240 78 99 25 -30 217 218 -127 37 -2 -113 197 241 126 51 344 121 310 -28
5218 -28 25 286 182 66 241 387 135 -201 119 -14 228 -28 269 -288 194 -21 -62 -54 115 -165 25 78
5240G8l33K88j5l78L88l3j59J3J88j43k1J01M4j60j4J26j34R2k7j03L92j5k35
5263f0R8L94j83m24L24k0j42j64R7J86K4jj36J85l35o4K16k96j14L89k41Q9L1
5286a47J78j37J73m09J61J56J38j82J22j7L4k18L04l59J6j7j13M00p3j06j43K80
5308D1k47L64n2j76K66j86k0j44L20j89nK98m6k64m42M84j56J52p8l1j40M59k61
5331e3P9J79J01m05K6o1K20k14K38l6J61k12J04l57L78J99m83L25m58K01J65j32
5353c5j88K45o8P7o9j80J29M9n5J21j9r1j22N6K09n56O33r9k43Q3J68l05N55k42
5377E3L0j63M57l85J19p1J54m27J91M15j97j00j09j36L30k28k15K38o6p6j44K80
5399e0J23L3j69p9j5K3K13j33J28R2K1k02r9K99k97K54j49j96M17n43J82m4J69
$$ plain form
5240 78 -255 33 18 -360 28 -5 -164 -151 37 -106 -127 -26 18 -142 -156 -30 -164 -72 -99 -202 190 175 -60
5263 -60 38 432 249 -175 149 129 -13 -177 -80 106 130 129 -7 178 -157 -221 -5 -301 -415 -26 -267 -178 -147
5286 -147 31 -106 67 -342 -181 -25 113 -69 53 36 70 -148 156 -203 -187 -204 -317 83 10 -96 -239 41
5308 41 -206 158 106 -70 196 10 -10 -154 166 -23 -28 270 224 -40 -482 2 -154 -2 -80 -111 -251 208 -53
5331 -53 26 205 306 -99 -73 -134 86 -128 110 74 235 23 127 -230 148 347 -136 189 -269 -68 97 -35
5353 -35 -223 22 -46 31 -38 -218 -89 -40 -95 26 7 -84 -206 -150 59 -497 136 37 -206 -123 45 -260 295 53
5377 53 83 -80 377 -8 111 40 194 -233 -42 373 176 76 -33 -169 161 -67 -282 -44 -110 -186 -330 -50
5399 -50 73 106 -63 -142 -157 -134 79 -54 74 166 187 -15 -114 185 -112 142 -7 -203 214 -329 -147 -191 -22
5422b2O3p8m3Q3p4K3r2L0Q8Q1J44r4J24k02M0m14J39J48r0j66N87m21L30l08j39
5447b63K99m15N09o5J45m2m03K96M5j04j6k0j02J34j5K24J08l58M3J21K46j57
5469B10k91l1K80m36J18J17k17K39n3K38n7o3N5k5r7L55j85k69K11M6J31j85J51
5492B42k95j3O2J0j52M2J5r0mJ15J27j54L68l77j81J51J1L17q0k8j46j5K39j95
5516c1J9K12J31l91J08j45J07j22Q3o5N27j18m17M0J88j54k7K61l41j54O22m24
5538i1L8p8K15J60j61k49j3O6j53J69L00r6q1N3K07k29O3P8j65K96j62n4j92M24
5562C45p1l10j48K22r7K71j35J15R6l35k47J55L58q32N00J39k59L79l53L75j78
5583a0j82N6J47l8l71K63K27q2P4l22K31l2L8J32k99J07l8J42j18k3Q9K19k64
$$ plain form
5422 -22 41 -37 -80 3 -71 -48 -140 -110 -22 59 203 109 233 31 71 -343 -204 -56 -146 -312 275 -146 184 -124 -263
5447 -263 36 -379 130 65 210 168 -235 61 106 2 -14 -34 -136 -2 -17 207 315 -43 0 121 367 210
5469 210 -81 -112 168 -268 -150 -33 -250 -11 -64 174 117 54 109 84 -13 342 157 -112 99 145 276 91 242
5492 242 -53 -66 -4 6 -146 -104 -89 -179 -183 -68 59 -95 273 -104 -285 -134 -123 194 114 86 -60 -75 164 -31
5516 -31 -12 200 331 -60 48 -97 10 -112 -29 -94 433 315 -102 -62 126 -28 -55 206 -135 -289 333 -91
5538 -91 -53 -131 84 244 83 -166 -179 -113 -266 -97 203 107 26 79 286 57 120 198 33 329 167 113 -79 345
5562 345 274 -36 -184 38 -59 212 77 192 288 -47 -294 -139 219 -613 -113 26 -233 146 -207 168 -10
5583 -10 -192 -136 11 -27 -398 -135 92 10 84 -238 -7 -39 -1 131 -168 -61 -99 43 -75 -98 -9 210 -54
5606e4l3K2N8J50J31k55j61J78j5l33L25J66k07J30k9n5J48j04j30k23J35K05
5628D9L9p2j47K53r2L6k0k55M66k16l4j60J38l1K18J2j21K6m8p0J00k41J52l6
5652e4J76k41M1j10m2N24k40K6K4J3q7K60p7m51J87k77M90n24K58J39P6j82J13
5675D2k82K92K53l22l17J14L97m78K50l36M40J28m87L78j56L9p6jJ90m4p0k45
5697b91J33k1J85K1nN0q8Q2o6j04K08R6j45k16K64O0j29N1k44J11J03j15J77k71
5721a54P6J74j89M3o9K39k73k37N38k12N0M13l65k1j8J32j51k20J46J7J46K49
5743C14m85L63k11J56m24M95j50l04K24k13J93N7L4O6j68m4r5J60J6l02J35K66
5765H3k20o6K97j23M8K65k82j5J01p6J26J26r2k4J57r8j00j56j1q7K55j22pR8
$$ plain form
5606 -54 -87 -65 -7 143 274 19 -142 36 21 -312 13 179 -28 102 73 18 166 62 -68 -291 -156 49
5628 49 88 16 -131 122 30 66 46 -209 257 41 7 -153 -15 -46 172 184 63 89 41 -29 71 -170 -18 -54
5652 -54 122 -119 -78 -188 -230 294 54 80 104 117 30 290 213 -238 -51 -328 162 -362 -104 35 111 -71 42
5675 42 -240 52 305 -17 -334 -220 177 -301 -51 -387 53 181 -306 72 -84 -45 -121 -122 68 24 -46 -291
5697 -291 -158 -179 6 27 22 72 -16 66 0 -104 104 200 55 -161 103 163 34 85 -159 -48 55 -60 117 -154
5721 -154 -78 96 -93 -50 -119 120 -153 -390 148 -64 -14 399 34 13 -5 127 -24 -244 -98 -81 65 314
5743 314 -171 192 -19 137 -287 208 58 -246 -22 -235 -42 15 49 115 -53 -97 -192 -32 -16 -318 -183 83
5765 83 -137 -203 94 -29 19 284 2 -13 88 12 138 264 172 148 305 207 107 -49 -60 -147 108 -14 -21 77
5789G7r3j24Q5J70J20l77m8L4J48J19J71k35J91P3n51K35k45k3L45J2j12K13j26
5812E9m0K24j32J0Q7j4k1j93J6LO5j8J81l30n4K59j72J71j26N3N0q0j99L29j23
5837EO0k17J05m2L90j34K02k20l1j19N3m0J62j12M7K91m01J3J97m69L24n8k72
5860b66K76j10Q6J13l20K69j32k1M24p10N26Kj30K21p8l05J94n8l5L25k80n9k8
5883i6O5j40M90j79j01r4O7n9j22K47j9J3K19r4j62j9o8n4J84k36j06M11M6k14
5907b1P3j20r8L99j68K83j76j14j36J08J18j70j43K88R6l66J16J8K25q5l56L10
5929H1m56K34j30R8K83m24J8K39k0J17j42L3R5N1k67M3j10J42k11M28k74K06p6
5952d2O8K81m20n8M33m03J92J44mL6l11J92j06K4m20N05nml50K34O0o9K74k39
$$ plain form
5789 77 -16 -140 -55 115 235 -142 -190 -156 -8 111 282 47 238 311 -240 -5 -250 -273 72 84 -28 185 59
5812 59 19 243 111 121 208 194 173 -20 -4 -1 64 46 227 -103 -157 102 -70 101 -25 28 78 -2 -201 128 5
5837 5 65 -152 -47 -89 301 167 369 149 118 -1 52 12 174 62 109 400 -1 12 209 -260 64 6 -266
5860 -266 10 -100 -14 99 -221 48 -84 -105 319 -391 135 137 7 228 150 -155 39 -19 -54 271 -9 -68 -96
5883 -96 -31 -171 319 140 39 -55 12 -47 -169 78 59 72 291 197 35 16 -52 -106 78 -158 -264 147 193 -21
5907 -21 52 -68 -166 233 65 348 172 58 -78 30 148 -22 -165 123 219 -147 -31 -13 212 127 -229 81
5929 81 -375 -141 -271 -173 110 -314 -296 -57 -77 40 -102 -69 26 77 -190 -147 -257 -115 -326 102 -172 34 -42
5952 -42 26 307 -113 -171 262 -141 51 195 191 227 -84 108 2 26 -394 111 106 102 -248 -14 46 -23 251 12
5976A2P2j6R1k4k47k09N85k77M4O2o3J10j12J57j77N6j17J56K01q3k40k6m4L28
6000B39j53j0J27n07j9Q9J30M9K07J8m7J02k15J8J78l26k29N28l10j86J61k3L05
6023A26l06J43m86N25l96J57K70l12M5q4J85j21K60j04L67m92J66J6j38J7O1p
6045a08J84l6j16K46k73J59m5p7J12J0R4k1J6Pq1J59j59j36K72l19K0K33m4l3
6069F4q5J64j69l14M92j91K6M8p8J7j71K06j92J91J80o83N05Q8m7l03M92k37k7
6092b4p3O9O1R3J05l09N6k77M52k21L14p25M82J93j66n8Jn8n8L44j92l0o0R4j27
6117a14K9J6K30j30j79J07N2j51J41J48k55r3M3J35Q3j26L73l20K6J35j86n6J55
6140F3J98l68M0k14J04K33k13L43l30J92K85m87M89l62j72K41l9J2m7l5J65K77
$$ plain form
5976 12 84 68 159 135 -112 -321 264 -13 31 93 30 140 28 185 8 64 -53 103 304 221 -19 -45 -89 239
6000 239 86 76 203 -304 -323 -234 -104 -55 152 170 123 225 10 28 206 -120 -349 179 -131 -317 -156 -179 126
6023 126 -180 -37 -523 2 -394 -237 33 -279 -234 -318 -133 -254 6 -98 269 -223 -57 -41 -179 -162 -101 -108
6045 -108 76 40 -76 170 -103 56 11 -66 46 56 150 129 145 152 71 230 71 -65 207 -112 -92 141 97 64
6069 64 -21 143 -26 -340 152 -39 -13 35 -43 -26 -197 9 -183 8 188 -495 10 98 51 -252 240 3 -24
6092 -24 -97 -28 33 126 231 -78 -22 -299 153 -68 246 -479 3 196 30 -28 -27 -85 -143 201 9 -21 -81 13 -114
6117 -114 -85 -69 161 31 -148 -41 11 -140 1 149 -106 -199 -156 -21 62 -64 309 -11 15 150 -36 -92 63
6140 63 261 -107 -67 -281 -177 56 -157 186 -144 48 333 -154 335 -27 -199 42 3 15 -32 -67 98 375
6162C75n84K24O4J24N7k62l4k5K24j07ko4K88k12M8k24J33k03J91j60q3L22j98
6185a08J98lj83j56J24K59K00j20l56k12K43oL29q1r4p1L26j97k27L18O2jk6J5
6209B33l6k27q5J26K9J37j69k03K10K81k76L0l9J82l6j73K77j78r3Q7j4J40p4
6232A29r4p7N3j03K08j74j05L56r2j04N5J54l65J74k71L46M1k31k57L11k20J19
6254a47K77k79k7K08k22J90l55M72m14J07K34K59k81j81N0Q4K94k70M2%Q6p9K60
6277C08k07j54m7N74o01J25M6k48LK21o0J41J6J47l33k32J42PM4j27L05k32J52
6300a0J86k46J33k08L12l83J04M3J5L9J18j02J80k94J9K5Q5Q2k73K3K45j55j32
6323a94J46j85L65j27j5j67R8R3l7J40k91J36pj72M21l15K99m97K30L28k08j9
$$ plain form
6162 375 -209 15 79 203 260 -2 -36 -61 163 56 54 -10 278 66 114 -110 23 -180 11 -149 -232 90 -108
6185 -108 90 87 -96 -252 -128 131 331 211 -145 -357 -114 -120 209 128 34 -37 289 92 -135 183 245 244 218 233
6209 233 197 -30 -115 11 40 177 8 -195 15 296 20 50 11 193 157 -16 261 83 -10 77 63 203 129
6232 129 35 -42 11 -92 116 -58 -163 193 101 -3 52 206 -159 15 -256 90 131 -100 -357 -46 -266 -147
6254 -147 130 -149 -176 32 -190 0 -355 117 -297 -190 44 303 22 -159 -109 -25 269 -1 41 41 127 48 308
6277 308 101 -53 -100 474 -127 -2 44 -204 -201 20 -40 101 117 264 -69 -301 -159 -152 -108 -235 70 -162 -10
6300 -10 176 -70 63 -145 167 -216 -112 -69 -54 -15 103 1 181 -113 -94 -69 16 98 -175 -152 93 -62 -194
6323 -194 -48 -233 132 5 -10 -177 -79 14 -23 117 -174 -38 -45 -217 204 -111 188 -309 -79 249 41 22
6345B2j44L59j14K96o23J83Q8J01j34J22j02JJ9K46l6k9k30l37M57k84J07kr3
6368a27L1r4NK5J00N1k22K32K1K0N6l85K42L3J67k29J05M3j44O0K2P7J8k5l7k22
6394a77l4K33Q3j85J3K07k71M64j08j85j12J23K24l29m7K3J94m42K18P1j34K19
6416D8J02k33J56q6K48k54J02o8J30k6l35K00J73j07k25P5J89k0p0Q2k68M9J37
6439al28M79j10l13L45n4K07l07l0L1kk08M79N1j16nr2j30j40J78k81K48J83n8
6463B6M1J1J83j33j4n7j76K58j11j7M0L09k37j31l4k91L57L0J69L8j17j92l18
6486c66N44M5q7k21J68l42J77k14L56P5kj23L50m77N5o9K52o8M5j15o9L29m01
6509a58K43m65L61Q0k54J5K31k51J25q4j4j59M73o12K03K31J99m16L7R9J72ll02
$$ plain form
6345 22 -122 237 123 419 -204 -21 67 168 34 156 54 55 74 320 284 255 25 -312 145 -139 -32 -34 -127
6368 -127 -96 -190 -185 -160 -60 -9 -231 1 22 42 98 -287 -45 -12 155 -74 31 74 -70 -10 12 89 107 82 45 -177
6394 -177 -211 22 105 -80 -67 140 -131 333 225 40 -72 51 275 -54 -101 -78 116 -326 -108 -37 -171 48
6416 48 150 -83 73 -13 235 -19 83 15 145 119 -216 -16 157 50 -175 -100 89 69 -1 81 -187 -138 -1
6439 -1 -329 150 40 -273 72 18 225 -82 -112 -81 -83 -291 188 239 123 118 26 -104 -244 -66 -347 -99 84 26
6463 26 67 78 261 128 114 57 -119 139 28 11 51 360 123 -8 -42 -333 24 54 223 261 144 -48 -366
6486 -366 178 223 136 -85 83 -259 -82 -296 60 135 133 10 360 -117 -62 -131 121 53 98 -17 -86 243 -158
6509 -158 85 -380 -19 61 -193 -178 53 -198 -73 -157 -171 -330 143 -469 -266 -35 164 -252 -215 -116 56 53 -249
6532b49N61l94J34k50M57j48P7m25J54P6o3J80p9k8j13k51M90P5p4j41O4J42j01
6555I4j06J28J47q3j41j76L35k62J65j66j09M50n25K48O4j71R9K26k85K19k32
6576h1j94J80k02L15l28M34l24J41J29j42Q9p8k63K28m6O2j09K60J36r9O4o3R7
6599B06j80m1k10K01J81j30L3J41l18K51Nk14p5J88k56L41n3J05l7o5l2J30j39
6622C2K98l86M02l56q9K49l30J42K27n27L2M89l08J40M3m9O6k37M04p9j81n8J86
6645A10J23l36Q5j67J89l3q3q0N3o6L20p0l88N59j36l41J78m2j33Q6K36j69k1
6668a26P8L69j77L07o60j6M96J53l71j61J5N4J53j50j8M02p9n66L23j68J21j63
6690a84J99J46n15N76n21L23L5j67L24j83j4K60J27m81K44J73n46J74l11J35J05
$$ plain form
6532 -249 312 -82 52 -198 259 111 188 -237 -83 -7 -70 110 31 3 -110 -361 129 204 130 -11 53 195 94
6555 94 -12 116 263 180 39 -137 198 -64 101 -65 -174 276 -249 -1 63 -108 -9 217 -68 151 -81
6576 -81 -275 -95 -297 18 -310 124 -200 -59 70 -72 17 -61 -324 -96 -142 -80 -189 71 207 108 172 109 206
6599 206 26 -15 -225 -24 157 27 60 201 -117 134 139 -75 -150 38 -218 123 70 175 138 73 41 171 32
6622 32 330 -56 346 -10 -99 150 -180 -38 189 -338 -306 183 -125 15 58 9 75 -162 242 163 -18 -76 110
6645 110 233 -103 -18 -185 4 -29 -112 -192 -139 -205 115 45 -343 216 80 -261 -83 -125 -258 -172 64 -105 -126
6668 -126 -48 321 144 451 -209 -225 271 424 53 -108 -93 -39 114 -36 -54 348 269 -297 26 -142 -21 -184
6690 -184 15 161 -354 222 -299 24 59 -108 216 33 19 279 406 -75 169 342 -204 -30 -341 -206 -101
6711a01R0M9N0n3P9j22K46J5m46J03M7L88l66M9k60L2K55k3L5L1m39L20J82k60
6735i9J3L18l24j88J77J71k03N7J13p2l7K95l85R3L9K69l80R6L28k81j83L46j00
6758F3j35p1OM13m76J26K0M16k79n9n5l4r4M54j72j15J97qm95M16J66m32q6J66
6782f8P3J0K08l00k2N4J81k20m9J40M5n8q2J09j0MR1k34L8J97l48J98m7j35L17
6807I2j6j89L07k97K88l28K93j96M6J18q2r5J67k34K77m09j80M06j41M71k58P8
6829A18k95L28k08K05k4k12J10L53l18k02L62l19k3j58M30N6l13J73j93K65j6
6850A19K5Nj84L6j34J93j03J28k73J12n9L22r4k59P2L72l40j85L92K0l71J03l5
6873a38K62k49K75n05J45M64l60L11q2l93K96K97k69Pmm5O7j20R5k09K1P5M0P4
$$ plain form
6711 -101 -11 38 88 35 114 -8 238 253 -193 -90 -43 345 -21 28 -232 -200 55 32 67 98 -341 -21 161 -99
6735 -99 -86 232 -92 -280 -103 68 -135 -78 35 -37 -74 221 -164 -71 -32 237 -143 -47 281 0 -183 163 63
6758 63 -72 -143 -137 276 -200 -74 -54 362 83 24 -31 -65 -159 295 123 8 205 197 -298 118 284 -148 -234 -68
6782 -68 5 15 223 -77 -99 -45 136 -84 -133 7 52 -6 -88 21 11 15 106 -128 -90 107 -241 -43 -90 -225 92
6807 92 76 -113 194 -103 185 -143 150 -46 0 118 36 -59 108 -126 151 -258 -438 -32 -173 298 40 118
6829 118 -177 151 -57 148 124 -88 22 375 57 -145 217 -102 -125 -283 147 203 -110 63 -130 135 119
6850 119 144 149 -35 1 -133 60 -43 85 -188 -76 -135 187 93 -166 -94 278 -62 -247 145 165 -206 -103 -138
6873 -138 124 -125 150 -355 -210 254 -106 205 123 -270 26 323 54 61 57 12 79 -41 54 -155 -134 -59 -19 55
6897E5j4j24J61j48K29l19J76k00j22K19r0K77j92j43N04m71L17j32J36j12O0
6918F7k71M95m27L69l39J07k5j73M26l07N0P4k80J00r3M18j81J70r8N3j86J87
6940A36l3k01j0q6J22j2J10l9j06O7l5J97k29J48O7J56k58Q1j26R0r9J65Q8m3
6964A50l09K18l41K40J76P5j11m5J80k32n8L28m02k2P1J96j74j51J99J49L7k27
6986e3J94j31M4j28j70J29J89o4j2k98L04m5l4m09L25R9o6K10L3j60J99k26N7
7009a3r4O3K1k79K3K64J90j30K73j46q8k43L59p3J52l10j26K80k68K10j09P3M39
7032D68l88J12N3m24K4j26K20j04L73k76r8J64j65j7N8N73m38j17K27j85K43j40
7054C7kp4J67j87K37k16K13r8J01o6k12J92j14K23j78j63r3J35J43k20L84l0j44
$$ plain form
6897 55 41 -83 78 -70 159 -160 16 -184 -306 -87 -177 100 -92 -235 269 -202 115 -17 119 7 67
6918 67 -204 291 -136 233 -106 1 -24 -197 229 -78 -28 46 -234 -134 -227 191 10 180 82 135 -51 136
6940 136 103 -98 -108 -194 -72 -84 26 -13 -119 -52 -87 110 -119 29 96 252 -6 75 -51 39 -60 105 193 150
6964 150 -159 59 -282 -42 134 209 98 53 233 1 -57 271 -131 -153 -82 114 -60 -211 -12 137 174 -53
6986 -53 141 10 54 -74 -244 -115 74 10 -2 -300 4 -41 -75 -484 -159 -60 -126 84 117 -43 156 -70 -13
7009 -13 -107 -44 -23 -302 -279 -15 175 45 318 172 84 -159 200 127 279 -31 -157 123 -145 65 -44 29 468
7032 468 80 192 245 -179 -155 -281 -61 -165 208 -68 -166 -2 -167 -184 -126 447 9 -108 119 -66 177 37
7054 37 35 -39 128 -59 178 -38 175 77 178 112 -100 92 -22 201 23 -140 -233 -98 45 -175 209 179 35
7077C5l06L12j58j62K03J41j5L06l24k06J81j68K5K42j5j34o9J60k08K15m08L77
7099B4J04j66q6J34J45J81l10P4j42j36L12l50K9K93j72K10J30l72R2k04K00K41
7121B31j05j88q1K87j11j90K33J46m07O7k2J78R5j18J5O9j86k4o1J22J06k75M82
7144B63k55p3R8k52Q6N0O4Pj4J94l8j11j14n1l3J72l90N83j96L8K56rn80J57L82
7169B34o0k56J24J20j6K96n47k9J98J65j57q3J64n33M5J18L37P1k22j16J55J28
7191A36l0j56J25L1j6O1j58l50N49ol0j82L1O8l91M50k50M98n39j2J88J33n3j62
7215f5J3k46J46K61j64M3R2L0k39J13o2Q3J96k69J37k40rrJ62pL12k31j21J05
7239C1J98q4m62K14J93j79J77n5o4M9j64K11nJ61j48L0O4j62k36Q6O0J97k06J9
$$ plain form
7077 35 -271 41 -117 -279 -76 65 50 356 32 -174 7 -161 -136 106 91 -43 -112 48 -160 55 -353 24
7099 24 128 -38 -124 10 155 336 26 100 -42 -178 134 -216 -187 106 -66 144 274 -98 -6 -210 -10 231
7121 231 126 -62 -143 144 33 -157 76 222 -185 -118 -140 38 133 15 30 99 -87 -111 -172 -50 56 -219 263
7144 263 8 -65 33 -219 -133 -83 -19 -12 -26 168 130 19 -95 -146 -179 -7 -397 186 -10 28 284 275 -305 -148 234
7169 234 174 -82 42 162 146 442 -105 -134 64 229 72 -11 153 -380 -335 -217 120 191 -31 -147 8 136
7191 136 106 -50 75 106 90 151 -7 -357 192 186 156 -26 5 73 -318 132 -118 380 -159 -171 17 150 97 -65
7215 -65 -52 -298 -152 109 -55 -12 80 110 -129 -16 -78 5 201 -68 69 -171 -180 -189 -27 -34 278 47 -74 31
7239 31 229 145 -317 -103 90 -89 88 33 -31 18 -146 65 60 221 73 103 167 5 -231 -145 -85 112 -94 -75
7263g5K64P2k62q5j57K69Q5j33Pj71K65j36j39j4K83m77L75l3L5K15j59j75J72
7286B6J3j15J34j74K24P9k79L67r5l8K53l71j03Mj48J02p6K40j62j69K71j53K43
7309G3j26r1K62O7L4j48m5j9L32m77L62k15l7K69k10J8k2J31k49M19l58R5K80
7332C45q5k12j83P5l34L93pP6Kj31O7J14l6M2o7J1j20JK4l2L64k15j76m1p0K29
7358C4J0J11J54l83PR3k66J32J12l04K19K53k39P0p1r7N9L58k54J29j47J91o6
7381A05o9j13Q8J03m1j04J56L57o26L70j99j71K58l41K93J06k7rk07R9j69K88
7403A47l48M75k50j42J01l74K50K93J1Q0k45k97K04j3L48l16j60P8n2j2M76m45
7425a91j03N39m46K6K67k20J82k52K74r5J14R7j73J20n0r3L2q6O4l6L13j48k91
$$ plain form
7263 -75 189 261 -1 -86 -243 26 111 -22 -15 -186 79 -57 -196 -210 73 -404 -29 -62 -27 188 29 -146 26
7286 26 39 -76 58 -116 108 187 -92 275 180 142 395 24 -79 -75 -223 -121 -197 43 -119 -288 -17 -170 73
7309 73 -53 -144 118 185 219 71 26 7 339 -138 224 9 -28 241 31 49 27 158 -91 328 -30 65 345
7332 345 260 48 -135 -60 -394 -1 -8 68 70 -61 6 120 84 126 59 70 -50 -49 -25 -57 307 92 -84 -125 -195 34
7358 34 44 155 309 -74 -67 26 -240 -108 4 -300 -81 172 -67 3 -68 -165 -106 252 -2 127 -20 171 105
7381 105 36 -77 11 114 73 -31 125 482 -144 226 27 -144 114 -227 66 172 145 136 -71 28 -141 147
7403 147 -201 274 24 -118 -17 -391 -141 152 163 243 -2 -299 -95 -108 240 -76 -236 -158 -210 -222 254 -191
7425 -191 -294 245 -201 -175 92 -128 54 -198 76 -19 95 192 19 139 89 -4 28 -58 6 -30 283 135 -156
7448a56N40l06J5j21k09K99K53l47j6J65k53L22j99J35j0j58j80M15j09r7J60
7469A43M1m38J0M47k46P1j34j1K00Q4j23J06k55j25K78n5j74L8P0L3J92k51L99
7492C00o8l4k18j13j3K63k3j83L4p6K51l9j3O2k6K43k11P5j79NJ4q0p6J64n5m1
7518c7L59l08J82k56P2P9J30l95J99l8J3j91L37k48M8K2j17J34J47j01K5M3m23
7541c24K39K34j97nK61j48J76m16K67K45k13P8k14J15o4j20R8j56K62k32K2L9
7563e3L1n0j88M11j17J80j57k24J37j28L57J75k21j93o7J52k1J51n33J21N08l27
7585e6M3k24J97O2%j78J71m4K88l44QN1j47m9K57j6m8J87k01m9n2q1L13P0k3m05
7611b70M61m79M5K05Q7K34j21J70n90L52J85j37R3m6k60Q8j81J99K78j98kj36
$$ plain form
7448 -156 384 78 93 -28 -237 62 315 -32 -48 117 -136 186 -13 122 112 -46 -226 189 80 -17 143
7469 143 184 -254 -244 203 -43 28 -106 -117 83 167 44 150 -105 -230 48 -7 -181 -143 -73 -40 152 -99 300
7492 300 232 198 -20 -133 -146 117 94 -89 -55 -131 120 81 68 130 104 347 136 211 32 37 51 -29 -105 59 4 -37
7518 -37 322 14 196 -60 12 91 221 -174 25 -13 0 -191 146 -102 -54 -32 -149 -15 132 31 56 99 -324
7541 -324 -85 149 -48 -53 208 60 236 -180 87 332 119 197 -17 98 34 -86 12 -144 118 -114 -92 -53
7563 -53 -22 -72 -260 151 34 214 57 -167 -30 -158 199 374 153 -40 -107 45 24 175 -358 -237 271 -56
7585 -56 -13 -237 -40 22 22 -156 15 -29 259 -85 -77 -26 -173 -222 35 19 -29 158 -43 -92 -144 -225 88 158 135 -270
7611 -270 191 -288 -243 -38 49 283 162 332 -258 94 279 142 235 189 -71 17 -164 35 313 115 113 -23
7633b3j58K12m2R6r4J93L8m12j3K75j74l1q5L44k24R9N7l69O85n22j31L83o2J13
7657A55j34l1k1p7k42O20m86k13L79J09k6J63p4k11K04j78J60l74M72O5p87N13
7679a4k09Q5L13k38NP0P1k54K7L08k56J77j76L78m55M36l00Q9k33O6n9K58J42
7702B31n75N26k99r5M68J2j30k14M5j2o4J50L4k04K83j43j0J16k16P7o6J60m05
7725c31K90M61m27j91J67k32L09kQ6J6k97K86K0j38L8k54J38M0J78l64KoJ01Q8
7749b2L71k46l34L93r4n4k11j22M98r3K63k09q9n6q1k27L97j4j86O9n1J01j75
7772a72K96j29K03j63PL1L4k06J44J99m14L11K9j06l7Pj62J0K38j38K37m2l23
7795a46PK48l32J97P8K35Kk02j98J6J36l11K40o2jM7R7P0O8k66J11OR0n5k23J37
$$ plain form
7633 -23 -181 31 -11 85 -9 184 222 -190 -203 72 -102 -133 -218 126 -98 1 58 -311 374 -148 -279 104 42 155
7657 155 21 -10 -31 -108 -350 270 -216 -429 -50 59 33 196 122 -89 115 -63 97 -277 195 260 -527 -14
7679 -14 -223 -138 175 -63 -58 12 83 -171 -144 164 -92 85 -91 287 -168 268 -32 57 -176 -110 -169 89 231
7702 231 -344 182 -117 -212 256 268 138 -76 -31 -43 -107 43 77 -127 156 13 3 119 -97 -20 -86 74 -331
7725 -331 -41 420 -7 -198 -31 -263 46 44 130 146 -151 135 155 17 55 -199 -61 -21 157 -207 -205 -211 -110 -22
7749 -22 349 103 -231 162 68 14 -197 -319 179 86 349 140 51 -5 -86 -313 84 70 -116 -47 -98 3 -172
7772 -172 124 -5 198 35 42 73 107 -99 45 244 -170 141 170 64 27 34 -128 -118 120 -18 219 177 -146
7795 -146 -139 109 -223 -26 52 287 289 87 -111 -95 41 -270 -30 -92 -93 -46 51 121 189 -77 34 40 130 75 -148 -11
7821a1p1R7n08O59Q2l00J06onl00J86K58j27l21L17N2k08K36k29J05J42j45l5
7844b6n7M8PJ63m7j92k72O68l76K8j20K84p7K7j42PJ47l46L5K32n2k00M27j81
7868a5j2J47Q6l65K78j56j19p0J22J86Qn6k86N3L98k02k44K60J52j14N2j78m7
7891a22L10k78J33J96l62O8J39j89K27l37jK23l7J71n0K5l14J99J68k06J31j65
7913g1k24J04qK95j27J55r8K25n0l35O2j13O2L09j44j85R5K50k27j74L77j13L32
7936C97n98m5K58k2nJ50%j32K2K6k86N24k38Jl76K71K79l24R6J18J2m4j84L69
7960B69r3nl42J5K33j41J7P2J10L3k50L5L9M6j81m8K22J8Q1p0L3j4Q8k61J95o2
7986C9o0q8M5J12%r0qK17j31j33J57J23l07M2K42j63mj78J14rj8P2j00J19J22
$$ plain form
7821 -11 -82 15 -493 166 248 -52 54 48 43 -257 -71 187 60 -261 56 108 -100 136 -93 12 154 9 -26
7844 -26 -83 -35 -28 135 88 -104 -376 292 -84 -56 -176 108 31 58 -84 -77 70 -276 -241 -9 -61 -261 166 -15
7868 -15 -27 120 206 -159 119 -37 -156 -226 -104 82 90 34 -252 -199 199 -3 -247 13 165 51 103 -75 -122
7891 -122 188 -90 43 239 -123 -55 84 -105 122 -215 -216 7 -30 141 91 116 -198 1 169 -37 94 -71
7913 -71 -295 -191 -199 96 -31 124 26 251 201 -134 -72 -185 -123 186 42 -143 -48 202 -25 -199 178 65 397
7936 397 -201 -246 12 -10 -15 135 135 3 25 51 -235 289 51 52 -324 -53 226 -98 -2 116 128 84 -100 269
7960 269 176 171 -171 -156 77 -64 -47 25 135 168 -82 -47 -8 38 -143 -191 31 49 130 60 93 79 167 -94 101 39
7986 39 -21 -109 -64 48 48 -42 -50 167 36 -97 60 183 -124 -82 160 -3 -7 -185 -71 -80 -98 -26 -126 -7 115
8011A15k36K07j82J04l7J1m0K62m9k17J35k24N3j06K09J49m23M02J03j56k19K7
8033a12k8Q2Q8qJ36m4J9M5K02J72n22k46J36K04j40k65M46n9K0J60l23oK1J99
8057A77J54n49K10J57p6j10Ll2K41P3k35l11L07J02J2j43R5j23K46j86Q6m8L3
8080H3J9j07J22k26Q6L2r9J35j97K51p3R1o9Q5r8k23L99j99K0LO6J6k73L81l38
8105a13J40L27m37O1m6j21K36M1ol03L70j80J04k62l7K71l3q1L99l07j12J21N5
8128H7o4p5q5J48J16j65k22K13J59q4k4j48O3N4M9O8j94p8K40j02J16j36k35L83
8152H4J74l62J57j02L41j53K05l41j62K39j47r9k05L13j61J99k5J4m5P3k68L23
8174E2N0J15j70j1o6l2k6K76N0k43J8o9j98K85J30j96j7
$$ plain form
8011 115 -121 86 -96 8 -29 -18 -58 204 155 -62 73 -151 -98 -204 5 154 -269 133 236 80 -139 -112
8033 -112 -140 -58 30 22 158 114 133 178 380 552 30 -216 -80 124 -16 -281 165 106 126 286 -37 -43 -22 177
8057 177 331 -218 -8 149 73 -37 -34 -66 175 248 13 -298 9 111 123 -20 75 -48 198 12 98 50 83
8080 83 102 -5 117 -109 -23 9 -90 45 -152 99 26 117 48 133 35 -188 211 12 32 35 101 117 -156 225 -113
8105 -113 27 354 -83 -22 -68 -189 47 88 82 -221 149 -31 73 -189 -226 45 12 -69 330 23 -89 32 87
8128 87 23 -52 -137 11 127 -38 -260 -47 112 28 4 -144 -81 -27 22 90 -104 -182 58 -44 72 -64 -299 84
8152 84 258 -104 53 -49 292 139 344 3 -159 80 -67 -166 -371 -58 -219 -20 -45 -31 -76 -3 -271 52
8174 52 102 217 47 36 -30 -62 -88 188 238 -5 13 -56 -254 31 161 -35 -52
8191e2
$$ Imaginary data points
##PAGE= N=2
##DATA TABLE= (X++(I..I)), XYDATA
0@%%%%%%qRrJ6j6J7k5L2m0M9n8P3q8J04j21J40j64J91k19K51k86L26l71M20m73
31b50N32n96O68p47Q31r24J027j140J266j404J553j719J903k108K338k597K892
48A525l228L615m072M618n283O114p188Q640j0727J4000j9931L4162j32989j97205
62c07949L3931k0678J067j2353j2101m0095p411m348K7902M9092M0865M817J4435
75b32826J1468K1391M7469N7314L7230M2831K0705j2162P269M8935L7973K6996
87A14593K1772k610j6455k310J877J6589K8937K440k4699j7936k0748j6329J0647
100I5768J1317r672r638k3564m4616j9530J1567L712l317q457k9607k9649j0225
113f5911k642J4226K2253m664j8597m552n721L633L4027K9375O322P111n83j2005
$$ plain form
0 0 0 0 0 0 0 0 -8 1 -8 8 -8 9 -16 16 -24 25 -33 40 -48 56 -65 75 -89 102 -117 134 -152 174 -197 223 -250
31 -250 282 -314 354 -393 438 -486 541 -599 667 -737 816 -903 1000 -1108 1230 -1367 1525
48 1525 -1703 1912 -2160 2458 -2825 3289 -3899 4741 -5986 8014 -11917 22245 -110744 -307949
62 -307949 -274018 -294696 -293629 -305982 -318083 -358178 -365589 -369937 -342035 -292943 -252078 -247261 -232826
75 -232826 -221358 -199967 -152498 -95184 -57954 -15123 5582 -6580 689 49624 87597 114593
87 114593 136365 133755 117300 114990 116867 133456 162393 164833 140134 122198 101450 85121 95768
100 95768 107085 97413 87775 64211 19595 65 11632 15344 12027 3570 -26037 -55686 -65911
113 -65911 -68553 -54327 -32074 -36738 -55335 -59887 -65608 -61975 -27948 1427 7749 14860 14277 2272
127B272J1422L1518K0909J4488J415k1321j6438P30L146J0581Q713k0722k9106
140A7607j8085k1986j0545J5709K844k0341j5597j7600j9760L948J8038J0546
152e5222J0084k216j9747l171J7956J6940K2136J8882n671q914K338j572J1344
165C167K9312Q997j2937q185r738q993Q328J2008N164K385j4147k6220m356J1403
179c812O329R939N490j6045j4531k481k976J1100K3142L67j6477p063o715l214
193a6947J2513J2405N124K186j3842j9388N538J6277P095J0852M671j4174r407
206B903J926K946J5647J9321n122j5129m852o712j388J2809N876k104n716j9910
220D95j8810M866P835j778K688m693k0724j1362R85J889J3568J1745r313j0411
$$ plain form
127 2272 13694 45212 66121 80609 82024 60703 44265 44995 48141 58722 67435 46713 17607
140 17607 -478 -22464 -33009 -17300 -14456 -34797 -50394 -67994 -87754 -83806 -65768 -55222
152 -55222 -45138 -47354 -67101 -70272 -52316 -35376 -13240 5642 -29 -8943 -6605 -8177 3167
165 3167 32479 41476 28539 20354 10616 1623 9951 21959 27123 29508 15361 -10859 -15215 -3812
179 -3812 2517 12456 17946 1901 -12630 -15111 -18087 -6987 16155 16522 45 -7018 -13733 -16947
193 -16947 -4434 7971 13095 15281 1439 -17949 -12411 3866 10961 21813 26484 12310 2903
206 2903 4829 7775 23422 42743 37621 22492 17640 10928 9540 22349 28225 26121 20405 495
220 495 -18315 -13449 -5614 -7392 -4704 -9397 -30121 -41483 -40498 -38609 -25041 -13296 -22609 -33020
234c3020K98j811O401K0405J0383J339Q80q952m937J5947J3721M095Q654k007
248C1396j5952m621N827M775J0750M092j3827j1144m046p607L026J3209p10r292
262E876p316j3307o059J0204N197j183L616p970j6648j883P359M949R236K080
276e849j2063n452K88k787R629J5802m68o117k044n948J403J4187O795K432N528
291A5336p009j1786N757R458L602Q077j26j1115m014l69l250R033J0208p281q949
306G572l939p230n27R421J435j523K26j1211j0070O857O231J370O107j824j0074
321g179j751J670O66J0880Q513p155m932K98m876L819J0426J770j012l24j0038
336G75n797Q778L747r36M320m061j1191j851O14J85Q083J743r962l858q26n662
$$ plain form
234 -33020 -32722 -34533 -28132 -7727 2656 3995 4875 -4077 -9014 6933 20654 24749 33403 31396
248 31396 15444 10823 16650 21425 32175 36267 22440 11296 7250 -357 2669 15878 15168 5876
262 5876 -1440 -14747 -20806 -10602 -5405 -6588 -2972 -10942 -27590 -29473 -22114 -17165 -7929 -5849
276 -5849 -17912 -23364 -23076 -25863 -16234 -432 -900 -7017 -9061 -15009 -13606 581 7376 9808 15336
291 15336 8327 -3459 2298 11756 15358 23435 23309 12194 8180 7811 4561 13594 23802 16521 7572
306 7572 3633 -3597 -4124 5297 6732 5209 5435 -5776 -15846 -8989 -2758 -1388 4719 2895 -7179
321 -7179 -8930 -7260 -6594 4286 12799 5644 712 1010 -3866 -47 10379 12149 11137 10813 775
336 775 -5022 3756 7503 6567 10887 6826 -4365 -6216 -5602 -5417 2666 4409 -5553 -9411 -10237 -15899
352a5899L301Q991r89k309j179q316j443R502K825l60N558k479q215K016L984
367e012L431Q099P16o719J163O32m230O197Q889k147k954r18o203O34P579q23
383H334r73M186o335p957K302K481O51M250k377p565J341j271m589O077O671n152
399G4l023l59m542J767N999k029P54L538o580m943N326K497k50M169k395m783
415d780K784p06l612P828M818o063j264J566k940K107M616j929J181K642o210
430C8k833O144N73j113L013k895l666K613k137k101O201J731o571N16J082l122
446b527K023L088k514J690J577o237k68O375j743j141L265k277k717L118j354
461C58j446N375o70n288K613R49l505K438K032k810K026N91n028J799M932l736
$$ plain form
352 -15899 -12598 -3607 -4596 -6905 -8084 -16400 -17843 -8341 -5516 -5876 -318 -2797 -11012 -8996 -5012
367 -5012 -1581 6518 7234 515 1678 2310 -1920 4277 13166 11019 8065 7147 944 1578 9157 8334
383 8334 7361 11547 5212 -2745 -443 2038 2689 6939 4562 -3003 -1662 -2933 -7522 -1445 5226 74
399 74 -2949 -3308 -7850 -6083 -84 -2113 -1359 2179 -4401 -9344 -4018 -1521 -1771 2398 3 -4780
415 -4780 -1996 -2702 -6314 1514 6332 269 -995 571 -2369 -262 4354 2425 3606 6248 38
430 38 -2795 3349 3922 2809 5822 2927 -739 1874 -263 -2364 3837 5568 -1003 -487 595 -2527
446 -2527 -504 2584 70 1760 3337 -2900 -3168 3207 1464 323 3588 1311 -1406 1712 358
461 358 -1088 4287 3617 -1671 942 1891 -1614 824 2856 46 2072 2663 -2365 -566 4366 630
477F30j021M669l036k361K840j635j421L406k647l688L280p23m670K548K71l709
493g267J347K93m371K520K626n397O97N149l059p19L929q86l51L155j344m01N724
510A645j725l311M164P88l881L083J677l446K327O73n015J894M060l438k46L737
526B986k217j265K962j086K167N181k237k325N260L48k599N110L243k307J520
541A4741j8l635L600L096l967R87J914m621k327J075k130J210K122o127l977K367
557D310l869m326L503k93n425j857l601n013J975K1m991K35n18o453j696K163
573b5835j255K291K795m154r09M634m24P72R607L654j566K710J782J944P686M373
589H105J029N314R45l855K994M889l7K652J794n478k206J594l623k98N295k222
$$ plain form
477 630 -391 4278 1242 -1119 1721 86 -1335 2071 -576 -4264 -984 -1707 -6377 -3829 -3558 -7267
493 -7267 -5920 -5627 -9998 -7478 -4852 -10249 -9552 -4403 -7462 -8181 -4252 -5138 -5489 -2334 -3678 -4079 1645
510 1645 -80 -3391 773 1561 -2320 763 2440 -1006 1321 1994 -3021 -1127 2933 -505 -751 2986
526 2986 769 -496 2466 1380 3547 8728 6491 4166 9426 9774 7175 12285 15528 13221 14741
541 14741 14723 11088 14688 17784 13817 14804 16718 12097 9770 10845 8715 9925 12047 5920 1943 4310
557 4310 441 -3885 -382 -675 -6100 -7957 -11558 -16571 -14596 -14575 -19566 -19331 -19849 -26302 -27998 -25835
573 -25835 -27090 -24799 -22004 -26158 -27067 -22433 -22857 -22085 -12478 -8824 -10390 -7680 -5898 -3954 3732 8105
589 8105 9134 14448 15393 11538 14532 19421 19384 22036 23830 18352 16146 17740 14117 13819 19114 16892
605A6892o066k176k718j905L603l22k277J399m308o822K530L955k065J472O01
620A793n962k036J345j749K168N788l429m494l92j414Q44N506J290r5J741l910
636c006m048O550N055j082K791J446n835q65J996l70L517K941n227n024j122l128
652e411n29M234p55l175j510o467l846O834L156k193K599j75n298L31M339K773
668e093N667L082l881j572J861j552L577O894m78k446j578n676j445P056J607
683F023k233J297k962o573N94M034K026L484K25m643q70N29j187N289O673j674
699A0032l123j466m747K78P072R88k420M20n319o848J546L808N53J573k603n659
715e915p17j76j323O108N518m009l244k27l609J920P340J304j347o33n355m978
$$ plain form
605 16892 10826 8650 5932 4027 7630 7308 5031 6430 2122 -4700 -2170 1785 -280 1192 1793
620 1793 -4169 -6205 -4860 -6609 -4441 1347 -2082 -6576 -6968 -8382 -7538 -2032 -742 -837 904 -3006
636 -3006 -7054 -504 4551 3469 6260 7706 1871 1006 3002 2632 6149 9090 3863 -1161 -2283 -5411
652 -5411 -5940 -1706 -2461 -5636 -7146 -13613 -17459 -10625 -7469 -9662 -7063 -7238 -12536 -12205 -7866 -5093
668 -5093 574 3656 -225 -1797 64 -1488 2089 8983 8505 6059 4481 -1195 -2640 4416 6023
683 6023 3790 5087 2125 -4448 -3854 180 2206 5690 5915 1272 402 931 -256 5033 11706 10032
699 10032 6909 5443 696 974 8046 9034 6614 7034 1715 -5133 -3587 221 774 2347 -256 -5915
715 -5915 -6632 -6808 -8131 -2023 3495 -514 -3758 -3985 -7594 -5674 1666 2970 1623 990 -4365 -9343
731i343M064M354Q3J205l393n395k63Q9L35P154M160n082k418J654j373M106Q758
748H695K834j15k3m757n42P329M606J007P44m236o338K1n67m59N134j106r451
765B776n087k363l893R14M304j590m047m362o909k73O068K607J93Q18m953m021
781a9818K572K388L070O926J4o282m79K197q53N194P367j69j999k401l218L731
797a760P775K781J587J189m835l059M603L125L546M805k703o801n50J49j302M762
813A3312L530m137n051m626m614K390M689o67o47k126p969l074M141L654K302
828A107L055l676n686Q68J460J512O487L402l735l164l048j331M128M433o76m59
844D677l173q069k497M985J905O2N82n495o647L25L73K244N126p8n129k790j438
$$ plain form
731 -9343 -5279 -925 -842 363 -3030 -8425 -8688 -8599 -8264 -1110 3050 -2032 -4450 -2796 -4169 -63 8695
748 8695 11529 11414 11391 6634 6092 13421 18027 19034 19778 15542 9204 9225 8658 8199 13333 12227 2776
765 2776 -2311 -4674 -8567 -7653 -3349 -4939 -8986 -13348 -20257 -20530 -14462 -11855 -11662 -10844 -15797 -19818
781 -19818 -17246 -14858 -11788 -4862 -4848 -11130 -11609 -9412 -10265 -5071 2296 2127 128 -2273 -5491 -1760
797 -1760 6015 8796 10383 11572 6737 3678 8281 11406 14952 19757 17054 10253 9703 9852 8550 13312
813 13312 16842 12705 7654 3028 -1586 804 5493 4826 4179 2053 -5916 -8990 -4849 -1195 1107
828 1107 4162 486 -5200 -4332 -2872 -1360 5127 8529 4794 1630 -1418 -2749 1379 5812 5136 4677
844 4677 1504 -6565 -9062 -4077 -2172 -2110 -1528 -7023 -13670 -13345 -12972 -10728 -5602 -5680 -10809 -13599 -15037
861a5037q2N607M740k28M71k156o349J947P504L175J549J168m178l397K280K337
877f49M239O010j184m782n53n85J188O494L807j361o19l044n506L454O992J063
893A4964M2j102n689m135J327J706L150K740m649o640j184k051j11N226J365l863
909A096k732m236m788L760N442q58p93j147o079k437K200L457L646J743n034m089
925a0849P28k34J962O190K103l466j464k826j140O124N079l8P18j384m893j15
941c505M757L474L785L34n491k667J241o98K316O283o31n447k500k403r09M855
957B794K707j401j068l034n959P11L927K210J926q60n839k047J366n6L197N603
973D177k218n101o20j492R73N842K312q32n94l314l838K915N260J180J434q94
$$ plain form
861 -15037 -15119 -9512 -4772 -5000 -4529 -6685 -13034 -11087 -3583 -408 1141 2309 -1869 -5266 -2986 -649
877 -649 3590 9600 8416 3634 3081 2496 3684 10178 13985 12624 12005 8961 3455 6909 13901 14964
893 14964 15006 13904 8215 4080 5407 7113 10263 13003 8354 1714 530 -1521 -1632 3594 4959 1096
909 1096 -1636 -5872 -10660 -6900 -1458 -2316 -3109 -4256 -10335 -12772 -10572 -7115 -3469 -1726 -6760 -10849
925 -10849 -10121 -10355 -8393 -2203 -100 -3566 -5030 -7856 -8996 -2872 2207 2169 2887 1503 -3390 -3505
941 -3505 1252 4726 8511 8845 3354 687 1928 1230 3546 9829 9198 3751 1251 -1152 -2061 2794
957 2794 5501 4100 3032 -2 -5961 -5250 -1323 887 2813 1953 -3886 -5933 -4567 -4623 -1426 4177
973 4177 1959 -3142 -3762 -5254 -4281 1561 3873 3041 2447 -867 -4705 -1790 3470 4650 6084 5190
989E190n537j303K116J94L917L803m016n265p49l47P35M546J001k320j530m210
1005c775k910L914L862j72P70j586n400o75K676J224L974K601n014l581Q81j09
1021c320K056M516P99k408j871l459j171N179K910j087N87k091n254J98L340J217
1037A41K931R85n292k424J395k0K819M499n99k671j256k939K76N672J395j520
1053C392Q22k983m838J036L472R53J995j331n408j147R79n75K449L336j705l055
1069b608j480j491J425N407M77j130O63k719l628L241L675J020J632j477m355
1084a348r2J325k62L621K632l705k856r29j247J813L834j50j470N4l501k271L526
1101a026K915Q3J002k158l808M71J418K73L399J675m646k313N08j054J862L731
$$ plain form
989 5190 -347 -1650 466 660 4577 8380 4364 -901 -1650 -1997 -1262 3284 4285 1965 435 -3775
1005 -3775 -6685 -2771 1091 919 1689 103 -5297 -5972 -3296 -2072 1902 4503 -511 -4092 -3211 -3320
1021 -3320 -1264 3252 4051 1643 -228 -3687 -4858 321 3231 2144 2731 640 -4614 -4416 -1076 141
1037 141 3072 4057 -1235 -3659 -2264 -2284 535 5034 4435 1764 508 -2431 -2155 3517 4912 3392
1053 3392 4214 1231 -3607 -2571 901 1854 3849 2518 -2890 -4037 -3058 -3633 -1184 2152 447 -2608
1069 -2608 -4088 -5579 -4154 1253 1730 600 1263 -1456 -5084 -1843 1832 2852 4484 3007 -1348
1084 -1348 -1440 -115 -377 3244 5876 2171 -685 -1614 -2861 -1048 2786 2636 1166 1220 -2281 -4552 -1026
1101 -1026 1889 1972 2974 816 -2992 -2521 -1103 -830 2569 4244 -402 -2715 -2207 -3261 -1399 2332
1117B332j015j329j05m089l78M542J891m99P96j911k724J463J276J042L667L62
1133E321m571j246J079n34J717K862j269j916o68l755L66L783J79r33L09k274
1149a550l248J792J414O90K950p90l971L39J510m67K395K619j433r59j105k434
1165b248J588M120r12j137P69l293k658J846Q88J78J798k405l596J092M35n33
1181d068K514K194k519r91k60j199K792L675j238l68J027k129j408L067J258P63
1197C110P75j878k766J559K19n59K752R70l230q87j31j139K640K110j622k84N14
1214B153k958OL267M41n20Q61k139k045J556j43n51K464l46l828j54M16j633K475
1232f78R94k069M44Q8l600J184L444m22k38P96j336r50J663J33K96K864p34k882
$$ plain form
1117 2332 1317 -12 -117 -4206 -4584 -42 1849 1350 2146 235 -2489 -1026 250 1292 4959 5321
1133 5321 750 -496 583 49 1766 4628 3359 1443 775 -2980 -2614 1169 1348 415 724 -1550
1149 -1550 -4798 -3006 -1592 -902 2048 1258 -2713 -2374 -864 -1331 1064 3683 2250 1291 186 -2248
1165 -2248 -660 3460 2548 1411 2180 -1113 -3771 -1925 -1037 -859 939 -1466 -5062 -3970 -3535 -4068
1181 -4068 -1554 640 -1879 -2870 -3130 -4329 -1537 2138 900 532 1559 -570 -1978 1089 2347 3110
1197 3110 3885 2007 -759 800 1019 460 3212 4182 952 65 -66 -1205 1435 3545 1923 1639 2153
1214 2153 -805 -799 2468 2909 2389 3250 1111 -934 622 479 -72 2392 2046 -1782 -1936 -1520 -3153 -678
1232 -678 316 -1753 -1309 -1221 -4821 -3637 -193 -615 -853 -57 -1393 -2343 -680 -547 -251 2613 1879 -1003
1250a003J003M05p78J758R77j542L97p09k689J340L028j341n88J036j895p51J496
1267A44j13K91K309k053j960J462j03r96J703L38j659M19q37k403J970J783k475
1284b180P5R78k200n93J673J75N3J360j923n80K032J56p42K317M29j221J293l36
1302G66o37K259J262j766O04J547k405n6J856j95k29P13k067j85J686j222r56
1319I75K458q42j675P66q6j378K122N91k273J560J28k159M93J177j203k55M19
1336H18k073N24P86k366l51J824j697k032J223l72j545J274m04j431J636L8j947
1353f095J145J707r80R01N77p13J243J598j398J048K579j318m88K825r9r26J106
1370B712L35n27J824k12j389J333M09j591M60Q17j657M86M45k442M21J218k534
$$ plain form
1250 -1003 0 405 -373 1385 2362 820 1217 508 -2181 -841 2187 846 258 1294 -601 -1352 144
1267 144 31 322 2631 578 -1382 80 -23 -1019 684 1022 -637 -218 -1055 -3458 -1488 295 -2180
1284 -2180 -2105 -1127 -3327 -3920 -2247 -2072 -2019 -659 -2582 -3162 -1130 -974 -1716 601 1030 -191 1102 766
1302 766 129 2388 3650 1884 2488 4035 1630 1574 3430 3235 3006 3719 1652 1467 3153 1931 975
1319 975 3433 2591 916 1682 1596 218 2340 2931 658 2218 2346 187 680 1857 654 399 818
1336 818 -1255 -731 55 -2311 -2662 -838 -2535 -4567 -3344 -3716 -5261 -3987 -4391 -5822 -4186 -4148 -6095
1353 -6095 -4950 -3243 -4223 -3322 -2745 -3458 -2215 -617 -2015 -967 1612 294 -194 2631 2532 1606 2712
1370 2712 3047 2520 4344 4132 2743 4076 4485 2894 3354 4171 2514 3000 3445 1003 1424 2642 108
1387A08p50K196j430j449L20n39q05J547j241p92J372n25j287J751J029j280J101
1404f74R96j476J142J803j388R10K507j145j047J163o2J21R00r80o76Q59j597
1421A356j834J589O5k420L31k28k365L72L40j806L82J531k067j085J250l68O03
1438d354J551n26K45J464j287k2L330R04j434J478P07j365J262J292m34J243P28
1455D782j822k61J017q05J21J443j368j010N11k558K2K742j099k225N79l65j841
1472b137L21N97o91P40k16k642J055M06r12J245J649j004m96R56j292R26L167
1489A672q57q41J543k13j716J931J536n57O87l31j972J076K33j247J647Q07k250
1506A148j382M65k087J143J689j103j648J026j640j250J883Q94l88N22j446j089
$$ plain form
1387 108 -642 1554 124 -1325 -1005 -1544 -2349 -802 -2043 -2835 -1463 -1988 -3275 -1524 -495 -1775 -674
1404 -674 322 -1154 -12 1791 403 1313 3820 2675 1628 2791 2729 2850 3750 2770 2094 2953 1356
1421 1356 -478 1111 1176 -1244 -913 -1141 -3506 -3134 -2794 -4600 -4218 -2687 -4754 -5839 -4589 -4957 -4354
1438 -4354 -2803 -3329 -3084 -1620 -2907 -2929 401 1305 -129 1349 2056 691 1953 3245 2811 4054 4782
1455 4782 2960 2699 3716 2911 3032 4475 3107 2097 2608 50 72 2814 1715 -510 69 -296 -2137
1472 -2137 -1816 -1219 -1910 -1170 -1386 -4028 -2973 -2567 -3479 -2234 -585 -1589 -2085 -1129 -2421 -1495 1672
1489 1672 815 -26 1517 1304 -412 1519 3055 2498 3185 2854 882 1958 2191 944 2591 3398 1148
1506 1148 -234 231 -1856 -713 976 -127 -1775 -749 -2389 -3639 -1756 -862 -1250 -728 -2174 -3263
1522c263J515M06p20J987J249k235k89N96o87J557K119j063q51O74j195r40K719
1539A579P85o28j15q53j130J533q0p27K257K35l254k18J010r72R66J763j333j141
1557c23n6j661K96K349o0p44K33j556j305J659J78J06K065n63l534P04J602o88
1575a298J287J728j322o64k65j184J756K176n10o99L72k165k40J938r8M22J329
1592B563j858k297J121N31r78J781J014j587p83j091q25J617J908m57q83L2j625
1609a817m60K277M20K48O03j497j929J896M94j36J703N71j560r40k70l32K139
1626A410J498j475r8m02k271J30K432K48j50K46k115j402J434R4j31J923p05k390
1644a724p0k86J74J688J040j822K12l15k525J243K751L4m13N0j731m98J806o4
$$ plain form
1522 -3263 -1748 -1342 -2062 -75 1174 -1061 -1350 -754 -1441 116 2235 1172 321 995 -200 -1140 1579
1539 1579 2364 1736 1621 768 -362 1171 1091 364 2621 2856 -398 -616 394 -578 388 2151 818 -323
1557 -323 -379 -2040 -1744 605 545 -199 34 -1522 -2827 -1168 -990 -884 1181 618 -2916 -2212 -610 -1298
1575 -1298 -11 1717 395 -269 -534 -1718 38 2214 1704 1005 1377 -788 -1028 910 812 1234 2563
1592 2563 705 -1592 -471 60 -918 863 1877 290 -493 -1584 -2409 -792 1116 659 -224 -192 -1817
1609 -1817 -2277 0 420 668 1271 -226 -2155 -259 235 99 1802 2373 813 -127 -397 -729 1410
1626 1410 2908 1433 1335 933 -1338 -1208 1224 1472 1322 1568 -547 -1949 -515 -421 -552 1371 666 -1724
1644 -1724 -1794 -2080 -1906 -218 822 -1000 -788 -1103 -3628 -2385 366 400 -13 37 -1694 -2192 -386 -450
1662d50O05J821j053k018K19Q6Q06J793O22j712n7m32k030J718K562n80q86k87
1680G27j769l68J459P0R94R13k045k014J136lM20K189j3j287k74o88j358K528
1698F17J952r76n81j86j861j03J681P1Q76L55k745j367J012L32L14J666l71k015
1716a329j38q43n91L041J235j610k88K77j894N42K174P02O64K74k383p45J750
1733H38l74N13K084q21k412j62o81J74K290K78j461j81r26k093J139J942J22J1
1751B80j48k630j04J715l21R05J780j218j922J0M00J032J758K23j045r2j005j312
1769a694J593K421l07k55o15k147P92J190k0Q93J066k147j435M84j52P10J758
1786B135p78j438J79j233j329K372J142r64k36q78j806P53J201k23J612N21j867
$$ plain form
1662 -450 155 1976 923 -1095 -876 -790 16 1809 2431 719 662 230 -1800 -82 2480 1900 1014 727
1680 727 -1042 -1410 49 119 1113 2026 -19 -2033 -897 -900 -480 1709 1696 409 135 -553 -1911 617
1698 617 2569 1593 1012 826 -1035 -1138 543 614 1490 1845 -900 -2267 -1255 -923 -609 1057 686 -1329
1716 -1329 -1467 -2310 -2901 140 1375 -235 -523 -246 -2140 -1598 576 1278 1942 2216 -167 -912 838
1733 838 464 977 3061 2240 -172 -334 -1015 -841 1449 1727 266 85 -841 -2934 -1795 147 269 280
1751 280 132 -2498 -2602 -887 -1208 -303 1477 259 -1663 -1653 -1253 -221 1537 1760 715 623 -382 -1694
1769 -1694 -101 2320 2013 1758 1143 -1004 -212 978 958 1851 2917 770 -665 -181 -333 377 2135
1786 2135 1357 -81 98 -1135 -2464 -92 1050 86 -150 -1028 -2834 -2081 -880 -1103 509 1030 -837
1803h37j307P78N20Q52J961q30j273N35j177j38K808O04j086j39p19j684R60J004
1821H32l84J410m67k770j034J738m74Q23J277r11j155l12p42M43K584Or34L20
1839B50o59j393J675J397K16P79p77k302L71J293k82Q55R62j186j511j68q63J226
1857a17J727p07j298j7r33j245J664R76J04M99j188j997J108J363o20J576P67
1874A662j571j208K74o3J165J904j233p47L25j249r65K252J039n22j85j124j223
1891a469R21P69j3J101N87k000q37L31J91R93J010r49n66m49q98j76J674N02o00
1910A22j83r20j192J380J46L45J243m36k258J10P36M67R95R45j070l34K6j067
1928i45P40K229n1r94J56j214l27J167K02k75J086o86k254J93R86k23J049N14
$$ plain form
1803 -837 -2144 -1366 -846 6 1967 1137 -136 399 -778 -916 1892 2496 1410 1271 552 -1132 -172 832
1821 832 448 1858 1391 -1379 -2413 -675 -1149 -326 951 40 -1115 -1427 -2169 -1726 858 864 -70 250
1839 250 -409 -1802 -127 1270 1486 2265 1488 -814 -443 850 568 1423 2385 1199 -312 -480 -1343 -117
1857 -117 1610 903 -395 -412 -1345 -2590 -926 50 154 653 -535 -2532 -1424 -61 -681 895 1662
1874 1662 91 -1117 -843 -906 259 2163 930 183 508 -741 -1706 546 1585 1063 878 -246 -1469
1891 -1469 -548 221 208 1309 1896 -104 -941 -610 -419 574 1584 635 69 -380 -1278 -1454 220 722 122
1910 122 -61 -981 -2173 -793 -647 -302 941 505 -1753 -1643 -907 -440 555 1500 430 96 122 -945
1928 -945 -205 2024 1973 979 1135 -79 -406 761 963 688 1774 1088 -1166 -973 13 -210 839 1353
1946A353j245m02N0j069J157J917p33q93K62r23m25J036J48O53O0q65j773R36
1964g56M68q14P68N98j227p58J08p43J368J366j104j26O2p90L3J860R1L11N88
1983A303j364n57J102Q75o07J139L85j432o84Qj92J232O93j333m68J7j323J48
2001a058J325J52m66O3j551J27J054J80l06J329j96j445J56J06L1J226M00r22
2019B05j52K34j529O00J561l44o38N91q70n73J284j5k46J068l19j373O8O14r7
2038F9J036k7r80M40m83q66R54J097q00o45L61j114K5J051r6j36L93o72j126J043
2058d76K19K45N88p4o51J4K86j101J220J321j142n94N60l64l88J063m86Q3O27
2077I50j604n54J025j63k66O61l79m34K22l43p34J699J73p41j04N36n58N9Q44
$$ plain form
1946 1353 108 -294 -244 -1313 -156 1761 1028 135 397 -526 -951 85 233 886 946 81 -1692 -756
1964 -756 -288 -1102 -334 264 -963 -1721 -1613 -2356 -988 378 -726 -852 -790 -1580 -1547 313 404 715 1303
1983 1303 -61 -618 484 1359 752 1891 2276 844 160 168 -24 1208 1901 568 100 117 -1206 -1058
2001 -1058 267 419 -47 16 -1535 -1408 -354 -174 -480 849 653 -792 -636 -530 -499 727 1127 205
2019 205 53 287 -1242 -642 919 575 -63 528 -342 -915 369 354 108 1176 857 -516 -448 166 69
2038 69 1105 1078 98 538 55 -811 143 1240 440 -205 156 -958 -933 118 22 -114 279 -393 -1519 -476
2058 -476 -257 -12 576 502 -149 -135 151 -950 270 1591 449 -145 415 51 -337 726 240 323 950
2077 950 -654 -1208 -183 -346 -612 49 -330 -764 -542 -885 -1619 80 253 -488 -592 -56 -614 -555 289
2096B89j87M60n8j270k08J446q38q0O18j33r15N47m6m84J409L44j021L10N32j060
2116c45N27J039J63K22J0q85N22P65q26J06Q30m56o12M4o3m41J127n09r89K72
2136E01k32j564Q47O25o07l53k24j253N60P21j256L31R53r23o63J034k78k75P25
2155a331l66mN59O6p50J090O28l11q0J00m65Q84J136j345P72P10o75n02J304l79
2175A041n09O65j91p9N77p83m76Q53J15r93K86p3l76O06J49q71N16P37j168K14
2195B40J162n71p08O80j41j49P94o23n1Q13l85o68P42k63p18L51J29o75J16O6
2215A41j202j8R35q88l18K24j33l38M59p96J6Q31o20l86J171o46m71P94L08k39
2235a176L48M95p23N97R65q01J10P12l24K10K14R6j42N79m85m3Q06l50r78O19
$$ plain form
2096 289 102 562 504 -766 -974 472 -366 -446 172 39 -876 -329 -375 -859 550 894 -127 183 715 -345
2116 -345 182 1221 1384 1606 1616 731 1253 2018 1192 1298 2128 1672 1060 1104 1041 600 1727 1218 229 501
2136 501 269 -1295 -448 177 -430 -783 -1007 -2260 -1700 -979 -2235 -1904 -951 -1874 -2537 -1503 -1781 -2056 -1331
2155 -1331 -1697 -1701 -1142 -1076 -1826 -736 -108 -419 -499 -399 -864 20 1156 -189 583 1293 618 116 1420 1041
2175 1041 532 1197 1006 927 1504 721 245 1098 1213 220 506 433 57 663 812 -59 457 1194 26 240
2195 240 1402 831 123 803 662 513 1307 684 633 1446 1061 393 1135 872 154 505 634 -41 75 141
2215 141 -1061 -1079 -144 -1032 -1350 -1126 -1259 -1597 -1138 -1934 -1918 -1087 -1707 -2093 -922 -1568 -2039 -1245 -937 -1176
2235 -1176 -828 -333 -1056 -459 506 -295 -185 527 203 413 627 723 581 1160 675 632 1438 1088 110 729
2255G29K70o16N47k58l77M37K76p65m2K64m98J50P07m78j27M89n03J9J182p95
2275F11p18J089n01k40K55J56k57K77k15n11M28K34q09K25K26o32O7o4q37N82
2295f34N27n22r83R99m7o78N01L35l22n5k56l47R09J24o50Q29J99p59L44J57o39
2316i68J043M45l47l4M13n65k95J217k82k69J27l73kL55L38q51R11J5j243N66
2336B01J2k84L65P35j369N92P5m06K71P87l94m8j02n10J81O29j56o90R50k6j133
2357c20L56K93k81K61K97p45k56N13j020N23P42p34m12O7j80k61O61l37L59O05
2377A31l75j135Q78L62m89P07K64p46j49O32m40N80R13j057L03J81o05K97M61
2396G13R1K7L13o14q72J421j64m62N22K48o86k89J09m56N78N13j034J23K21p68
$$ plain form
2255 729 999 383 930 672 295 732 1008 243 201 465 -33 117 824 346 219 708 205 224 1406 611
2275 611 -107 982 481 241 496 652 395 672 457 -54 374 608 -201 24 250 -382 -315 -379 -1216 -634
2295 -634 -107 -629 -1612 -613 -660 -1338 -837 -502 -824 -879 -1135 -1482 -573 -449 -1099 -270 -71 -830 -486 -329 -968
2316 -968 75 520 173 139 552 -13 -308 909 627 358 485 112 110 465 803 -48 863 878 -365 201
2336 201 213 -71 294 1029 -340 252 327 -79 192 979 585 537 435 -75 106 735 579 -111 839 813 -320
2357 -320 36 329 48 309 606 -139 -395 118 -902 -379 363 -371 -783 -716 -896 -1157 -496 -833 -474 131
2377 131 -244 -1379 -501 -139 -628 79 343 -403 -552 80 -360 220 1133 76 379 560 -45 252 713
2396 713 804 831 1144 530 -342 1079 915 453 975 1223 537 248 357 -99 479 992 -42 81 302 -466
2416d66k92O37k37k43N24j137n62J083j90m84P29l63p31K52J86j21Q12J52j033
2435a484J42P72q08M32P23l7k72O30m29q7Q83L0J11P16o12m31N64K41K43P89n18
2456A598n22K83l7n02P59O73m94k14k72j020N29O62p55L88L74j012r64M57M37
2475C68o86O50l45q01J69k34m60Q17N08r47l15L95l62R6N49l93J84N44r04q13
2495a980J014L93k86L53l33p22N90k59k85J031M03p35j00K20l29M60K58K3K24
2514f0J02o38n9J190k33K46P41j06o38J50J14J05P80P4p58K73k39l84O52K30P
2535A549l98j41r96KJ153p58L1Q39j216p77L03j41M00P92o90n02J28l30k52O63
2555c41N61n37j59j53l37K58P88o35L77L69r23l22N32J24L46O15o57k76J72nn27
$$ plain form
2416 -466 -758 -121 -358 -601 -77 -1214 -1776 -693 -883 -1367 -638 -1001 -1732 -1480 -1294 -1415 -603 -451 -1484
2435 -1484 -1342 -570 -1378 -946 -223 -260 -532 98 -331 -418 465 495 606 1322 710 279 843 1084 1327 2116 1598
2456 1598 1076 1359 1322 820 1579 2252 1758 1544 1272 252 781 1443 688 1076 1450 438 -526 -69 368
2475 368 -318 332 -13 -814 -645 -879 -1339 -522 -14 -961 -1276 -881 -1243 -1147 -598 -991 -807 -263 -1167 -1980
2495 -1980 -966 -573 -859 -506 -839 -1561 -971 -1230 -1515 -484 -81 -816 -916 -696 -1025 -565 -307 -284 -60
2514 -60 42 -596 -655 535 302 548 1289 1183 545 695 809 914 1694 1768 1010 1283 1044 660 1312 1542 1549
2535 1549 1151 1010 14 16 1169 411 442 1281 65 -712 -409 -550 -150 642 -48 -550 -422 -752 -1004 -341
2555 -341 220 -317 -476 -629 -966 -708 80 -555 -178 191 -732 -1054 -522 -398 -52 563 -94 -370 -198 -203 -730
2576g30R36P73p71M0k13o31O33N47o50N91L25j034m66Q22j65K16O60r61l85L49
2596a14n34j2Q03L37r29R2n4m96P87J35k89M31q2r59J42M36J93J81M44n18l76
2617c82L29k48J92J016K7p41O6q5K4L75N89m16L14l70o67P17N96k28R8M69p50
2638I25l59P5k99L39J177o53j200K86m63m01O38j16l78j60n8j102M15O99o61Q62
2658d34m65p03k4L47k60N50P21o33l14O38k14n25J100J90k99K89l33n59P19N01
2678B92k26L95J62p17K87N0J68M31N16o16m27L73m77o1J183L35q01q3k83k55M27
2699F73K1q3N10l33j121p6N76j25K04J1p17k56M86r06J37Q75j3p98N6j39j17N82
2721e53K16k67M54j32q00K98N21L78J74L78q98O8P9KN49R90p63j27J40o93N09
$$ plain form
2576 -730 206 979 208 248 35 -596 37 584 -66 525 850 -184 -650 172 7 223 883 -78 -463 -114
2596 -114 -648 -660 143 480 -449 -357 -411 -907 -120 15 -274 157 75 -884 -742 -306 -113 68 512 -6 -382
2617 -382 -53 -301 -109 907 934 193 259 174 198 573 1162 746 1060 690 23 740 1336 1108 1206 1675 925
2638 925 566 641 342 681 1858 1205 5 291 -172 -573 65 -51 -429 -589 -647 -1749 -1334 -635 -1296 -434
2658 -434 -899 -1602 -1626 -1279 -1539 -989 -268 -901 -1215 -577 -791 -1316 -216 -26 -325 -36 -369 -928 -209 292
2678 292 66 461 623 -94 193 243 411 842 1358 742 315 688 211 150 1333 1668 867 784 501 246 673
2699 673 694 611 1121 788 -333 -409 167 42 246 257 -460 -716 -230 -1136 -999 -124 -137 -935 -879 -1018 -1135 -553
2721 -553 -337 -604 -150 -282 -1082 -784 -263 115 289 667 -231 -163 -84 -82 467 1457 694 567 707 14 523
2742E23L71k64J56O49p79j029O97M31o59J84J25p70mN9n00O24K46n62n28q9l46
2763a465M45J89R1k64O67o56n90J124L50l86P12J07o12N13l05L40R41K78j012
2782D67J95N94m96L57M68l67J37O2r65n94J182m49m94N75j70q33j26K34r1K30
2802h4M9n98J31N8p54M56N34m52ML7p14o3J055l8l87N15Mp82L83J11M25k1K34
2825A03m22M69j31n60R19N40k94m70K27k47J93N33j59o9J17m29n02M60K23k11
2845B90P32l41l26K46m36j48N31M33p28k30J39m75J77M66l91L3Q5p82j51N27l72
2866g21j11L89m42j17M83n66j60R92K40q28mJ00J14M7O32k63Q3M40p40M36Q23
2887H27j49n6N91k34m07P02j07k76R27O9q23j07J43l65K34K43k81l8o77n71K03
$$ plain form
2742 523 894 630 786 1435 656 -373 324 755 96 280 405 -365 -369 -310 -810 -186 60 -502 -1030 -1119 -1465
2763 -1465 -1020 -831 -740 -1004 -337 -993 -1583 -459 -109 -495 217 324 -288 225 -80 260 1201 1479 467
2782 467 662 1256 760 1117 1585 1218 1355 1417 452 -142 1040 591 97 672 502 -331 -457 -223 -314 -84
2802 -84 -35 -633 -502 -444 -1198 -742 -208 -660 -656 -619 -1333 -1396 -341 -379 -766 -251 -247 -1029 -646 -535 -110 -131 103
2825 103 -319 150 19 -541 378 918 624 154 381 134 327 860 701 632 749 320 -182 278 501 290
2845 290 1022 681 355 601 165 17 548 981 253 23 162 -313 -136 330 -61 -28 57 -725 -876 -349 -721
2866 -721 -832 -443 -885 -1002 -519 -1085 -1245 -253 -13 -841 -845 -745 -631 -584 48 -215 -132 308 -432 4 827
2887 827 678 622 1213 979 572 1274 1167 891 1818 1887 1064 957 1100 735 969 1212 931 893 216 -355 -152
2908a52O15o67j79L47q23J72j54k86k02O90k78o06K80q0m69N49J56m6J81m40M8
2929a344L89L54m21L73N54m81l00J080m62K44O43n63j43M87j77J15L00M55n76
2948E27O2q4k95O51J17m25L9Q1k04o8N90k61j94O66l05m37N10j83Q9L08J29l17
2970I96M3l07m98P20J1o53K27M60j264M79J10j5l51N6m91n1L83q93o8P00p49k80
2992a435l0q0l96M71J33n49M47k2l96L08O29n28r8P11n27K74M42n32P40O58m57
3013b37n5K28O34k93N82K22k94N49l19l77L54L88m47J90M15k65m74M42p69L32
3033H06M03p18j63L79k02l85J94M65m16p4l37p7K71K31l21M5N70q00M05K50j45
3054C81J61K24r04J92O44l83n93R36j81p21L46m1p48O29m79m21K38L48n96m1K71
$$ plain form
2908 -152 463 -204 -383 -36 -859 -687 -841 -1127 -1329 -639 -917 -1523 -1243 -1323 -1792 -1243 -1087 -1133 -952 -1392 -1344
2929 -1344 -955 -601 -1022 -649 -95 -576 -876 204 -258 -14 629 66 -77 410 233 348 648 1103 527
2948 527 589 505 210 861 978 553 592 673 469 401 991 730 536 1202 897 460 970 787 876 1184 1313 996
2970 996 1039 732 234 954 965 312 539 999 -265 214 324 309 -42 14 -477 -528 -145 -1038 -1106 -406 -1155 -1435
2992 -1435 -1465 -1545 -1941 -1470 -1337 -1886 -1439 -1461 -1857 -1549 -920 -1448 -1546 -835 -1362 -1088 -646 -1178 -438 220 -237
3013 -237 -292 -64 570 277 859 1081 787 1336 1017 640 994 1382 935 1125 1540 1275 801 1243 474 806
3033 806 1209 491 328 707 505 120 314 779 363 289 -48 -125 146 377 56 101 671 -129 276 526 381
3054 381 542 766 -138 54 698 315 -278 658 477 -244 102 61 -687 -58 -537 -958 -720 -372 -968 -1009 -738
3075g38n48J45K03n52K45L01n27J27P46o00L58K42L9j78M75L85o01J255k28l67
3095A82L15M24p00N26L48m43J61K03o19J10P23o87m41N34n1l11Q1k32l73L71l19
3116a98l39M11L2l10J29L95l28P32k87k79O9P28m30O9N80o1j11K61j60j21N15
3137A297j22n79O05l17l86j10M2p00R8J12m05j50M40q57m9M81m56m47K02k84J90
3158a395J56j60l47Q11K7k39M14J2k3M60J95j13L72K94q2K36O70m52R3K98j83
3179A044L8J0J75j00K16j80p94P17n72n27N10q3q47M11l55k93N65l86o09K02R9
3200g59p07J55P86k84K90K19n01j78R03k51m3L10J74l99N09p0j23N85l97j57L5
3221I7M67k50J39K56l73JK08o01m4K44J6j45L61k49n69M42K20l36N16k87l95P01
$$ plain form
3075 -738 -1286 -1141 -938 -1490 -1245 -944 -1471 -1344 -598 -1198 -840 -598 -559 -737 -262 123 -478 777 549 182
3095 182 497 921 221 747 1095 652 813 1016 397 507 1230 543 102 636 585 274 355 123 -250 121 -198
3116 -198 -537 -126 -94 -404 -275 120 -208 524 237 -42 27 755 325 394 974 913 802 1063 903 782 1297
3137 1297 1175 596 1201 884 498 388 430 -270 -172 -60 -465 -615 -175 -1032 -1081 -600 -1056 -1503 -1301 -1585 -1395
3158 -1395 -1239 -1399 -1746 -935 -908 -1147 -733 -721 -744 -284 -89 -202 170 464 382 618 1288 836 929 1227 1044
3179 1044 1082 1092 1267 1167 1383 1203 409 1126 554 27 537 454 -393 18 -337 -630 -65 -451 -1060 -858 -759
3200 -759 -1466 -1311 -525 -809 -519 -300 -801 -979 -76 -327 -370 -60 114 -285 224 154 31 616 219 62 97
3221 97 564 314 453 709 336 337 545 -56 -100 144 160 15 376 127 -442 0 220 -116 400 113 -282 419
3243D19l7m25J41Q25l81l10J18l84L42L29n22J5K72n9o07O50k46k54L16l86J3
3264a71J94n82j45J99O20j079L33q8K0k64N88m06J57K54m94m8M57K00J47j10j74
3285c92K83P1Pk36Q09L9l10j40M14k81K32L64k85L7J25n40J96K43J13n14L07k53
3307B89j69K81j84l07L02J37p80J45L89p59L87J19j06K26j13m99rP35k34J42J04
3328I6r4k71K20L08m33N71k85m39J74K89o7L55j89k42K65Ql21K70K61k92K86N0
3350E20l82j33J54j25P0J40m10q1N53n04j87L94J7l07k1j28l61N90o2k50j96M42
3372b67o40N67j33L20R2L31k81m39M10K19J05J26L34m72n5J96l49O75k74k44Q2
3393C03M40l97K0J75k69L09ol87J19L4k19k16L18k73m86L17k16j96K45R5m46M76
$$ plain form
3243 419 382 -43 98 923 542 232 350 -34 308 637 115 130 402 343 -264 386 140 -114 202 -184 -171
3264 -171 23 -559 -704 -505 115 -964 -631 -719 -699 -963 -375 -781 -624 -370 -864 -912 -455 -255 -108 -218 -392
3285 -392 -109 -38 -31 -267 542 581 271 131 545 264 496 860 575 612 737 197 393 636 749 235 542 289
3307 289 120 401 217 -90 212 349 -431 -286 103 -656 -269 -150 -256 -30 -143 -642 -651 84 -150 -8 96
3328 96 2 -269 -49 259 -174 397 112 -327 -153 136 69 424 235 -7 258 266 -55 215 476 184 470 520
3350 520 138 5 159 34 104 244 -166 -247 306 -198 -385 9 26 -281 -302 -430 -791 -201 -263 -513 -709 -267
3372 -267 -907 -340 -473 -153 -61 270 -11 -450 -40 179 284 410 744 272 217 413 64 739 465 221 303
3393 303 743 346 366 541 272 581 575 188 307 341 122 -94 224 -49 -535 -218 -434 -630 -385 -290 -736 -260
3415b60k49m61J14M58k3q8K57j26k85L56PK73K19j21n40M18L84k45L21q7jK91
3437F12k8n53L84K26J02n03L09m48J63K66k25J70J57k36k37L13l42J73J56J05
3457E64l00K63p44k66N89K26m09j36K75n55J43J04Pj1M1j56J4L5L5m89R50m06
3479b26j72k33LL04K43m3k30O17k06k62K24n3J88J32l7j82k95O41k91l5L89k70
3501B06j98K74k43r8N30n37k5J65n8o09M26j03l10N78K8n21J64K93q03K29N22
3522i0M4l46K49NK1N32n26J20O22l04k66N15K54J28k03J28m48K89j53p3qO22n01
3545F11k87j39J54j90N13n38N4L08o42l08K94K55k61o2J16o07K99J37k44L23K46
3566C2n52k94L89l06M91J62j06j51K59l45n5N26P1l25J46j53j53P7J16n6L27q6
$$ plain form
3415 -260 -509 -970 -856 -398 -421 -509 -252 -378 -663 -307 -300 -27 192 71 -469 -51 333 88 409 322 321 612
3437 612 584 31 415 641 743 240 549 101 264 530 305 475 632 396 159 472 130 303 459 564
3457 564 264 527 -217 -483 106 332 -77 -213 62 -493 -350 -246 -239 -250 -209 -365 -351 -316 -281 -770 180 -226
3479 -226 -398 -631 -628 -324 -81 -124 -354 263 57 -205 19 -34 154 286 249 67 -228 413 122 87 476 206
3501 206 8 282 39 -59 471 -66 -91 74 16 -593 -167 -270 -580 -2 26 -495 -331 -38 -841 -612 -90
3522 -90 -46 -392 -143 -138 -117 415 -111 9 631 327 61 576 830 958 755 883 435 724 571 498 490 1112 611
3545 611 324 185 339 149 662 124 178 486 -156 -464 -170 85 -176 -238 -122 -729 -430 -293 -537 -214 32
3566 32 -520 -814 -425 -731 -240 -78 -184 -335 -76 -421 -476 50 121 -204 -58 -211 -364 -287 -171 -227 100 14
3588A4l21j49J99k47L61L22o00k8K76m68M10N06j6n41M94j7l12N30K45l95M35
3609F98k7l87K91j22k5K62J04l15n4Omj29L10l22j2K89m40k81L20n1l20J45j25
3632a89k06O6l0m18O33J1n00J06j07K19R9K33k62n2K99j96l23J90J20j4J09l49
3654e61J37O22m73j10N16K00q45L02K14l28K43M07m60K47j07J54j98L23J15J19
3674E17j75j01j05J18l49K95N15k22m04L40o7k73K56k4M8j96K32m35k6J48J02
3695A94j12j75L5m22K94k61kO30l00m02L7L0j95l0K59R1l35M19m86M29j31j54
3717e87O5M79m86L3M10k04K49L93j75n9N09k81j70J39N15j20j16j40k8L77m4j90
3739E69k63N17k78J26J18l14K1j92j77K3K94j08m84L46Jl24r2k6j69L74L7n48
$$ plain form
3588 14 -307 -456 -257 -504 -143 179 -421 -449 -173 -641 -231 275 259 -282 212 195 -117 413 658 263 698
3609 698 671 284 575 453 428 690 794 479 425 431 427 298 608 286 274 563 123 -158 162 111 -209 -64 -189
3632 -189 -395 -329 -359 -777 -144 -133 -633 -527 -634 -415 -316 -83 -345 -397 -98 -294 -617 -427 -307 -321 -212 -561
3654 -561 -424 198 -275 -385 131 331 -514 -212 2 -326 -83 324 -136 111 4 158 -40 283 398 517
3674 517 342 241 136 254 -95 200 715 493 89 429 362 89 345 321 369 173 405 -30 -56 92 194
3695 194 82 -93 -58 -480 -186 -447 -449 181 -119 -521 -484 -454 -649 -679 -420 -329 -664 -245 -731 -302 -433 -587
3717 -587 -522 -43 -529 -496 -86 -290 -41 352 177 118 627 346 176 315 830 710 594 454 426 803 759 569
3739 569 306 823 545 671 789 475 496 304 127 150 444 336 -148 198 199 -125 -217 -243 -412 -38 -1 -549
3761e49M48k04l49K69j27J79k11J06k00J25K02k0k67L40k92k24L22j22J4O76k97
3782a81qK63k64k43l0P31l17m8kr1J89N97m36%M03j45m53L46j96j27R17n54j31
3805B20K87l10n3O5J85j35j59L74l56L14k04K05j35k1j45k85O93k83m9K48l25
3826A31q6P5j42m51N97L45n91Q7r6k00K48K9p5K32o3l49j34M28j36j80M41k66
3848a56l18M08Qm25M64k43j44M19k32l74J37L56j08O9K08m56K47N4j22R2j18j0
3870b44K41l13L25p9o9K47k90K39Q2k66K04J29l10L12m7o4J40M71n42K91J59k87
3892C29r0j2J80j30m5K7r9K47l30j88K42p4J59l59L00m18O9N64q58L96p2M14l15
3915f3K75l66J00J61l94J39K54M4k38L2J7j26J28l6q4L78k41j54n5O3M9J61J89
$$ plain form
3761 -549 -101 -305 -654 -385 -512 -333 -544 -438 -638 -513 -311 -331 -598 -258 -550 -774 -452 -574 -560 116 -181
3782 -181 -189 74 -190 -433 -463 268 -49 -97 -99 -190 -1 596 160 160 563 418 -35 311 115 -12 905 351 220
3805 220 507 197 144 209 394 259 100 474 118 432 228 433 298 277 132 -153 540 257 208 456 131
3826 131 45 120 -22 -473 124 469 -122 -35 -131 -331 -83 -54 -129 103 40 -309 -443 -15 -151 -331 110 -156
3848 -156 -474 -66 -58 -483 -19 -262 -406 13 -219 -593 -456 -100 -208 -139 69 -387 -140 -86 -208 -116 -234 -244
3870 -244 -3 -316 9 -70 -139 108 -182 57 139 -127 77 206 -104 208 161 97 237 708 166 457 616 329
3892 329 239 227 407 277 232 259 160 407 77 -111 131 57 216 -143 157 -261 -192 372 -486 -90 -162 252 -63
3915 -63 212 -154 -54 107 -287 -148 106 150 -88 -56 -39 -165 -37 -73 -157 221 -20 -174 -229 -166 -117 44 233
3938B33l33K11l1j0k59N1N9MR5j8J9j3j0l76K56Kk21M73j18j16J06M03n16L1J18
3963D0J26K30J5j45m19M87j86N9O2l19m7K91j65J9rJ48n99K02M52n94n0M18P3
3986H9m23J18Qk30O32l92k98K90J99j03J88j01L5K70k49J62j51K79l01Q4J35p5
4008A66j79K35n4k07K7j18K31J31k16k77L53j95J7M3n7j61L02j99k37L01K45m26
4030b75J06K99L5j61j80L33p9k3m01M00J68P9jj76N8j09L8J39k32J69R0n82J30
4053a75L17M5l21K2p6J67K18l47L2L03j63l17L36j02p6Q0J29k77K50K97n11O06
4075D37j28m44j9M23k84K45q7q6k5K01l66q5J32J46l9K52j60k38J97j3l36M61
4097A84m09J0P4K35m44O89m20O8q8J8M2j0P6k61L45M1k4k90K49l1k48M65k40l21
$$ plain form
3938 233 -100 111 80 70 -189 -138 -79 -75 20 2 21 8 -2 -378 -122 -120 -341 132 14 -102 4 407 -109 -78 40
3963 40 166 396 411 266 -153 334 148 207 269 -50 -97 194 29 48 39 187 -412 -210 242 -352 -402 16 89
3986 89 -334 -216 -208 -438 194 -198 -496 -206 -7 -110 78 -23 12 282 33 195 44 323 22 106 241 166
4008 166 -13 222 168 -39 -12 -130 101 232 16 -261 92 -103 -86 -43 -100 -261 41 -158 -395 -94 151 -275
4030 -275 -169 130 165 4 -176 157 78 55 -346 54 222 301 300 124 182 73 111 250 18 187 277 -305 -175
4053 -175 142 187 -134 -112 -188 -21 197 -150 -118 185 22 -295 41 -61 -137 -57 72 -205 45 342 -169 437
4075 437 309 -135 -154 269 -15 230 143 57 32 233 -133 -218 -86 60 21 273 113 -125 72 59 -277 184
4097 184 -225 -215 -141 94 -350 339 -81 -13 -101 -83 -41 -51 25 -236 109 150 126 -164 85 54 -194 271 31 -290
4121b90K78L1O6Pk51J09l0L41n80N4P67n59J24L11q35O00L7l03J25K8j53J62L38
4144C77l45j19J37K68l48K09j69N5J33M68r72K66L57o52L4L92l23J65K3l12J44
4165b12N8P1n2k13o2L90j2m2R5J84l3k54K95J60k37l19N36j96q3L87o65L15J02
4188B13l07J49J85k69q7K8K07l18M20m8l54L26k00m18J95L36k77J38K75o99J58
4209c47K67J92j01J42o8q0oklK30n9n3r4Jk99K34N48n76L82k73K4J30n9j68J76
4234A38K89l98q9J05J65q6J59k16j69J90m5l03M00p6j58k7L71j42m8J24J3l6l9
4257A22j88K00k41j5J41%k43j72K65k8j70K45j65j09M7K7j49P1K39l36J71M27
4279A39m39k12M55k5j8J2N5j82L21J2K5k1j23J19K76j44k33K38J38j99K49k65
$$ plain form
4121 -290 -12 19 85 92 -159 -50 -80 261 -319 -265 502 -57 67 378 -457 143 180 -123 2 30 -123 39 377
4144 377 32 -87 50 318 -30 179 10 65 198 666 -306 -40 317 -335 -301 91 -232 -67 -44 -356 -212
4165 -212 -154 -83 -135 -348 -410 -20 -32 -74 21 205 172 -82 213 373 136 -183 353 157 74 461 -204 111 213
4188 213 -94 55 240 -29 -116 -88 119 -199 221 173 -181 145 -55 -473 -278 58 -219 -81 194 -505 -347
4209 -347 -80 112 11 153 85 5 -1 -3 -6 224 165 112 18 19 -280 -46 502 -74 308 35 59 189 130 -38 138
4234 138 427 29 -60 45 210 124 283 67 -102 88 43 -260 140 64 -94 -121 250 108 60 184 197 161 122
4257 122 -66 134 -107 -122 19 19 -224 -396 -131 -159 -329 -84 -249 -358 -311 -284 -433 -362 -123 -459 -288 139
4279 139 -300 -512 -57 -82 -100 -88 -33 -215 106 118 143 122 -1 118 394 250 17 255 393 194 443 178
4301A78k00P0K1nl87N75J17n05N35l33J23j90J71R4p5R9l12L37l1j48J77l25q3
4324i7L81p5k0j39J20j61j92L06j10J27Jl64Q3J96q4m29K71N9K2pK73q03N03m9
4348a88p6L36k05m7J3M17m82K16O4r1J62K06p48M15n7K39m21O1L65n15K80l2r5
4371a83K29k84n5J47j82M0K04K39n62K61J65j06M7M13l91J1lR7r5K70p2k86L22
4394B26K1k00j15L73o4k19K23P5j18K94l55P8L21o81Q1L98q3k43J61l46N4K84
4416A65m96j83O15j50k9N4r9L4j71J78r8O7Q1j16r9N72n24J38p2J30n6K36j53
4439B4j61M58j88l53L36j1l47j40M40j13j99M60l03j93K01J60j35k0k73K20K56
4460A19m40L37R4k8m9K01k57L5l7j5J09J80k35P7%J97o3k44K89k94R0N14q26K84
$$ plain form
4301 178 -22 48 69 64 -323 252 369 -136 399 66 189 -1 170 264 189 288 -24 313 282 134 311 -14 -97
4324 -97 284 209 189 50 170 9 -183 123 13 140 141 -223 -140 56 -28 -457 -186 -127 -105 -112 161 -642 -139 -188
4348 -188 -264 72 -133 -180 -167 250 -232 -16 48 -43 119 325 -423 -8 -65 174 -247 -186 179 -336 -56 -88 -183
4371 -183 46 -238 -293 -146 -328 -288 -84 155 -407 -146 19 -87 -40 373 -18 -7 -10 87 -8 262 190 -96 226
4394 226 247 47 -68 305 241 22 245 320 202 496 141 219 540 -141 -60 338 255 12 173 -173 -119 165
4416 165 -331 -514 101 -49 -78 -24 -123 -89 -260 -82 -180 -113 -32 -148 -247 325 -199 -61 -133 -3 -59 177 24
4439 24 -137 321 133 -220 116 105 -242 -382 58 -55 -254 206 -97 -290 -89 71 -64 -84 -357 -137 119
4460 119 -321 16 110 82 33 234 -23 12 -25 -40 69 249 14 91 91 288 225 -19 270 -24 66 580 -246 38
4484C8K11l35J4M06l18k25J12M46m37j8J87m6p8k9k21M29l61J96Oj05J37k77N29
4507B61n74J20J22J3m00N83J44n08L7L11m29M74j16k06M51n8k61K05J56k93p8
4528d6L73k83J02L11k36j97J65k44J59k36J88Oj22J99q7L81m56j12q0j03k00M81
4550c7K36m60L4K17k16j0O0L6j93K95j45K63q5k86R3j13J59J65L63M4k14J29n13
4573a78P4J92k33J50K53J05k62J01n0K19m02R0q5K12m8l43L07j10k50p5P8o8K02
4596a21O4l24L1p7M74k82L8O44m32k25K00J50J03j76J39ml29K42J66K29l50j01
4618E9M1J28M08n15K17j87k4q5l06J17J59k67J19l9k42L92k15K85k52M9n5j96
4640d09L31j82R3K81k86K36m14N20l36q5M21j03LK09j14l38L80j69k6L02l14J4
$$ plain form
4484 38 249 -86 -72 334 16 -209 -97 349 -88 -106 81 35 -43 -72 -293 136 -225 -29 -23 -128 9 -268 261
4507 261 -313 -193 -71 -58 -458 125 269 -239 -202 109 -320 154 38 -168 283 225 -36 169 325 32 -46
4528 -46 327 44 146 457 221 24 189 -55 104 -132 56 62 -60 139 52 433 -23 -135 -215 -318 -518 -37
4550 -37 199 -261 -227 -10 -226 -236 -176 -140 -333 -38 -183 80 -5 -291 -198 -311 -152 13 376 420 206 335 -178
4573 -178 -104 88 -145 5 258 363 101 202 152 371 -31 59 -26 186 138 -205 102 -8 -258 -333 -255 -323 -121
4596 -121 -57 -381 -350 -427 47 -235 -197 447 15 -210 -10 140 243 67 206 202 -127 115 281 510 160 59
4618 59 100 228 636 121 338 151 127 42 -264 -147 12 -255 -136 -175 -417 -25 -240 45 -207 -158 -213 -409
4640 -409 -78 -260 -167 114 -172 64 -350 170 -166 -251 170 67 70 279 165 -173 207 38 12 314 0 14
4662A4j23K1R7j24L74k38j98M73o81K18J76l65K28J59k2j26j47JL12P7j00m00
4684c74L81K11m65K29o8k28L65r1m08O67k48j00J81K32l53m4K27j37l2J42r5J38
4706A30k03J75l81J37L16l69K40k13J57J11j62J99q9J96l01k12N97n08q7L11k03
4727a59J43L11n27J71K15l37k69L87K06l85K06J7k69L83l10K41L4L50j90n75O41
4748B84Kl05K2k06J72J72L2p9J60j07j28q3K93n73J99n3lK16j37K40k84J84k57
4771b39K70%j01j37M02l58L0K64ol10kK06J35j56r5j14M70l38O9J52l8j33l0K27
4795A68k27M19r2l63J03K27lj05j41L84q58O97k85J45r0K55m90J71R0j80J41J80
4817A46j86J06l99J17J72M4j49j39M67l60Q9K72k83K15j11L3P4P6j45n8J06j92
$$ plain form
4662 14 -109 -88 9 -115 259 21 -177 296 -385 -167 9 -356 -128 31 9 -117 -264 -263 49 126 26 -374
4684 -374 7 218 -247 -18 -86 -314 51 -40 -448 219 -29 -129 52 284 -69 -113 114 -23 -55 87 -8 130
4706 130 -73 102 -279 -142 174 -195 45 -168 -11 100 -62 137 48 244 -57 -269 328 -180 -267 44 -159
4727 -159 -16 295 -232 -61 154 -183 -452 -65 141 -244 -38 -21 -290 93 -217 24 58 408 218 -357 284
4748 284 286 -19 3 -203 -31 141 173 94 254 147 19 -64 229 -344 -145 -198 -201 15 -122 118 -166 18 -239
4771 -239 31 31 -70 -207 195 -163 -133 131 125 -185 -187 19 154 -2 -97 -211 259 -79 -10 142 104 -29 -59 168
4795 168 -59 360 268 -95 8 235 232 127 -14 370 -488 209 -76 69 -21 234 -256 -85 5 -175 -34 146
4817 146 -40 66 -333 -216 -44 0 -149 -288 179 -181 -92 180 -103 112 1 34 108 184 39 -19 87 -105
4839a05R5J35J10l76J58k38K51J66r9l40K93P2o6m3j02k1p6J39M8l4Q4K7J49j24
4863A03j99L04o6m3K3O7j79q9m4J72K0q1J21k43K00j78K73j03o8J56p0M6k28k4
4887a30K40J48o12J44n7l3L38r6K51k08K09N0Pj11j30j40K01K71k18k10K00R8
4909B12k22J95k40J17j42J26M5j56l5J58k11L40m37M20j53p4K22k94o1M02Nj00
4931A17j14P8Mj57p1J92J17k23J39l49P34m80j75O8l6K72l6j88j6K93l10J38j94
4954a97O8K2J23Kk04K11O6k38JK05j04j2J83j60K20k84n5L26l01K11J79j21k40
4977i9J59J24o4k27L02j68k02L46l43J54L36k45k39L72k19k08J4K59J04k11j64
4998b19J5R2J62J40l04K12j74M5J58P8n87K84M56l32l2J98J19k68L4k97K75M9
$$ plain form
4839 -105 -10 125 235 -141 17 -221 30 196 97 -243 50 122 56 13 -89 -110 -186 -47 1 -33 51 78 227 103
4863 103 -96 208 142 99 122 189 10 -79 -123 49 69 -12 109 -134 66 -112 161 58 -10 146 76 122 -106 -130
4887 -130 110 258 -354 -210 -267 -300 38 -58 193 -15 194 244 251 140 10 -130 71 342 124 -86 114 212
4909 212 -10 185 -55 62 -80 46 91 -65 -100 58 -153 187 -250 170 17 -57 165 -129 -190 212 217 117
4931 117 3 81 85 -72 -143 49 166 -57 82 -267 467 -13 -188 -120 -156 116 80 -108 -124 169 -141 -3 -197
4954 -197 -129 -107 16 18 -186 25 91 -147 -146 59 -45 -57 126 -34 186 -98 -153 173 -128 83 262 141 -99
4977 -99 60 184 120 -107 195 27 -175 171 -172 -18 318 73 -166 206 -13 -221 -207 52 156 -55 -219
4998 -219 -204 -112 50 190 -114 98 -76 -31 127 205 -382 -98 358 26 -6 192 311 43 77 -220 55 104
5020A04K9j43j45Q1M46m47L6m6J17j94J70j44M16q4r8N2k66L62l01P7K36l01K59
5043B16n13N61k8k80r9J49k10J28J64k44K44k8k65K35K8o3J07k49N1K3J61l14
5065b26K20J48l95k0j53L70k28M66k94j10J98j35K60J13k73K4q8K4k75L42K23
5086A91k35K04LOO5j96O4j15n8Q3l49J30o3pK77J7l41L88l4j32J58PK6J71j95
5111F5k52K94Lj62J57p7J94n0r0k23N3K74k65L16l53M38m21K45j38m6M65n21L5
5134e9j24J85k43L60j55j67J49N3k21M7K31k69L04q0m2k00J95l30K90m0P3q3J73
5157D7r5j84L74j37j30L7K03l24M20j30k94L63P6k26l1p8J79K02l09P6j67K02
5179G4j69k39O55l90N3K61m2j32k64Q5K62l8k54J35j11K25l94N23K52m55K52l5
$$ plain form
5020 104 133 -10 -155 -74 372 -75 -39 -85 32 -162 8 -136 280 196 98 150 -116 246 -55 22 258 -43 216
5043 216 -297 264 236 -44 -143 6 -204 -76 88 -156 88 60 -205 30 58 -5 102 -147 -96 -73 88 -226
5065 -226 -6 142 -253 -273 -426 -56 -284 182 -112 -222 -24 -159 101 214 -59 -35 -123 -99 -374 -32 191
5086 191 -44 160 163 169 234 38 102 -13 -71 12 -337 -207 -270 -277 0 17 -324 64 30 -102 56 63 89 260 65
5111 65 -187 107 110 -52 105 28 222 172 82 -141 -88 186 -79 237 -116 322 -99 146 8 -38 427 -94 -59
5134 -59 -183 2 -241 119 -36 -203 -54 -1 -222 -175 56 -213 91 11 -31 -231 -36 -366 -76 -116 -43 -126 47
5157 47 -48 -232 142 5 -125 -88 115 -209 211 81 -213 150 226 0 -31 -109 70 272 -37 39 -128 74
5179 74 -95 -334 321 -69 -16 245 203 71 -193 -108 154 116 -138 -3 -114 111 -283 240 492 37 289 254
5201B54k22K29N8j92N8k25j38j23L29m5k05J77J49j84Kn8M1j0L57n36K91J88k57
5224f2M0Lj30M25k30k01J13J90k66J88n8J23p9j91k01K65K29l04J38j10p2l9K50
5247B1j90J63N3n6%K43j21J69k62J80P3k92P7K61j92j7K4k57j33J60r2K11K27
5270B50m54L45j71q8m9o2n9K31J06j65MN3K60k76o7O3j20k10P86l51N1n6K4Q1
5294A26Kj55K9J29k8n3k10M56m35Q1J62l43L85j2m73L04%O9r7l3K59l05K79j7
5318A20K3k71k4K1Q4j07k5J79J63m60J47J98Kj25J16L6k69K76j40J07QK94m10
5341e7k0K79J4n0m1q7J0O4l81L57j89l6j7J90j07n6N2k85K58R0r1J13M3j58q3
5366a88L31p3q5K42l01j27M10q9k38J50K47j23j44K74k73L05k81k7K01m46K54
$$ plain form
5201 254 32 261 319 127 185 -40 -178 -301 28 -17 -222 -45 104 -80 -78 -136 -95 -105 252 -284 7 195 -62
5224 -62 -22 -19 -149 276 46 -155 -42 148 -118 70 12 135 56 -135 -336 -71 158 -146 -8 -118 -190 -229 21
5247 21 -169 -6 47 -9 -9 234 113 282 20 200 273 -19 58 319 127 110 134 -123 -256 -96 -188 23 250
5270 250 -204 141 -30 -118 -167 -229 -288 -57 49 -116 -112 -59 201 -75 -142 -79 -199 -409 377 26 77 21 45 126
5294 126 128 -27 2 131 103 50 -160 296 -139 -58 104 -239 146 134 -339 -35 -35 34 -63 -96 163 -142 137 120
5318 120 143 -128 -152 -131 -47 -154 -179 0 163 -297 -150 48 50 -75 41 77 -192 84 -56 51 59 353 -57
5341 -57 -77 202 216 166 125 38 48 112 -269 88 -101 -137 -154 36 -71 -127 -75 -360 -102 -12 -103 10 53 -105 -188
5366 -188 143 70 -15 227 -74 -201 209 120 -118 32 279 156 12 286 13 318 37 10 211 -235 19
5387A9J78j46k81j56L71j15k4J23M6J55L6k77o9K77p3r0J58J5k51K34k32O4J86
5410A48m63L26J49m3j62o3K06k34K27j70K24j86N6N4k50J29K8k63L23m7J53k05
5432f3k22J99J18Qm16J81L10O1j99j64M29k58M01P8j18j67M3k43k39L55r5J3K11
$$ plain form
5387 19 197 51 -230 -386 -15 -130 -154 -31 15 170 206 -71 -140 137 64 -26 132 147 -104 130 -102 -38 148
5410 148 -315 11 160 117 -45 -108 98 -136 91 -79 145 -41 15 69 -181 -52 -24 -287 36 -11 142 -63
5432 -63 -285 -86 32 40 -376 -195 115 176 -23 -187 242 -16 385 463 345 178 221 -22 -261 94 -1 12 223
$$ [...]
8191h8
##END NTUPLES=NMR FID
##END=
