##TITLE=1H_BAU-j-GID
 CDCl3, 8 sc, 
 2.7.2019
##JCAMPDX= 6.0         $$ Bruker NMR JCAMP-DX V2.0
##DATA TYPE= NMR FID
##DATA CLASS= NTUPLES
##ORIGIN= UXNMR, Bruker Analytische Messtechnik GmbH
##OWNER= root
$$ XWIN-NMR		Version 3.5
$$ Tue Jul  2 14:48:01 2019 Russian Standard Time (UT+4h)  she@DPX200
##.OBSERVE FREQUENCY= 200.13155
##.OBSERVE NUCLEUS= ^1H
##.DELAY= (6, 6)
##.ACQUISITION MODE= SIMULTANEOUS
##.ACQUISITION SCHEME= undefined
##.AVERAGES= 8
##.DIGITISER RES= 18
##SPECTROMETER/DATA SYSTEM= spect
##.PULSE SEQUENCE= zg30
##.SOLVENT NAME= CDCl3
##.SHIFT REFERENCE= (INTERNAL, CDCl3, 0, 15.7039)
##AUDIT TRAIL= $$ (NUMBER, WHEN, WHO, WHERE, WHAT)
$$ ##TITLE= Audit trail, XWIN-NMR		Version 3.5
$$ ##JCAMPDX= 5.01
$$ ##ORIGIN= Bruker BioSpin GmbH
$$ ##OWNER= she
$$ F:/spectra/data/she/nmr/H-F/1/audita.txt
$$ ##AUDIT TRAIL=  $$ (NUMBER, WHEN, WHO, WHERE, WHAT)
(   1,<2019-07-02 14:47:13.54 +0400>,<she>,<DPX200>,
      <created by zg, POWCHK disabled, PULCHK disabled
       configuration hash MD5:
       00 E9 B6 7A A2 85 ED C7 34 08 36 98 17 FE 4E 26
       data hash MD5: 16K
       21 87 4E B0 B5 C6 C4 82 D5 90 A6 1E AE A3 BF 92>)
$$ ##END=
$$ 
$$ hash MD5
$$ 15 E0 A2 D4 B3 6A DF 6F A2 74 78 1B 3B 23 80 65
##$RELAX= 
##$RELAX= 
##$RELAX= 
##$RELAX= 
##$RELAX= 
##$RELAX= 
$$ Bruker specific parameters
$$ --------------------------
##$DU= <F:/spectra>
##$EXPNO= 1
##$NAME= <H-F>
##$PROCNO= 1
##$TYPE= <nmr>
##$USER= <she>
##$AMP= (0..31)
100 100 100 100 100 100 100 100 100 100 100 100 100 100 100 100 100 100 
100 100 100 100 100 100 100 100 100 100 100 100 100 100 
##$AQSEQ= 0
##$AQ_mod= 1
##$AUNM= <au_zg>
##$AUTOPOS= <>
##$BF1= 200.13
##$BF2= 200.13
##$BF3= 200.13
##$BF4= 200.13
##$BF5= 200.13
##$BF6= 200.13
##$BF7= 200.13
##$BF8= 200.13
##$BYTORDA= 1
##$CFDGTYP= 0
##$CFRGTYP= 5
##$CHEMSTR= <none>
##$CNST= (0..31)
1 1 145 1 1 1 1 1 1 1 1 1 1 1 1 1 1 1 1 1 1 1 1 1 1 1 1 1 1 1 1 1 
##$CPDPRG= <>
##$CPDPRG1= <>
##$CPDPRG2= <>
##$CPDPRG3= <>
##$CPDPRG4= <mlev>
##$CPDPRG5= <mlev>
##$CPDPRG6= <mlev>
##$CPDPRG7= <mlev>
##$CPDPRG8= <mlev>
##$CPDPRGB= <>
##$CPDPRGT= <>
##$D= (0..31)
0 1.2 0 0 0 0 0 0 0 0 0 0.03 0 0 0 0 0 0 0 0 0 0 0 0 0 0 0 0 0 0 0 0 
##$DATE= 1562064432
##$DBL= (0..7)
120 120 120 120 120 120 120 120 
##$DBP= (0..7)
150 150 150 150 150 150 150 150 
##$DBP07= 0
##$DBPNAM0= <>
##$DBPNAM1= <>
##$DBPNAM2= <>
##$DBPNAM3= <>
##$DBPNAM4= <>
##$DBPNAM5= <>
##$DBPNAM6= <>
##$DBPNAM7= <>
##$DBPOAL= (0..7)
0.5 0.5 0.5 0.5 0.5 0.5 0.5 0.5 
##$DBPOFFS= (0..7)
0 0 0 0 0 0 0 0 
##$DE= 6
##$DECBNUC= <off>
##$DECIM= 24
##$DECNUC= <off>
##$DECSTAT= 4
##$DIGMOD= 1
##$DIGTYP= 9
##$DL= (0..7)
0 120 120 120 120 120 120 120 
##$DP= (0..7)
150 150 150 150 150 150 150 150 
##$DP07= 0
##$DPNAME0= <>
##$DPNAME1= <>
##$DPNAME2= <>
##$DPNAME3= <>
##$DPNAME4= <>
##$DPNAME5= <>
##$DPNAME6= <>
##$DPNAME7= <>
##$DPOAL= (0..7)
0.5 0.5 0.5 0.5 0.5 0.5 0.5 0.5 
##$DPOFFS= (0..7)
0 0 0 0 0 0 0 0 
##$DQDMODE= 0
##$DR= 18
##$DS= 0
##$DSLIST= <SSSSSSSSSSSSSSS>
##$DSPFIRM= 0
$$ [...]
##$SUBNAM2= <"">
##$SUBNAM3= <"">
##$SUBNAM4= <"">
##$SUBNAM5= <"">
##$SUBNAM6= <"">
##$SUBNAM7= <"">
##$SUBNAM8= <"">
##$SUBNAM9= <"">
##$SW= 24.9336996594482
##$SWIBOX= (0..15)
0 0 2 0 0 0 0 0 0 0 0 0 0 0 0 0 
##$SW_h= 4990.01996007984
##$TD= 16384
##$TD0= 1
##$TE= 0
##$TE2= 300
##$TE3= 300
##$TEG= 300
##$TL= (0..7)
0 120 120 120 120 120 120 120 
##$TP= (0..7)
150 150 150 150 150 150 150 150 
##$TP07= 0
##$TPNAME0= <>
##$TPNAME1= <>
##$TPNAME2= <>
##$TPNAME3= <>
##$TPNAME4= <>
##$TPNAME5= <>
##$TPNAME6= <>
##$TPNAME7= <>
##$TPOAL= (0..7)
0.5 0.5 0.5 0.5 0.5 0.5 0.5 0.5 
##$TPOFFS= (0..7)
0 0 0 0 0 0 0 0 
##$TUNHIN= 0
##$TUNHOUT= 0
##$TUNXOUT= 0
##$USERA1= <user>
##$USERA2= <user>
##$USERA3= <user>
##$USERA4= <user>
##$USERA5= <user>
##$V9= 5
##$VALIST= <valist>
##$VCLIST= <CCCCCCCCCCCCCCC>
##$VD= 0
##$VDLIST= <DDDDDDDDDDDDDDD>
##$VPLIST= <PPPPPPPPPPPPPPP>
##$VTLIST= <TTTTTTTTTTTTTTT>
##$WBST= 1024
##$WBSW= 4
##$XGAIN= (0..3)
0 0 0 0 
##$XL= 0
##$YL= 0
##$YMAX_a= 33521
##$YMIN_a= -68406
##$ZGOPTNS= <>
##$ZL1= 120
##$ZL2= 120
##$ZL3= 120
##$ZL4= 120
##$ABSF1= 10
##$ABSF2= 0
##$ABSG= 5
##$ABSL= 3
##$ALPHA= 0
##$AQORDER= 0
##$ASSFAC= 0
##$ASSFACI= 0
##$ASSFACX= 0
##$ASSWID= 0
##$AUNMP= <proc_1d>
##$AZFE= 0.1
##$AZFW= 0.1
##$BCFW= 1
##$BC_mod= 2
##$BYTORDP= 1
##$COROFFS= 0
##$CY= 11.3945322036743
##$DATMOD= 1
##$DC= 2
##$DFILT= <>
##$DTYPP= 0
##$F1P= 18.9103706918063
##$F2P= -1.10871071338519
##$FCOR= 0.5
##$FTSIZE= 0
##$FT_mod= 4
##$GAMMA= 1
##$GB= 0.15
##$INTBC= 1
##$INTSCL= 1
##$ISEN= 128
##$LB= 0.24
##$LEV0= 0
##$LPBIN= 0
##$MAXI= 10000
##$MC2= 0
##$MEAN= 0
##$ME_mod= 0
##$MI= 1.114404
##$NCOEF= 0
##$NC_proc= 0
##$NLEV= 6
##$NOISF1= 3.799351
##$NOISF2= 2.8
##$NSP= 1
##$NTH_PI= 0
##$NZP= 0
##$OFFSET= 15.70392
##$PC= 1
##$PHC0= -8488.189
##$PHC1= -5.599028
##$PH_mod= 1
##$PKNL= yes
##$PPARMOD= 0
##$PSCAL= 0
##$PSIGN= 0
##$REVERSE= no
##$SF= 200.130013532006
##$SI= 16384
##$SIGF1= 3
##$SIGF2= 2
##$SINO= 400
##$SIOLD= 16384
##$SREGLST= <1H.CDCl3>
##$SSB= 0
##$STSI= 0
##$STSR= 0
##$SW_p= 3612.71676300578
##$SYMM= 0
##$S_DEV= 0
##$TDeff= 0
##$TDoff= 0
##$TI= <>
##$TILT= no
##$TM1= 0
##$TM2= 0
##$TOPLEV= 0
##$USERP1= <user>
##$USERP2= <user>
##$USERP3= <user>
##$USERP4= <user>
##$USERP5= <user>
##$WDW= 1
##$XDIM= 8192
##$YMAX_p= 0
##$YMIN_p= 0
$$ End of Bruker specific parameters
$$ ---------------------------------
##NTUPLES= NMR FID
##VAR_NAME=  TIME,          FID/REAL,        FID/IMAG
##SYMBOL=    X,             R,               I
##VAR_TYPE=  INDEPENDENT,   DEPENDENT,       DEPENDENT
##VAR_FORM=  AFFN,          ASDF,            ASDF
##VAR_DIM=   8192,          8192,            8192
##UNITS=     SECONDS,       ARBITRARY UNITS, ARBITRARY UNITS
##FACTOR=    0.0002004,     1,               1
##FIRST=     0,             0,               0
##LAST=      1.6414764,     0,               0
##MIN=       0,             -68406,          0
##MAX=       1.6414764,     33521,           0
$$ Real data points
##PAGE= N=1
##DATA TABLE= (X++(R..R)), XYDATA
0 0 0 0 0 0 0 0 0 0 0 0 0 -8 8 -8 8 -8 16 -16 16 -24 24 -32 35 -40 47 -54 61 -70 78 -87 100 -112 125 -140
34 -140 156 -176 195 -217 241 -265 295 -327 361 -400 443 -490 546 -609 677 -761 858 -972 1116
53 1116 -1294 1523 -1838 2289 -3002 4305 -7459 33521 7195 -41702 19857 31600 -5682 -12850
67 -12850 20383 3589 -24088 -9423 13735 -6821 -18160 2405 8463 -19057 -20878 7421 12927
80 12927 -13249 -16370 4703 7400 -9860 -7585 6579 3295 -9101 -3316 6716 123 -8195 359
94 359 7092 -2311 -8404 1891 7771 -1305 -6980 1211 6683 927 -2119 2465 3787 -314 109 4886
110 4886 4254 -245 188 4592 3031 -1620 805 5710 2949 -3494 -2009 3497 2319 -1838 -930 1420
126 1420 -746 -2677 70 1539 -979 -1869 195 238 -2051 -1508 1274 1229 -2226 -2942 -413 529 -1199
143 -1199 -2043 -1391 -1232 -1383 -1692 -1747 -1331 -1194 -1564 -1752 -856 -345 -510 -134 775 -403 -635 1558 2802
162 2802 951 -684 1753 3569 1511 34 2833 3434 955 114 2617 3105 510 378 2474 1388
178 1388 -926 623 2602 137 -1884 328 1779 -1313 -2158 836 891 -2784 -2758 774 -162 -3564 -2613
195 -2613 655 -1177 -4264 -2217 873 -1526 -4081 -1622 466 -1559 -2987 -414 723 -1229 -1338
210 -1338 935 1239 -414 208 2402 1489 -354 1400 3448 1476 -415 1759 3895 1467 -488 1657
226 1657 3404 1125 -599 1379 2750 794 -568 1143 1724 118 -663 1140 822 -1444 -1134 828
242 828 -116 -2069 -1149 719 -1021 -2891 -1176 385 -1317 -3064 -1320 46 -1842 -2793 -749 -73
258 -73 -1834 -2218 -152 -90 -1708 -1285 576 -62 -1407 -287 1537 357 -870 540 2177 838 -239
275 -239 1197 2586 1268 -35 1462 2460 942 226 1559 2141 966 218 1503 1752 511 -58 975
292 975 760 -278 -225 1079 130 -936 -822 326 -381 -2041 -1175 -37 -999 -2516 -1376 -435 -1482 -2233
310 -2233 -1361 -424 -1308 -2308 -1115 -233 -1275 -1775 -307 90 -898 -940 634 648 -529 -371 1204 791
328 791 -238 287 1758 1426 171 793 2318 1658 385 1155 2193 1512 526 1257 1605 760 66 1403
346 1403 1155 82 -44 961 660 -787 -806 649 89 -1616 -1303 350 -251 -2000 -1634 -214 -767 -2227
364 -2227 -1698 -377 -844 -1964 -1486 -436 -927 -1738 -700 -119 -884 -1354 -85 211 -747 -753 805 691 -340
383 -340 64 1454 1409 -47 259 1895 1704 528 796 2065 1496 471 1093 1808 1172 279 1026 1532 500
402 500 -79 1089 1217 -131 -516 722 698 -968 -1020 306 273 -1494 -1496 -162 -211 -1939 -1648 -338 -910
421 -910 -1864 -1401 -578 -1134 -1578 -1028 -161 -1310 -1434 -290 110 -954 -790 376 636 -483 -404 1130 1096
440 1096 -53 165 1609 1480 429 733 1642 1560 622 786 1773 1374 634 963 1795 681 110 978 1424
459 1424 163 -242 838 882 -423 -618 348 402 -821 -1285 -185 -172 -1486 -1486 -470 -612 -1661 -1442 -385
478 -385 -924 -1720 -1155 -336 -1202 -1638 -581 -64 -1031 -1206 -95 269 -820 -1097 554 1023 -192 -431 1002
497 1002 1266 199 114 1120 1554 555 756 1484 1314 471 915 1437 961 392 1092 1296 755 -10 774 1141
517 1141 68 -406 737 816 -598 -985 159 370 -1019 -1217 -408 -268 -1273 -1424 -697 -556 -1476 -1426 -579
536 -579 -1123 -1533 -774 -449 -1103 -1340 -430 142 -649 -986 -186 347 -474 -538 408 1069 -58 -144 936 1092
556 1092 383 275 1234 1019 515 1057 1520 1033 596 978 1520 657 284 953 1087 427 -56 702 964 6
576 6 -607 385 441 -483 -868 -251 -47 -934 -1173 -640 -549 -1251 -1224 -711 -965 -1390 -799 -518 -1092 -1604 -546 -39
598 -39 -981 -1277 -117 134 -704 -828 237 504 -131 -113 751 677 -44 699 1241 728 415 891 1379 938 254
619 254 1205 1364 591 460 1282 1371 339 282 1014 898 150 -262 733 402 -418 -472 318 -167 -924 -824 -265
640 -265 -643 -1074 -735 -454 -1035 -1404 -710 -384 -1265 -1539 -625 -252 -1205 -1555 -322 55 -855 -1241 -63 140
660 140 -404 -446 319 463 -122 134 760 548 138 677 1211 674 284 965 1666 1101 133 1228 1706 443
680 443 117 1081 1599 263 21 591 773 115 -419 186 362 -535 -646 -164 -127 -602 -561 -233 -683 -1184 -755
701 -755 -355 -850 -1279 -883 -410 -767 -1332 -741 109 -585 -1353 -585 163 -237 -1003 -325 239 -140 -416 277
721 277 543 138 347 971 950 465 397 1100 1003 520 671 1508 1079 15 536 1583 1061 233 450 1278 471
742 471 -347 260 682 170 -445 -75 338 -162 -624 -278 -252 -679 -938 -370 -722 -1196 -989 -363 -797 -1460 -943
763 -943 -416 -646 -1260 -798 -220 -363 -947 -804 128 116 -460 -235 325 74 -113 415 534 364 317 728 921
784 921 464 375 1100 1357 392 268 1115 1269 607 298 934 919 -3 220 709 453 -149 47 445 -274 -534
805 -534 -71 230 -385 -692 -382 -414 -809 -1033 -395 -362 -1281 -1173 -574 -667 -1210 -1054 -306 -400 -1103 -894 -168 -123
827 -123 -499 -408 100 243 -233 22 628 196 -30 574 761 588 347 1047 1079 281 423 1021 1002 398 277
848 277 963 1200 526 251 848 824 -29 178 601 193 -193 160 303 -239 -498 -170 -194 -665 -824 -386 -416
869 -416 -1128 -1083 -303 -411 -1008 -1288 -440 -684 -935 -776 -338 -501 -781 -541 -172 -266 -414 -27 225 95 163
890 163 421 499 249 308 871 934 278 408 1166 1167 339 407 1153 1096 348 366 775 897 354 324 611 442 35
913 35 414 621 -242 -241 -71 66 -623 -406 -53 -203 -1072 -905 -312 -468 -1015 -1163 -313 -419 -974 -704 -320
934 -320 -564 -815 -525 -242 -614 -638 -87 -37 -417 -375 158 291 18 -11 582 793 189 358 844 706 414 612
956 612 936 910 481 591 1092 717 307 401 869 482 257 325 345 313 -28 231 94 -440 -701 30 -103 -641
978 -641 -786 -279 -195 -986 -865 -494 -329 -1082 -691 -485 -583 -926 -607 -311 -561 -713 -144 -109 -507 -861 191
999 191 137 -383 -237 515 675 -21 -108 671 571 37 420 945 739 510 717 920 721 637 701 814 386 349
1021 349 753 559 86 56 381 582 3 -183 214 183 -465 -487 -264 -25 -695 -771 -332 -398 -885 -928 -379 -646
1043 -646 -672 -777 -514 -689 -881 -720 -285 -626 -685 -165 95 -603 -464 255 474 -273 -219 547 622 343 228
1064 228 839 782 450 357 719 803 448 758 902 638 481 601 819 377 98 480 430 170 47 209 191 -257
1086 -257 -202 -45 -66 -639 -513 -265 -213 -562 -758 -468 -393 -964 -703 -466 -727 -843 -440 -464 -530 -626 -385 -168
1108 -168 -359 -695 -43 188 -171 -127 279 466 200 136 351 544 405 406 873 596 452 607 624 566 535 588 762
1131 762 362 514 728 718 338 199 487 193 -160 -200 432 -43 -174 -747 -54 -126 -460 -860 -526 -415 -771
1152 -771 -542 -458 -440 -1021 -709 -527 -655 -756 -446 -430 -629 -459 -314 -146 -326 -402 9 332 96 -75 223
1173 223 488 258 149 430 678 289 475 651 643 528 578 879 593 321 618 866 514 212 419 596 423
1194 423 -113 242 377 125 -322 -97 227 -161 -448 -394 -223 -696 -565 -634 -669 -439 -773 -463 -626 -701 -424
1215 -424 -540 -497 -660 -558 -239 -291 -330 -47 97 -244 -379 55 490 219 219 344 430 458 132 453 659 625 391
1238 391 861 640 507 708 705 594 336 458 663 609 126 119 582 140 -166 -35 190 -91 -157 -271 -405 -297
1260 -297 -405 -314 -412 -784 -465 -263 -832 -627 -667 -214 -841 -621 -539 -171 -600 -743 -296 -174 -234 -416 -290 22
1282 22 4 203 182 175 153 257 418 554 595 469 474 354 386 569 576 507 237 608 744 211 365 326 433 281 41
1307 41 141 307 165 -192 50 2 -260 -392 -174 -218 -370 -527 -269 -462 -529 -753 -222 -560 -898 -537 -538 -447
1329 -447 -960 -534 -93 -315 -582 -195 -50 -225 -206 15 238 41 82 284 424 198 161 613 373 382 557 792
1351 792 837 194 691 993 547 92 427 801 359 85 252 536 176 18 177 184 60 -264 -60 -280 -270
1372 -270 -426 -292 -253 -571 -452 -302 -470 -654 -663 -302 -443 -729 -665 -332 -91 -478 -515 -164 -285 -331 -309 98
1394 98 159 19 14 496 261 217 396 531 388 376 569 661 346 434 704 803 410 399 703 377 376 423 714 437
1418 437 221 181 332 -3 44 -221 -95 -269 -66 -330 -295 -310 -405 -241 -335 -724 -547 -247 -479 -610 -635 -491
1440 -491 -285 -675 -578 -45 -156 -414 -419 -10 -72 -253 -94 51 -71 19 -60 317 330 270 294 470 258 379 527
1463 527 566 473 218 525 523 309 334 517 424 285 97 416 131 84 97 153 -76 15 -24 -45 -420 -165 -296 -299 -432
1488 -432 -740 -208 -361 -584 -722 -485 -357 -587 -685 -240 -281 -327 -514 -366 -142 -187 -445 -101 37 173 104 133
1510 133 139 224 345 296 325 271 734 527 147 317 648 743 426 283 548 773 442 237 575 507 300 22 186
1533 186 80 7 132 -11 -240 -253 -70 -614 -394 -374 -335 -379 -565 -383 -128 -236 -609 -518 -420 -653 -400 -507
1555 -507 -368 -341 -221 -194 -285 -284 -254 -125 -69 68 135 82 250 105 250 471 524 285 300 463 658 440 408 426
1579 426 541 372 210 437 466 335 265 186 335 180 51 164 -90 -17 149 94 -213 -147 -172 -63 -374 -406 -469
1602 -469 -334 -469 -551 -445 -485 -654 -520 -296 -253 -265 -326 -214 -234 -145 -311 -241 -24 -259 -87 301 -122 75 372
1625 372 362 421 292 351 683 359 379 353 584 557 413 405 413 600 576 346 347 320 75 310 77 72 110 314 -151 -231
1651 -231 -101 -64 -294 -497 -371 -200 -307 -546 -381 -335 -406 -640 -559 -468 -433 -645 -175 -362 -394 -317 -376 -274 -270 -148
1675 -148 -81 -105 -70 206 272 34 61 266 518 280 153 650 522 429 299 510 669 370 495 486 410 233 371
1698 371 334 274 248 246 175 -124 -163 -74 100 -344 -216 -276 -108 -116 -333 -528 -207 -393 -497 -306 -345 -567 -584 -525 -510
1723 -510 -215 -112 -393 -398 -142 -172 -30 -257 -220 -141 180 195 -139 369 359 324 37 543 462 327 199 425 589
1746 589 264 158 210 485 276 355 543 250 265 238 206 149 83 147 21 -107 -247 136 178 -212 -475 -98 -86
1769 -86 -370 -486 -304 -300 -464 -509 -348 -377 -329 -348 -346 -358 -477 -322 -35 -193 -297 -240 124 -46 -151 113 252 66
1793 66 -74 438 370 341 300 535 265 262 368 377 219 356 414 482 477 72 403 406 210 112 133 347 182 -198 -71
1818 -71 190 -30 -270 -439 -63 -204 -290 -463 -311 -291 -525 -603 -502 -417 -383 -158 -333 -445 -275 -94 -188 -371
1840 -371 -10 14 -299 -308 -20 315 142 37 115 235 309 206 153 220 383 382 369 203 226 369 418 151 -78 237
1864 237 264 232 135 255 482 -7 96 174 228 240 -109 -109 -41 -41 -297 -314 -173 -348 -297 -414 -479 -547 -422 -175 -244
1889 -244 -449 -477 -171 -375 -452 -358 -107 -238 -394 -105 -53 144 -110 86 58 107 -163 274 61 304 251 291 314
1912 314 175 615 405 350 344 419 379 414 260 281 508 292 181 86 33 188 -176 -81 180 62 -32 -239 -176 -117
1936 -117 -224 -254 -339 -306 -385 -160 -108 -598 -372 -247 -299 -496 -223 -222 -90 -449 -441 -125 -260 -363 -181 11 68 31
1960 31 -56 107 321 226 295 389 187 413 283 186 171 353 625 337 205 343 311 441 43 265 276 -34 58
1983 58 -55 290 194 -231 -65 -56 11 -351 -230 -117 -274 -409 -334 -461 -392 -335 -321 -401 -309 -223 -140 -249 -261 -227 -199
2008 -199 -240 -347 -18 -33 -63 -207 -141 181 -42 34 279 147 146 215 334 142 398 422 577 365 344 341 548 570
2032 570 180 184 372 498 208 31 151 185 31 -51 -1 96 -152 -330 -153 -131 -222 -135 -234 -266 -273 -272 -100 -316 -505
2057 -505 -417 -259 -293 -441 -307 -397 -283 -465 -105 -165 -202 -119 -100 58 -47 -123 -68 171 11 189 323 160 48
2080 48 489 451 248 277 535 557 240 70 468 552 114 196 347 190 135 78 175 139 12 31 47 -243 -192 -4
2104 -4 -24 -262 -352 -270 -420 -267 -345 -113 -286 -418 -369 -485 -270 -452 -441 -350 -125 -240 -345 -71 -86 -126 -144 161
2128 161 181 -151 171 131 272 73 237 299 260 203 304 354 301 226 434 599 343 242 157 336 126 75 180
2151 180 214 135 26 108 -10 -249 -20 -48 -28 -276 -311 -297 -138 -267 -303 -144 -276 -364 -366 -300 -300 -575 -423 -124 -335
2176 -335 -456 -301 -57 -39 -152 -254 147 74 132 54 -178 51 226 191 140 124 282 114 114 418 288 412 238
2199 238 183 404 304 391 316 207 307 150 241 76 4 0 216 161 -30 -129 45 -36 -207 -42 -83 -238 -330 -508
2223 -508 -350 -279 -369 -485 -316 -155 -108 -211 -290 -233 -124 -216 -192 -234 30 -114 138 -219 -105 331 139 45 159
2246 159 310 -136 110 333 246 413 388 339 279 301 137 273 256 282 169 241 368 168 331 88 65 18 96 -100
2270 -100 -44 -55 -163 10 -204 -348 -182 -106 -225 -311 -421 -327 -79 -399 -376 -226 -472 -288 -301 -104 -293 -159
2292 -159 -34 -157 -98 -260 -266 165 -223 145 418 142 252 216 220 375 329 297 300 346 298 349 356 219 215 242 356 405
2318 405 136 70 148 -8 148 71 35 -235 -182 -99 -128 -137 -193 -161 -268 -251 -311 -479 -213 -453 -217 -250 -242 -326 -314 -119
2344 -119 -393 -319 -118 19 -281 -29 -83 163 -126 -241 136 52 103 97 89 347 247 64 259 263 333 388 300 227 294
2369 294 418 250 245 280 305 202 257 58 189 -13 81 -73 -122 -1 -20 -134 30 -250 -342 -389 -237 2 -232
2392 -232 -355 -229 -264 -168 -218 -435 -268 -140 -266 -360 -412 -291 31 -159 -115 -221 75 -65 71 -197 137 69
2414 69 115 42 25 438 230 407 204 194 492 230 103 192 249 133 392 244 219 43 271 223 0 239 68
2437 68 4 32 -156 4 93 -137 -162 -273 -195 -122 -370 -153 -169 -87 -292 -335 -414 -349 -189 -271 -197 -95 -142 -94 -144 -268
2463 -268 -111 -21 -152 -19 264 224 8 149 253 232 385 7 396 282 278 387 2 238 160 367 230 260
2485 260 97 222 184 219 116 -3 183 72 -104 -118 -104 -84 -254 -180 50 -307 -263 -193 -215 -417 -409 -205 -268 -192
2509 -192 -208 -310 -329 -258 -277 -123 -97 -229 -143 36 -39 11 197 56 32 48 234 157 152 163 235 139 81 298 184 132
2535 132 306 224 313 248 331 430 262 314 194 136 128 176 -41 -7 194 12 83 -29 62 78 -24 -372 -186 -134 -307
2560 -307 -247 -214 -302 -52 -88 -346 -341 -227 -274 -278 -214 -97 88 -179 -74 -133 32 -170 -207 217 174 176 -2 194 111
2585 111 179 42 315 237 228 291 205 374 297 457 284 132 222 262 146 159 69 133 217 2 -127 -70 -114 -231 -87
2610 -87 -151 41 -281 -136 -181 -76 -233 -169 -326 -227 -275 -307 -263 -392 -456 -221 -243 -217 -394 1 -313 -138 11 2
2634 2 148 -5 44 79 57 -3 114 146 27 182 207 285 383 96 377 352 117 222 298 308 67 -17 110 77 129
2659 129 177 221 -9 37 -7 -100 -247 41 -19 -270 -271 -297 -226 -291 -232 -326 -217 29 -381 -195 21 -123 -371 -313 -26
2684 -26 -107 -6 -414 -4 78 -69 -121 -156 113 -129 70 93 -38 354 252 274 295 122 488 224 277 204 342
2707 342 312 13 318 342 130 87 88 206 168 11 36 -154 1 -75 -109 -238 -66 -234 -8 -118 -372 -210 -305
2730 -305 -295 -348 -292 -154 -87 -251 -205 -294 -185 -281 -260 -219 -107 -70 -242 78 8 -100 -103 71 54 51 196 194 237 110
2756 110 254 242 97 354 281 265 39 24 225 300 139 274 87 227 96 -19 193 289 9 -48 -10 -238 -425
2779 -425 -111 -202 -172 -237 -260 -258 -327 -279 -242 -139 -229 -381 -399 -215 -132 -182 6 -281 -177 -247 -176 -242 89 102 -150 121
2805 121 -59 320 97 -28 319 255 248 -14 140 473 152 212 205 49 311 476 201 179 239 259 115 128 268
2828 268 96 67 -85 -52 110 -25 27 -286 31 -160 -106 11 -168 -303 -219 -154 -267 -90 -184 -172 -32 -374 -226
2851 -226 -181 -184 -217 -117 3 -3 -225 -125 81 114 -98 -130 -27 135 188 128 35 -52 174 407 291 303 230 196 306
2876 306 277 224 142 101 91 192 260 107 149 74 180 60 -124 -21 -135 40 -105 65 -212 -118 -130 -255 -315 -230
2900 -230 -160 -37 -351 -408 -29 -274 -312 -392 -174 -128 -137 -183 -248 -279 100 41 107 -57 95 18 10 112 105 215 177 -39
2926 -39 243 538 130 128 3 77 303 65 245 15 285 360 291 146 181 -75 82 174 -97 -48 56 50 -167 -105
2950 -105 -79 6 -84 -46 -174 -239 -337 -480 -260 -140 -210 -249 -172 -212 -391 -122 -114 -223 -166 -249 52 -228 -7 162 111
2975 111 -63 -7 206 130 157 166 376 429 93 287 411 337 77 272 123 136 -101 235 144 42 185 127 19
2998 19 -218 -1 -41 -135 7 -140 -97 -61 -139 -149 -299 -236 -222 -353 -159 -324 -184 -390 -119 -206 -243 -177 -271 22
3022 22 -191 -171 -287 48 -145 278 -63 -104 42 -97 -138 34 62 165 98 134 -10 67 89 69 210 164 123 113
3046 113 12 175 67 194 122 25 -62 -75 170 200 -10 98 164 -245 -99 -123 -81 -171 -142 -198 -224 -141 -7 -388
3070 -388 -273 -64 -227 -272 -159 -251 -61 -234 -217 -221 -212 25 -166 54 -41 -11 -57 -117 152 56 -197 146 19 241
3094 241 361 171 70 298 347 134 251 78 55 78 153 247 139 101 101 279 30 -79 283 -31 -53 -75 -25 187
3118 187 -138 -292 -68 -91 -189 -71 -268 -111 -284 -195 -145 -376 -305 -170 -51 -159 -179 -90 53 -336 20 -9 -25
3141 -25 -142 -99 282 -44 308 241 166 208 79 62 319 289 331 280 141 411 212 211 216 -1 171 107 144 21 28 -198
3167 -198 -20 51 -100 24 -46 -12 -139 -77 -118 -89 -81 -365 -132 -123 -131 -304 -373 -375 -289 -193 -250 -163 2 -175 -3 -215
3193 -215 -145 137 -167 -38 78 146 -8 120 118 149 -47 45 190 179 256 167 450 -40 305 334 82 304 158
3216 158 189 31 254 302 18 281 169 147 24 15 -164 -13 -114 -35 -105 26 -225 -223 -56 -72 -310 -186 -194 -249
3240 -249 -147 -214 -257 -77 -79 -251 -175 -150 -205 -123 91 60 -47 67 -8 26 3 223 197 37 57 83 -66 148 247
3265 247 331 134 17 166 182 295 49 266 0 273 154 -29 275 85 269 67 -169 -34 -8 28 -28 -187
3287 -187 -220 -143 -307 107 -210 -230 -199 -384 -87 -124 -316 -186 -206 -153 -135 67 -123 -165 -69 -306 -20 101 42 118
3311 118 -5 119 115 56 229 232 -7 142 416 25 69 193 220 227 360 305 268 189 219 -85 166 138 -38 -60 172
3336 172 51 7 22 -77 -116 -151 -77 -227 -310 -240 90 -248 -154 -166 -166 -269 -83 -3 -230 -89 30 -213 -28 -87 -57
3361 -57 -69 -108 -58 -48 31 64 23 66 29 92 51 107 43 209 84 114 232 136 146 93 24 119 116 80 24 91 86 127 103 94
3391 94 65 317 -20 -10 -84 32 -65 -13 -75 -162 -120 -98 -410 -227 -55 -267 -32 -134 67 52 34 -266 -130 -273
3415 -273 -58 -168 -146 -39 64 -95 188 -188 156 144 -122 -6 93 116 10 195 167 362 -18 331 274 -42
3437 -42 218 247 4 106 317 296 190 93 82 -19 57 -185 359 -33 -106 83 -242 -90 -50 2 -53 119 -69
3460 -69 -95 -198 -240 -187 -243 -125 -293 -317 34 -135 -141 -59 -75 96 -180 -161 120 189 7 -87 -72 226 77 -17 -74
3485 -74 202 279 134 238 -134 190 228 190 119 17 163 370 94 308 116 96 116 -8 -174 182 -70 -37 -48
3508 -48 -84 156 -48 28 -146 -179 105 -72 -245 -23 -95 -155 -175 -237 -137 -85 -99 -69 -194 -90 16 -150 -131 -153
3532 -153 -76 18 -66 100 53 122 -130 68 289 157 100 -93 312 321 -68 162 247 137 255 80 84 276 108 73
3556 73 168 172 109 107 33 -32 -36 -79 91 -217 3 -64 -170 -49 -361 -13 -110 -191 -265 -206 -81 -76 -249 -149 -104 -65 -250
3583 -250 -199 -49 -152 -120 -228 85 187 -85 -123 22 -59 144 61 -11 -127 105 245 107 184 -30 116 206 100
3606 100 31 109 74 -64 -20 106 188 69 150 6 -47 83 152 47 -167 -69 38 -37 -81 -136 0 -162 -305 -92
3630 -92 -166 -113 -197 -377 -371 -146 -167 -67 -44 -135 -64 16 -260 15 66 64 -59 -83 -42 -22 92 -61 99 245 -17 47
3656 47 -7 20 196 41 157 -15 81 31 -68 197 -31 385 92 75 -146 150 -43 -34 -205 -154 262 128 -2
3679 -2 -89 -89 -384 -8 56 28 -12 -151 -50 62 -242 -367 -270 -132 -234 -54 -176 -196 -102 -12 -6 -108 -76 -183 -34
3704 -34 -126 46 -127 -14 5 66 78 108 143 148 -124 20 188 86 124 55 -18 128 31 26 209 158 209 205 34 20 44
3731 44 -161 -38 -60 139 -45 -236 -44 -251 -72 -49 -33 -74 -97 -98 -44 -39 -64 18 50 -1 16 -160 -88 -256 -42 -229
3757 -229 76 -41 -267 -16 68 36 12 -54 -11 69 -37 -5 165 359 204 112 338 195 190 191 183 140 55 92 -133 109
3783 109 126 173 169 -16 154 -65 49 -57 -271 -122 3 -2 -73 -128 -203 -69 -387 -327 -181 -51 -76 -134 -191 -201 -237
3808 -237 -17 -63 -85 -189 -70 -58 -89 -86 99 -77 -118 19 -6 -123 71 16 47 -60 67 217 -39 187 45
3831 45 213 259 92 221 109 4 154 61 188 98 134 104 30 112 -29 -144 18 -82 37 -106 -161 32 -214
3854 -214 -115 -128 -197 -134 -118 -23 -99 -77 -117 -190 -184 -72 -57 -86 -135 -38 8 -63 -23 43 216 170 4 159 66 75 145 -68
3882 -68 -11 261 81 -12 300 9 105 29 193 181 -41 91 -178 194 99 142 117 -2 -256 -6 -25 -57 94 -59
3906 -59 -178 -131 -3 -21 26 -70 -300 -267 -305 -208 -304 -156 -227 -295 15 -455 -108 107 -163 -134 42 -76 36 7
3930 7 91 -61 78 24 -3 182 -58 56 167 178 80 -7 138 281 209 20 69 341 40 194 -98 3 183
3953 183 51 132 153 -32 21 191 -47 161 -78 -15 -7 66 71 -244 51 -144 -121 -89 -172 -85 -83 -121 58 -180 -42
3978 -42 -37 72 -120 -135 -64 -24 -178 -48 -289 -188 -173 22 68 144 44 207 24 -23 224 126 51 -27 -11 259 -139
4003 -139 147 174 334 183 -28 170 170 85 -117 134 -27 69 -79 -68 -170 102 -89 -104 -158 -14 105 -199 -71
4026 -71 -76 -61 -13 -239 -73 -138 -117 -306 -97 -28 56 30 -23 -229 53 149 -38 88 6 5 64 119 260 -101 244 348
4052 348 56 268 -18 117 245 -56 -19 70 -72 215 173 57 73 214 40 37 86 80 172 -202 -67 -2 -86 -155
4076 -155 -110 -56 -10 -116 -122 -168 -262 -130 -176 -73 -42 -166 -202 42 -105 -66 -203 -323 96 -86 -31 -18 115 -82
4100 -82 -30 -8 147 12 113 84 -51 190 47 160 -55 -35 130 198 216 117 -3 136 158 187 137 129 -57 131
4124 131 81 -93 -10 62 124 -71 -13 -50 -83 -107 -6 48 19 -74 -181 -68 -225 -272 -133 -193 90 -182 -68 -165 -100
4149 -100 26 -126 16 -67 -90 16 56 133 3 -44 80 -155 -8 -22 178 -18 29 189 25 48 45 120 88 82 -33
4174 -33 91 131 81 84 101 80 -11 41 -148 281 97 -124 -12 -100 -117 -132 -199 18 -111 80 -152 -367 -46 -224
4198 -224 -171 -71 -87 -102 -83 -100 -216 -50 -75 -64 -36 -32 -157 -19 -28 -100 -59 -1 103 52 103 52 170 145 15 -18 137
4225 137 -9 206 106 161 109 120 17 160 188 199 317 -31 67 155 6 20 130 -66 -33 -46 -11 7 -80 -254
4249 -254 -152 -94 -2 -80 -34 -133 -44 -217 -189 -159 -154 -122 -5 -144 -23 -111 -11 -55 43 -16 -136 126 124 147 11 19 -8
4276 -8 -7 -23 -37 32 26 47 120 100 116 -30 157 108 -66 126 -141 18 -60 -35 216 -4 149 -41 58 -128 -220 1
4302 1 106 -136 -170 -152 -83 93 -247 -243 -148 25 -31 33 -67 -183 54 -130 -132 -105 -53 82 -85 -168 14 100 96 -28
4328 -28 -64 189 55 32 86 -7 64 -45 133 88 129 208 99 143 76 208 14 -14 160 77 211 -67 -66 89 45
4353 45 -94 -170 -255 -42 0 -187 -212 -67 -156 -121 -119 -270 -47 -8 -10 -10 -135 -131 -26 164 13 -149 -1 -8 42 -80
4379 -80 -137 12 -78 -9 41 275 52 -10 -63 56 62 156 -117 167 -25 -2 96 126 -9 184 97 8 136 111 111 80
4405 80 34 24 -88 25 77 -74 -20 -69 52 29 -55 -13 68 -134 -92 22 24 -156 -241 38 -45 17 -207 -19 -122
4430 -122 80 -130 -168 -150 30 -95 -198 134 -51 233 -53 76 -8 172 98 112 -66 -120 63 20 130 149 235
4453 235 -44 55 216 256 80 90 10 88 155 -35 -61 105 30 180 47 -60 66 -31 -90 17 161 -49 -117 -141
4477 -141 -154 -69 43 36 -89 -127 -22 -186 14 -119 -16 -141 -23 49 13 -86 4 225 126 -75 171 65 142 5
4501 5 97 134 64 -114 146 107 105 78 -82 -46 -3 10 66 107 220 28 44 85 71 22 15 39 -123 -138 44 -247 93
4528 93 -156 -76 -40 -18 -197 -179 -104 -47 -95 -211 -16 13 -85 -1 -7 -95 -193 -301 117 3 -161 -129 154 -21 4 -27
4554 -27 -169 98 -36 36 158 149 -45 41 285 80 115 119 23 18 130 132 -95 25 163 25 101 27 9 -35 -51 -100
4580 -100 54 20 -49 140 -89 -112 -121 -114 -185 74 -94 -8 -172 -189 -18 103 -72 -79 88 -196 68 37 45 -52 0 82
4606 82 -43 -33 155 -10 2 2 103 196 -87 97 32 136 -34 111 -12 10 203 191 121 168 15 77 31 109 -124
4631 -124 158 42 -17 -2 -155 -15 7 134 22 -60 -124 -247 -135 -136 -174 -106 -243 -169 -147 -104 15 -96 -60 -116 -129
4656 -129 -70 -118 -50 140 -112 98 -194 33 166 43 -52 1 181 26 21 52 -8 205 289 132 92 291 219 67
4680 67 51 91 29 -14 26 69 106 163 47 4 120 49 -159 -18 -88 -62 250 -158 -181 -17 -121 -120 -204 19 -289 -32
4706 -32 -267 -194 31 -70 27 -253 -161 -147 -156 -119 -36 -100 -6 -149 -113 50 -22 -55 125 158 61 -55 -18 188 143 149 166
4733 166 49 -81 23 47 206 -2 134 325 -143 21 -41 -34 -58 2 -151 -89 62 -32 -88 60 114 -24 47 -250
4757 -250 6 -137 57 -197 -91 1 -410 -195 65 -106 -68 -44 -65 -23 -22 170 -166 66 3 -158 77 -98 -47
4780 -47 150 -35 87 -145 216 81 93 85 -142 155 42 161 145 228 111 49 92 9 -132 -64 -129 148 -16 45
4804 45 -48 65 -3 -201 34 22 -90 -89 -24 144 -87 103 36 -73 -284 -100 1 -246 -192 15 -119 -114 -64 95
4828 95 -55 47 246 -61 -87 50 56 89 -32 -112 -25 -14 126 109 -45 169 129 139 66 41 34 -42 -83 -1 -200 16
4854 16 49 68 6 168 -152 -83 -183 -58 287 113 -193 -43 -154 -421 -110 -184 -226 -99 -149 -4 129 -129 -104
4877 -104 -215 -44 -130 -158 -182 -241 -163 13 -88 34 6 7 -30 130 -12 -2 -173 74 67 -14 180 100 145 -48 14
4902 14 211 129 116 -6 161 244 23 14 -68 -67 51 44 -90 -38 33 -68 -61 -18 -46 19 -172 -37 79 -117 52 -138
4928 -138 -34 -24 -20 -159 -95 -79 16 14 -100 -23 92 -228 58 -131 -18 98 -89 132 -169 -112 3 -50 73 106
4952 106 -114 123 71 202 100 271 285 42 136 111 51 98 -41 317 86 -69 30 -7 17 150 42 99 -45
4975 -45 -38 84 -70 -216 -160 42 -71 29 -73 -94 -106 -103 -126 -19 -177 33 -126 -83 -161 69 -8 58 64 58 -50 -116
5001 -116 86 1 -76 54 74 159 160 46 -16 32 149 122 61 206 195 115 18 -16 -18 152 193 81 122 -49 -189 153
5027 153 -63 -5 -50 -82 -147 -154 57 191 49 -71 -36 106 44 -93 -141 -74 -320 -17 -123 -182 -94 -144 1 6 -145
5052 -145 -86 -52 1 19 -32 -93 88 -106 -21 102 79 -160 -17 124 -88 89 119 206 194 149 -37 139 79 43 145
5077 145 4 168 -8 104 -15 52 -33 45 -161 -60 117 -100 -111 -19 -219 -203 -88 -86 -158 -95 89 184 52 -319
5101 -319 118 -199 -108 19 -157 19 -68 -72 -119 -45 219 -13 -104 -85 247 191 -48 151 222 -103 81 71 -170 225
5125 225 194 -7 52 28 46 40 57 85 -64 -45 292 25 71 146 80 -234 89 21 -266 49 -142 27 -28 -53 -83
5150 -83 -94 -198 -194 14 -63 39 -178 -221 -16 4 52 -28 8 -73 2 -120 -10 67 -68 101 53 17 185 11 139
5175 139 141 220 -99 66 -46 28 104 -77 57 -86 37 145 66 109 -79 11 45 100 21 350 -5 -5 95 -80
5199 -80 -19 49 -130 -93 -23 -173 42 -106 -122 -189 -119 -185 -91 -30 -32 50 -38 -140 -107 -46 14 -48 -57 -79 -135 -113 -51 -63 84
5228 84 38 49 69 233 201 83 144 183 97 -5 52 23 52 16 28 115 158 73 167 41 94 20 15 205 110 74 -12 150
5256 150 -107 -143 75 -67 -42 -233 -213 -19 -81 -47 125 -70 -165 -43 -35 -18 49 -13 24 -204 -120 -115 -60 -160 27
5281 27 -74 -70 -76 -179 29 -18 1 72 -15 58 45 21 140 -110 87 46 29 -80 15 -86 -131 14 105 56 168 -13
5307 -13 9 -62 -217 152 -120 90 -41 -96 77 76 -15 2 239 -198 -68 -114 21 101 -242 30 -115 -152 -70 27
5331 27 53 -240 11 -59 -112 -160 -96 36 -83 39 134 88 128 -83 -87 86 97 14 99 110 123 4 -30 -92 62 65 153
5358 153 154 -16 76 99 -193 42 -83 119 150 -89 22 -101 13 -180 59 -252 -226 54 49 5 -81 56 27 21
5382 21 -47 -43 -13 -35 -27 -43 -28 -53 -184 -23 97 -34 -81 -26 -107 -42 -119 35 -86 286 -9 177 -202 11 84 13
5408 13 -20 108 180 348 100 -24 26 48 -71 -185 -67 -14 24 19 -21 -124 124 24 -152 53 -79 -51 -90 2
5432 2 70 -196 214 -86 92 -82 -161 -126 -138 -111 44 100 -83 -83 -129 -154 75 37 -99 228 300 108 246 -49 -128
5457 -128 74 160 47 11 204 -12 -127 -19 -130 56 24 70 17 20 99 -78 -45 127 324 -260 -66 64 -9
5480 -9 88 210 -275 -133 23 -72 -114 111 137 -211 36 -58 -117 154 96 -68 -239 78 -95 -114 4 12 41 58 45
5505 45 32 -141 -11 146 142 -21 56 138 247 -38 33 176 -39 -36 187 95 -87 54 33 -51 126 -56 65 16
5529 16 -113 -72 57 81 85 -110 24 139 4 150 4 89 -174 -147 -89 -143 -62 83 -244 8 -138 -14 -44 27
5553 27 10 -24 50 12 -38 -202 -251 -151 167 92 -16 -48 128 -113 25 93 81 134 155 82 44 239 193 40 292
5578 292 -124 -107 -97 -93 110 -83 279 127 84 71 -124 25 -89 -42 1 -36 54 13 73 -65 82 -98 86 -46
5602 -46 26 -184 -132 103 3 24 -129 -138 -199 -199 46 -58 -52 -156 84 -89 61 47 149 -158 -63 -45 -147 178 -34
5627 -34 -52 159 120 -67 46 206 -27 70 195 74 -168 -3 34 -1 9 131 58 -37 -110 -40 68 -164 2 -109
5651 -109 -54 6 -116 39 -3 11 -94 -140 -42 -82 -105 31 -162 -61 -48 -153 -127 -132 141 64 -112 -15 7 -19 -95 4
5677 4 87 -122 -56 199 41 -5 25 207 -90 -2 184 18 67 4 37 29 -66 21 -48 71 -74 -4 -47 -83 -3 7 130
5704 130 -7 -172 -133 80 -19 40 -79 43 -208 -25 -145 -150 44 20 -187 45 80 -94 -70 90 -81 -6 -37
5727 -37 -49 294 -260 140 72 144 107 -46 -9 114 56 17 91 5 168 78 186 -86 252 9 130 -142 37 160
5751 160 51 -88 111 -54 223 42 92 208 -19 90 107 -104 -12 143 94 68 42 -24 -46 -104 -210 140 -263
5774 -263 69 83 -249 -68 -179 84 -235 -206 -59 -162 -63 -80 104 53 -27 203 -135 -111 211 148 56 83 -27
5797 -27 166 4 -11 208 118 199 99 68 231 85 66 52 106 122 -121 -51 243 82 -42 13 161 -75 34 27
5821 27 -47 37 198 -112 -85 -201 -170 -156 -97 -28 -36 65 -136 51 -154 72 2 -55 131 60 162 -103 -84 38 172
5846 172 69 80 -123 76 19 17 -82 9 -7 105 183 87 295 111 109 16 9 -49 -10 128 3 -143 8 123 36 123
5872 123 -41 -109 98 144 99 -26 -57 -147 -89 -174 -18 112 -30 -113 62 -160 0 -105 60 -123 -163 47 -38
5895 -38 -32 -216 77 -4 166 -71 109 224 -32 33 -58 237 -33 88 127 -87 -72 22 37 -141 217 55 -50
5918 -50 65 28 31 199 61 185 -81 75 -59 -175 36 -43 200 19 -119 206 -123 158 53 -98 31 -105
5940 -105 -45 -57 249 62 8 -180 -47 -54 -114 2 -105 -5 30 57 -4 -37 94 73 -277 69 49 -24 -11 -59 -119
5965 -119 78 -54 73 171 -1 -98 119 201 -167 231 -86 166 -21 -115 57 157 11 -164 30 89 3 103
5987 103 66 51 -85 -9 -12 -17 -87 12 -85 -21 87 -242 -44 -143 -38 -215 33 68 -104 64 -44 -44 75 -52 -112
6012 -112 45 -87 153 -21 -117 31 88 95 81 -42 224 -33 93 20 -15 -86 186 7 7 283 67 274 113
6035 113 129 26 137 -2 -159 138 -55 160 148 -24 -15 -14 -68 -49 -40 -172 -149 52 -56 152 -134 -23 -72 -91
6059 -91 -97 -268 49 -58 21 -72 -25 -89 -56 -71 -22 -133 65 69 -88 58 -58 131 69 14 -67 -43 156 79 166 165 -11
6086 -11 47 175 9 1 68 15 30 44 53 150 -64 -141 -104 35 86 62 -59 -100 -3 -59 56 43 16 39 55 163 -255
6113 -255 -4 -20 -70 -80 -144 101 110 -17 -74 -120 2 -190 -21 60 -33 -64 -62 -47 -105 108 -131 21 -18 91 -88
6138 -88 -42 195 -78 -118 20 -57 45 84 -12 -33 26 -130 -81 -47 114 57 -110 37 -202 -40 22 -19 -67 35 -131
6163 -131 -127 -103 -135 21 -23 34 -16 -107 -130 -30 80 -35 -105 -107 109 88 -58 -59 -41 114 -78 43 -4 -53 32 39 -9
6190 -9 230 -51 51 34 6 102 -114 206 248 -27 4 77 -116 122 11 78 89 0 -86 35 -216 30 21 63 -7
6215 -7 33 66 77 -172 -9 -71 144 -44 -60 26 12 3 62 -89 -124 3 -45 39 -77 -26 -1 -152 140 22 -71 3
6241 3 28 271 140 149 -188 164 161 113 10 107 -79 -31 271 130 113 135 155 220 50 -89 -42 38 -121 80 49 -113
6267 -113 -99 113 228 88 49 -6 -165 -197 -141 -27 144 66 -178 -4 -73 -81 37 -7 59 106 -157 -143 45 -140
6291 -140 -19 -131 -23 -127 -145 7 3 36 135 17 0 -84 -9 57 -45 128 -123 86 179 20 133 75 58 -5
6315 -5 80 143 -90 37 13 -107 -104 -70 -35 191 -45 40 182 -14 -64 -79 -119 -4 4 -149 -126 44 14 -78 -113 -142 -28
6342 -28 -125 -228 41 -35 73 52 -71 -81 42 -106 -6 69 -20 97 -4 -4 -82 20 108 48 -14 127 -15 59 58
6367 58 -64 -85 101 -80 151 -87 -105 -50 40 -26 40 102 -112 105 -42 -104 34 -102 -110 -61 -27 43 -124 18 131
6392 131 -139 -161 -134 100 -52 -159 186 -102 -10 10 -66 1 24 -52 87 64 -258 -99 158 -2 48 54 86 -80
6416 -80 -85 -31 31 -33 -62 148 199 82 -68 -17 -178 118 -135 216 24 -29 4 -19 154 112 148 -122 95 -75 -21
6441 -21 7 -14 7 -68 -57 134 12 -64 -8 -88 -106 -188 -101 -127 9 -259 -31 -70 25 43 -90 -135 -6 88 -81 -27
6467 -27 93 -33 -21 63 -57 -123 -80 -121 81 112 77 129 60 231 64 130 65 84 -240 20 82 314 56 -39 -92
6492 -92 -6 67 34 -2 103 -165 123 -49 -38 124 113 -35 -61 -20 -24 57 95 97 -162 69 -152 125 -94 -172 23
6517 23 -176 -73 -85 41 -35 -28 79 116 151 -6 -36 12 25 16 18 -64 21 202 207 -19 157 -91 25 169 -69 -59
6543 -59 46 188 -146 23 -5 -75 103 67 -31 8 -74 41 24 -17 -162 -166 -64 -200 -57 78 -140 -93 -106 -14 248
6568 248 159 9 81 -70 -159 -53 -1 -67 -66 -1 220 -213 -50 116 73 25 72 117 -51 -2 143 24 68 16 43
6593 43 296 42 -27 83 122 -197 105 -133 -57 211 72 -2 -189 73 -123 -23 96 44 111 -141 -212 126 -25
6616 -25 12 90 -98 -149 -91 -3 15 -306 -91 39 -194 -32 44 158 -11 -59 -7 -25 33 69 -51 143 -7 -83 81
6641 81 69 51 -28 -27 -45 -6 146 71 3 17 21 -8 118 -54 51 63 -6 85 -102 54 32 -91 52 -111 11 71
6667 71 -14 17 -307 245 197 -94 -17 -131 -141 3 -43 7 112 -31 -191 -91 148 107 -66 70 -200 -203 -70 85
6691 85 -128 10 41 95 250 -141 78 119 -13 -59 -19 -102 45 11 -41 -97 -34 133 124 166 70 -3 -75 21 97 -29
6717 -29 50 -41 18 -37 112 5 -66 37 -30 7 -16 -106 -47 -78 20 -31 -60 -60 -19 -24 -151 -106 -99 -64 -217 -169 -11 34 12
6746 12 -42 -56 -19 -82 273 10 16 -5 25 97 93 -7 -119 -92 -221 80 81 42 46 -48 -75 232 -11 132 -167 161 165
6773 165 122 -63 -131 96 -208 -51 -5 -5 -142 -31 9 143 -189 28 -21 -61 -18 -59 32 -209 -147 -176 -42 -135 137
6798 137 -112 -76 20 -69 114 92 54 40 78 33 68 -28 -19 75 108 -35 163 9 -49 32 205 110 197 47 15 -259
6824 -259 -204 -59 -29 -78 41 -16 -105 35 -177 -17 -206 -27 41 41 -193 -32 -71 -84 -6 -63 -22 -102 -202 -91 25
6849 25 -117 -10 -193 -3 4 41 -140 1 -179 12 -135 -73 -80 4 108 -48 3 16 80 173 -86 -16 248 -7
6873 -7 45 27 271 -10 -126 40 -134 -42 91 -118 -66 67 -38 24 -27 -180 -21 -33 78 152 -82 -100 -100 -51 -161
6898 -161 -69 -182 -56 -143 -149 48 -53 88 -31 -107 -197 8 2 -83 109 136 -54 81 -44 -66 -183 -166 -131 -87 203
6923 203 110 -134 -55 -89 21 3 -4 -154 20 -3 24 -47 -58 47 -213 -158 -87 209 -95 -77 21 -173 -193 -186 -84 -93
6949 -93 -222 83 3 -30 -97 -190 80 9 83 -125 -81 116 -93 -32 -130 -124 31 -12 -104 113 -112 -205 -16 -64 -114 60
6975 60 -67 126 -11 -21 173 -92 11 33 -12 316 -73 197 -52 56 28 133 -72 -29 -326 -88 -49 -220
6997 -220 34 3 -33 142 -129 102 150 -21 20 -196 -33 39 -162 -67 -223 7 -36 12 -191 -60 54 -1 -253
7020 -253 -187 -24 72 -138 104 -32 9 93 -40 -12 -89 102 227 -15 -9 69 114 26 -173 150 105 -70 -76 -177 102
7045 102 22 -77 30 43 142 98 -63 234 57 -31 -9 39 64 68 -263 69 29 -53 -21 13 7 -88 54 -167 -81 -201
7071 -201 -202 -7 -51 -32 -7 25 -123 14 136 22 92 119 -140 -59 99 -43 115 37 72 -44 2 -98 35 174
7095 174 140 40 158 113 78 122 -2 147 38 40 9 48 -17 -9 -52 24 121 20 -13 -33 -15 -55 -13 -79 -52 -65 -169
7122 -169 -104 -18 -55 -69 4 160 -126 -118 168 14 49 132 -112 42 4 -42 -198 24 32 -194 -22 15 -104 39 22
7147 22 104 -6 -6 219 46 150 246 125 196 137 20 -30 -34 170 -2 -51 -31 19 213 -31 -74 -60 33 -69 37
7172 37 226 142 166 -53 -77 -148 179 -17 -70 -164 -62 91 28 -57 36 -55 -298 -53 -61 -83 -73 58 -246 128 165
7197 165 22 -31 94 -32 38 -16 72 -34 -69 -19 -63 -5 191 81 83 56 70 90 27 -60 -63 -8 -91 5 42 118 -141
7224 -141 -18 -182 -32 -36 107 91 70 -73 -49 31 -160 123 52 -92 16 -130 -96 -73 -40 -133 -47 -114 -129 -113 60
7249 60 119 -163 -153 -47 13 -58 -42 62 -93 50 262 -19 -133 -43 -19 85 112 -5 67 29 -39 33 64 38 -109
7274 -109 33 -53 -14 54 -49 -156 -9 31 -111 41 -231 -8 -25 -108 -170 87 67 -6 -273 -185 -86 -27 -185 -97
7298 -97 -97 77 -19 -110 185 -116 -64 162 -121 -73 102 -72 -43 1 -16 143 -77 35 -156 101 108 6 30 145
7322 145 -91 19 -74 -23 -53 -72 -99 139 201 57 -202 110 75 -17 19 -158 -153 72 31 -130 -48 -95 58 -329 -73
7347 -73 107 -61 -217 31 -28 132 -50 -17 18 -83 -180 -18 -135 -67 59 -297 52 114 6 110 98 -61 65
7370 65 -8 -25 -100 56 191 66 -70 -17 -123 -42 61 103 318 31 117 -66 117 -34 -50 -15 40 31 80 57 166
7395 166 26 60 119 44 48 -5 -94 -238 167 232 -46 -82 149 -265 77 91 94 151 -32 109 101 -102 2 -96 49
7420 49 -59 155 46 36 146 17 89 -134 24 -5 68 155 210 218 90 9 34 126 226 -179 42 -32 -119 132 13
7445 13 112 49 -72 -141 -191 145 -194 116 12 -49 80 93 -125 -143 -139 -116 63 -252 -114 -132 46 -63 -28 123
7469 123 123 -81 81 163 -54 10 -224 -117 -31 -54 -207 9 -83 31 -55 5 -45 55 7 125 5 -121 243 132
7493 132 230 -156 -84 -130 -68 125 203 32 -153 -14 -253 92 -87 85 -170 -49 -68 61 -95 -186 -44 24 -27
7516 -27 12 19 -8 -95 -59 111 145 -41 -8 23 -17 139 -17 30 111 71 36 59 130 170 79 119 154 42 81 -195 -22
7543 -22 33 27 -7 -167 96 -23 -124 40 67 120 140 -105 34 41 118 -72 102 -45 -88 -44 30 -49 -8 27 9 -172
7569 -172 23 92 31 -11 133 -100 -108 -40 -190 10 -130 -200 -5 -76 0 -57 -52 -8 -64 -80 39 124 1 49 -112 53
7595 53 88 9 63 122 -141 147 -71 16 -112 33 -11 -220 72 68 -4 118 -50 112 -47 112 66 -93 53 -214
7619 -214 68 -205 4 -54 -70 75 -40 195 -109 -105 72 4 -88 -82 -131 -129 -2 131 64 119 11 -108 2 -84 70
7644 70 72 38 -71 -15 0 -70 67 28 -6 -90 -59 -204 57 -71 82 221 130 131 144 146 -25 -48 167 -187 39 144
7670 144 41 84 122 -28 67 164 29 61 37 48 -36 -99 43 -101 -139 -124 -136 113 176 -129 68 20 48 -108 76
7695 76 91 -3 -92 -26 -54 -72 4 18 -1 -18 4 -161 -78 2 16 51 -78 67 52 58 34 63 10 17 127 302 -56 23
7723 23 0 73 137 -6 -122 23 105 -161 -120 -147 14 -26 11 46 31 79 245 -256 66 -71 36 162 -135 61
7747 61 92 111 -126 -110 -12 27 59 60 -122 6 -41 97 96 -31 -103 -96 51 89 -43 108 -111 -178 -93 34 40 85 -111
7774 -111 51 94 16 -87 -76 -43 18 70 31 72 61 -27 -42 -4 32 34 27 54 -24 85 -92 30 -16 12 24 -138 -189 104
7802 104 133 27 -33 -19 55 51 15 -20 186 -276 233 17 -41 112 130 14 123 70 -27 184 -4 -29 -127 163 5
7827 5 -167 2 220 -43 22 -106 -114 -24 -42 81 -105 2 37 25 -63 -54 -85 35 -102 -47 28 -102 27 -62 -5 -4
7853 -4 -18 4 -6 -2 -19 -77 -26 -113 83 -45 -36 100 -98 -102 -80 6 -74 75 -7 -67 -264 4 -58 112 26 39 55 204
7881 204 -82 15 95 149 -154 -32 136 100 -4 60 101 -70 -9 -86 92 -28 -148 126 190 -98 76 26 88 -165
7905 -165 -63 79 114 103 -52 -77 149 155 -33 76 -181 -185 30 -5 32 -158 189 -135 -168 131 13 -75 -93 97
7929 97 -60 74 -44 -32 170 -18 81 247 65 63 -104 69 210 41 -3 66 127 -10 -7 138 143 16 58 -161
7953 -161 -126 79 -38 279 -220 -39 -225 -28 -109 -37 123 -49 98 -91 -110 -195 50 -55 39 -23 117 -25
7975 -25 77 -68 -59 -128 -88 -4 -51 -120 83 -126 107 -1 2 -67 22 205 278 -197 0 -74 216 -54 -62 13 150 47
8001 47 43 -135 43 -79 83 10 218 10 36 134 -46 -142 60 211 -131 -82 -225 -152 -111 -144 -9 -109 -184 -28
8025 -28 133 0 82 166 140 -28 116 51 -35 54 128 -247 -137 144 -18 -51 5 -74 -133 -65 16 -48 -164 -80 86
8050 86 233 -59 6 109 116 -106 71 26 73 11 82 75 32 -36 114 97 -29 197 -11 -57 130 27 113 154 14
8075 14 -142 -71 -103 -134 114 84 -133 -10 -98 -75 72 145 129 -159 95 -17 49 -76 -88 101 -111 -104 -78 -128 121
8100 121 143 57 -134 92 12 -176 110 218 282 164 -42 80 6 18 -41 -220 -26 -56 -122 -76 -99 50 193 -23
8124 -23 -45 -2 -138 -92 -23 -7 66 16 -152 -162 -100 -87 16 -216 104 98 -72 39 -72 29 22 9 106 -23 -140 34
8150 34 -151 147 -113 -49 -41 -57 -10 -90 -17 -1 94 69 -204 -30 10 92 -14 -94 165 -20 -197 231 70 -134 -112
8175 -112 -53 6 -135 -66 -77 -43 34 -116 -62 -137 -4 -18 17 84 -29 -120
8191a20
$$ Imaginary data points
##PAGE= N=2
##DATA TABLE= (X++(I..I)), XYDATA
0 0 0 0 0 0 0 0 0 0 0 0 0 0 0 8 -8 8 -8 8 -8 15 -16 16 -18 24 -24 31 -32 40 -43 48 -55 63 -71 79 -87 97
36 97 -108 120 -133 146 -162 180 -199 222 -246 271 -302 337 -377 424 -480 547 -632 738 -880 1079
56 1079 -1375 1866 -2829 5411 -26788 -68406 4061 28001 -17782 -31577 4976 -2416 -30577
69 -30577 -14797 13078 -4586 -20031 426 10178 -13539 -15548 13082 17420 -10205 -13931 9605
82 9605 13246 -5623 -5902 9729 7139 -6433 -2044 9141 3020 -6162 1632 9087 166 -6141 3746
97 3746 9807 112 -5990 3041 8525 1578 -2759 2127 4231 -381 -704 3749 2614 -2503 -2159 2205
113 2205 877 -3758 -1933 2706 -241 -5928 -3801 2158 1055 -3842 -3039 71 -1100 -2969 -621
128 -621 1258 -1162 -2468 -446 276 -1933 -1683 1066 748 -2516 -2741 297 1270 -618 -1692 -600 130
145 130 163 38 359 902 982 810 887 1675 2210 1802 1671 2154 1642 1389 2685 3417 1181 -377 1686 3283
165 3283 510 -939 822 2085 -908 -2119 441 1327 -1725 -2340 53 -600 -2813 -1741 377 -1418
181 -1418 -3766 -1412 406 -2337 -3484 -250 -27 -3190 -3229 591 294 -3135 -1910 1441 303 -2676
197 -2676 -471 2540 740 -1866 707 3337 1259 -278 2198 3409 1186 675 2784 3128 949 1226
213 1226 3003 1960 -28 1135 2887 1055 -1085 562 2282 136 -2154 -21 1588 -857 -2559
228 -2559 -609 776 -1307 -2755 -833 -46 -1824 -2423 -488 -410 -2482 -1896 -155 -530 -2692 -1699 399
245 399 -933 -2677 -896 1071 -666 -2264 -292 1311 -158 -1193 631 1758 -65 -295 1699 1971
261 1971 66 577 2426 1829 327 1137 2699 1726 51 1125 2728 1280 -359 840 2069 606
277 606 -849 439 1495 -136 -981 24 666 -764 -1453 -408 -8 -1210 -1624 -787 -829 -1883 -1751 -764
295 -764 -1178 -2247 -1614 -432 -998 -2443 -1372 262 -883 -1923 -878 454 -374 -1239 -75 993 296
312 296 -506 688 1757 535 137 1522 1821 954 618 2035 1819 746 755 2065 1853 141 620 1867
330 1867 1311 -120 148 1545 754 -795 85 770 -161 -1010 -365 206 -815 -1442 -648 -231 -1603 -1574 -626
349 -626 -724 -1927 -1852 -455 -653 -2105 -1647 -105 -477 -1931 -1264 481 -195 -1263 -800 707 361 -700
367 -700 105 1067 417 -24 757 1675 826 252 1392 1862 588 444 1831 1891 414 693 1965 1436 -15
386 -15 332 1642 1297 -147 -148 1092 511 -542 -493 630 -203 -1437 -637 -99 -1091 -1649 -479 -413 -1677
405 -1677 -1903 -683 -588 -1918 -1904 -557 -147 -1742 -1656 -135 -138 -1574 -1185 351 -25 -930 -442 597 427
424 427 -239 411 1259 437 117 1216 1631 785 430 1604 1636 645 557 2025 1820 365 378 1918 1472 -88
444 -88 219 1103 887 -454 -240 765 187 -956 -407 179 -584 -1592 -513 -90 -1322 -1648 -686 -269 -1789
463 -1789 -1788 -693 -525 -1738 -1822 -433 -402 -1391 -1382 48 -128 -1136 -648 320 -30 -757 -73 983 447 -327
483 -327 945 1629 573 476 1353 1775 516 254 1626 1911 576 295 1566 1717 397 156 1357 1114
501 1114 -98 -13 569 631 -333 -330 293 -131 -733 -300 -89 -848 -1110 -468 -266 -1194 -1743 -637 -276 -1469
521 -1469 -1959 -591 -302 -1270 -1711 -302 -307 -1044 -984 -233 -28 -623 -423 293 9 -381 482 802 528 -99
541 -99 1022 1431 617 214 1418 1745 894 457 1161 1631 782 149 1313 1300 331 230 1040 633 -101 -17
561 -17 459 146 -348 -279 164 -430 -976 -411 -183 -853 -1439 -605 -313 -1341 -1565 -628 -553 -1382 -1578 -703 -424
582 -424 -1341 -1059 -455 -457 -726 -499 90 113 -547 216 662 79 -16 722 1127 549 -41 1109 1446 384 323
603 323 1381 1471 716 552 1446 1179 306 614 1022 793 203 424 700 171 -206 260 630 -526 -762 57
623 57 27 -647 -1228 -205 -492 -1287 -1346 -703 -467 -1070 -1230 -584 -568 -1264 -1141 -397 -700 -1028 -362 -99 -592
644 -592 -727 -117 430 -282 -630 690 950 16 -144 868 1230 265 168 1001 1366 651 490 1159 1071 625
664 625 577 1380 1099 315 585 1127 662 -33 396 1097 223 -567 39 510 -405 -751 -129 258 -1035 -1158
684 -1158 -642 -296 -1446 -1347 -434 -331 -1343 -1325 -411 -609 -1093 -1069 -319 -557 -840 -428 76 -515 -767 54
704 54 424 93 -421 299 884 548 -258 352 1417 708 257 1039 1548 1084 520 796 1210 581 564 919 963
725 963 499 396 844 653 -176 38 675 126 -657 -376 487 -384 -1160 -604 -135 -636 -1040 -721 -313 -724
745 -724 -1426 -967 -333 -917 -1214 -463 -242 -866 -1081 -200 -12 -530 -280 76 -71 -550 -181 815 498 -87
765 -87 216 993 710 79 569 1283 1161 320 577 1219 1030 552 859 1128 768 279 705 908 234 -62 662
786 662 544 52 -463 429 198 -394 -616 -53 -47 -1151 -887 -269 -404 -1172 -857 -490 -864 -1220 -603 -326 -793
807 -793 -1198 -630 -461 -793 -804 -209 17 -553 -491 80 478 -187 -293 593 537 246 160 863 971 650 493 1007
829 1007 1097 681 675 1073 932 622 764 920 324 212 806 623 258 -82 620 399 -430 -525 85 334 -640
850 -640 -775 -184 -177 -938 -728 -378 -821 -1068 -696 -330 -946 -1104 -472 -581 -1016 -812 -367 -273 -680 -547 -6
871 -6 58 -380 -280 457 518 -329 -57 666 608 337 294 972 883 580 729 886 661 403 714 1043 381 693 977
894 977 803 56 253 651 583 -174 -203 335 346 -393 -501 6 -218 -707 -746 -204 -467 -819 -755 -441 -938 -911
916 -911 -615 -540 -1108 -1054 -371 -462 -1006 -915 -185 -194 -593 -505 322 28 -267 78 733 663 -66 233 950 673 236
939 236 712 917 595 468 888 854 392 453 749 884 382 289 819 740 -144 76 464 520 -234 -107 217 -218
961 -218 -567 -402 -246 -401 -664 -548 -474 -676 -934 -502 -448 -1057 -851 -441 -377 -903 -943 -45 -163 -788 -463 -16
983 -16 10 -450 -276 357 367 -78 35 851 550 300 531 781 341 265 1136 871 444 526 937 815 459 235
1005 235 924 714 244 143 543 586 36 38 460 65 -274 -214 54 -402 -596 -403 -308 -607 -738 -416 -315 -1057
1027 -1057 -939 -293 -512 -904 -834 -294 -218 -664 -555 -298 -152 -415 -416 -53 159 -330 -28 219 82 280 389
1048 389 423 288 250 647 758 552 368 841 928 400 300 905 1036 489 254 736 976 330 151 615 338
1069 338 26 -173 83 73 -262 -270 -299 -506 -643 -171 -375 -675 -623 -496 -431 -893 -1086 -310 -352 -598 -803 -436
1091 -436 -319 -506 -368 -211 -118 -267 -14 170 62 -113 311 169 282 123 559 553 540 505 936 835 367 350
1113 350 723 942 542 241 827 960 413 149 453 505 88 -2 53 98 -141 55 -59 22 -665 -369 -284 -708
1135 -708 -755 -301 -306 -628 -872 -557 -450 -776 -627 -769 -258 -505 -730 -465 -135 -286 -390 -174 -69 -179 -264
1156 -264 90 52 255 363 518 385 275 531 812 488 394 668 749 500 280 635 661 582 287 511 522 469
1178 469 315 312 71 187 24 82 6 -355 -188 -184 -441 -686 -606 -95 -713 -854 -607 -313 -628 -840 -559 -370
1200 -370 -429 -911 -535 -440 -531 -352 -353 -264 -229 -365 91 63 -217 299 419 143 113 406 586 314 359 586 776
1223 776 508 453 472 724 513 324 301 542 500 183 391 471 295 228 233 208 -87 -99 17 -236 -432 -311 -301 -416
1247 -416 -667 -386 -300 -686 -705 -611 -440 -408 -782 -535 -377 -399 -715 -479 -413 -383 -218 -273 -155 -235 51 278 194
1270 194 -5 102 191 463 187 329 520 622 258 396 825 468 534 457 822 548 334 484 760 360 154
1291 154 324 -140 -127 -44 43 -84 -259 -247 150 -194 -516 -406 -220 -378 -421 -533 -236 -648 -832 -484 -440 -699
1313 -699 -524 -398 -577 -440 -565 -188 -141 -395 -352 103 -63 -245 -104 310 308 -244 133 654 349 -86 632
1334 632 822 467 374 484 585 388 587 695 686 441 350 611 455 169 233 487 128 -69 47 286 -254 -550
1356 -550 -497 -219 -411 -520 -437 -194 -398 -656 -655 -383 -694 -677 -529 -228 -651 -427 -464 -329 -458 -294 -52 -82
1378 -82 -400 -268 49 122 -228 113 551 386 219 484 688 582 74 409 767 734 315 455 876 479 299
1399 299 663 524 178 237 269 452 110 -130 29 188 -317 -265 -61 22 -571 -386 -222 -521 -683 -656 -325 -448
1421 -448 -614 -531 -615 -494 -612 -608 -463 -442 -387 -276 -328 -361 -458 -3 265 -298 -142 109 376 192 -134 317 658
1444 658 233 245 557 698 415 485 650 419 523 584 553 380 568 332 198 359 109 313 222 128 -21 -78
1466 -78 -18 -200 -334 -154 11 -374 -518 -446 -374 -734 -535 -401 -401 -319 -623 -473 -572 -324 -326 -438 -661 -318 -199
1489 -199 -9 -261 -205 39 148 9 -211 213 475 179 157 354 490 235 218 454 443 456 512 362 524 424
1511 424 421 477 352 452 326 395 99 165 38 318 -50 -301 -50 -26 -197 -441 -298 -275 -475 -636 -357 -255
1533 -255 -486 -377 -483 -527 -522 -553 -335 -602 -344 -254 -165 -475 -286 -113 -20 -7 -11 37 277 1 -110 240 301 556
1557 556 318 235 542 581 332 513 397 615 659 559 255 293 449 419 213 202 394 222 150 -79 50 -310
1579 -310 48 -261 -184 -234 -13 -483 -574 -396 -461 -356 -313 -341 -466 -463 -569 -286 -415 -406 -133 -350 -222 -42 -211
1602 -211 -146 -272 97 73 -72 -134 231 238 120 168 325 544 253 390 517 631 327 534 520 512 444 494 509 159
1626 159 400 484 166 182 98 44 -35 168 -95 12 50 -148 -54 -206 -292 -170 -379 -349 -421 -594 -208 -482 -604
1649 -604 -713 -330 -82 -307 -514 -143 -96 -304 -491 -91 175 -53 -64 -110 127 -29 -26 -6 417 394 347 471 165
1672 165 341 330 397 460 532 508 637 101 256 499 401 211 93 130 257 57 -217 20 113 -118 -310 16 -100
1695 -100 -113 -224 -215 -387 -300 -457 -325 -468 -594 -553 -381 -431 -533 -402 39 -466 -468 -303 2 -129 -331 27 0
1718 0 87 -163 108 87 59 128 329 387 28 317 388 315 209 388 682 556 203 338 435 172 288 347 501 209
1742 209 130 301 209 146 -45 -7 89 -87 -150 -34 -225 -571 -70 -225 -438 -285 -318 -247 -200 -621 -249 -315 -371 -292
1766 -292 -367 -47 -258 -391 -340 -55 72 -143 -160 25 0 -70 233 260 273 417 364 353 94 349 545 581 241
1789 241 561 744 509 217 298 375 353 67 120 425 270 180 64 27 -130 -62 145 -51 -247 -305 -14 -353 -545
1812 -545 -381 -38 -568 -653 -410 -161 -453 -608 -397 -144 -345 -326 -365 -287 -112 -341 32 -248 139 -3 -54 210
1834 210 145 236 305 308 252 283 470 240 162 308 421 222 290 463 511 421 302 301 448 241 233 370 180 5 -146
1859 -146 62 -136 -49 23 -149 -21 -276 -274 -151 -345 -465 -342 -113 -611 -536 -486 -550 -378 -498 -401 -231 -247 -416
1882 -416 -247 -96 -21 34 75 -142 102 -15 197 71 -138 243 290 255 283 310 420 273 248 461 427 469 450 140
1906 140 276 417 191 178 396 265 324 59 -28 4 -32 -55 -71 -109 -240 -195 -43 -386 -498 -168 -425 -381 -447 -376
1930 -376 -303 -342 -424 -463 -172 -418 -194 -281 -171 -218 -10 -87 -236 -140 143 31 128 201 310 102 279 303 464 210
1954 210 299 301 209 647 138 197 434 384 193 344 169 252 311 215 254 209 -25 185 -135 105 -111 -76 90 -425
1978 -425 -269 -93 -201 -460 -586 -488 -334 -524 -408 -174 -444 -445 -395 -285 -323 -53 -281 -167 -309 55 54 -36 6
2001 6 183 181 75 188 -110 361 342 212 54 488 456 419 249 355 473 364 231 457 225 324 475 367 388
2024 388 77 396 121 -247 -67 161 -26 -145 -325 -10 -113 -214 -351 -162 -241 -531 -529 -499 -363 -334 -288 -251
2046 -251 -411 -333 -345 -221 -144 -401 6 -226 -307 -236 -35 89 -128 90 361 142 121 49 288 335 240 237 464 450
2070 450 113 233 182 403 312 243 347 337 169 240 430 196 -28 -4 259 -84 36 68 -121 -335 -183 -232 -87
2093 -87 -405 -337 -131 -357 -472 -393 -381 -335 -370 -451 -467 -453 -380 -285 -199 -222 -367 -5 125 -199 -27 111 154 -30 -17
2118 -17 316 319 189 170 264 418 207 292 507 333 214 511 445 225 226 211 283 260 66 98 69 -123 -213 26 -33
2143 -33 -141 -241 -8 180 -131 -437 -163 -209 -196 -330 -196 -336 -282 -409 -252 -446 -337 -188 -19 -304 -414
2164 -414 -93 -123 -78 -92 -26 39 -113 -142 260 55 228 176 104 76 384 318 396 238 441 304 436 164 268 477
2188 477 301 259 233 245 129 112 51 237 86 194 -219 -58 -96 -246 -155 -30 -80 -357 -261 -292 -296 -237 -380 -139
2212 -139 -311 -387 -336 -170 -357 -357 -333 -431 -225 -92 -9 117 -202 -29 92 -86 125 156 47 277 220 264 362 364
2236 364 394 337 469 417 320 508 491 209 124 279 267 187 70 354 325 -4 139 69 18 -46 -100 -70 -301 -150 -132
2261 -132 -231 -404 -397 -155 -149 -232 -387 -177 -246 -479 -453 -434 -318 -387 -132 -142 -274 -83 -143 1 -44 -10 -64 242 -212
2286 -212 149 93 42 335 227 384 214 321 200 255 411 345 304 346 295 179 117 408 279 107 285 146 92
2309 92 67 76 -22 -149 -138 -219 -145 -353 -233 -166 -348 -219 -283 -197 -129 -307 -513 -90 -246 -477 -260 -232 -28 -437
2333 -437 -211 -56 -284 -116 -58 42 -10 -61 81 180 109 166 265 336 163 70 194 276 211 259 441 419 385 237 145
2358 145 260 274 246 95 129 274 267 -82 101 -110 -39 -188 -244 -46 -115 -195 -178 -240 -164 -58 -230 -164 -179 -134 -308
2383 -308 -328 -157 -32 -212 -215 -209 -203 75 -78 -140 -97 12 89 77 86 62 150 49 88 98 390 384 234 266 235 545 223
2410 223 103 374 253 306 470 127 146 162 410 60 103 192 0 -87 -147 -8 -146 -229 -116 -338 -275 -280 -325 -202
2434 -202 -476 -358 -220 -274 -431 -315 -305 -373 -162 -24 -202 -366 -312 -178 21 -124 27 21 8 90 123 137 155 29
2458 29 334 151 440 192 245 389 205 306 313 310 360 311 325 369 163 13 202 -11 47 -32 -131 -107 -94 -24 -6 -167
2484 -167 -148 4 -35 -463 -460 0 -294 -371 -310 -157 -229 -313 -576 -315 -108 -306 -233 -187 -129 -124 -78 20 102 -20 -10 256
2510 256 -3 1 357 273 273 158 341 255 227 250 504 325 77 107 186 343 267 138 337 325 219 -112 309 70
2534 70 175 62 58 -138 -101 -56 -149 -213 -60 -259 -102 -160 -239 -381 -437 -334 -221 -264 -258 -383 -249 -218 -40 -131 -155
2559 -155 -180 -67 -66 -53 92 -2 -94 22 306 84 -21 223 278 216 211 206 324 135 91 354 150 271 -47 352
2583 352 227 207 323 -28 181 88 91 178 -5 -48 -56 37 -132 -316 107 85 -109 -355 -179 -356 -228 -431 -235
2606 -235 -291 -362 -535 -372 -141 -178 -227 -217 -167 -316 -195 -97 -61 -97 180 15 -8 25 75 315 163 33 472 383
2630 383 288 309 347 153 110 154 277 207 186 137 14 280 215 155 -85 -237 -14 83 -173 -61 -74 22 -55 -166 -274
2655 -274 -182 -198 -300 -679 -161 -246 -250 -143 -327 -464 -267 -327 -10 -233 -241 -182 -135 -142 -238 3 58 -21 -119 139 130 166
2681 166 106 129 200 216 58 385 322 16 139 399 322 496 412 289 406 8 517 359 98 133 181 133 111 -125
2705 -125 139 -108 -94 -40 -3 -290 -491 -297 -165 -311 -226 -134 -270 -335 -205 -193 -409 -66 -113 -190 -70 -281 -309
2728 -309 -123 -68 -176 -131 35 41 -89 95 312 408 67 98 357 387 187 104 164 197 274 167 214 240 146 367 90
2753 90 195 210 19 251 96 211 26 -36 -126 -212 212 -73 -398 -218 -213 11 -37 -123 -55 -423 -88 -126 -73 -270
2777 -270 -354 -198 -105 -324 -129 -126 -172 -203 -6 -70 21 -65 -102 87 122 -45 245 -56 183 84 -91 -18 183 287
2801 287 237 281 241 171 199 271 411 281 144 127 95 78 227 50 222 -8 4 119 -25 -32 -264 108 28 -347
2825 -347 -429 -9 -96 -79 -323 -157 -217 -220 -175 -212 -222 -165 -325 -285 -202 -83 -200 -221 -305 -126 11 112 5 93 254
2850 254 286 106 189 189 235 259 134 323 226 188 36 253 128 304 291 -31 195 -56 209 137 38 158 27 90
2874 90 -127 11 -72 -93 -84 -210 -64 132 -109 -31 -205 -274 -109 -34 -417 -153 -320 -175 -402 -153 -181 -128 -164 -166
2898 -166 -106 -189 20 -68 25 182 244 41 245 228 217 113 200 338 408 277 66 244 301 218 204 169 184 -82 264
2923 264 249 175 30 145 108 34 95 152 21 64 -87 -232 75 -227 -274 -119 -131 6 -155 -215 -259 -356 -197 -249
2947 -249 -242 -218 -189 -140 -196 -174 72 -191 -104 51 -194 -65 127 148 -7 123 118 97 306 195 127 127 44 95 266 112
2973 112 157 -15 167 378 265 172 146 142 221 257 -34 210 186 -75 -113 -86 40 -54 -74 -130 -154 -238 -215 -154 -110 -378
2999 -378 -223 -294 -233 -114 -93 -217 -277 -231 -184 -89 -177 24 -128 98 -236 -110 -26 -71 200 48 188 183 203 74
3023 74 159 174 48 160 126 233 237 201 467 11 154 52 20 49 200 47 -1 -274 -102 52 -83 -105 31 62
3047 62 -68 -99 12 -100 -104 -417 -359 -252 -235 -287 -37 -114 -278 -271 -253 -195 -133 43 -253 -46 -107 -148 -167 -130 4 160
3073 160 114 51 115 362 63 228 -14 202 249 109 130 251 267 74 399 433 104 70 -50 155 281 203 17
3096 17 131 90 -80 -146 -163 -23 65 92 -53 -121 -313 -203 80 -103 -59 -215 -191 -456 -141 -126 -134 -224 -312 4 -5
3121 -5 -197 -254 -38 -58 -92 -35 -20 130 -64 105 236 15 119 164 14 163 172 422 92 311 191 83 32 213
3145 213 278 334 341 101 196 49 269 1 3 48 135 39 23 -102 31 -76 20 53 -347 -51 -192 -289 -229 -209 -172 -235
3171 -235 -190 -263 -205 -128 -170 78 122 -118 16 -19 -2 -177 24 74 53 28 74 262 229 -26 80 302 193 258 33
3196 33 269 85 199 213 342 223 272 206 64 154 164 260 137 -26 23 84 -49 -99 -45 -153 -197 -179 -127 29 -164
3221 -164 -365 -88 -139 -434 -246 -111 -95 -488 -42 -32 -292 -196 -148 -237 -5 9 -152 7 -8 -97 103 193 54
3244 54 -80 113 135 116 -8 96 196 81 217 150 86 296 142 328 113 192 306 -41 173 176 214 53 -66
3267 -66 156 83 53 68 40 -117 -5 -306 -68 -333 -120 -222 -197 -226 -178 -261 -259 -157 -146 -285 -88 -143 -28 -260
3291 -260 -245 -46 78 -89 11 -44 -11 -167 113 246 47 281 197 154 301 279 187 94 218 104 49 349 182
3314 182 187 200 66 176 153 98 -33 -87 29 14 3 -72 -174 -29 -143 43 2 -13 -225 -75 -28 -295 -256 -281 -76
3339 -76 -148 -137 -24 -181 -326 -216 -87 -7 -108 -83 -209 68 51 13 173 2 107 21 108 164 175 83 138 9
3363 9 243 7 306 311 277 214 135 -16 128 170 295 54 70 10 -114 287 -24 129 141 111 -97 -124 25 14 -250
3388 -250 -527 -123 -176 -30 -28 -139 -145 -10 39 -136 -3 -187 -123 -107 -38 -90 26 22 -84 -169 -99 153 61 72 3 49
3414 49 330 227 161 166 70 124 176 233 282 171 102 246 201 277 200 216 98 84 -57 213 67 94 -119 -138 15 -297
3440 -297 -96 -56 1 -161 -240 -135 -232 -13 -119 -84 -268 -41 -168 -193 -167 -268 -155 -157 -351 92 -97 -105 -79 -101
3464 -101 292 -54 271 149 -40 44 120 36 -37 151 102 333 194 176 383 372 248 297 233 73 -4 163 -46
3487 -46 -47 79 23 -105 -130 145 44 29 -96 -206 -266 -162 84 -86 -46 -102 -159 7 -306 -24 -90 -7 -17 -153
3511 -153 -326 -204 112 -69 -161 -22 -182 -67 -129 34 36 0 158 -105 26 -87 68 48 55 21 211 62 225
3534 225 155 98 211 88 -4 142 402 297 15 135 186 186 137 109 182 24 53 -152 -26 140 -11 111 -172
3557 -172 -291 -11 -25 -354 -301 18 -187 -70 -378 -237 -123 -228 -167 -207 33 -37 -278 -20 -51 -68 -98 -153 -47
3580 -47 95 75 2 115 231 175 -15 27 210 67 197 -49 348 80 180 -18 58 -115 160 87 -15 84 -57
3603 -57 141 84 -8 124 121 92 80 -56 -138 70 -306 -57 -120 -61 2 -110 -62 -59 18 -80 -187 -206 -196 -65 -225 44
3629 44 193 -138 -134 -136 -80 54 135 -7 -30 137 129 233 -13 22 202 29 99 233 262 198 386 194 233 51 144
3654 144 191 24 205 225 31 38 -21 -38 113 -154 -44 -134 -57 -2 -194 -158 -142 -56 -167 -280 34 15 -53 -276 -20
3679 -20 -209 -67 -111 -178 -69 -176 -126 -134 -53 -131 64 29 -99 -12 116 279 195 138 300 204 173 6 196 175 24
3704 24 27 121 208 166 47 69 152 74 191 -150 178 20 115 203 -65 12 -89 3 -79 -74 12 -114 -28 -221 -177 -348
3730 -348 -194 -123 178 -210 -423 -100 -232 -8 -45 -222 -97 -177 -172 -29 -223 152 92 10 141 133 -54 112 106 -60
3754 -60 38 74 143 116 25 84 26 409 186 -19 -89 299 235 97 221 175 -140 16 3 114 -47 13 37 36 -74
3779 -74 72 -159 -75 -121 -15 -113 -105 -61 -135 -122 -406 -285 -340 131 -34 -236 -142 -38 -141 -178 -93 -88 135 -134 -104
3804 -104 -115 175 23 -251 -15 68 109 129 124 18 310 132 112 -61 62 171 262 103 198 49 166 73 126 -5
3828 -5 -3 5 -173 -2 -83 -97 68 -52 9 43 -9 -46 -37 -15 -194 -217 -122 -102 -304 -79 -140 65 -168 43 75 -11 -42
3855 -42 -48 10 68 56 -86 180 169 46 207 292 108 196 -21 -28 224 353 7 19 315 260 -4 90 116 56 72 93
3881 93 78 57 14 46 -11 131 74 15 -126 -201 -189 -21 -233 30 -194 -271 -95 -211 -112 -162 -31 -76 -138 -96 -35 -118
3907 -118 -104 -186 99 -88 -183 -305 -53 -149 76 -79 -37 126 232 9 93 -2 161 68 89 -122 248 302 137
3930 137 44 380 189 -50 19 8 222 74 -71 271 33 -10 -59 23 65 114 52 126 -96 6 -118 -220 -7
3953 -7 6 -176 -101 -87 -106 76 -37 -258 -82 -153 -167 -1 8 -21 -100 53 -58 35 -72 132 117 -157 216 82 -1
3978 -1 -110 207 196 -62 22 199 126 43 117 10 31 130 119 68 50 250 37 116 206 -114 26 210 -80 11 18 -198
4004 -198 -110 -43 -92 -119 -138 -8 -178 -133 -10 -65 -182 -144 -257 -84 -125 -166 36 -12 -216 -103 14 24 -71 45
4028 45 59 46 -70 152 76 -7 61 143 116 121 166 447 520 233 45 63 170 38 122 144 187 249 143 47 154 9
4054 9 173 52 182 -84 -102 83 -247 -93 -93 -48 -127 -109 -208 173 -137 -225 -102 33 -137 -348 -149 -142 33 -36
4078 -36 62 -81 -44 168 -43 -50 -113 14 323 -106 -17 23 -94 213 35 181 231 28 17 184 182 -22 48 -70
4102 -70 210 164 272 179 97 -12 140 150 72 108 78 32 29 12 43 -16 -80 2 -37 -144 51 -328 -263 -113 -173 -67
4128 -67 -96 -139 -64 -156 -136 70 -54 -153 -12 -43 -106 35 88 -93 70 161 -82 61 180 240 53 127 -102 99
4152 99 -6 24 5 6 66 67 295 204 46 139 156 -119 94 38 9 239 19 162 -99 29 -179 -4 -9 117 21
4177 21 -73 -114 -65 -69 16 -117 -87 -95 -96 -210 -51 -130 -137 -152 -117 -145 -168 -41 -93 -8 -101 108 -94 63 216 17 205
4204 205 43 6 79 154 -73 -17 276 -23 94 75 171 5 55 170 33 -56 -24 63 -59 -101 -4 84 -43 68
4228 68 45 1 99 -17 -206 -133 -113 -272 -96 -168 -162 -49 -319 -220 43 1 -60 -25 -171 -239 -175 -176 180 139 -24 27
4254 27 -30 -4 -7 -33 -172 64 83 208 132 92 25 41 287 159 188 256 269 206 137 103 21 71 301 106 145 143 -71
4281 -71 43 93 152 171 -133 -94 -4 -33 -211 55 -136 -25 -43 40 -235 -164 -158 -68 -108 -98 -55 -152 -166 -97 -66 92 61
4308 61 -16 34 -93 -109 77 -30 151 63 65 -41 175 -115 162 86 133 215 133 2 30 164 154 26 62 -68 -60
4333 -60 8 209 -95 2 -162 -69 133 28 -83 -107 -63 6 -37 -113 63 -155 -87 -133 -67 -218 -12 -57 -80 124 -246
4358 -246 -59 2 -125 -119 1 -133 -186 -44 214 32 12 260 23 -49 34 132 160 138 36 -81 35 25 -46 173
4382 173 295 73 152 209 -25 162 38 76 -4 228 -86 -173 11 -49 20 -110 -158 70 -37 -73 -83 56 -86
4405 -86 26 -93 -74 -57 79 -151 -63 -175 -192 132 -205 -22 -203 -16 -34 -51 67 -107 -185 117 -70 -225 11
4428 11 68 -29 57 76 -4 -166 259 129 -56 148 164 112 235 61 126 89 176 141 137 -238 81 -107 -179 23 50
4453 50 55 -31 -88 -105 -6 -39 -3 -325 -52 -53 -227 -106 -178 -106 34 45 13 -10 -259 -3 1 -168 -199 -100 12 -109 -82
4480 -82 62 -69 -162 -45 105 22 -41 129 -142 176 40 70 -97 121 24 83 114 20 95 197 167 13 -47 161
4504 161 95 256 23 -13 47 20 234 18 -13 -109 -3 31 -119 -34 -274 -49 -234 -158 -148 -201 -238 -101 -123 -108 -76
4529 -76 -88 -58 -79 -39 -60 -22 208 102 58 -35 -51 -12 202 147 78 78 24 12 127 63 136 27 196 249 -35 80 -43
4556 -43 55 -24 8 -61 -31 101 -40 180 -86 -133 -44 -16 -90 -120 -48 -89 -68 -77 -108 159 17 115 18 -241 -187 -95 81
4583 81 -191 -275 -39 -23 -42 -30 -138 -38 -127 -79 5 -5 161 334 40 -52 -56 25 -31 -20 59 118 69 34 174 145 65
4610 65 32 59 85 -16 119 7 -35 14 73 40 -155 103 -64 -55 -9 21 -15 -123 76 151 -116 -167 -168 -35 -331 -18
4636 -18 -188 -177 -158 -108 -154 -86 -228 -165 -34 -78 -167 43 -51 -71 118 -10 -120 172 92 46 205 59 221 91
4660 91 290 117 180 237 182 -40 105 40 -52 101 212 -2 59 143 175 -9 76 -2 -117 107 153 -35 -175 -99
4684 -99 45 -230 -129 -174 -247 -245 -327 -74 -73 191 3 -154 -16 -136 -204 14 -369 -85 50 58 -99 -8 -21 101
4708 101 183 156 4 107 20 77 88 21 -6 121 21 -157 86 154 31 -32 63 -80 -39 -10 125 85 -54 -71 145
4733 145 64 -105 41 18 -41 126 32 -21 43 -20 -37 8 -280 -75 45 -111 24 -93 5 -50 8 3 11 53 -80 15
4759 15 246 -173 -123 -10 -67 241 201 25 -60 213 44 98 -83 -56 253 232 27 162 -24 -58 -9 75 145 135
4783 135 278 -77 -112 28 -22 267 -128 -42 124 1 79 -31 -165 144 -45 179 -235 -167 -237 -154 -37 -116 -91
4806 -91 -79 -52 26 -105 -37 -72 29 -121 23 -43 -160 209 10 -10 -119 -83 -25 60 -62 -51 105 22 249 174 94
4831 94 -38 241 188 67 129 -20 -93 172 -31 103 -91 -26 2 -73 232 -70 102 15 -25 -120 161 41 -92
4854 -92 -139 -98 -163 -68 114 -147 -146 61 -116 -145 -66 72 -88 21 -31 23 126 71 -55 -43 -14 122 -186 65 185
4879 185 -4 -50 139 87 170 -16 50 108 137 91 219 88 75 37 163 31 -21 147 14 15 -96 -69 11 7 -43 -177
4905 -177 60 -58 100 -111 -92 -38 -141 219 -70 34 -73 91 -100 -26 -91 -131 -121 -26 -69 -100 -28 76 -68
4928 -68 -30 -8 -14 -6 -6 178 -139 101 25 -12 6 -38 120 203 210 -40 92 58 53 -19 49 175 -77 273 306 180 -125
4955 -125 23 131 80 -89 51 6 189 -138 -144 83 -15 -140 -142 -138 -91 -2 80 4 -56 -162 -160 -80 -65 -6 -77 -45 -74
4982 -74 53 -152 -250 -112 65 84 57 -18 176 9 -21 -120 61 37 104 -49 -29 -1 61 -21 68 28 111 -133 -74 25
5008 25 88 36 -89 31 -43 45 77 1 89 -122 33 37 13 110 -83 29 7 -127 -35 -125 -29 -96 -43 66 -84 97
5034 97 -30 6 -23 -40 -112 -158 -21 -38 68 7 -176 -35 -89 -9 -6 20 -138 24 23 -48 36 43 89 186 11 50 101 -7
5062 -7 68 -23 120 8 62 32 25 -40 13 117 -58 53 -26 -5 -8 9 -63 -48 -72 -53 93 97 -170 -157 -187 -67 -136 18
5090 18 7 50 -51 -8 201 -125 227 46 130 -115 -108 140 -17 112 -153 152 111 -20 -54 100 156 65 38 -48
5114 -48 213 -198 26 78 162 -143 199 183 6 104 193 10 -71 -43 -79 92 188 -212 -176 63 20 -33 43 -62 5
5139 5 38 6 -147 -57 -62 -105 -89 -32 21 107 7 102 -13 -107 -48 -34 -122 -33 118 -79 142 76 -69 88 139 185 172
5166 172 -46 145 65 26 83 61 142 66 124 -29 -71 38 -42 -129 -71 -35 44 -49 0 -53 62 -2 -28 62 88 87 -235
5193 -235 -39 -138 -21 125 -300 -112 -8 84 -196 -9 -31 -13 -118 -132 44 163 -145 -362 -165 -240 69 64 -19
5216 -19 -46 70 -150 23 -4 168 21 -83 59 119 209 -155 159 88 243 -97 108 14 99 -28 -28 18 90 111
5240 111 17 92 51 92 -186 -18 -85 -45 28 -77 -101 -44 -13 -29 -83 -111 24 20 -199 -40 -52 -157 -5 -97 -114 -53
5266 -53 -13 -115 -41 96 -170 -3 -220 123 69 1 113 77 55 -11 -84 149 -13 150 -100 -66 212 -34 221
5289 221 72 207 14 67 -14 26 52 -28 -98 -150 -20 117 98 -236 46 167 52 -80 -31 29 -69 -106 -60 -132 -297
5314 -297 -79 -79 -7 -196 -88 -141 21 33 3 -286 -72 73 -127 -168 22 105 14 -123 -41 186 168 12 30 -29
5338 -29 191 53 107 295 48 -41 -48 79 -111 196 108 79 -65 -108 21 17 213 79 -160 -63 -8 142 -81 40
5362 40 -177 -226 44 -174 -41 174 -167 -138 -141 -161 -123 -179 100 -161 -172 -205 -101 70 18 -172 -5 216 -82 80
5386 80 92 62 18 245 -30 34 3 -140 136 58 106 52 -45 139 -18 27 17 30 61 -13 27 18 64 246 204 -118 -11
5413 -11 -94 -53 -20 -31 64 -42 -47 81 -170 -252 -174 41 -12 -21 -129 -94 155 -60 -268 -96 16 -81 -195 -115 85
5438 85 273 -123 -110 -93 -23 148 -54 108 187 173 -66 -13 -60 -116 183 113 105 -28 82 180 81 46 110 -19 104
5463 104 -71 -89 64 -108 158 -103 -11 -85 -5 -31 -86 -23 -51 -395 -143 -21 93 -86 -71 -146 -93 -2 -136 63
5487 63 34 -150 -22 -209 -86 -129 -61 -117 23 18 20 86 -66 135 263 70 88 163 -74 19 61 -86 152 -31 -151
5512 -151 -38 127 20 27 122 -120 24 28 -1 -71 -21 -75 120 -146 -30 88 -3 -47 -119 -201 9 41 -81 73 -37
5537 -37 130 -217 10 -122 -61 36 -6 -104 117 -29 50 -17 97 66 -169 147 30 89 224 27 -26 193 149 -13
5561 -13 138 -122 77 95 166 133 42 -33 -48 10 7 -52 156 -24 25 181 -182 5 92 -104 -12 -53 -120 -125 -113 46
5587 46 -145 -76 -180 187 -160 123 -108 40 -34 -137 107 -55 -121 -37 -38 4 77 -25 -82 -54 -31 134 226 144 -71
5612 -71 37 64 88 18 -118 61 -28 9 166 88 63 208 137 107 -82 -62 -44 1 45 168 207 -36 -16 -174 46
5637 46 -18 -82 -23 -90 -48 20 -82 44 -222 -138 64 -2 -185 -24 -91 -36 17 -209 112 -170 2 -13 -21 52 65 57
5663 57 10 -11 7 19 120 105 244 48 51 -72 91 -33 81 20 -35 175 131 10 32 33 135 106 -24 201 -8
5688 -8 34 -231 -39 63 -98 58 90 205 -161 -90 -61 -17 -52 59 52 -88 -96 -123 54 -162 -42 -148 44 -8 80
5713 80 -128 -68 -62 -69 -150 10 -80 49 -32 40 -49 -29 12 31 140 74 133 140 33 168 -33 181 27 158 24 -7
5739 -7 -21 66 13 202 -54 156 14 -30 77 -65 45 -226 8 -83 41 -24 -115 -4 -23 -230 -10 -68 -258 111
5763 111 -91 20 -102 -49 -86 -45 -13 -87 -73 251 -28 56 204 56 18 -38 27 173 167 50 41 103 14 120 103 8
5789 8 95 -20 79 -115 -10 150 19 148 -52 58 175 146 16 -16 145 -17 62 16 27 -129 61 -150 -133
5812 -133 -16 -32 78 1 -59 -105 -111 107 -58 -146 -20 -26 4 -132 -98 -82 -247 -110 26 -18 -155 -6 116 24 -22
5837 -22 20 -30 37 -2 25 -73 92 196 -16 84 14 -3 193 218 -107 265 152 -15 -27 88 14 -17 -82 38 61
5862 61 18 60 -60 -255 207 -60 160 -6 85 -148 -86 29 -44 -142 7 -122 25 -19 146 -24 -103 177 139
5885 139 15 -67 152 -211 41 -101 -18 122 -30 154 21 68 -44 293 87 80 85 -24 111 -75 7 -15 -34
5908 -34 -8 107 -49 -43 76 -219 -23 -10 79 92 -99 -163 -181 81 -172 2 -11 -28 -73 53 -139 -87 4 -275 -24
5933 -24 -5 109 -5 -25 129 161 -25 -288 36 -5 -22 132 20 -84 39 22 -63 67 -59 168 239 90 -130
5956 -130 -8 -1 79 -166 103 12 -47 273 -89 64 -118 -164 -10 28 12 70 -28 -38 -39 40 1 25 27 67 -136 73
5982 73 92 -82 -151 -58 -4 -188 -58 -129 -147 37 -145 -65 -48 -1 30 -138 71 82 -105 -25 64 7 133 167 69 50
6008 50 -4 48 -117 149 182 -62 89 -21 -189 -23 72 -19 55 -87 -188 -19 100 43 37 -111 60 -11 -40 39
6032 39 -34 -160 -80 -15 58 -85 -48 -21 143 -120 -150 -68 -36 -100 -91 -74 -212 -80 -195 6 -176 -20 260 -42 91
6057 91 124 -49 -31 117 -79 121 11 -59 73 -12 90 328 16 -39 11 -174 20 -127 162 -35 27 -291 114
6080 114 26 34 46 -180 144 71 33 46 -59 71 -124 37 -84 -82 -224 37 -153 -77 65 41 -182 -72 104 -105
6104 -105 -13 -104 112 -2 -141 -87 51 -66 -22 -28 39 -7 102 -74 58 -4 193 -187 -10 63 80 -135 136 166
6128 166 -122 155 17 -117 36 -32 91 55 -39 -73 -24 -36 -62 34 -227 -29 28 42 -137 92 -64 150 28
6151 28 110 12 -208 -11 66 -37 -188 -41 0 -89 -3 9 -98 -159 -5 11 -135 -119 -177 -80 81 58 17 -22 -56 61
6177 61 53 -234 -45 278 135 215 -3 65 -125 80 207 -11 -128 98 -26 26 182 41 21 58 -65 -145 -130
6200 -130 31 5 -50 77 -113 5 -14 83 -86 -147 26 57 -84 -15 -6 -147 -60 137 -114 -132 72 -24 107 41
6224 41 47 -114 59 -34 84 62 84 60 -12 -36 -1 76 220 -229 -35 35 -110 132 12 152 42 113 9 -92
6248 -92 8 100 97 -38 -88 90 84 14 -41 -93 39 33 71 89 -140 -53 72 -178 0 -71 -122 152 -201 63 123 68
6274 68 -156 -46 154 80 -155 33 -45 -40 -92 -12 -3 205 162 -65 50 22 -73 -93 -69 151 62 31 -7 -52 95 5
6300 5 -140 -38 51 17 -2 -53 112 -72 -151 -171 -8 19 -85 -186 -79 -10 115 -22 51 -90 -112 -95 216 -110
6324 -110 -136 23 -65 -126 -56 130 -37 -97 -13 -216 220 95 -79 -3 166 9 38 58 211 40 -81 123 112
6347 112 26 7 191 300 -13 65 207 200 91 -119 65 -4 12 -47 154 22 108 -3 -129 40 -27 63 -154 48
6371 48 -100 67 142 19 108 -115 133 27 -141 -70 -195 7 121 1 -102 -14 -137 -16 92 -66 47 21
6393 21 140 -25 35 63 -35 -63 40 18 103 63 18 148 264 -36 -93 68 -127 -67 18 46 59 20 48 15 -18 -31
6419 -31 2 159 72 105 -130 -39 -222 -109 -97 -68 42 -2 -18 -33 -195 31 -75 -107 -15 -39 -28 -162 116 10 57
6444 57 133 -114 -240 -149 107 13 106 161 -226 -80 59 -59 17 140 94 238 83 73 -49 -50 -141 -72 83 109 84
6469 84 122 97 48 202 39 57 184 -44 -147 2 -5 -92 26 -86 -35 5 -165 -70 -6 -148 -53 103 -3 280
6493 280 156 2 -118 126 119 169 -48 -245 71 49 -130 19 -20 -52 126 34 -138 69 4 -131 -86 -37 -57 42
6517 42 154 -67 -49 -3 -23 28 14 33 -60 -75 -41 -44 -55 -35 174 127 -6 169 -79 259 -12 -81 110 -152 -140 -182
6543 -182 -123 -80 -75 -49 -188 -59 -127 -190 -24 -226 -15 176 116 -25 -48 -20 215 -72 -160 0 29 -24 -44 49 76
6568 76 -12 9 47 0 -226 2 -45 -54 99 131 2 97 14 -24 43 151 -148 -10 93 23 -91 -2 51 -214 -55
6593 -55 48 73 -51 78 -15 41 -216 -167 -77 -165 6 -115 -82 38 -13 -347 -45 -109 114 61 -191 17 -26 -22 -82
6618 -82 13 105 -20 135 178 59 86 0 50 24 205 19 -51 58 169 -54 130 88 319 60 78 69 102 -2 -42
6643 -42 33 37 -193 -75 106 -225 -10 -89 -13 -43 88 -68 -36 -110 32 -21 122 33 -1 -54 -135 48 117 1 -95
6668 -95 125 14 -93 105 263 -91 -124 94 86 154 29 -116 -134 -17 -46 235 104 -106 258 -133 -83 -139 -101
6691 -101 15 75 -83 -22 16 -86 65 277 103 370 -85 -90 84 173 0 -72 -111 -24 -140 -198 179 -10 37 -101
6715 -101 40 134 82 -262 56 -156 -15 -225 -49 205 17 9 -35 144 -10 -82 -234 -154 91 148 74 -16 160
6738 160 -23 83 45 16 80 -174 178 19 -4 40 -46 109 -56 217 89 -122 76 154 -6 75 39 97 -61
6761 -61 -91 -78 -19 26 -162 -94 -87 154 -114 76 22 48 9 -157 45 162 -87 4 40 -23 171 64 -49 -126 -83
6786 -83 -173 -72 21 110 20 -58 -75 -118 17 131 -124 3 -271 -241 110 141 139 134 135 -67 196 -57 286 -13 35 125
6812 125 33 42 195 -12 -5 -43 126 -60 -33 -153 -92 -59 2 -44 -10 11 -105 -128 -45 -42 -70 54 -27 51 -66 -197 -77
6839 -77 57 15 -128 -6 -118 -2 -105 -32 9 141 38 -231 -30 24 182 201 -49 24 179 -29 -65 -23 -76
6862 -76 -71 -82 -218 -46 -83 65 -126 11 105 89 57 -79 77 -101 -36 -143 -182 5 55 -70 -41 -130 -77 -42 65
6887 65 -90 74 -64 -67 -167 -101 135 132 -158 -92 -66 -5 56 56 13 -44 -19 1 -60 166 -123 -103 6 -91 -125 86 149
6914 149 -139 67 92 3 -34 20 79 -78 57 89 -195 28 121 120 89 62 24 174 -145 153 -137 -88 -102 5 82
6939 82 -180 8 -11 221 61 86 -66 -73 -129 -98 -23 -67 -36 -35 -195 32 75 -220 -103 141 41 18 19 88 -78 -94
6965 -94 152 -72 224 244 -53 148 -109 -86 -25 85 -80 -69 174 34 45 30 130 -10 117 -136 29 32 118
6988 118 -23 -110 2 -67 56 93 139 -128 -45 -94 -52 17 295 -117 -240 28 78 2 128 245 -15 54 -92 26
7012 26 16 90 -100 92 75 149 107 45 -10 -14 -65 111 104 145 54 -61 145 64 -24 153 19 88 77 -24 -71 -48 -159
7039 -159 -8 9 -1 -51 -121 13 -194 -20 2 -146 -121 -81 -185 43 38 67 -38 68 -168 146 22 112 7 -18
7063 -18 -73 -132 4 137 190 128 63 20 -13 20 23 107 77 -83 198 80 179 11 -20 97 97 154 133 19 -54 365 49
7090 49 -13 -22 47 89 32 90 -49 71 58 -118 -19 32 33 -77 -39 169 -59 -97 31 -22 147 -184 -223 38 -61 -42
7116 -42 -42 81 -158 -98 -101 -46 -51 -126 245 -12 137 -7 155 103 9 -17 -46 36 85 18 22 -48 -1 -40 -9 52 -4 20 -65
7145 -65 -96 25 49 -22 159 141 -123 45 31 -45 94 120 13 -12 -263 44 -97 -23 -13 14 288 -50 37 18 -37
7170 -37 -144 -117 7 63 -50 -10 -22 -114 30 158 -90 -197 -43 97 114 156 3 -175 273 271 19 194 154 63
7194 63 40 195 -108 18 2 -92 147 203 96 233 134 46 59 118 101 0 60 108 220 19 14 -54 83 -80 -123
7219 -123 175 52 -207 14 31 27 60 -27 45 -28 63 -121 -112 -22 19 -120 -104 -84 -9 10 -3 148 -144 128 92 67
7245 67 259 54 61 197 74 90 10 131 105 109 108 4 230 38 -56 -140 -126 -72 -35 138 148 174 43 134 119 -106
7271 -106 57 -8 -154 -18 162 -22 18 109 50 -91 -18 -202 -167 -50 -312 -72 -96 -86 125 69 93 81 71 37
7295 37 -104 -6 -111 44 -89 -61 -7 104 6 -27 104 -28 -50 -19 42 -14 47 -40 -42 116 -43 30 -38 124 72 96
7321 96 -23 79 158 13 113 -42 -14 50 -94 -171 -110 -60 17 -4 159 200 -128 -78 -45 21 -6 -28 109 177 2
7346 2 -119 -5 -81 -97 2 -29 52 226 -87 28 6 65 -58 -134 44 -104 164 192 19 -172 224 38 -54 145
7370 145 79 -141 103 -89 -41 2 68 138 -38 -83 71 50 44 37 82 -7 20 2 -92 76 -62 -69 -122 -117 -157 -62 3 -21
7398 -21 -144 -138 -54 -221 -152 -22 86 13 -63 12 -40 95 -7 86 -61 146 223 -22 186 151 -77 -38 7 42 227
7423 227 -38 217 -50 239 -62 -283 104 -34 76 -3 -42 13 97 13 -12 -21 -52 68 2 113 -66 14 7 84 -75
7448 -75 64 28 -86 17 -3 222 -41 -218 113 -231 -174 13 -114 51 -19 55 -186 46 -144 -6 -147 -31
7470 -31 46 -40 95 -44 50 14 -82 40 128 -52 264 -66 -82 -177 227 99 75 -22 12 -206 -125 -64 53 -26 -240
7495 -240 12 -138 10 -62 -32 35 -19 68 49 9 -69 101 259 205 -20 63 13 -7 -1 35 45 7 -52 90 -26 -7
7521 -7 -93 15 2 12 -45 46 341 -18 51 49 170 64 -92 -91 15 272 140 100 -10 -41 -45 -16 40 -86 114 154
7547 154 68 -37 -14 42 -41 133 30 -41 -39 51 -92 -105 29 -103 50 -207 23 56 187 15 -1 189 10 -41
7571 -41 43 -48 18 179 -6 -39 -81 140 28 130 113 -173 116 144 135 16 150 -102 -80 33 -83 -67 134 142 -93
7596 -93 -55 -66 16 101 128 95 -53 41 -138 64 -61 92 -45 -121 94 -156 -30 12 -154 -58 -133 -47 29 -52 -147
7621 -147 20 -7 -70 83 -188 92 153 36 84 117 31 45 55 80 -1 -40 41 50 61 26 201 -67 81 -21 -28 68
7647 68 222 219 -39 27 70 173 -78 -39 143 187 -137 -179 54 -4 101 -74 15 58 -239 128 190 -102 43 220
7671 220 62 -16 -131 112 36 -19 -7 40 -102 58 -131 61 4 -121 43 85 -213 46 -126 -67 -40 -6 -89 -91
7695 -91 4 -114 165 -272 -133 62 39 -1 113 74 9 56 23 131 142 194 121 -124 59 -75 -108 84 61 -49
7719 -49 50 -155 133 -34 -18 -30 -18 -95 -46 -132 40 -79 91 -63 57 274 -56 -1 -120 -80 36 92 3 -8
7743 -8 111 38 2 -26 117 198 -72 30 -105 -120 22 -54 -82 197 133 35 -80 -142 34 130 -69 -19 11 98 47 -227
7769 -227 161 118 -151 -158 -91 166 118 -194 115 55 -95 -304 -97 62 100 -145 -54 -36 106 -67 83 -18 -135
7792 -135 -79 -120 32 68 -104 37 -44 110 -44 84 29 -43 114 162 -31 1 201 -68 -220 126 234 -29 -26
7815 -26 95 -147 -27 89 87 57 65 65 -118 -109 175 45 -3 -37 -130 42 -81 -190 28 -6 -321 3 101 -18 120
7840 120 79 -68 -22 -121 -101 110 -154 -59 140 45 95 -108 -29 -76 107 99 -140 22 99 -183 -22 -34 -1 -11 130
7865 130 121 91 -4 24 -3 -2 20 13 -93 31 -59 -118 -6 -32 -7 51 -148 169 -74 -50 -2 -151 158 154 224 -43 -73
7892 -73 -33 -180 -84 200 -39 -52 -129 -57 50 7 47 -31 -100 19 -72 -2 65 35 -294 -63 -184 -124 102 23 -99
7917 -99 87 20 45 75 -142 15 94 71 -198 -60 28 -123 11 -101 14 -91 97 -110 167 4 -97 -49 -74
7940 -74 -42 50 121 -147 163 79 49 75 81 22 -222 152 -195 78 -5 -7 -14 -43 -60 22 183 -146 173 -102 41 177
7966 177 23 8 -90 -73 31 29 -160 -89 42 84 155 27 -3 15 -67 -102 -83 -101 93 -19 36 15 158 8 84 32
7992 32 189 -24 24 -62 114 -54 38 159 22 -19 66 115 81 65 -190 -22 167 -5 -89 -21 30 164 -15 -164
8016 -164 27 7 -17 -15 -218 -48 11 63 -110 -17 -126 133 3 -87 6 217 -9 11 -62 107 221 29 186 -4
8040 -4 12 188 -120 43 -48 -193 36 -52 -35 -96 -131 90 -41 -61 -87 3 -81 -17 -75 -78 -104 -106 23 151 -50 3 46
8067 46 179 -103 -35 85 -246 87 4 -2 -4 -185 51 -126 -187 63 67 69 -26 -73 129 35 93 44 112 -27 -56 -47 152
8094 152 51 99 -161 -228 214 96 29 -117 184 87 84 -20 61 167 -21 -90 -88 107 40 120 -354 86 -32 -81
8118 -81 20 -89 68 106 -19 -67 36 -118 -62 -70 71 -88 -29 111 -188 -19 -87 51 -117 167 -92 1 -209
8141 -209 -115 24 2 -158 146 220 97 107 146 212 4 39 199 -47 -63 112 -11 6 57 -81 28 -85 -22 75
8165 75 134 92 34 -148 -9 -125 -45 18 43 -35 76 -98 245 0 67 -67 -154 85 -86 36 -61 44 88 18
8189 18 73 3
8191C
##END NTUPLES=NMR FID
##END=
