##TITLE=1H_BAU-j-FPO
 CDcl3, 8 sc, 
 20.8.2019
##JCAMPDX= 6.0         $$ Bruker NMR JCAMP-DX V2.0
##DATA TYPE= NMR FID
##DATA CLASS= NTUPLES
##ORIGIN= UXNMR, Bruker Analytische Messtechnik GmbH
##OWNER= root
$$ XWIN-NMR		Version 3.5
$$ Tue Aug 20 15:19:25 2019 Russian Standard Time (UT+4h)  she@DPX200
##.OBSERVE FREQUENCY= 200.13155
##.OBSERVE NUCLEUS= ^1H
##.DELAY= (6, 6)
##.ACQUISITION MODE= SIMULTANEOUS
##.ACQUISITION SCHEME= undefined
##.AVERAGES= 8
##.DIGITISER RES= 18
##SPECTROMETER/DATA SYSTEM= spect
##.PULSE SEQUENCE= zg30
##.SOLVENT NAME= DMSO
##.SHIFT REFERENCE= (INTERNAL, DMSO, 0, 15.7039)
##AUDIT TRAIL= $$ (NUMBER, WHEN, WHO, WHERE, WHAT)
$$ ##TITLE= Audit trail, XWIN-NMR		Version 3.5
$$ ##JCAMPDX= 5.01
$$ ##ORIGIN= Bruker BioSpin GmbH
$$ ##OWNER= she
$$ F:/spectra/data/she/nmr/H-F/1/audita.txt
$$ ##AUDIT TRAIL=  $$ (NUMBER, WHEN, WHO, WHERE, WHAT)
(   1,<2019-08-20 15:18:14.18 +0400>,<she>,<DPX200>,
      <created by zg, POWCHK disabled, PULCHK disabled
       configuration hash MD5:
       00 E9 B6 7A A2 85 ED C7 34 08 36 98 17 FE 4E 26
       data hash MD5: 16K
       2B FF F9 35 7F F7 38 5D 2E 7A 56 67 FD 83 48 18>)
$$ ##END=
$$ 
$$ hash MD5
$$ D6 79 EA F9 AC 5C 9B FE 95 33 D5 84 E6 DF 46 DB
##$RELAX= 
##$RELAX= 
##$RELAX= 
##$RELAX= 
##$RELAX= 
##$RELAX= 
$$ Bruker specific parameters
$$ --------------------------
##$DU= <F:/spectra>
##$EXPNO= 1
##$NAME= <H-F>
##$PROCNO= 1
##$TYPE= <nmr>
##$USER= <she>
##$AMP= (0..31)
100 100 100 100 100 100 100 100 100 100 100 100 100 100 100 100 100 100 
100 100 100 100 100 100 100 100 100 100 100 100 100 100 
##$AQSEQ= 0
##$AQ_mod= 1
##$AUNM= <au_zg>
##$AUTOPOS= <>
##$BF1= 200.13
##$BF2= 200.13
##$BF3= 200.13
##$BF4= 200.13
##$BF5= 200.13
##$BF6= 200.13
##$BF7= 200.13
##$BF8= 200.13
##$BYTORDA= 1
##$CFDGTYP= 0
##$CFRGTYP= 5
##$CHEMSTR= <none>
##$CNST= (0..31)
1 1 145 1 1 1 1 1 1 1 1 1 1 1 1 1 1 1 1 1 1 1 1 1 1 1 1 1 1 1 1 1 
##$CPDPRG= <>
##$CPDPRG1= <>
##$CPDPRG2= <>
##$CPDPRG3= <>
##$CPDPRG4= <mlev>
##$CPDPRG5= <mlev>
##$CPDPRG6= <mlev>
##$CPDPRG7= <mlev>
##$CPDPRG8= <mlev>
##$CPDPRGB= <>
##$CPDPRGT= <>
##$D= (0..31)
0 1.2 0 0 0 0 0 0 0 0 0 0.03 0 0 0 0 0 0 0 0 0 0 0 0 0 0 0 0 0 0 0 0 
##$DATE= 1566299893
##$DBL= (0..7)
120 120 120 120 120 120 120 120 
##$DBP= (0..7)
150 150 150 150 150 150 150 150 
##$DBP07= 0
##$DBPNAM0= <>
##$DBPNAM1= <>
##$DBPNAM2= <>
##$DBPNAM3= <>
##$DBPNAM4= <>
##$DBPNAM5= <>
##$DBPNAM6= <>
##$DBPNAM7= <>
##$DBPOAL= (0..7)
0.5 0.5 0.5 0.5 0.5 0.5 0.5 0.5 
##$DBPOFFS= (0..7)
0 0 0 0 0 0 0 0 
##$DE= 6
##$DECBNUC= <off>
##$DECIM= 24
##$DECNUC= <off>
##$DECSTAT= 4
##$DIGMOD= 1
##$DIGTYP= 9
##$DL= (0..7)
0 120 120 120 120 120 120 120 
##$DP= (0..7)
150 150 150 150 150 150 150 150 
##$DP07= 0
##$DPNAME0= <>
##$DPNAME1= <>
##$DPNAME2= <>
##$DPNAME3= <>
##$DPNAME4= <>
##$DPNAME5= <>
##$DPNAME6= <>
##$DPNAME7= <>
##$DPOAL= (0..7)
0.5 0.5 0.5 0.5 0.5 0.5 0.5 0.5 
##$DPOFFS= (0..7)
0 0 0 0 0 0 0 0 
##$DQDMODE= 0
##$DR= 18
##$DS= 0
##$DSLIST= <SSSSSSSSSSSSSSS>
##$DSPFIRM= 0
$$ [...]
##$SUBNAM2= <"">
##$SUBNAM3= <"">
##$SUBNAM4= <"">
##$SUBNAM5= <"">
##$SUBNAM6= <"">
##$SUBNAM7= <"">
##$SUBNAM8= <"">
##$SUBNAM9= <"">
##$SW= 24.9336996594482
##$SWIBOX= (0..15)
0 0 2 0 0 0 0 0 0 0 0 0 0 0 0 0 
##$SW_h= 4990.01996007984
##$TD= 16384
##$TD0= 1
##$TE= 0
##$TE2= 300
##$TE3= 300
##$TEG= 300
##$TL= (0..7)
0 120 120 120 120 120 120 120 
##$TP= (0..7)
150 150 150 150 150 150 150 150 
##$TP07= 0
##$TPNAME0= <>
##$TPNAME1= <>
##$TPNAME2= <>
##$TPNAME3= <>
##$TPNAME4= <>
##$TPNAME5= <>
##$TPNAME6= <>
##$TPNAME7= <>
##$TPOAL= (0..7)
0.5 0.5 0.5 0.5 0.5 0.5 0.5 0.5 
##$TPOFFS= (0..7)
0 0 0 0 0 0 0 0 
##$TUNHIN= 0
##$TUNHOUT= 0
##$TUNXOUT= 0
##$USERA1= <user>
##$USERA2= <user>
##$USERA3= <user>
##$USERA4= <user>
##$USERA5= <user>
##$V9= 5
##$VALIST= <valist>
##$VCLIST= <CCCCCCCCCCCCCCC>
##$VD= 0
##$VDLIST= <DDDDDDDDDDDDDDD>
##$VPLIST= <PPPPPPPPPPPPPPP>
##$VTLIST= <TTTTTTTTTTTTTTT>
##$WBST= 1024
##$WBSW= 4
##$XGAIN= (0..3)
0 0 0 0 
##$XL= 0
##$YL= 0
##$YMAX_a= 353017
##$YMIN_a= -366354
##$ZGOPTNS= <>
##$ZL1= 120
##$ZL2= 120
##$ZL3= 120
##$ZL4= 120
##$ABSF1= 10
##$ABSF2= 0
##$ABSG= 5
##$ABSL= 3
##$ALPHA= 0
##$AQORDER= 0
##$ASSFAC= 0
##$ASSFACI= 0
##$ASSFACX= 0
##$ASSWID= 0
##$AUNMP= <proc_1d>
##$AZFE= 0.1
##$AZFW= 0.1
##$BCFW= 1
##$BC_mod= 2
##$BYTORDP= 1
##$COROFFS= 0
##$CY= 11.3945322036743
##$DATMOD= 1
##$DC= 2
##$DFILT= <>
##$DTYPP= 0
##$F1P= 20.1720416913024
##$F2P= 0.152960286110954
##$FCOR= 0.5
##$FTSIZE= 0
##$FT_mod= 4
##$GAMMA= 1
##$GB= 0.15
##$INTBC= 1
##$INTSCL= 1
##$ISEN= 128
##$LB= 0.24
##$LEV0= 0
##$LPBIN= 0
##$MAXI= 10000
##$MC2= 0
##$MEAN= 0
##$ME_mod= 0
##$MI= 1.114404
##$NCOEF= 0
##$NC_proc= 0
##$NLEV= 6
##$NOISF1= 3.799351
##$NOISF2= 2.8
##$NSP= 1
##$NTH_PI= 0
##$NZP= 0
##$OFFSET= 15.70392
##$PC= 1
##$PHC0= -9213.038
##$PHC1= 16.00096
##$PH_mod= 1
##$PKNL= yes
##$PPARMOD= 0
##$PSCAL= 0
##$PSIGN= 0
##$REVERSE= no
##$SF= 200.130013532006
##$SI= 16384
##$SIGF1= 3
##$SIGF2= 2
##$SINO= 400
##$SIOLD= 16384
##$SREGLST= <1H.CDCl3>
##$SSB= 0
##$STSI= 0
##$STSR= 0
##$SW_p= 3612.71676300578
##$SYMM= 0
##$S_DEV= 0
##$TDeff= 0
##$TDoff= 0
##$TI= <>
##$TILT= no
##$TM1= 0
##$TM2= 0
##$TOPLEV= 0
##$USERP1= <user>
##$USERP2= <user>
##$USERP3= <user>
##$USERP4= <user>
##$USERP5= <user>
##$WDW= 1
##$XDIM= 8192
##$YMAX_p= 0
##$YMIN_p= 0
$$ End of Bruker specific parameters
$$ ---------------------------------
##NTUPLES= NMR FID
##VAR_NAME=  TIME,          FID/REAL,        FID/IMAG
##SYMBOL=    X,             R,               I
##VAR_TYPE=  INDEPENDENT,   DEPENDENT,       DEPENDENT
##VAR_FORM=  AFFN,          ASDF,            ASDF
##VAR_DIM=   8192,          8192,            8192
##UNITS=     SECONDS,       ARBITRARY UNITS, ARBITRARY UNITS
##FACTOR=    0.0002004,     1,               1
##FIRST=     0,             0,               0
##LAST=      1.6414764,     0,               0
##MIN=       0,             -366354,         0
##MAX=       1.6414764,     353017,          0
$$ Real data points
##PAGE= N=1
##DATA TABLE= (X++(R..R)), XYDATA
$$ plain form
0 0 0 0 0 0 8 -8 8 -8 16 -16 23 -24 32 -40 48 -56 65 -80 96 -111 129 -151 175 -201 232 -267 304 -344
28 -344 390 -443 499 -558 628 -702 783 -874 971 -1079 1195 -1326 1469 -1627 1800 -1995
44 -1995 2209 -2451 2722 -3032 3388 -3802 4290 -4876 5593 -6499 7685 -9306 11676 -15484
58 -15484 22638 -40888 189220 353017 174686 276280 302730 262038 208016 260531 229187
69 229187 160103 128450 140839 77095 54982 117262 135073 6174 -66232 526 34498 -67595
81 -67595 -109499 -29323 4279 -84969 -140554 -124045 -125825 -137244 -84967 -60085 -137133 -193830
93 -193830 -137223 -104085 -168070 -182381 -86447 -53236 -146042 -197652 -138539 -99767 -118500 -98945
105 -98945 -57467 -83919 -120442 -80445 -44902 -83982 -85029 8189 48338 -31492 -76207 -10417
$$ packed form
0@%%%%Qj6J6j6K4l2L9m7N6p2Q8j04J21j45J76k07K40k80L26l76M33m99N71o48
28c44P34q33R42j057J186j330J485j657J845k050K274k521K795l096L427l795
44a995M204m660N173n754O420p190Q092r166J0469j2092J4184j6991K0982k7160
58a5484L8122o3526K30108J63797j78331J01594K6450m0692n4022N2515l1344
69B29187o9084l1653J2389o3744k2113O2280J7811j28899p2406O6758L3972j02093
81f7595m1904Q0176L3602q9248n5585J6509j780j1419N2277K4882p7048n6697
93a93830N6607L3138o3985j4311R5934L3211r2806n1610N9113L8772j8733J9555
105i8945M1478k6452l6523L9997L5543l9080j047R3218M0149p9830m4715O5790
$$ plain form
117 -10417 35531 6095 8784 62007 60076 12928 15740 39352 14620 9159 75885 98775 13329
130 13329 -44929 3136 36759 -7756 -23961 23038 22206 -44869 -73149 -50324 -51842 -58049 -22731
143 -22731 -15283 -84318 -123565 -71993 -40144 -87981 -106477 -47466 -26092 -82179 -113978 -84604
155 -84604 -68153 -72565 -47948 -26957 -60488 -90648 -63379 -45005 -73889 -66933 -2096 10214
167 10214 -60516 -97253 -51791 -13066 -21253 -18782 -2488 -18679 -40705 -23257 -4569 -18808
179 -18808 -11890 34257 40864 -12272 -31483 13118 35583 9846 9108 45238 46532 10456 -4195
192 -4195 6350 8006 19486 50006 44216 -9300 -33019 -1261 13954 -9499 -8976 21197 12117
205 12117 -35805 -50786 -24931 -11387 -13829 -5217 -6488 -34379 -47173 -23896 -14418 -32268 -24512
$$ packed form
117a0417M5948k9436K689N3223j931m7148K812K3612k4732n461O6726K2890q5446
130A3329n8258M8065L3623m4515j6205M6999q32o7075k8280K2825j518o207L5318
143b2731P448o9035l9247N1572L1849m7837j8496N9011K1374n6087l1799K9374
155h4604J6451m412K4617K0991l3531l0160K7269J8374k8884O956O4837J2310
167A0214p0730l6737M5462L8725q187K471J6294j6191k2026J7448J8688j4239
179a8808O918M6147O607n3136j9211M4601K2465k5737p38L6130J294l6076j4651
192d195J0545J656J1480L0520n790n3516k3719L1758J5215k3453N23L0173r080
205A2117m7922j4981K5855J3544k442Q612j271k7891j2794K3277R478j7850P756
$$ plain form
218 -24512 9241 6201 -34664 -45338 -17267 -5088 -11374 -1007 11534 -5493 -26667 -19767 -9016
231 -9016 -12213 -912 24592 16168 -23874 -34975 -7881 6601 36 7580 19182 2526 -20507
244 -20507 -13594 5360 8608 12376 26503 21768 -3296 -8116 13900 23603 14518 20723 37185 29509
258 29509 7030 5735 18152 20944 25052 40084 38981 12869 -2080 9407 20122 19328 26062
271 26062 35843 21666 -5474 -9355 8786 19211 18633 20948 15773 -2754 -11242 735 10205 5191
285 5191 5372 13716 8011 -10640 -15856 -4843 -175 -2173 1905 5172 -6456 -21639 -22247 -15452 -11366
300 -11366 -4683 2598 -6793 -28439 -35405 -22446 -10650 -8521 -6757 -7755 -18932 -29916 -25766 -12212
314 -12212 -4874 -2886 -2764 -7678 -15992 -15767 -6318 80 571 4255 8934 4810 -4967 -5634 2158 8789
$$ packed form
218b4512L3753l040m0865j0674K8071J2179o286J0367J2541j7027k1174O900J0751
231i016l197J1301K5504q424m0042j1101K7094J4482o565P544J1602j6656k3033
244b0507O913J8954L248L768J4127m735k5064m820K2016R703r085O205J6462p676
258B9509k2479j295J2417K792M108J5032j103k6112j4949J1487J0715p94O734
271B6062R781j4177k7140l881J8141J0425n78K315n175j8527q488J1977R470n014
285E191J81Q344n705j8651n216J1013M668j998M078L267j1628j5183o08O795M086
300a1366O683P281r391k1646o966J2959J1796K129J764r98j1177j0984M150J3554
314a2212P338J988J22m914q314K25R449O398M91L684M679m124r777o67P792O631
$$ plain form
330 8789 13110 17321 15399 5799 -1914 195 8870 16495 21648 19567 8392 -3200 -3088 6537 14434
345 14434 16123 13276 6383 -1906 -5948 -1793 4857 7416 6022 2009 -2963 -6830 -7150 -5359 -3196
360 -3196 -990 919 -508 -6460 -12234 -13245 -8637 -2783 1429 2051 -3771 -11501 -15125 -11092 -2533
375 -2533 4255 5145 -1616 -9623 -12182 -7563 -468 4490 5179 1697 -3121 -6207 -4741 -103 3489 4581
391 4581 3816 2755 622 -708 -971 -150 2076 6144 8464 5261 -383 -4303 -3011 1016 6595 9032
407 9032 6912 58 -6243 -5851 542 6341 8035 5283 -474 -5198 -5002 954 5161 4906 3371 2060
423 2060 -68 -949 742 4070 4427 3638 5162 6776 5316 1670 1934 4308 5936 8434 10866 7917
439 7917 724 -1970 2356 6471 7585 7176 4515 -2836 -7422 -4159 1849 1195 -3638 -6216 -8509 -12872
$$ packed form
330H789M321M211j922r600p713K109Q675P625N153k081j1175j1592J12R625P897
345A4434J689k847o893q289m042M155O650K559j394m013m972l867l20J791K163
360c196K206J909j427n952n774j011M608N854M212O22n822p730l624M033Q559
375b533O788Q90o761q007k559M619P095M958O89l482m818l086J466M638L592J092
391D581p65j061k133j330k63Q21K226M068K320l203n644l920J292M027N579K437
407I032k120o854o301L92O393N799J694k752n757m724J96N956M207k55j535j311
423B060k128q81J691L328L57p89J524J614j460l646K64K374J628K498K432k949
439G917p193k694M326M115J114m09k661p351m586L263O008o54m833k578k293m363
$$ plain form
455 -12872 -13367 -9007 -8567 -14288 -17420 -15809 -16516 -20118 -19773 -18243 -21520 -24023 -19591 -16959 -22621 -28124
471 -28124 -24716 -19981 -20836 -21485 -17975 -19337 -25815 -25208 -17788 -14668 -16650 -15440 -14552 -19582 -20732 -11439
487 -11439 -4828 -10561 -15597 -10322 -5851 -8614 -8821 -2864 -2528 -7368 -5967 549 -348 -4248 -1172 1545
503 1545 -3931 -5504 3702 7192 -3011 -8726 -1835 3396 -1489 -3017 105 -2144 -7751 -4199 2412
518 2412 -1903 -7001 -1914 1141 -6218 -7977 3424 7563 -4005 -8470 1780 7808 3415 3574 8050
533 8050 5144 1929 11356 18898 12519 8265 18070 22950 14197 14002 28540 33110 21660 18960 29909
548 29909 33596 29123 31317 36097 30346 27808 39496 44072 29977 23820 36883 42279 30916 27023
562 27023 36521 35623 21598 20299 30243 29076 21392 22264 21064 7908 4881 19955 22956 3662
$$ packed form
455a2872m95M360M40n721l132J611p07l602L45J530l277k503M432K632n662n503
471b8124L408M735q55o49L510j362o478O07P420L120j982J210Q88n030j150R293
487a1439O611n733n036N275M471k763k07N957L36m840J401O516q97l900L076K717
503A545n476j573R206L490j0203n715O891N231m885j528L122k249n607L552O611
518B412m315n098N087L055p359j759J1401M139j1568m465J0250O028m393J59M476
533H050k906l215R427P542o379m254R805M880q753j95J4538M570j1450k700J0949
548B9909L687m473K194M780n751k538J1688M576j4095o157J3063N396j1363l893
562B7023R498q98j4025j299R944j167p684Q72j200j3156l027J5074L001j9294
$$ plain form
576 3662 -5441 7418 11175 -4145 -8035 2526 2169 -8577 -7383 -1475 -8799 -15078 -4702 -771
590 -771 -14384 -16071 1520 3201 -18403 -22490 -1170 7250 -5982 -9782 -1122 -3934 -10123 57
604 57 8871 -624 -5137 9466 11376 -7579 -7343 18141 23790 2270 -2645 14986 18473 5736
618 5736 7795 19059 14362 8952 19682 21322 3304 411 22682 27193 4156 -582 19624 20251
632 20251 -3615 -6428 12589 14481 1466 1317 2619 -10499 -14119 5812 10927 -12114 -19289 1126
646 1126 2922 -21243 -22088 3430 6963 -14964 -18021 -3854 -5849 -13683 -3433 2880 -11819 -13861
660 -13861 8130 8606 -19108 -21908 8827 16663 -7217 -12952 4136 2512 -13524 -6610 9911
673 9911 3538 -6950 1857 2127 -17164 -14902 15228 18214 -13644 -20707 5629 10686 -11248 -12644
$$ packed form
576C662r103J2859L757j5320l890J0561l57j0746J194N908p324o279J0376L931
590g71j3613j687J7591J681k1604m087K1320Q420j3232l800Q660k812o189J0180
604E7Q814r495m513J4603J910j8955K36K5484N649k1520m915J7631L487j2737
618E736K059J1264m697n410J0730J640j8018k893K2271M511k3037m738K0206O27
632B0251k3866k813J9017J892j3015j49J302j3118l620J9931N115k3041p175K0415
646A126J796k4165q45K5518L533k1927l057J4167j995p834J0250O313j4699k042
660a3861K1991M76k7714k800L0735P836k3880n735J7088j624j6036O914J6521
673I911o373j0488Q807K70j9291K262L0130K986l1858p063K6336N057k1934j396
$$ plain form
687 -12644 6506 5896 -7861 -2416 3471 -10955 -15812 5466 10798 -12340 -17200 5927 4842 -24663
701 -24663 -25237 5361 9692 -13942 -20357 -9889 -14428 -19992 -5392 1668 -16983 -23540 -3925 -1412
715 -1412 -25086 -25125 5859 10746 -15953 -21313 -724 1904 -12163 -5824 7773 827 -6584 5176
729 5176 7089 -12774 -11931 16774 21277 -6118 -13179 9562 11888 -9000 -7995 12718 13192 -1869
743 -1869 -1325 2577 -8331 -7996 15199 19434 -5360 -12627 8960 12715 -7958 -6942 17965 19405
757 19405 -2009 -4562 7682 5850 -34 10943 15968 488 -3308 13714 12778 -10792 -10866 16595
771 16595 21444 -2177 -10189 1738 1028 -8246 -58 11550 2313 -8818 -2690 -993 -12479 -8342
785 -8342 13151 13335 -12203 -17141 2131 6563 -7795 -7179 5697 3896 -5916 -2839 -601 -10164
$$ packed form
687a2644J9150o10j3757N445N887j4426m857K1278N332k3138m860K3127j085k9505
701b4663n74L0598M331k3634o415J0468m539n564J4600P060j8651o557J9615K513
715a412k3674l9L0984M887k6699n360K0589K628j4067O339J3597o946p411J1760
729E176J913j9863Q43K8705M503k7395p061K2741K326k0888J005K0713M74j5061
743a869N44L902j0908L35K3195M235k4794p267K1587L755k0673J016K4907J440
757A9405k1414k553J2244j832n884J0977N025j5480l796J7022r36k3570p4K7461
771A6595M849k3621q012J1927p10r274Q188J1608r237j1131O128J697j1486M137
785h342K1493J84k5538m938J9272M432j4358O16J2876j801r812L077K238r563
$$ plain form
799 -10164 -10755 5322 9232 -8070 -14198 -1433 -2149 -16493 -12442 7033 6587 -10868 -15647 -8885
813 -8885 -8405 -7417 3424 5544 -8253 -12888 -556 2137 -9240 -6081 11067 11488 -4299 -7415
827 -7415 2762 3899 -1023 4745 11096 4805 -901 3518 3315 -5793 -2037 13577 13104 -3630 -8704
842 -8704 719 1284 -5779 -1085 7522 3152 -6655 -6799 -5725 -8967 -4438 6519 5147 -9759 -13460
857 -13460 -4062 -2834 -8523 -4975 3436 -188 -10438 -10836 -6620 -7919 -7024 -713 -536 -8904 -11625
872 -11625 -6001 -7713 -14137 -9223 2659 1388 -10309 -14188 -10419 -9295 -7015 683 2597 -5796
886 -5796 -11265 -8084 -6033 -6491 -1079 5968 1636 -8711 -9142 -1766 -745 -2780 710 3334 -759
901 -759 -4305 -3028 -3407 -6133 -2261 5659 4074 -4109 -7238 -4468 -5036 -5031 1720 6326 1079 -7205 -7831
$$ packed form
799a0164n91J6077L910j7302o128J2765p16j4344M051J9475m46j7455m779O762
813h885M80R88J0841K120j3797m635J2332K693j1377L159J7148M21j5787l116
827g415J0177J137m922N768O351o291n706M419k03r108L756J5614m73j6734n074
842h704R423N65p063M694Q607m370r807j44J074l242M529J0957j372j4906l701
857a3460R398J228n689L548Q411l624j0250l98M216j299Q95O311J77q368k721
872a1625N624j712o424M914J1882j271j1697l879L769J124K280P698J914q393
886e796n469L181K051m58N412P047m332j0347m31P376J021k035L490K624m093
901g59l546J277l79k726L872P920j585q183l129K770n68NO751M606n247q284o26
$$ plain form
918 -7831 -4941 -2786 1852 7242 3968 -4208 -5113 -749 1247 904 5260 8550 4517 -819 543 3546
934 3546 3688 5667 9989 10393 5590 3110 4729 4654 4443 10168 15143 11325 4493 2747 4474 5754
950 5754 8453 13430 13067 6345 1429 2288 4030 5920 9641 11713 6924 -46 -1049 2665 3473 4423
966 4423 6665 6296 1327 -2099 -1103 347 229 2530 5675 3744 -1147 -3526 -2646 -2319 -192 3914
982 3914 5741 963 -4704 -5535 -3668 -867 2992 5678 2509 -3983 -5992 -3719 -486 1988 4271
997 4271 4036 -114 -3892 -2763 432 1668 2919 4588 4187 483 -1336 -662 161 1632 4116 6409
1013 6409 3574 -1083 -3772 -2561 -785 2667 4703 3776 -1998 -6742 -6580 -3248 -13 1589 1382 -2594
1029 -2594 -7152 -7672 -4701 -1937 -292 458 -589 -3241 -5304 -4069 -2154 -264 1266 2763 2110 -854
$$ packed form
918g831K890K155M638N390l274q176r05M364J996l43M356L290m033n336J362L003
934C546J42J979M322M04m803k480J619p5k11N725M975l818o832j746J727J280
950E754K699M977l63o722m916Q59J742J890L721K072m789o970j003L714Q08R50
966D423K242l69m969l426R96J450j18K301L145j931m891k379Q80L27K127M106
982C914J827m778n667q31J867K801L859K686l169o492k009K273L233K474K283
997D271k35m150l778J129L195J236J251J669m01l704j819O74Q23J471K484K293
1013F409k835m657k689J211J776L452K036r27n774m744J62L332L235J602k07l976
1029b594m558n20K971K764J645P50j047k652k063J235J915J890J530J497o53k964
$$ plain form
1045 -854 -2755 -2121 -91 2815 5079 5603 2206 -2082 -2959 -988 2625 5233 5703 2952 -1610 -4258
1061 -4258 -2190 1465 4193 4358 3015 -490 -2931 -2312 475 2470 2908 3236 2214 -137 -1759 -734
1077 -734 695 1952 2963 3806 1838 -1644 -3712 -2568 -382 1625 3082 1347 -3054 -6360 -5817 -2638
1093 -2638 -9 1319 775 -2718 -6406 -6357 -3110 284 1659 1508 448 -2127 -3358 -500 1819 2671
1109 2671 3261 4404 3403 1211 145 1836 3231 4017 5352 5711 2627 -1601 -1525 726 2189 3406
1125 3406 4588 1596 -3750 -5397 -2254 774 1485 1598 722 -2492 -5487 -3467 576 1144 886 1939
1141 1939 1019 -2187 -2459 944 2067 1517 2023 4171 2472 -1337 -1692 863 2029 2254 4420 3708 -1122
1158 -1122 -4112 -1246 2176 1655 2030 3883 1107 -4354 -3355 2040 4163 3049 3009 3064 -730 -1559 2342
$$ packed form
1045h54j901O34K030K906K264N24l397m288q77J971L613K608M70k751m562k648
1061d258K068L655K728J65j343l505k441O19K787J995M38L28j022k351j622J025
1077g34J429J257J011Q43j968l482k068J144K186K007J457j735m401l306N43L179
1093b638K629J328n44l493l688M9L247L394J375j51j060k575j231K858K319Q52
1109B671N90J143j001k192j066J691J395P86J335L59l084m228P6K251J463J217
1125C406J182k992n346j647L143L028P11J13q76l214k995K020M043N68k58J053
1141A939r20l206k72L403J123n50N06K148j699l809l55K555J166K25K166p12m830
1158a122k990K866L422n21L75J853k776n461R99N395K123j114m0N5l794q29L901
$$ plain form
1175 2342 5037 2955 2307 5123 4191 -445 -943 2905 3786 857 1642 3642 421 -4050 -2949 -289
1191 -289 -1041 -1231 1822 -459 -7428 -8016 -2244 270 -2559 -2859 -426 -3044 -7022 -4349 909 1011
1207 1011 -900 1025 1090 -3030 -2588 3388 4625 96 427 5191 4548 -1371 -915 3871 3901 1917 4027
1224 4027 4818 -187 -2906 1661 4161 750 1159 5423 2404 -5115 -3984 3847 4644 -34 -37 1855
1240 1855 -1426 -3757 766 3308 -791 -2385 1916 1064 -5359 -5038 1949 1625 -5059 -4191 1037 -1707
1256 -1707 -7574 -5732 -1964 -3964 -4623 -338 -1461 -8786 -8714 -888 628 -4942 -3893 1565 -894 -7412
1272 -7412 -3793 3681 2874 -855 1103 2444 -1035 -570 6632 6758 70 582 8166 6841 -839 864
1288 864 7722 6167 1358 3867 7124 2902 -892 3758 5781 1330 1700 7459 4265 -5036 -2760
$$ packed form
1175B342K695k082o48K816r32m636m98L848Q81k929P85K000l221m471J101K660
1191b89p52j90L053k281o969n88N772K514k829l00K433k618l978K673N258J02
1207A011j911J925O5m120M42N976J237m529L31M764o43n919M56M786L0j984K110
1224D027P91n005k719M567K500l411M09M264l019p519J131P831P97m678lJ892
1240A855l281k331M523K542m099j594M301q52o423L21O987l24o684Q68N228k744
1256a707n867J842L768k000o59M285j123p325P2P826J516n570J049N458k459o518
1272g412L619P474q07l729J958J341l479M65P202J26o688N12P584j325p680J703
1288H64O858j555m809K509L257m222l794M650K023m451L70N759l194r301K276
$$ plain form
1303 -2760 6966 6142 -1944 -1127 3346 271 -3839 220 3632 -1558 -3791 1207 880 -6206 -4772 2916
1319 2916 1008 -7926 -5584 2498 -810 -8322 -6362 -100 -2468 -5558 -1944 -1111 -7397 -7194 690
1334 690 696 -6646 -4633 3013 1 -8184 -4618 4780 2558 -3835 -1452 2614 -1464 -2522 3542 4065
1350 4065 -2436 -2044 5743 4090 -4175 -1682 6973 4465 -3872 -866 5536 2463 -3503 437 3457
1365 3457 -754 -1363 4667 2780 -5737 -4105 4936 3891 -4805 -3322 3420 614 -6563 -2764 3037
1380 3037 -438 -5339 -1528 -387 -5107 -4423 2009 -243 -8660 -6833 2440 333 -8181 -6604 361
1395 361 -1875 -6704 -2997 435 -4667 -7156 -1666 -108 -5364 -4415 1483 -628 -7897 -4848 4301
1410 4301 2178 -5501 -4052 2050 543 -2891 1181 3114 -1462 -2361 3701 4408 -1401 -709 5644 3959
$$ packed form
1303b760R726q24q086Q17M473l075m110M059L412n190k233M998l27p086J434P688
1319B916j908q934K342Q082l308p512J960O262k368l090L614Q33o286K03P884
1334F90Op342K013P646l012q185L566R398k222o393K383M066m078j058O064N23
1350D065o501L92P787j653q265K493Q655k508q337L006O402l073n966L940L020
1365C457m211o09O030j887q517J632R041j045q696J483O742k806p177L799N801
1380C037l475m901L811J141m720O84O432k252q417J827R273k107q514J577O965
1395C61k236m829L707L432n102k489N490J558n256R49N898k111p269L049R149
1410D301k123p679J449O102j507l434M072J933m576q99O062P07n809O92O353j685
$$ plain form
1426 3959 -1973 596 7718 5117 -1228 918 5855 3855 1242 4759 4946 257 679 6325 5805 -592
1442 -592 309 6414 4675 -1186 500 5646 3315 -1433 628 3804 1138 -1052 2334 1828 -3089 -2050
1458 -2050 3083 1705 -3958 -2906 1661 170 -4637 -2469 1126 -645 -4322 -2494 -1022 -3638 -3398
1473 -3398 562 -907 -5338 -4336 884 34 -4419 -3416 611 -382 -3564 -1156 1014 -1123 -2537
1488 -2537 -39 1549 -354 -165 2519 898 -2406 337 5056 3888 -91 -126 2637 2417 1132 3382
1504 3382 3846 1033 263 2709 3158 898 1491 3568 2050 -426 1391 3781 1518 -1474 -187 1983
1520 1983 1377 77 757 -385 -2257 -1216 1720 1124 -2001 -1799 -472 -1842 -2718 -560 1123 -1068
1536 -1068 -3158 -2141 -1042 -1699 -1434 25 -1165 -2692 -1164 584 -818 -2663 -1025 1446 25
$$ packed form
1426C959n932K569P122k601o345K146M937k000k613L517J87m689M22N646n20o397
1442e92R01O105j739n861J686N146k331m748K061L176k666k190L386n06m917J039
1458b050N133j378n663J052M567j491m807K168L595j771l677J828J472k616K40
1473c398L960j469m431J002N220q50m453J003M027r93l182K408K170k137j414
1488b537K498J588j903J89K684j621l304K743M719j168l979l5K763k20j285K250
1504C382M64k813p70K446M49k260N93K077j518k476J817K390k263k992J287K170
1520A983o06j300O80j142j872J041K936n96l125K02J327j370q76K158J683k191
1536a068k090J017J099o57K65J459j190j527J528J748j402j845J638K471j421
$$ plain form
1551 25 -948 -291 489 -693 -811 1077 1845 225 301 1201 -35 -1111 1230 2858 1864 -337 512 941
1569 941 -18 133 1929 2207 353 193 828 332 -556 727 2219 684 -777 -70 1392 -237 -990
1586 -990 323 1153 -96 -865 297 -632 -1560 -877 812 792 -356 -451 -694 -1506 -1557 1008 2314 708
1604 708 -1326 -661 -20 -314 1057 2314 1689 -511 -31 1333 1099 86 1531 2248 1001 555 1454
1621 1454 1503 170 -414 1609 2424 1108 482 241 -745 -1179 548 1894 1044 -1511 -1572 -1218 -1077 -449
1639 -449 906 1055 -1161 -2094 -982 -418 -809 -341 671 -531 -1259 -1132 -636 -1135 -1369 -148 308 -396
1657 -396 -1045 -1214 -1139 -1488 -1361 1003 812 -44 -1214 -1185 -1020 -280 869 1715 1329 -890 -742 397 329
1676 329 1320 2323 1758 852 81 600 1021 1195 1260 1822 1246 197 370 667 559 40 982 1195 396 -914
$$ packed form
1551B5r73O57P80j182j18J888P68j620P6R00j236j076K341J628r94k201Q49M29
1569I41r59J51J796K78j854j60O35m96q88J283J492j535j461P07J462j629p53
1586i90J313Q30j249p69J162r29r28O83J689k0j148r5k43q12n1K565J306j606
1604G08k034O65O41k94J371J257o25k200M80J364k34j013J445P17j247m46Q99
1621A454M9j333n84K023Q15j316o26k41r86m34J727J346q50k555o1L54J41O28
1639d49J355J49k216r33J112N64l91M68J012j202p28J27M96m99k34J221M56p04
1657c96o49j69P5l49J27K364j91q56j170K9J65P40J149Q46l86k219J48J139o8
1676C29R91J003n65r06p71N19M21J74O5N62n76j049J73K97j08n19R42K13p99j310
$$ plain form
1696 -914 -1261 -1029 -1373 -505 631 681 -1288 -1752 -1990 -1048 -357 601 894 -623 -1626 -1435 -498 468 775
1715 775 1098 586 -335 -342 314 748 472 957 1045 785 -148 173 -204 37 172 1277 1483 -81 -1047 -1224
1735 -1224 -812 -101 988 1324 733 -1011 -1582 -771 177 979 1375 799 -457 -980 -507 484 580 630 810
1754 810 181 -742 -831 -648 -469 -710 10 325 -457 -1470 -1690 -1866 -1486 -330 580 202 -1425 -2030 -1658
1773 -1658 -868 151 1211 1271 -267 -1039 -583 849 1172 1599 2324 1434 61 117 1263 1594 805 1600
1791 1600 1646 914 -259 400 319 -463 194 1048 915 -698 -1626 -1265 -1084 -909 546 1004 -41 -2006 -1972
1810 -1972 -1193 -414 90 1363 674 -1619 -2088 -592 243 -178 228 629 -46 -1468 -1425 -50 -324 -971
1828 -971 228 523 -934 -2114 -1129 -683 -1588 -426 1426 882 -1414 -1739 -482 142 179 1798 2220 241
$$ packed form
1696i14l47K32l44Q68J136N0j969m64k38R42O91R58K93j517j003J91R37R66L07
1715G75L23n12r21pO56M34k76M85Q8k60r33L21l77K41J35J105K06j564r66j77
1735a224M12P11J089L36n91j744n71Q11R48Q02L96n76j256n23M73R91R6N0J80
1754H10o29r23q9J83J79k41P20L15p82j013k20j76L80J156R10l78j627o05L72
1773a658P90J019J060O0j538p72M56J432L23M27P25q90j373N6J146L31p89P95
1791A600M6p32j173O59q1p82O57Q54j33j613r28L61J81J75J455M58j045j965L4
1810a972P79P79N04J273o89k293m69J496Q35m21M06M01o75j422M3J375k74o47
1828i71J199K95j457j180R85M46r05J162J852n44k296l25J257O24L7J619M22j979
$$ plain form
1846 241 -1419 -174 1593 1263 1633 3012 1720 -525 -520 1389 1681 595 1134 1577 522 -925 -394
1863 -394 315 -643 -738 771 786 -1828 -2512 -661 -557 -1714 -188 1421 -102 -2964 -1961 -85 -47 111
1881 111 1363 1184 -1404 -1570 390 1515 307 225 2048 697 -1519 -985 1374 983 -614 540 1460
1898 1460 -382 -1321 118 469 -1073 -241 1953 1135 -1486 -1312 719 1009 44 1201 2513 573 -1625
1915 -1625 159 1897 931 921 2570 1527 -1479 -1430 1705 1656 -332 298 1335 116 -2200 -1113 760
1932 760 -876 -1202 404 537 -2075 -2502 446 -174 -1903 -891 1921 -160 -2845 -1927 668 183 -597
1949 -597 1036 1133 -1576 -2589 879 1245 -544 -31 1690 16 -2696 -1269 1343 575 -1704 -274
1965 -274 1045 -997 -2254 -27 597 -1520 -898 2172 450 -2303 -1820 1750 1014 -1177 716 2998
$$ packed form
1846B41j660J245J767l30L70J379j292k245NJ909K92j086N39M43j055j447N31
1863c94P09r58r5J509J5k614o84J851J04j157J526J609j523k862J003J876L8J58
1881A11J252j79k588j66J960J125j208q2J823j351k216N34K359l91j597J154R20
1898A460j842r39J439L51j542Q32K194q18k621J74K031K90r65J157J312j940k198
1915a625J784J738r66j0J649j043l006M9L135m9j988O30J037j219k316J087J873
1932G60j636l26J606J33k612m27K948o20j729J012K812k081k685R18K595m85p80
1949e97J633R7k709j013L468L66j789N13J721j674k712J427K612p68k279J430
1965b74J319k042j257K227O24k117O22L070j722k753M83L570p36k191J893K282
$$ plain form
1981 2998 589 -2158 -143 2408 1422 1144 2790 2028 -1208 -426 3222 2835 -54 1004 3086 756
1997 756 -1297 530 3404 1420 -263 1536 2164 -318 -1096 1511 1649 -816 431 3215 1347 -2419
2013 -2419 -1372 1887 989 -1002 355 1428 -1543 -2691 227 1213 -1065 -1737 677 -1037 -4159 -2531
2029 -2531 789 -603 -3491 -2066 -348 -2591 -3793 -1965 -490 -2534 -2736 -453 -634 -3784 -3473 -4
2045 -4 -456 -2668 -1234 1223 -828 -3681 -1913 1534 -108 -1130 627 652 -1545 -1752 1787 1814 -778
2062 -778 -390 2109 787 -1949 -115 2660 1344 -691 827 2151 240 -1406 1194 1625 -530 -424
2078 -424 1822 721 -1864 -928 1519 1096 -1270 38 1362 -720 -2671 -562 1027 -275 -1111 340
2094 340 -196 -2780 -1738 1270 997 -1413 -1075 553 -500 -2034 -150 1363 -158 -1269 179 1092
$$ packed form
1981B998k409k747K015K551r86k78J646p62l236P82L648l87k889J058K082k330
1997G56k053J827K874j984j683J799O28k482p78K607J38k465J247K784j868l766
2013b419J047L259q98j991J357J073k971j148K918R86k278o72K414j714l122J628
2029b531L320j392k888J425J718k243j202J828J475k044k02K283j81l150L11L469
2045dm52k212J434K457k051k853J768L447j642j022J757K5k197k07L539K7k592
2062g78L88K499j322k736J834K775j316k035J518J324j911j646K600M31k155J06
2078d24K246j101k585R36K447m23k366J308J324k082j951K109J589j302q36J451
2094C40n36k584J042L008k73k410L38J628j053j534J884J513j521j111J448R13
$$ plain form
2110 1092 -869 -972 1144 838 -872 212 2056 880 -1995 -167 1940 1445 557 935 1183 -653
2126 -653 -626 1498 2100 571 170 1191 247 -1003 264 1986 492 -992 -104 930 16 -926 -11
2143 -11 145 -877 -760 431 -84 -1891 -1613 162 263 -1084 -596 3 -1365 -2278 -455 857 -63 -760
2161 -760 -285 -428 -1078 -398 1058 904 -257 181 1129 375 -273 517 1582 748 213 1657 1470 269
2179 269 558 1857 1841 842 1324 1995 1209 171 1207 1683 1514 957 1420 1395 446 343 1560 1252 813
2198 813 958 1001 219 -292 803 1996 724 -38 54 379 -253 42 930 397 -417 -290 470 182 -366 32
2218 32 166 -37 -669 248 623 -656 -818 204 830 187 191 503 -339 -769 186 1122 792 -234 -168 40
2238 40 -166 -271 808 793 -429 -620 286 261 -513 -607 -80 -497 -594 -57 398 -414 -1289 -785 -11 -406 -310
$$ packed form
2110A092j961j03K116l06j710J084J844j176k875J828K107m95q88L78K48j836
2126f53K7K124O02j529m01J021r44j250J267J722j494j484Q88J034r14r42R15
2143a1J56j022J17J191n15j807K78J775J01j347M88N99j368r13J823J312r20o97
2161g60M75j43o50O80J456j54j161M38R48p54o48P90J065q34n35J444j87j201
2179B69K89J299j6r99M82O71p86j038J036M76j69n57M63k5r49j03J217l08m39
2198H13J45M3p82n11J095J193j272p62R2L25o32K95Q88n33q14J27P60k88n48L98
2218C2J34k03o32R17L75j279j62J022O26o43ML12q42m30R55R36l30j026O6K08
2238D0k06j05J079j5j222j91R06k5p74r4N27m17r7N37M55q12q75N04P74l95R6
$$ plain form
2259 -310 63 -829 -1009 -889 279 211 -735 -500 -126 -773 -558 356 612 -204 -696 -183 294 -112 -475 338
2279 338 188 -148 45 451 533 -420 -150 354 153 -201 334 674 -412 -655 159 731 14 -62 88 -65
2299 -65 -679 -272 679 304 -637 -550 -284 -763 -820 -94 4 -417 -1341 -586 -677 -957 -823 -578 -1188 -1577 -1134 -375
2321 -375 -703 -1084 -1170 -590 -629 -680 -603 -155 -964 -1070 -300 662 -114 -337 -163 -283 -420 94 691 256 -227
2342 -227 -308 652 416 674 490 636 75 34 945 1295 623 382 571 506 479 706 928 286 104 -88 963
2363 963 697 113 461 -28 -150 -114 448 614 -365 -307 -220 287 -11 72 499 -166 -370 63 632 265 7
2384 7 41 -144 -342 97 351 564 -64 -363 -141 456 92 201 238 59 -232 183 488 208 34 256 263 -383
2406 -383 -256 545 -8 -291 -536 -100 11 -135 -292 -381 -772 -740 -441 -59 -356 -1154 -862 -723 -647 -470 -453
$$ packed form
2259c10L73q92j80J20J168o8r46K35L74o47K15R14K56q16m92N13M77m06l63Q13
2279C38j50l36J93M06Q2r53K70N04k01l54N35L40j086k43Q14N72p17p6J50j53
2299f5o14M07R51l75r41Q7K66m79n7P26R8m21r24P55r1k80J34K45o10l89M43P59
2321c75l28l81q6N80l9n1P7M48q09j06P70R62p76k23J74j20j37N14N97m35m83
2342b27q1R60k36K58j84J46n61m1R11L50o72k41J89o5k7K27K22o42j82j92J051
2363I63k66n84L48m89j22L6N62J66r79N8Q7N07k98Q3M27o65k04M33N69l67k58
2384GL4j85j98M39K54K13o28k99K22N97l64J09L7j79k91M15L05k80j74K22Po46
2406c83J27Q01n53k83k45M36J11j46j57q9l91L2K99L82k97p98K92J39P6J77J7
$$ plain form
2427 -453 -779 -1192 -1281 -707 -802 -649 -716 -544 -1308 -1616 -986 -550 -1119 -1132 -727 -1013 -714 -889 -385 -585 -976
2448 -976 -527 -187 -189 -417 -463 -545 -580 -432 131 278 -176 -361 -57 -6 -92 -143 410 12 -566 -72 281 65 -404
2471 -404 28 242 -257 -40 484 255 -456 -356 299 499 -56 66 516 67 -42 762 939 336 244 230 101
2492 101 199 1136 1536 881 48 410 824 598 660 1120 1135 424 435 1162 1513 507 819 1563 1400 786 1104
2513 1104 1627 1020 416 1141 1842 1369 1032 1204 1079 570 623 1813 1300 97 334 1394 807 205 824
2532 824 1608 158 -492 717 674 207 -37 567 242 -300 -196 311 60 -258 -143 783 652 -510 331
2551 331 537 -180 -477 649 1109 142 -412 259 461 92 679 1379 382 -511 18 908 407 292 779 716
2571 716 -290 -364 327 647 -88 -128 780 214 -719 39 753 -441 -742 127 513 -10 -1018 -106 4 -837
$$ packed form
2427d53l26m13q9N74r5J53o7J72p64l08O30M36n69j3M05k86K99j75N04k00l91
2448i76M49L40kk28m6q2l5J48N63J47m54j85L04N1q6n1N53l98n78M94L53k16m69
2471d04M32K14m99K17N24k29p11J00O55K00n55J22M50m49j09Q04J77o03r2j4j29
2492A01R8R37M00o55q33L62M14k26O2M60J5p11J1P27L51j006L12P44j63o14L18
2513A104N23o07o04P25P01m73l37J72j25n09N3J190n13j203K37J060n87o02O19
2532H24P84j450o50J209m3m67k44O04l25n42J04N07k51l18J15R26j31j162Q41
2551C31K06p17k97J126M60r67n54O71K02l69N87P00r97q93N29Q90n01j15M87o3
2571G16j006p4O91L20p35m0R08n66r33P58P14j194l01Q69L86n23j008R12J10q41
$$ plain form
2591 -837 -551 533 109 -1355 -1303 -333 -878 -912 -342 272 -865 -1498 -659 -353 -695 -1081 -220 31 -1218
2610 -1218 -1177 25 -163 -1224 -695 217 -294 -1220 -361 243 -686 -962 182 658 -489 -931 -343 -110 -532
2629 -532 -227 684 17 -1289 -577 181 64 -1043 -72 167 -1037 -1180 -119 143 -960 -770 -32 -222
2647 -222 -1086 -615 115 -633 -1098 0 328 -181 -1419 -73 264 -281 -243 885 518 -1023 -462 604
2665 604 97 -518 373 1023 -219 -853 188 1139 236 -73 834 551 -674 -238 1012 617 -125 239 825
2684 825 385 -480 295 1083 -57 -473 713 992 -449 -677 301 128 -644 -521 713 252 -1327 -844
2702 -844 205 -115 -605 149 298 -966 -1423 -154 494 -399 -615 140 -132 -878 -630 665 -87 -827 -69
2721 -69 766 430 -699 291 651 -21 158 1123 660 -67 -260 539 600 50 406 1340 395 -176 49 1327
$$ packed form
2591h37K86J084m24j464N2R70n45l4N70O14j137o33Q39L06l42l86Q61K51j249
2610a218M1J202j88j061N29R12n11r26Q59O04r29k76J144M76j147m42N88K33m22
2629e32L05R11o67j306P12P58j17j107R71K39j204j43J061K62j103J90P38j90
2647b22q64M71P30p48m65J098L28n09j238J346L37n45L8J128l67j541N61J066
2665F04n07o15Q91O50j242o34J041R51r03l09R07k83j225M36J250l95p42L64N86
2684H25m40q65P75P88j140m16J186K79j441k28R78j73p72J23J234m61j579M83
2702h44J049l20m90P54J49j264m57J269O48q93k16P55k72p46K48J295p52p40P58
2721f9Q35l36j129R90L60o72J79R65m63p27j93P99O1n50L56R34r45n71K25J278
$$ plain form
2741 1327 571 6 496 635 -101 -352 913 954 -44 -48 649 132 -455 249 830 -379 -587 152 703 -290
2761 -290 -932 -4 269 -375 -98 311 215 -890 -872 265 543 -341 361 516 -56 -627 -111 852 -122 -175
2781 -175 534 290 -214 -218 749 617 -359 350 849 161 -448 97 665 591 150 415 696 -172 -460 340 228
2802 228 -288 341 653 -301 -853 -412 76 73 -170 -64 -212 -909 -1040 -360 -27 -500 -859 -575 -910 -1168 -432
2823 -432 -492 -872 -947 -707 -381 -917 -1098 -502 -671 -734 -453 -62 -466 -718 -622 31 134 242 219 394 -339 -276
2845 -276 11 601 363 581 419 203 360 238 949 500 328 393 576 593 410 567 1005 262 477 923 965
2866 965 221 220 766 876 645 633 880 454 -105 376 1019 961 519 668 539 144 130 905 372 399 332 409 304
2889 304 -109 373 298 61 267 470 411 -62 -64 487 287 443 -76 530 142 -240 -214 2 249 -287 295 23
$$ packed form
2741A327p56n65M90J39p36k51J265M1r98mO97n17n87P04N81j209k08P39N51r93
2761b90o42R28K73o44K77M09r6j105J8J137K78q84P02J55n72n71N16R63r74n3
2781a75P09k44n04mR67j32r76P09M99o88o09N45N68p4m41K65K81q68k88Q00j12
2802B28n16O29L12r54n52M41M88lk43J06j48o97j31O80L33m73l59K84l35k58P36
2823d32o0l80p5K40L26n36j81N96j69o3K81L91m04k52R6O53J03J08k3J75p33O3
2845b76K87N90k38K18j62k16J57j22P11m49j72O5J83J7j83J57M38p43K15M46M2
2866I65p44jN46J10k31j2K47m26n59M81O43n8m42J49j29l95j4P75n33K7o7P7j05
2889C04m13M82p5k37K06K03n9m73kN51k00J56n19O06l88l82K6K16K47n36N82k72
$$ plain form
2911 23 -412 -819 -331 -73 -422 -272 -549 -871 -1146 -787 -546 -854 -1066 -1003 -822 -1192 -1466 -1184 -905 -995 -1378
2932 -1378 -838 -862 -1463 -1133 -1079 -627 -906 -848 -402 -1061 -1354 -1271 -288 -350 -530 -530 -591 -920 -751 -387 122 -319
2954 -319 -344 -129 -425 -523 -346 272 -470 -590 -321 176 -129 -124 -159 -18 -179 -221 -112 139 -389 -246 -318 -72
2976 -72 -72 -146 -383 -652 -215 -131 70 -355 -121 -809 -468 -824 -477 -104 51 -543 -518 -409 -299 -494 -435 -252
2998 -252 -346 -343 -164 326 -308 -365 143 22 -90 162 161 186 66 169 693 780 440 723 771 193 313 960 1036
3021 1036 863 235 700 665 641 364 857 666 129 350 609 695 475 396 842 607 135 502 572 279 311 487
3043 487 411 524 512 222 225 -8 275 232 673 104 -18 429 -122 325 632 655 358 -37 117 329 191 257
3065 257 591 369 368 495 840 727 610 623 771 680 820 701 607 391 713 901 1210 879 441 901 463 594
$$ packed form
2911B3m35m07M88K58l49J50k77l22k75L59K41l08k12O3J81l70k74K82K79r0l83
2932a378N40k4o01L30N4M52k79N8M46o59k93Q3R83o2j80%o1l29J69L64N09m41
2954c19k5K15k96r8J77O18p42j20K69M97l05Nl5J41j61m2J09K51n28J43p2K46
2976g2%p4k37k69M37Q4K01m25K34o88L41l56L47L73J55n94K5J09J10j95N9J83
2998b52r4LJ79M90o34n7N08j21j12K52jK5j20J03N24Q7l40K83M8n78J20O47P6
3021A036j73o28M65l5k4k77M93j91n37K21K59Q6k20p9M46k35m72L67P0k93L2J76
3043D87p6J13j2k90Lk33K83m3M41n69j22M47n51M47L07K3k97l95J54K12j38O6
3065B57L34k22jJ27L45j13j17J3J48r1J40j19r4k16L22J88L09l31m38M60m38J31
$$ plain form
3087 594 781 1034 761 392 323 263 595 391 767 549 165 203 397 557 291 -41 257 300 310 151 412 -113
3109 -113 -280 -65 -138 -79 37 18 -182 -501 -205 83 -297 -81 -28 115 -225 -389 88 -260 -273 -153 78 -266
3131 -266 -211 -229 129 62 -324 186 -50 208 -2 122 67 -266 368 402 269 -187 -164 349 277 174 115 77 -95
3154 -95 -135 33 411 227 -315 -17 -256 -77 -96 408 206 -681 -299 145 -190 -118 -228 -118 -357 -393 -227 -291
3176 -291 -656 -627 -622 -472 -665 -463 -320 -837 -870 -327 -448 -531 -707 -662 -652 -1081 -819 -479 -396 -579 -1068 -720 -716
3199 -716 -943 -553 -356 -409 -1119 -585 -58 -445 -683 -192 -38 -612 63 -130 44 -376 -285 70 118 -162 226
3220 226 303 -48 -354 240 728 170 -17 250 510 165 81 848 381 47 409 699 68 370 472 522 123
3241 123 193 632 711 -87 -272 145 124 -413 -12 348 -298 -587 -316 204 -3 -129 -55 -125 -385 -327 312 226
$$ packed form
3087E94J87K53k73l69o9o0L32k04L76k18l84L8J94J60k66l32K98M3J0j59K61n25
3109a13j67K15p3N9J16j9k00l19K96K88l80K16N3J43l40j64M77l48j3J20K31l44
3131b66N5j8L58o7l86N10k36K58k10J24n5l33O34L4j33m56K3N13p2j03n9l8j72
3154i5m0J68L78j84n42K98k39J79j9N04k02q87L82M44l35P2j10J10k39l6J66o4
3176b91l65K9NJ50j93K02J43n17l3N43j21q3j76M5J0m29K62L40Q3j83m89L48M
3199g16k27L90J97n3p10N34N27l87k38M91J54n74O75j93J74m20R1L55M8k80L88
3220B26P7l51l06N94M88n58j87K67K60l45q4P67m67l34L62K90o31L02J02N0l99
3241A23P0M39P9p98j85M17k1n37M01L60o46k89K71N20k07j26P4p0k60N8O39q6
$$ plain form
3263 226 -129 -441 -2 -62 11 -241 105 -112 -568 -69 538 -208 -133 329 402 46 -128 989 715 -93 -24
3284 -24 652 604 108 438 680 449 19 521 617 398 400 218 432 134 370 890 605 -210 300 501 272 -36
3306 -36 349 497 -322 -547 258 419 -156 -473 -95 -95 -840 -508 -49 -120 -846 -394 -196 -384 -728 -326 -349 -765
3328 -765 -564 -681 -187 -679 -780 -348 -220 -610 -443 -9 -323 -556 -302 68 -152 -330 -52 57 -456 -304
3348 -304 414 178 -305 -67 387 293 93 285 715 -19 -67 223 475 331 246 284 451 329 140 649 573 -116
3370 -116 215 894 446 -80 268 526 -184 -246 336 188 -139 -173 108 413 136 31 452 247 -54 -6 351
3391 351 145 -190 -99 482 -145 -306 446 267 -299 -351 42 176 -38 42 199 -291 -402 -58 476 -125 -199
3412 -199 -128 204 -262 -210 57 341 -346 -517 -235 -311 -350 -384 -58 -251 -686 -323 82 30 -607 -206 -213 -622 -575
$$ packed form
3263B26l55l12M39o0P3k52L46k17m56M99O07p46P5M62P3l56j74J117k74q08O9
3284b4O76m8m96L30K42k31m30N02R6k19Kj82K14k98K36N20k85q15N10K01k29l08
3306c6L85J48q19k25Q05J61n75l17L78%p45L32M59p1p26M52J98j88l44M02k3m16
3328g65K01j17M94m92j01M32J28l90J67M34l14k33K54L70k20j78K78J09n13J52
3348c04P18k36m83K38M54r4k00J92M30p34m8K90K52j44q5L8J67j22j89N09p6o89
3370a16L31O79m48n26L48K58p10o2N82j48l27l4K81L05k77j05M21k05l01M8L57
3391C51k06l35R1N81o27j61P52j79n66n2L93J34k14Q0J57m90j11L44N34o01p4
3412a99P1L32m66N2K67K84o87j71K82p6l9l4L26j93m35L63M05n2o37M01pm09M7
$$ plain form
3435 -575 -215 -130 -677 -712 -127 -190 -400 -554 -178 -446 -306 -159 45 -322 -360 16 -133 -269 -175 325 28 -495
3457 -495 -316 -2 260 211 -51 168 -294 -219 -63 486 0 -221 -107 56 -135 189 282 34 -289 -50 235
3478 235 60 315 -165 109 70 -209 272 -75 -208 -462 -118 -48 -266 -8 -36 38 -406 -42 -428 -206 -430
3499 -430 68 -47 -410 -283 88 62 -185 12 -85 -153 129 -58 -198 120 -191 170 -36 100 -83 -16 -82 -147
3521 -147 -226 -7 -149 -323 -107 -108 -200 -33 127 -179 -326 -550 114 -163 -109 -437 -139 -67 -493 -317 -157 -279
3543 -279 -609 -247 -209 -25 -272 -266 74 -155 -126 299 -32 -451 -163 54 -144 0 256 297 242 305 163 159 -10
3566 -10 322 172 251 -106 451 445 565 44 526 270 459 427 274 621 229 429 544 584 291 23 138 406
3588 406 312 236 347 306 -48 72 373 325 350 280 283 259 384 404 460 365 161 431 368 376 235 634 248 19 248
$$ packed form
3435e75L60Q5n47l5N85o3k10j54L76k68J40J47K04l67l8L76j49j36R4N00k97n23
3457d95J79L14K62m9k62K19m62P5J56N49m86k21J14J63j91L24R3k48l23K39K85
3478B35j75K55m80K74l9k79M81l47j33k54L44P0k18K58k8P4m44L64l86K22k24
3499d30M98j15l63J27L71k6k47J97r7o8K82j87j40L18l11L61k06J36j83O7o6o5
3521a47p9K19j42j74K16jr2J67J60l06j47k24O64k77N4l28K98P2m26J76J60j22
3543b79l30L62L8J84k47OL40k29K9M25l31m19K88K17j98J44K56M1n5O3j42mj69
3566a0L32j50P9l57N57oJ20n21M82k56J89l2j53L47l92K00J15M0k93k68J15K68
3588D06r4p6J11m1l54J20L01m8K5p0Lk4J25K0N6r5k04K70o3Qj41L99l86k29K29
$$ plain form
3613 248 578 461 -78 177 417 436 243 302 421 -39 -5 437 461 320 336 510 304 273 -78 377 416 20
3635 20 -9 358 115 -205 372 70 244 55 373 3 61 -356 63 137 50 -7 -272 -200 -26 -90 -49 -42 -106 257
3659 257 -81 -19 -91 -226 -10 78 -72 31 67 -224 -190 -73 -27 96 13 -126 146 -107 27 399 -109 -157 51
3682 51 141 -154 -442 -194 31 -173 89 -27 -245 -257 -491 -476 -10 138 -263 -512 -722 -320 -244 19 -302 -305
3704 -305 -153 -356 -303 -289 53 -261 -339 -173 -344 -372 -390 87 -292 10 -147 259 24 -98 -369 102 -65 -59
3726 -59 -10 -389 125 90 -171 -18 154 303 330 294 -41 241 211 400 550 553 107 344 27 204 166 235 -121
3749 -121 737 374 245 -90 379 220 214 -88 -82 -98 -116 129 -59 146 40 -79 -75 93 -340 -106 89 543 75
3772 75 10 112 1 187 376 310 39 127 67 42 156 63 28 -76 170 131 -80 343 359 44 447 -111 -135 -40
$$ packed form
3613B48L30j17n39K55K40J9j93N9J19m60L4M42K4j41J6J74k06l1l51M55L9l96
3635B0k9L67k43l20N77l02J74j89L18l70N8m17M19P4q7n7k65P2J74o4M1Po4L63
3659B57l38O2p2j35K16Q8j50J03L6k91L4J17M6J23q3j39K72k53J34L72n08m8K08
3682E1R0k95k88K48K25k04K62j16k18j2k34J5M66J48m01k49k10M02P6K63l21l
3704c05J52k03N3J4L42l14p8J66j71k8j8M77l79L02j57M06k35j22k71M71j67O
3726e9M9l79N14l5k61J53J72J49K7l6l35K82l0J89J50Lm46K37l17J77l8O9l56
3749a21Q58l63j29l35M69j59ol02Oj6j8K45j88K05j06j19MJ68m33K34J95M54m68
3772G5o5J02j11J86J89o6k71Q8o0k5J14r3l5j04K46l9k11M23J6l15M03n58k4R5
$$ plain form
3796 -40 53 266 134 196 250 -26 483 12 -67 197 262 215 -10 132 -209 -132 108 -16 -33 -326 -172 -69 -258
3819 -258 -90 -325 -333 -159 -310 -111 -146 -4 -399 -368 -168 -415 -543 -404 -462 -412 -540 -222 -500 -166 -390 -324
3841 -324 -323 -268 -153 -78 -354 -337 -226 -151 -18 -100 49 228 62 -14 328 217 -309 261 112 -20 -186 -125 -54
3864 -54 20 -210 128 179 73 -133 125 16 -343 -35 77 174 -293 -160 119 -110 -403 -133 -234 -261 -363 4
3886 4 -107 -371 -285 -172 89 -204 -64 25 -368 -179 -67 -24 -157 277 506 229 -244 -56 302 233 -131 107
3908 107 208 118 -120 458 492 249 -243 -5 230 88 90 119 243 -228 -29 160 -96 218 -183 -143 -16 -86
3930 -86 105 -82 62 -298 -272 -26 109 -52 85 -100 -206 -100 355 299 -86 -2 -150 -162 -65 329 -71 -497
3952 -497 -329 66 6 20 277 77 5 -135 77 169 47 -648 339 215 94 -108 107 177 -167 -107 154 59
$$ packed form
3796d0R3K13j32O2N4k76N09m71p9K64O5m7k25J42l41P7K40j24j7k93J54J03j89
3819b58J68k35qJ74j51J99l5J42l95L1K00k47j28J39n8N0j28L18k78L34k24O6
3841c24JN5J15P5k76J7J11P5J33q2J49J79j66p6L42j11n26N70j49j32j66O1P1
3864e4P4k30L38N1j06k06K58j09l59L08J12R7m67J33K79k29k93K70j01k7j02L67
3886Dj11k64Q6J13K61k93J40Q9l93J89J12M3j33M34K29k77m73J88L58o9l64K38
3908A07J01r0k38N78L4k43m92K38K35j42KK9J24m71J99J89k56L14m01M0J27p0
3930h6J91j87J44l60K6K46J35j61J37j85j06J06M55n6l85Q4j48j2R7L94m00m26
3952d97J68L95o0J4K57k00p2j40K12R2j22o95R87j24j21k02K15P0l44O0K61r5
$$ plain form
3974 59 -37 242 44 -105 -215 13 398 -113 145 -79 125 -245 -118 60 -100 -228 -362 255 -159 -98 57
3995 57 -27 -200 -396 -21 -179 45 -213 50 97 68 -114 55 -41 -305 128 -26 254 23 -283 20 -183 5
4017 5 -26 313 -7 -226 283 -91 10 -34 217 -41 -302 215 200 154 208 -276 62 361 -263 324 382 -308 -447
4040 -447 82 94 -312 110 3 -56 -366 -105 320 -194 -123 -181 -123 -235 -256 -33 -42 -113 -481 72 336 -114 -19
4063 -19 175 54 -484 137 -153 1 -68 158 445 443 268 258 360 183 -112 240 362 37 62 442 -182 -198
4085 -198 -60 472 -41 -141 -49 147 135 84 30 65 -281 -102 130 -258 -382 -260 35 -133 -237 34 36 -33 -60
4108 -60 -30 64 -156 -82 143 -19 -464 -163 -58 115 -6 197 133 -138 -97 446 -88 -177 0 34 232 -151 183
4131 183 127 109 10 284 -136 111 -91 146 -69 117 -150 235 104 -118 100 30 103 -138 49 425 -260 -35
$$ packed form
3974E9r6K79j98j49j10K28L85n11K58k24K04l70J27J78j60j28j34O17m14O1J55
3995E7q4j73j96L75j58K24k58K63M7k9j82J69r6k64M33j54K80k31l06L03k03J88
4017El1L39l20k19N09l74J01m4K51k58k61N17j5m6N4m84L38K99o24N87N8o90j39
4040d47N29J2m06M22j07n9l10K61M25n14P1n8N8j12k1K23rp1l68N53K64m50R5
4063a9J94j21n38O21k90J54o9K26K87kj75j0J02j77k95L52J22l25K5L80o24j6
4085a98J38N32n13j00R2J96j2n1n4L5l46J79K32l88j24J22K95j68j04K71Ko9k7
4108f0L0R4k20P4K25j62m45L01J05J73j21K03o4k71M1N43n34q9J77L4J98l83L34
4131A83n6j8r9K74m20K47k02K37k15J86k67L85j31k22K18p0P3k41J87L76o85K25
$$ plain form
4153 -35 436 158 8 60 -76 -188 -234 -212 -48 93 -59 198 -45 35 -92 102 5 -7 14 -236 -28 -104 -124
4176 -124 48 170 116 110 34 -153 -52 248 223 -365 -14 298 293 -149 191 115 181 32 -6 375 171 127 80 91
4200 91 186 11 189 156 -56 -74 -32 -164 -137 61 -152 -72 -299 -251 155 48 -119 -307 -252 -206 -255 38 -5 8
4224 8 -270 -313 452 5 133 55 175 116 -145 193 155 -294 -17 -29 115 43 138 89 -71 26 59 143 189 95 228
4249 228 227 221 -17 -107 323 68 61 168 200 175 50 328 44 339 195 73 -164 -10 79 -7 -94 -73 124 328
4273 328 156 -324 47 55 -99 272 369 -53 8 125 383 92 -1 129 274 61 -109 287 37 79 38 124 -51
4296 -51 -4 148 202 31 -8 349 173 263 44 -117 22 -270 203 -73 60 -127 122 -105 46 41 186 39
4318 39 -432 -161 -44 -69 9 81 25 85 -146 -1 -116 -380 -107 105 -54 -90 -200 75 -193 -67 -97 191 -40
$$ packed form
4153c5M71k78j50N2j36j12m6K2J64J41j52K57k43Q0j27J94r7j2K1k50K08p6k0
4176a24J72J22n4op6j87J01L00k5n88L51L12nm42L40p6O6j49l8L81k04m4m7J1
4200I1R5j75J78l3k12j8M2j32K7J98k13Q0k27M8M06j07j67j88N5M6m9K93m3J3
4224Hk78m3P65m47J28p8J20n9k61L38l8m49K77j2J44p2R5m9j60R7L3Q4M6r4J33
4249B28jok38r0M30k55pJ07L2k5j25K78k84K95j44j22k37J54Q9q6q7K1J97K04
4273C28j72m80L71Qj54L71R7m22O1J17K58k91r3J30J45k13j70L96k50M2m1Q6j75
4296e1M7J52N4j71l9L57j76R0k19j61J39k92M73k76J33j87K49k27J51nJ45j47
4318C9m71K71J17k5P8P2n6O0k31J45j15k64K73K12j59l6j10K75k68J26l0K88k31
$$ plain form
4341 -40 -19 -354 147 -185 76 -229 123 -159 -12 -128 100 -45 149 199 134 337 299 168 234 50 -126 77
4363 77 106 121 2 -192 -175 17 49 -73 -201 -86 64 199 -21 -110 -270 25 -137 20 -146 -106 -108 164 -260
4386 -260 38 -339 -25 -150 128 -141 -65 -109 -30 -60 52 -72 -304 -390 -448 101 -212 93 -166 -103 110 86 -107
4409 -107 -29 -312 16 95 208 308 264 -139 -151 93 265 76 -67 123 -311 -140 134 -6 41 -358 -4 -103
4431 -103 51 18 1 91 -38 -204 8 156 45 -175 52 -42 -110 165 -163 -174 -289 61 63 29 53 34 27 -75
4455 -75 80 42 77 -28 -122 36 -16 21 -69 -176 -9 194 51 449 367 -39 -18 152 -71 93 137 3 -11 -54
4479 -54 -157 167 -114 -265 217 119 111 41 85 82 22 134 -146 -62 -248 408 135 -153 -100 -168 127 -17 18 18 -45
4504 -45 71 -75 -15 35 -173 -39 -58 -104 170 69 -70 -117 -61 100 -64 107 237 220 -77 -37 137 3 -120
$$ packed form
4341d0K1l35N01l32K61l05L52k82J47j16K28j45J94N0o5K03l8j31O6j84j76K03
4363G7K9J5j19j94J7J92L2j22j28J15J50J35k20q9j60K95j62J57j66M0kK72m24
4386b60K98l77L14j25K78k69P6m4P9l0J12j24k32q6n8N49l13L05k59O3K13k4j93
4409a07P8k83L28P9J13J00m4m03j2K44J72j89j43J90m34J71K74j40M7l99L54r9
4431a03J54l3j7R0j29j66K12J48j11k20K27r4o8K75l28j1j15L50Kl4K4j9pj02
4455g5J55l8L5j05r4J58n2L7r0j07J67K03j43L98q2m06K1J70k23J64M4j34j4m3
4479e4j03L24k81j51M82r8qp0M4lo0J12k80Q4j86O56k73k88N3o8K95j44L5%o3
4504d5J16j46O0N0k08J34j9m6K74j01j39m7N6J61j64J71J30j7k97M0J74j34j23
$$ plain form
4527 -120 118 204 270 208 125 84 122 -54 115 256 -110 235 154 -52 -33 86 100 176 -88 -198 29 143 -301
4550 -301 120 -268 -562 -203 -77 -62 -161 -194 36 115 -21 17 -78 283 267 62 175 -188 -45 -109 341 93 27
4573 27 186 -28 -285 -42 202 90 245 200 277 -102 -53 216 59 313 -33 355 246 174 10 19 28 8 -177
4596 -177 -30 365 20 64 389 38 -70 170 -18 -80 -171 121 -28 -367 -327 -57 125 32 -86 19 119 62
4618 62 53 152 -64 -108 267 7 -140 -269 188 -6 -225 258 271 -327 103 -119 -129 153 -75 270 -71 178
4640 178 50 230 -7 -14 187 56 184 35 202 93 93 57 79 15 -205 63 160 357 147 22 -41 -185 -85
4663 -85 -267 297 8 -311 -49 -15 29 -47 -118 -73 -6 -135 -64 118 119 -106 149 -67 38 -31 -290 -188 -34 318
4687 318 54 -36 -5 10 -74 178 -12 -74 33 92 -400 280 -48 102 225 -46 131 -215 283 -191 -73 -203
$$ packed form
4527a20K38Q6O6o2q3m1L8j76J69J41l66L45q1k06J9J19J4P6k64j10K27J14m44
4550c01M21l88k94L59J26J5r9l3K30P9j36L8r5L61j6k05J13l63J43o4M50k48o6
4573B7J59k14k57K43K44j12J55m5P7l79M9K69j57K54l46L88j09p2j64RRk0j85
4596a77J47L95l45M4L25l51j08K40j88o2r1K92j49l39M0K70J82r3j18J05J00n7
4618F2rR9k16m4L75k60j47j29M57j94k19M83J3n98M30k22j0K82k28L45l41K49
4640A78j28J80k37pK01j31J28j49J67j09%l6K2o4k20K68R7J97k10j25o3j44J00
4663h5j82N64k89l19K62L4M4p6p1M5O7j29P1J82Jk25K55k16J05o9k59J02J54L52
4687C18k64r0L1J5q4K52j90o2J07N9m92O80l28J50J23k71J77l46M98m74J18j30
$$ plain form
4709 -203 230 -189 130 -65 -162 16 -287 142 -52 -24 103 208 -151 128 148 -237 -2 146 12 38 41 9
4731 9 -277 -269 110 69 170 136 136 79 1 -14 -102 -299 -39 260 -216 18 -23 126 71 13 59 16 -217 -96 48 -254
4757 -254 -166 261 107 103 57 125 69 127 135 -243 276 113 -59 -195 90 200 225 -218 103 -169 -193 -106 5 65
4781 65 -109 -44 38 76 8 104 -268 20 431 169 -213 -20 18 -65 -205 138 340 -28 -27 280 -116 -147 -3 257
4805 257 -140 119 83 170 185 53 139 269 318 213 66 -48 119 -24 243 -193 -101 -33 395 131 63 36 -376
4828 -376 -52 8 62 -32 -250 -270 61 186 -115 -253 456 -16 -148 115 -60 154 -236 -230 42 -159 328 344
4850 344 -42 -112 -209 -84 -11 -141 168 -149 318 -42 -9 479 -121 -221 -202 293 233 162 -98 206 68 -62
4872 -62 285 -153 -33 -98 174 282 -28 -16 -63 20 -178 -118 -54 3 178 -274 -134 -99 -8 -309 -206 -138 112 -139
$$ packed form
4709b03M33m19L19j95r7J78l03M29j94K8J27J05l59K79K0l85K35J48j34K6Ll2
4731Ik86QL79m1J01l4%n7p8j5q8j97K60K99m76K34m1J49n5n8M6m3k33J21J44l02
4757b54Q8M27j54mm6O8n6N8Ql78N19j63j72j36K85J10K5m43L21k72k4Q7J11O0
4781F5j74O5Q2L8o8R6l72K88M11k62l82J93L8q3j40L43K02l68JL07l96l1J44K60
4805B57l97K59l6Q7J5j32Q6J30M9j05j47j14J67j43K67m36R2O8M28k64o8k7m12
4828c76L24O0N4r4k18k0L31J25l01j38P09m72j32K63j75K14l90OK72k01M87J6
4850C44l86p0r7J25P3j30L09l17M67l60L3M88o00j00J9M95o0p1k60L04j38j30
4872f2L47m38J20o5K72J08l10J2m7Q3j98O0O4N7J75m52J40L5R1l01J03O8K50k51
$$ plain form
4896 -139 -45 -116 -53 -194 -142 -157 -154 -105 65 -146 -2 98 116 -83 319 -45 12 187 241 3 194 139 88 69 -189
4921 -189 297 128 141 343 119 -168 90 -21 119 215 -78 387 -127 37 -127 101 -275 -449 -185 208 -9
4942 -9 68 -351 163 -14 62 61 -190 -195 169 457 -202 -218 22 -329 37 -74 45 64 -140 -317 -180 265 176 -44
4966 -44 -58 349 14 60 123 31 -84 -109 284 93 -78 -388 -12 32 -138 -35 -25 -93 19 -176 190 326 -91
4989 -91 36 -246 230 -108 332 -45 160 -206 158 45 50 191 -102 -34 -239 -61 -33 -176 89 52 134 -50
5011 -50 147 -22 231 -2 47 80 127 217 -371 252 202 -256 29 -189 2 -26 -175 235 142 52 296 -102 41
5034 41 104 -30 134 103 -141 -264 172 -133 -116 69 -29 -220 -219 -173 178 -89 -196 -1 21 -23 170 -197 -187 268
5058 268 -14 -125 31 18 395 -340 28 117 -400 -50 33 102 -70 -145 -217 -188 158 43 -96 -52 319 -272 129
$$ packed form
4896a39R4p1O3j41N2j5LM9J70k11J44J00J8j99M02l64N7J75N4k38J91n5n1j9k58
4921a89M86j69J3K02k24k87K58j11J40R6k93M65n14J64j64K28l76j74K64L93k17
4942iP7m19N14j77P6jk51nL64K88o59j6K40l51L66j11J19J9k04j77J37M45q9k20
4966d4j4M07l35M6O3r2j15k5L93j91j71l10L76M4j70J03J0o8J12j95L66J36m17
4989i1J27k82M76l38M40l77K05l66L64j13NJ41k93O8k05J78K8j43K65l7Q2j84
5011e0J97j69K53k33M9L3M7R0n88O23n0m58K85k18J91k8j49M10r3r0K44l98J43
5034D1O3j34J64l1k44j23M36l05J7J85r8j91JM6L51k67j07J95K2m4J93l67J0M55
5058B68k82j11J56j3L77p35L68Q9n17L50Q3O9j72p5p2K9L46j15j39M4L71n91M01
$$ plain form
5081 129 150 -54 28 -225 -174 -27 -88 187 51 -189 -125 -70 210 -127 80 102 280 -51 -81 0 331 138 -68
5104 -68 68 -12 -283 -214 71 -104 -367 -203 -75 51 -216 135 -15 130 -216 -241 42 54 -24 -32 80 106 -165
5127 -165 -90 39 47 192 23 15 8 175 -159 -350 287 67 16 250 -19 -95 105 140 140 199 -175 -173 -21 269 316
5152 316 198 118 -59 -258 -20 -6 -237 -86 227 -134 -52 -67 -33 293 -205 -23 -44 -188 -25 92 -93 305
5174 305 56 65 -48 225 220 -295 -118 -194 -158 -185 -115 -94 203 -196 -31 7 -49 198 -10 -40 -54 -133 66 0 -39
5199 -39 265 -76 136 261 -121 -3 123 91 -52 -222 -54 41 -28 23 -143 54 238 106 -79 137 193 384
5221 384 124 199 137 -171 156 -452 119 152 154 5 96 46 -110 333 309 181 -1 -207 388 119 25 50 -3 -143
5245 -143 -86 274 184 -49 -135 235 52 -368 274 61 410 51 260 -149 -128 -164 10 -117 13 11 3 139 -2
$$ packed form
5081A29K1k04Q2k53N1J47o1K75j36k40O4N5K80l37K07K2J78l31l0Q1L31j93k06
5104f8J36q0k71O9K85j75k63J64J28J26k67L51j50J45l46k5K83J2p8qJ12K6k71
5127a65P5J29QJ45j69qpJ67l34j91O37k20n1K34k69p6K00L5%N9l74KJ52K90M7
5152C16j18q0j77j99K38J4k31J51L13l61Q2j5L4L26m98J82k1j44J63J17j85L98
5174C05k49Rj13K73nn15J77p6L6k7P0K1K97l99J65L8n6K47k08l0j4p9J99o6l9
5199c9L04l41K12J25l82J18J26l2j43j70J68R5o9N1j66J97J84j32j85K16N6J91
5221C84k60P5o2l08L27o08N71L3Kj49R1n0j56M43k4j28j82k06N95k69r4K5n3j40
5245a43N7L60r0k33q6L70j83m20O42k13L49l59K09m09K1l6J74j27J30kqJ36j41
$$ plain form
5268 -2 -186 86 29 -33 -5 111 242 191 95 39 160 -192 103 82 13 -247 123 -18 194 -42 213 139 -23 -382
5292 -382 -11 160 97 107 -173 -71 90 224 13 9 127 -67 -111 111 75 298 -118 9 -62 6 -25 -6 109
5315 109 216 290 119 -173 147 80 -13 110 77 368 242 141 -208 110 166 196 163 -221 -46 90 -118 103
5337 103 129 141 -75 3 49 -69 -126 54 -109 -68 -33 245 265 161 -123 -158 -143 -28 -129 43 191 86 -251
5360 -251 -62 218 -20 48 104 86 209 80 25 -25 -16 344 25 6 308 217 -81 53 41 -172 -208 -119 123 -214
5384 -214 -152 52 -130 -172 -54 -50 207 177 -110 56 17 82 -271 35 161 -221 -242 73 -251 -43 -129 -67 174
5407 174 45 -153 -33 14 24 -29 -86 3 318 28 -52 54 112 58 -277 -103 -61 -60 -28 -102 -212 225 98 42 72
5432 72 62 103 206 -409 -224 -138 -170 -161 217 89 267 61 -66 -82 58 -99 -47 14 95 320 19 -210 52 -202
$$ packed form
5268bj84K72n7o2K8J16J31n1r6n6J21l52K95k1o9k60L70j41K12k36K55p4j62l59
5292c82L71J71o3J0k80J02J61J34k11mJ18j94m4K22l6K23m16J27p1O8l1J9J15
5315A09J07P4j71k92L20o7r3J23l3K91j26j01l49L18N6L0l3l84J75J36k08K21
5337A03K6J2k16P8M6j18n7J80j63M1L5K78K0j04k84l5J5J15j01J72J48j05l37
5360b51J89K80k38O8N6j8J23j29n5n0RL60l19j9L02r1k98J34j2k13l6Q9K42l37
5384b14O2K04j82m2J18MK57l0k87J66l9O5l53L06J26l82k1L15l24K08q6O2K41
5407A74j29j98J20M7J0n3n7Q9L15k90q0J06N8n4l35J74M2JL2p4j10M37j27n6L0
5432G2j0M1J03o15J85Q6l2RL78j28J78k06j27j6J40j57N2O1Q1K25l01k29K62k54
$$ plain form
5456 -202 -47 45 -282 -80 7 -19 64 127 34 -1 -72 -161 47 207 26 -106 -8 -44 -127 -68 -48 -50 -67 -195 -51 125
5482 125 79 -99 -268 55 -48 -17 114 38 -84 -62 160 -182 -174 -37 -31 -335 200 -111 -79 70 -20 73 -73 23
5506 23 282 -256 77 -109 97 158 -401 -222 23 -272 -125 191 113 -54 10 138 104 83 93 -103 -18 166 126
5529 126 126 -314 291 199 11 391 313 -137 100 -237 -22 -83 160 -202 108 164 102 -133 28 -65 -121 -252 24
5552 24 18 398 -55 178 143 -68 9 -29 -98 -289 110 -87 52 112 -44 -263 315 177 134 -91 240 2 -59
5575 -59 -42 -8 -32 93 90 360 87 84 232 88 -43 -91 42 241 -202 71 205 -26 -98 -21 -90 -20 -315 -261 90
5600 90 -206 -72 102 122 43 50 -105 -313 68 271 -234 -46 24 144 165 -172 231 102 170 4 -54 186 173
5623 173 -30 -72 -139 -129 -233 118 -249 91 -14 194 -86 -196 -101 90 -228 104 -88 -99 -59 -56 -218 -190 -6
$$ packed form
5456b02J55R2l27K02Q7k6Q3O3r3l5p1q9K08J60j81j32R8l6q3N9K0kj7j28J44J76
5482A25m6j78j69L23j03L1J31p6j22K2K22l42QJ37Ol04N35l11L2J49r0R3j46R6
5506B3K59n38L33j86K06O1n59J79K45k95J47L16p8j67O4J28l4k1J0j96Q5J84m0
5529A26%m40O05r2j88L80p8m50K37l37K15o1K43l62L10N6o2k35J61r3n6j31K76
5552B4oL80m53K33l5k11P7l8o9j91L99j97J39O0j56k19N78j38m3k25L31k38o1
5575e9J7L4k4J25lK70k73lJ48j44j31m8J33J99m43K73J34k31p2P7o9P0k95N4L51
5600I0k96J34J74K0p9Pj55k08L81K03n05J88P0J20K1l37M03j29O8j66n8K40j3
5623A73k03m2o7J0j04L51l67L40j05K08k80j10R5J91l18L32j92j1M0Lj62K8J84
$$ plain form
5646 -6 -232 -22 260 44 -11 238 210 290 -41 60 -87 -115 -88 -9 62 -289 -265 -62 157 34 -50 299 -216 271
5670 271 -84 -273 2 -340 36 27 -236 -28 162 42 -65 -133 -69 26 436 266 18 10 -28 70 228 -196 -85
5693 -85 203 225 270 -195 -172 151 -233 9 -190 178 -39 -51 -29 -234 -152 -226 29 172 -161 -15 127 35 -106
5716 -106 158 124 256 62 -67 -6 -150 -110 -13 131 -223 2 -342 -95 -359 -145 90 263 -34 197 -298
5737 -298 63 118 -99 -258 101 130 -283 118 261 210 269 172 318 -51 11 29 -14 -80 -277 4 143 197 41
5760 41 92 -110 -12 -49 400 73 114 -272 -99 200 273 10 -120 -49 -52 31 -162 -148 -4 -280 206 -209 142 -165
5784 -165 179 132 -81 -45 105 93 248 -144 -221 -39 -45 96 22 95 201 -15 -164 349 -137 210 -84 30 332
5807 332 109 -66 -212 109 -510 220 10 -80 6 -377 -147 -11 45 98 -45 -71 140 32 252 87 -154 -34
$$ packed form
5646fk26K10K82k16n5K49k8Q0l31J01j47k8K7P9P1l51K4K03K19j23q4L49n15M87
5670B71l55j89K75l42L76rk63K08J90j20j07o8O4R5M10j70k48ql8R8J58m24J11
5693h5K88K2M5m65K3L23l84K42j99L68k17j2K2k05Q2p4K55J43l33J46J42r2j41
5716a06K64l4J32j94j29O1j44M0R7J44l54K25l44K47k64K14K35J73k97K31m95
5737b98L61N5k17j59L59K9m13M01J43n1N9r7J46l69O2J8m3o6j97K81J39N4j56
5760D1N1k02R8l7M49l27M1l86J73K99P3k63j30P1lQ3j93J4J44k76M86m15L51l07
5784a65L44m7k13L6J50j2J55l92p7J82oJ41p4P3J06k16j49N13m86L47k94J14L02
5807C32k23j75j46L21o19P30k10r0Q6l83K30J36N6N3j43k6K11j08K20j65k41J20
$$ plain form
5829 -34 199 -205 -216 25 9 -66 -115 -24 -55 5 48 -199 -189 -170 100 -63 -95 214 -346 -217 -129 298 220 -245 -158
5854 -158 102 -54 148 137 -40 32 -171 84 -110 184 152 17 -115 445 -57 -139 106 127 130 87 138 -291 127
5877 127 -287 -194 276 115 -239 -174 73 141 -133 -113 66 101 -8 -14 82 147 -261 64 -104 -89 250 -24 -38 -43
5901 -43 -1 -57 76 51 147 -94 111 2 -89 -61 -126 28 -243 28 30 -245 -385 -11 -59 -29 323 -23 -7 -41 117
5926 117 -204 -28 -293 -29 35 132 145 -79 18 182 -95 -181 -72 -55 -230 32 76 14 -132 -154 -50 -177 -308
5949 -308 224 143 85 3 16 206 -63 -9 40 -192 -13 -347 44 -32 -122 -133 -13 344 306 43 -196 -63 103
5972 103 -77 -87 310 61 -201 -161 87 -4 294 88 44 -168 -144 385 143 -107 210 -7 -42 -243 237 27
5994 27 45 -19 71 -154 -229 16 15 -10 212 70 -193 -309 -283 -260 -86 131 -15 70 -14 310 26 98 -38 -78 -40
$$ packed form
5829c4K33m04j1K41j6p5m9R1l1O0M3k47J0J9K70j63l2L09n60J29Q8M27p8m65Q7
5854a58K60j56K02j1j77P2k03K55j94K94l2j35j32N60n02q2K45K1Lm3N1m29M18
5877A27m14R3M70j61l54O5K47O8k74K0J79L5j09oR6O5m08L25j68J5L39k74j4n
5901d3M2n6J33k5R6k41K05j09r1K8o5J54k71K71Kk75j40L74m8L0L52l46J6l4J58
5926A17l21J76k65K64O4R7J3k24R7J64k77q6J09J7j75K62M4o2j46k2J04j27j31
5949c08N32q1n8q2J3J90k69N4M9k32J79l34L91p6r0j1J20L57l8k63k39J33J66
5972A03j80j0L97k49k62M0K48r1K98k06m4k12K4N29k42k50L17k17l5k01M80k10
5994B7J8o4R0k25p5K45jk5K22j42k63j16K6K3J74K17j46Q5q4L24k84P2j36m0L8
$$ plain form
6019 -40 221 20 -288 288 -255 -199 -105 -97 42 126 15 206 -208 122 -146 243 -43 -44 22 -58 206 -107 -178 19
6043 19 78 -133 145 63 68 43 75 24 -135 115 -32 -134 81 166 222 -58 245 -86 -110 40 -120 -78 -121 -76 506
6068 506 -146 -368 -124 230 16 75 126 48 118 -95 35 -283 179 -264 32 -154 -277 -25 46 41 159 -160
6090 -160 222 170 -68 -241 175 111 13 -280 -299 118 218 29 15 23 0 241 -226 51 238 152 -47 48 159
6113 159 -93 90 54 89 -137 149 124 163 -292 92 200 59 67 -159 -170 31 145 -235 -160 174 -26 -151 -26
6136 -26 49 253 44 234 -150 -228 -152 201 249 -143 -38 -5 7 -180 -113 -219 187 -82 -50 187 -172 116 -157
6159 -157 124 -176 136 142 254 -119 141 192 -145 -99 -260 168 184 71 230 95 6 240 11 -184 -157 -110 -161
6182 -161 42 60 89 -26 154 0 82 40 31 -188 115 -67 -105 -67 -82 -165 30 46 -96 147 22 -92 -267 59
$$ packed form
6019d0K61k01l08N76n43N6R4QJ39Q4j11J91m14L30k68L89k86jO6q0K64l13p1J97
6043A9N9k11K78q2Nk5L2n1j59K50j47j02K15Q5N6k80L03l31k4J50j60M2m3M5N82
6068E06o52k22K44L54k14N9N1p8P0k13J30l18M62m43K96j86j23K52P1nJ18l19
6090a60L82n2k38j73M16o4r8k93j9M17J00j89j4Qk3K41m67K77J87q6j99R5J11
6113A59k52J83l6L5k26K86k5L9m55L84J08j41Qk26j1K01J14l80P5L34k00j25J25
6136b6P5K04k09J90l84p8P6L53M8l92J05L3J2j87O7j06M06k69L2K37l59K88k73
6159a57K81l00L12OJ12l73K60N1l37M6j61M28J6j13J59j35q9K34k29j95K7M7n1
6182a61K03J8K9j15J80j54Q2m2rk19L03j82l8L8j5q3J95J6j42K43j25j14j75L26
$$ plain form
6206 59 73 -58 -54 143 -133 72 15 -34 -72 -57 -116 22 -25 211 -91 -216 174 209 39 -152 -236 221 66 -288
6230 -288 57 116 -45 206 121 21 112 -3 37 72 -28 -42 149 25 -107 -21 163 150 -67 -62 9 -134 388 277
6254 277 261 133 112 -117 -11 27 348 -391 129 -26 174 51 483 27 -17 242 -270 132 -201 -109 23 165
6276 165 52 -257 197 -96 -157 181 92 37 77 -157 11 153 -120 55 -37 -11 -99 82 -225 60 186 136 226
6299 226 174 -132 -60 -23 -297 -96 14 -198 -445 -126 57 91 89 92 -59 20 -47 105 61 -163 -57 137 84 -213
6323 -213 -54 112 -23 81 -60 33 212 -89 112 85 28 -148 -25 -74 40 106 -111 -39 302 195 -170 -123
6345 -123 179 81 -261 26 -246 -190 -165 -10 -393 218 -189 143 -143 20 63 -188 43 -141 -271 -53 -194
6366 -194 52 -191 160 -78 212 -52 -334 -160 80 131 -156 -87 -71 -88 -98 -130 146 -253 -144 -3 -42 67
$$ packed form
6206E9J4j31MJ97k76K05n7m9l8J5n9J38m7K36l02j25L90L5j70j91q4M57j55l54
6230b88L45N9j61K51q5j00R1j15M0L5j00j4J91j24j32Q6J84j3k17NP1j43N22j11
6254B77j6j28k1k29J06L8L21p39N20j55K00j23M32m56m4K59n12M02l33R2J32J42
6276A65j13l09M54k93o1L38q9n5M0k34J68J42k73J75r2K6q8J81l07K85J26n0R0
6299B26n2l06P2L7k74K01J10k12k47L19J83L4kLj51P9o7J52m4k24J06J94n3k97
6323b13J59J66j35J04j41R3J79l01K01k7n7j76J23m9J14O6k17P2L41j07l65M7
6345a23L02r8l42K87k72N6K5J55l83O11m07L32k86J63M3k51K31j84j30K18j41
6366a94K46k43L51k38K90k64k82J74K40N1k87O9J6j7j0l2K76l99J09J41l9J09
$$ plain form
6388 67 108 8 -127 -215 -234 332 -187 42 90 153 152 63 18 -220 79 -5 56 99 -230 -107 -58 37 8 -60 201 167
6414 167 -46 159 193 54 -25 23 -117 -188 -44 146 -114 272 169 69 -57 363 -15 106 -8 63 388 -74
6436 -74 -100 -12 48 -80 89 347 -175 332 159 58 37 4 -59 -160 -120 -261 -71 -153 284 63 -95 135 -75
6459 -75 210 -98 -23 -35 -147 234 -90 -39 -97 79 -40 -40 40 323 21 -52 -193 165 -34 313 131 2 125
6482 125 104 488 124 -60 -109 22 -108 -120 1 -15 158 163 234 -204 85 170 -206 43 -257 -158 5 5 -85 -25
6506 -25 179 -376 13 40 -293 321 -63 -100 27 -166 65 18 -129 44 54 -76 -262 129 -285 370 -340 -25
6528 -25 -46 -104 170 -50 108 -385 -137 -156 79 -330 181 70 174 51 -137 77 160 36 219 297 -181 261
6550 261 -33 -6 -236 91 129 278 -155 51 -90 -103 125 6 44 90 -90 136 -277 -174 36 -225 -8 -219
$$ packed form
6388F7M1j00j35q8j9N66n19K29M8O3jq9m5k38K99q4O1M3l29J23M9R5k9o8K61l4
6414A67k13K05L4j39p9M8j40p1J44J90k60L86j03j00j26M20l78J21j14P1L25m62
6436g4k6Q8O0j28J69K58n22N07j73j01k1l3o3j01M0j41J90q2M37k21j58K30k10
6459g5K85l08P5j2j12L81l24N1n8J76j19%Q0K83l02p3j41L58j99L47j82j29J23
6482A25k1L84l64j84m9J31j30j2J21j6J73NP1m38K89Q5l76K49l00R9J63%r0O0
6506b5K04n55L89K7l33O14l84l7J27j93K31m7j47J73J0j30j86L91m14O55p10L15
6528b5k1n8K74k20J58m93K48j9K35m09N11j11J04j23j88K14Q3j24J83P8m78M42
6550B61k94K7k30L27L8J49m33K06j41j3K28j19L8M6j80K26m13J03K10k61K17k11
$$ plain form
6572 -219 -4 143 47 -55 -281 -83 -113 31 5 30 -322 108 212 279 -244 67 169 60 146 60 77 -152 66
6595 66 106 -230 -39 -89 123 71 -38 118 -122 236 56 -165 40 193 -269 -200 8 211 -51 198 79 -117
6617 -117 69 -36 -206 144 -139 -110 -171 -149 -425 -192 -122 -78 -47 -149 272 31 19 -6 305 -48 190 54 -84
6640 -84 223 142 -31 -258 -129 -85 -55 -126 -177 -45 93 78 173 66 -49 -250 127 199 175 49 -227 64 71 -306
6664 -306 -63 71 17 -7 120 -193 -235 82 79 108 57 245 -34 26 -260 -32 -8 25 -37 -179 -121 277 -41 275
6688 275 -223 -109 133 132 -54 -113 417 -27 209 -18 221 15 230 -27 -95 73 46 -154 19 141 -144 396
6710 396 145 39 48 -96 -133 128 -87 114 210 -101 124 48 0 14 -4 -250 -228 290 174 -120 28 -36 282
6733 282 -118 -76 -45 163 269 -28 -40 176 0 -182 -132 -93 60 420 306 -169 -198 -81 83 233 270 -32
$$ packed form
6572b19K15J47r6j02k26J98l0J44k6K5l52M30J04O7n23L11J02j09Q6q6J7k29K18
6595F6M0l36J91n0K12n2j09J56k40L58j80k21K05J53m62O9K08K03k62K49j19j96
6617a17J86j05j70L50k83K9o1K2k76K33P0M4L1j02M21k41j2k5L11l53K38j36j38
6640h4L07q1j73k27J29M4L0p1n1J32J38j5R5j07j15k01L77P2k4j26k76K91Pl77
6664c06K43J34n4k4J27l13m2L17lK9n1J88k79O0k86K28K4L3o2j42N8L98l18L16
6688B75m98J14K42jj86n9N30m44K36k27K39k06K15k57o8J68k7k00J73J22k85N40
6710C96k51j06Rj44l7K61k15K01R6l11K25p6m8J4j8k46K2N18j16k94J48o4L18
6733B82m00M2L1K08J06k97j2K16j76j82N0L9J53L60j14m75k9J17J64J50L7l02
$$ plain form
6755 -32 11 -27 203 -42 -153 -372 -78 -101 199 0 149 -199 152 -169 -177 341 -165 118 96 -34 -227 -106
6777 -106 -195 103 37 -80 103 -246 -158 68 1 171 -81 -1 273 40 24 -346 -39 194 117 40 167 -226 -108
6800 -108 -6 -198 78 -151 -80 -90 10 113 209 -9 -215 141 -236 149 -95 -98 238 189 -18 35 185 -406
6822 -406 -13 -270 92 231 -69 373 272 315 88 -24 -25 -272 228 133 59 57 -1 -167 19 -315 172 -82 2
6845 2 151 -51 -26 -86 -79 51 -134 126 -81 -8 4 350 123 112 -80 21 -7 47 39 -246 392 82 189 -173
6869 -173 -105 109 141 -73 116 -109 196 167 -145 -209 55 87 318 99 -313 53 141 95 126 -32 -335 -386 109
6892 109 -49 -100 -96 -83 80 -297 56 87 34 147 -61 -51 -130 -92 -197 -80 -346 203 -261 135 47 105 -173 -69
6916 -69 63 -154 58 -28 140 52 146 -92 -37 243 -155 147 250 -108 188 82 -1 -262 -67 150 -154 75
$$ packed form
6755c2M3l8K30k45j11k19K94k3L00j99J49l48L51l21qN18n06K83k2j30j93J21
6777a06q9K98o6j17J83l49Q8K26o7J70k52Q0K74k33j6l70L07K33p7p7J27l93J18
6800a08J02j92K76k29P1j0J00J03R6k18k06L56l77L85k44lL36m9k07N3J50n91
6822d06L93k57L62J39l00M42j01M3k27j12jk47N00r5p4kn8j66J86l34M87k54Q4
6845BJ49k02K5o0PJ30j85K60k07P3J2L46k27j1j92J01k8N4qk85O38l10J07l62
6869a73O8K14L2k14J89k25L05k9l12o4K64L2K31k19m12L66Q8m6L1j58l03n1M95
6892A09j58n1MJ3J63l77L53L1n3J13k08J0p9L8j05J17k66N49m64L96q8N8k78J04
6916f9J32k17K12q6J68q8R4k38N5K80l98L02J03l58K96j06q3k61J95K17l04K29
$$ plain form
6938 75 138 53 3 26 -65 -92 363 51 -143 -120 185 -6 -155 -100 -177 -366 81 169 208 -35 -196 138 249 -76
6962 -76 33 -15 -326 -62 -105 -23 10 -62 -153 -277 -429 -219 75 3 127 123 9 43 206 21 221 -50 35 -39
6986 -39 -5 51 -285 15 -61 86 -7 -318 -186 414 387 90 171 -38 -19 -193 -6 95 -85 -158 291 29 102
7009 102 -84 24 -253 -106 -29 215 -106 93 -53 62 -73 -2 -73 -288 -26 3 39 -49 -302 25 10 -162
7031 -162 -86 -40 -20 241 17 -216 273 -17 73 207 -254 168 -121 -106 112 -50 -109 1 152 110 -153 109
7053 109 -187 159 -230 259 33 -126 304 -228 202 -8 211 -331 271 -259 82 91 38 -328 53 43 -45 -68
7075 -68 -173 -174 227 -211 -92 -76 -211 242 -172 -40 79 43 136 73 93 -291 -41 -27 -153 -10 -185 -59 -237
7098 -237 -136 265 88 -213 -165 12 179 -50 -324 -113 208 -24 13 -23 122 -128 60 99 194 -173 80 -92
$$ packed form
6938G5O3q5n0K3r1k7M55l12j94K3L05j91j49N5p7j89M47Q8L9k43j61L34J11l25
6962g6J09m8l11K64m3Q2L3p2r1j24j52K10K94p2J24mj14L4J63j85K00k71Q5p4
6986c9L4N6l36L00p6J47r3l11J32O00k7k97Q1k09J9j74J87J01j80p3M49k62P3
7009A02j86J08k77J47P7K44l21J99j46J15j35P1p1k15K62K9L6q8k53L27j5j72
7031a62P6M6K0K61k24k33M89k90R0J34m61M22k89J5K18j62n9J10J51m2k63K62
7053A09k96L46l89M89k26j59M30n32M30k10K19n42O02n30L41Rn3l66L81j0q8k3
7075f8j05jM01m38J19J6j35M53m14J32J19l6R3o3K0l84K50J4j26J43j75J26j78
7098b37J01M01j77l01M8J77J67k29k74K11L21k32L7l6J45k50J88L9R5l67K53j72
$$ plain form
7120 -92 401 -32 182 65 9 73 84 11 134 31 32 -56 6 -225 -10 -29 -80 80 -62 -41 -151 130 210 -147
7144 -147 248 21 28 286 90 -84 -33 137 22 -117 136 233 23 6 -74 129 122 -82 83 58 75 -31 -154
7167 -154 57 44 64 -55 -164 24 25 -33 -103 -118 41 95 81 -66 190 5 140 47 -446 265 -40 36 76 274
7191 274 65 22 124 77 -13 87 -37 -37 335 -308 306 -119 -88 -42 92 -132 104 186 -27 -133 210 411 -114
7214 -114 -76 59 -174 173 -74 86 175 88 -273 252 -124 260 -191 -253 131 130 -94 -133 -147 145 170 35 14
7237 14 116 -45 -50 191 23 109 174 -166 21 108 -225 -9 89 -90 44 14 55 -304 -57 -99 3 -147 -77 -324
7261 -324 17 172 -145 81 -151 -80 -139 -118 -158 -156 262 -139 53 -181 408 220 82 71 45 304 -220 182 256
7284 256 39 44 39 -200 -301 -103 109 -177 -68 -19 53 24 23 -155 51 -38 -63 -224 -10 -162 -39 -39 18 -96 -111
$$ packed form
7120i2M93m33K14j17n6O4J1p3J23j03Jq8O2k31K15j9n1J60j42K1j10K81Q0l57
7144a47L95k27PK58j96j74N1J70j15j39K53R7k10j7q0K03pk04J65k5J7j06j23
7167a54K11j3K0j19j09J88Jn8p0j5J59N4j4j47K56j85J35r3m93P11l05P6M0J98
7191B74k09m3J02m7r0J00j24%L72o43O14m25L1M6J34k24K36Q2k13j06L43K01n25
7214a14L8J35k33L47k47J60Q9q7l61N25l76L84m51o2L84jk24l9j4K92K5j35k1
7237A4J02j61nK41j68Q6O5l40J87Q7l33K16R8j79J34l0M1l59K47m2J02j50P0k47
7261c24L41J55l17K26k32P1n9K1m0KM18m01J92k34N89j88j38j1k6K59n24M02P4
7284B56k17Nnk39j01J98K12k86J09M9P2k9jj78K06q9k5j61K14j52J23%N7j14j5
$$ plain form
7309 -111 96 -45 1 -404 -150 -91 12 207 -150 -105 -117 303 -182 -37 -202 132 388 581 -297 -153 -60 129
7331 129 206 -155 17 34 314 -124 253 10 -1 196 -21 -38 169 303 -304 -107 220 145 -47 -188 -9 -78
7353 -78 14 -90 -271 -201 -28 -16 48 276 23 -103 140 -186 95 -5 124 -45 -26 23 106 -20 345 -27 196
7376 196 -235 212 160 -145 -237 20 -115 64 72 287 -230 -138 -45 -39 -71 0 -99 29 -322 82 -97 -93 247 -17
7400 -17 216 -119 133 -129 -90 -180 -51 263 -118 -83 -113 -335 -273 20 -63 -194 -52 -18 -339 -216 -68 157 388
7423 388 -123 -177 21 164 -25 90 -212 3 -19 -88 -41 248 175 263 -109 50 206 -229 162 21 -169 319
7445 319 -44 59 93 -85 -131 64 143 156 -48 142 69 55 -41 -264 149 72 -330 5 68 126 -27 -190 -90
7468 -90 214 66 -248 -125 -157 -147 39 233 7 53 -110 77 -200 420 203 -109 77 -42 221 -176 11
$$ packed form
7309a11K07j41M6m05K54N9J03J95l57M5j2M20m85J45j65L34K56J93q78J44R3J89
7331A29P7l61J72J7K80m38L77k43j1J97k17j7K07J34o07J97L27p5j92j41J79o9
7353g8R2j04j81P0J73J2O4K28k53j26K43l26K81j00J29j69J9M9Q3j26L65l72K23
7376A96m31M47n2l05r2K57j35J79QK15n17R2R3Ol2P1r9J28l51M04j79ML40k64
7400a7K33l35K52k62L9r0J29L14l81L5l0k22O2K93q3j31J42L4l21J23J48K25K31
7423C88n11n4J98J43j89J15l02K15k2o9M7K89p3Q8l72J59J56m35L91j41j90M88
7445C19l63J03L4j78m6J95P9J3k04J90p3j4r6k23M13p7m02L35O3N8j53j63J00
7468i0L04j48l14J23l2J0J86J94k26M6j63J87k77O20k17l12J86j19K63l97J87
$$ plain form
7489 11 -21 268 77 196 -177 40 60 32 270 241 43 94 -111 -217 48 66 6 -66 218 -7 174 -82 211
7512 211 -50 22 40 -48 193 168 54 112 -77 102 64 -69 140 -19 -338 -214 -31 66 -55 -9 48 -64 212
7535 212 188 -19 -44 -52 -81 -140 -19 -44 -69 -81 20 370 -53 194 4 -50 -95 -12 -97 -52 -231 -122 217 279 179
7560 179 -140 63 175 -76 -214 -133 85 -73 123 -79 77 -228 134 -187 -61 257 -133 72 251 90
7580 90 -148 341 54 40 19 181 51 30 208 166 -55 -166 74 199 259 -26 -173 -77 189 -53 -88 76 -78
7603 -78 -164 171 -68 35 17 -72 129 58 172 -139 1 63 -137 207 157 348 -51 -319 -18 -53 -94 237 -25
7626 -25 88 -133 139 199 -172 -138 -17 166 57 52 -270 -170 -242 82 -117 -263 -148 -47 -117 177 -163 -219 18
7649 18 153 409 332 82 -5 -133 -197 -99 -108 56 483 138 277 162 119 82 -79 -112 -137 -26 -208 16 58 24
$$ packed form
7489A1l2K89j91J19l73K17K0k8K38k9j98N1k05j06K65J8o0p2K84k25J81k56K93
7512B11k61P2J8q8K41k5j14N8j89J79l8j33K09j59l19J24J83R7j21M6N7j12K76
7535B12k4k07k5qk9n9J21k5k5j2J01L50m23K47j90n4m5Q3q5M5j79J09L39O2j00
7560A79l19K03J12k51j38Q1K18j58J96k02J56l05L62l21J26L18l90K05J79j61
7580I0k38M89k87j4k1J62j30k1J78m2k21j11K40J25O0k85j47R6K66k42l5J64j54
7603g8q6L35k39J03j8q9K01p1J14l11J40O2k00L44n0J91l99k68L01l5m1L31k62
7626b5J13k21K72O0l71L4J21J83j09nl22J00p2L24j99j46J15J01p0K94l40n6K37
7649A8J35K56p7k50q7j28o4R8rJ64M27l45J39j15m3l7j61l3k5J11j82K24M2l4
$$ plain form
7673 24 -301 65 -363 -47 -39 247 -347 55 -25 -21 172 -82 -58 -112 -77 -13 -79 -177 -143 103 -315 5 -196 -59
7697 -59 -66 -115 -143 -164 -196 39 -139 24 -104 -124 192 -82 98 58 -84 138 48 480 -23 103 -177 -168 120 -33
7721 -33 7 -49 400 -45 238 -71 -14 -78 170 23 207 -84 -189 66 -94 -72 -67 -51 18 33 262 7 108 59
7745 59 -95 -80 114 107 328 -267 -133 133 159 269 133 -11 -11 -152 99 -54 -9 -133 -39 -7 0 156 -252 141
7769 141 -123 -115 -186 -67 -4 -17 392 -159 -241 -15 179 0 42 151 -23 82 239 104 246 -26 -54 103 -196
7792 -196 49 -13 124 233 -110 -1 14 11 -112 131 300 8 -86 -67 68 0 -59 -76 145 -109 -79 139 -280
7815 -280 175 236 -140 -67 11 -201 37 -203 85 6 -71 81 -158 360 -11 -163 56 398 -59 -167 -190 -24
7837 -24 89 -62 36 -279 -24 -6 176 109 -144 171 -49 20 -95 -170 -60 101 -1 107 -52 -190 100 -134
$$ packed form
7673B4l25L66m28L16QK86n94M02q0MJ93k54K4n4L5O4o6r8L4K46m18L20k01J37
7697e9pm9k8k1l2K35j78J63j28k0L16k74J80m0j42K22r0M32n03J26k80RK88j53
7721c3M0n6M49m45K83l09N7o4K48j47J84k91j05K55j60K2NJ6O9J5K29k55J01m9
7745E9j54J5J94pK21n95J34K66K6J10j36j44%j41K51j53M5j24R4L2PJ56m08L93
7769A41k64Qp1J19O3j3M09n51q2K26J94j79M2J09j74J05J57j35J42k72k8J57k99
7792a96K45o2J37J09l43J09J5lj23K43J69k92r4J9J35o8n9j7K21k54L0K18m19
7815b80M55O1l76P3P8k12K38k40K88p9p7J52k39N18l71j52K19L42m57j08k3J66
7837b4J13j51R8l15K55J8J82o7k53L15k20O9j15p5J10J61j02J08j59j38K90k34
$$ plain form
7859 -134 -306 -270 183 -71 -254 239 -74 58 -13 -71 75 -194 -147 -313 -136 -14 -125 -230 122 277 66
7880 66 100 242 -82 33 -54 -173 160 116 188 -102 110 -29 96 70 -221 207 95 -128 -330 162 13 79
7902 79 310 -46 -218 78 -47 -90 14 -149 17 -47 7 -66 -51 75 141 -80 -145 25 -213 133 -159 -31 79
7925 79 -58 268 121 -124 8 -282 70 -82 -87 255 243 163 34 -287 -89 -134 7 -11 91 -1 133 217 66
7948 66 370 61 336 -94 101 -131 -220 -239 226 -59 -205 -256 -31 -189 -81 16 58 -8 -2 53 14 24 -28 -115 -62
7973 -62 50 -91 65 143 164 132 -22 350 203 -271 76 81 -38 32 253 63 -13 221 102 21 -179 -300 227
7996 227 -136 82 85 -89 -370 163 -108 -342 -4 -173 -340 -242 22 -48 28 104 -352 49 285 74 -12 -203
8018 -203 69 298 195 -9 -34 35 -96 -60 66 -63 -14 42 -196 166 197 -37 -75 245 -190 -158 -80 -163 -71 90
$$ packed form
7859a34j72L6M53k54j83M93l13J32p1n8J46k69M7j66J77J22j11j05L52J55k11
7880F6L4J42l24J15q7j19L33m4P2k90K12j39J25k6k91M28j12k23k02M92j49O6
7902G9K31l56j72K96j25m3J04j63J66o4N4p3J5J26O6k21o5J70k38L46k92J28J10
7925G9j37L26j47k45J32k90L52j52nL42j2q0j29l21J98m5J41j8J02r2J34Q4j51
7948F6L04l09K75m30J95k32q9j9M65k85j46n1K25j58J08R7M2o6ON5l9J0n2q7N3
7973f2J12j41J56P8K1l2j54L72j47m74L47Nj19P0K21j90p6K34j19q1k00j21N27
7996B27l63K18Lj74k81N33k71k34L38j69j67R8K64p0P6P6m56M01K36k11q6j91
8018b03K72K29j03k04k5O9j31L6J26j29M9N6k38L62L1k34l8L20m35L2P8q3R2J61
$$ plain form
8042 90 -299 102 -11 187 -85 33 227 34 -56 256 29 52 292 -193 -294 -35 -3 -169 9 267 108
8063 108 -174 -238 -138 162 124 69 -139 89 150 38 -165 -82 -85 -6 197 69 -13 119 258 -72 5 6 71 -175
8087 -175 -61 151 -32 85 78 -82 30 -166 128 161 188 31 -202 47 129 40 112 190 0 15 162 271 220
8110 220 49 -141 -61 135 140 266 -273 10 -52 -89 -238 70 39 -229 -166 -119 100 60 -15 -15 -33 65 42 -272 -161
8135 -161 -20 41 -180 19 -46 130 -115 59 73 171 -71 185 -93 -95 -426 46 -116 99 -303 3 -196 -185
8157 -185 204 178 236 79 89 93 36 -190 -105 -278 -148 -65 -257 125 219 -389 -53 136 40 -128 -202 -1 29 64
8181 64 103 -294 72 77 2 -127 -114 -59 27 205
$$ packed form
8042I0l89M01j13J98k72J18J94j93r0L12k27K3K40m85j01K59L2j66J78K58j59
8063A08k82o4J00L00l8n5k08K28O1j12k03Q3lP9K03j28q2J32J39l30P7JO5k46
8087a75J14K12j83J17pj60J12j96K94L3K7j57k33K49Q2q9P2P8j90J5J47J09n1
8110B20j71j90Q0J96NJ26n39K83o2l7j49L08l1k68O3M7K19m0p5%j8R8k3l14J11
8135a61J41O1k21J99o5J76k45J74J4R8k42K56k78kl31M72j62K15m02L06j99J1
8157a85L89k6N8j57J0Mn7k26Q5j73J30Q3j92L82R4o08L36J89r6j68p4K01L0L5
8181F4L9l97L66Np5j29J3N5Q6J78
8191B05
$$ Imaginary data points
##PAGE= N=2
##DATA TABLE= (X++(I..I)), XYDATA
$$ plain form
0 0 0 0 0 0 0 0 0 0 -8 8 -8 8 -16 16 -16 24 -25 32 -39 41 -50 57 -68 76 -90 102 -117 132 -150 169 -190 214
32 214 -239 269 -301 333 -370 411 -457 505 -560 620 -687 760 -843 935 -1041 1161 -1298 1457
50 1457 -1650 1879 -2165 2528 -3008 3676 -4672 6321 -9537 18209 -87392 -289259 -180789
63 -180789 -121409 -184597 -250968 -211652 -224427 -294513 -309460 -268040 -288010 -299862 -240354 -220969
75 -220969 -323625 -366354 -264159 -199382 -274673 -301752 -203090 -157649 -239186 -276875 -213554 -169112
87 -169112 -166292 -125878 -101295 -160812 -195234 -116074 -55904 -100025 -109943 -19812 9957 -80518
99 -80518 -116197 -27347 33361 7903 6364 40118 19237 -16420 22336 66176 34706 23042
111 23042 90540 107796 15065 -31539 41788 89905 42485 17065 50169 37683 -22777 -28510
$$ packed form
0@%%%%%%%%qJ6j6J6k4L2l2M0m9N7p1Q0r1J07j25J44j66J92k19K49k82L19l59M04
32B14m53N08n70O34p03P81q68R62j065J180j307J447j603J778j976K202k459K755
50A457l107L529m044M693n536O684q348J0993j5858K7746j05601k01867J08470
63a80789N9380o3188o6371L9316j2775p0086j4947M1420j9970j1852N9508J9385
75b20969j02656m2729J02195O4777p5291k7079R8662M5441q1537l7689O3321M4442
87a69112K820M0414K4583n9517l4422P9160O0170m4121r918R0131K9769r0475
99h0518l5679Q8850O0708k5458j539L3754k0881l5657L8756M3840l1470j1664
111B3042O7498J7256r2731m6604P3327M8117m7420k5420L3104j2486o0460n733
$$ plain form
123 -28510 2656 -12810 -29614 9156 11833 -76948 -126086 -62173 -14809 -60367 -87147 -45913
135 -45913 -44478 -106122 -120626 -70659 -49768 -57927 -37136 -31914 -85283 -105942 -38346 6604 -35046
148 -35046 -54510 2353 23531 -33251 -57293 -7492 25666 16456 24365 36994 5203 -20184
160 -20184 13887 44110 22917 22159 69757 69017 -2553 -27415 36517 81943 59407 41040 49497
173 49497 36836 16281 34796 58523 45851 41076 69266 63693 8344 -7213 41450 63756
185 63756 28713 14475 39934 34607 -8308 -20499 2707 12504 13254 23858 7768 -41276 -53130
198 -53130 -9471 13484 -11454 -18819 4956 -3126 -45175 -46691 -4163 16015 5308 2939 1652
211 1652 -17819 -22633 7462 23387 7324 8737 34277 27190 -12395 -15149 22571 38185 23942
$$ packed form
123b8510L1166j5466j6804L8770K677q8781m9138O3913M7364m5558k6780M1234
135d5913J435o1644j4504M9967K0891q159K0791N222n3369k0659O7596M4950m1650
148c5046j9464N6863K1178n6782k4042M9801L3158r210P909J2629l1791k5387
160b0184L4071L0223k1193p58M7598p40p1570k4862O3932M5426k2536j8367Q457
173D9497j2661k0555J8515K3727j2672m775K8190n573n5349j5557M8663K2306
185F3756l5043j4238K5459n327m2915j2191K3206R797P50J0604j6090m9044j1854
198e3130M3659K2955k4938p365K3775q082m2049j516M2528K0178j0707k369j287
211A652j9471m814L0095J5925j6063J413K5540p087l9585k754L7720J5614j4243
$$ plain form
224 23942 22471 29455 12418 -6367 6378 25806 24550 26272 38707 25110 -11062 -12238 24689
237 24689 41323 27235 23403 29408 14473 -4233 9138 34087 35280 28202 31657 23973 1727
250 1727 897 26088 35214 20049 16925 26557 15567 -7106 -5192 13213 16900 12526 15767 8612
264 8612 -16030 -25677 -6504 8599 3856 775 2212 -12373 -33495 -27897 -2970 6588 -2095 -8195
278 -8195 -14579 -26883 -28786 -11684 -330 -7887 -12908 -8331 -13618 -28337 -27625 -11008 -4180 -9298
292 -9298 -10188 -9074 -18659 -28617 -21494 -7501 -2137 -874 139 -9725 -24762 -21934 -953 12352
306 12352 8937 4043 1829 -5348 -8880 1184 17088 21215 16219 11596 7172 2949 6347 17598
320 17598 22094 18363 16367 17478 11428 3303 5283 14875 19438 17770 14404 8614 -549 -5039 1332
$$ packed form
224B3942j471O984j7037j8785J2745J9428j256J722J2435j3597l6172j176L6927
237B4689J6634j4088l832O005j4935j8706J3371K4949J193p078L455p684k2246
250A727q30K5191R126j5165l124R632j0990k2673J914J8405L687m374L241p155
264H612k4642r647J9173J5103m743l081J437j4585k1122N598K4927R558q683o100
278h195o384j2304j903J7102J1354p557n021M577n287j4719P12J6617O828n118
292i298q90J114r585r958P123J3993N364J263J013r864j5037K828K0981J3305
306A2352l415m894k214p177l532J0064J5904M127m996m623m424m223L398J1251
320A7598M496l731j996J111o050q125J980R592M563j668l366n790r163m490O371
$$ plain form
335 1332 11012 13916 10618 2687 -8162 -14445 -8692 3330 8122 2974 -4699 -10876 -15193 -13629 -5926
350 -5926 907 137 -5153 -9191 -12076 -12215 -9015 -4615 -2309 -1279 -1726 -4102 -8401 -10656 -6582 139
366 139 5396 6205 2570 -3722 -7962 -6357 1990 9754 12062 7193 -733 -6377 -3802 4082 10597 11998
382 11998 7287 2039 -1901 -1488 2573 7428 9007 6598 3501 1485 540 271 1683 3442 4408 5776
398 5776 5059 544 -4489 -5302 -836 4146 6511 4566 -299 -6151 -8466 -3764 3955 7186 4047 -1221
414 -1221 -5671 -7212 -3046 3564 5949 3043 -1065 -2377 -2597 -2447 523 2721 2028 -568 -637 154 -2378
431 -2378 -4779 -4159 -1259 -950 -1528 -2092 -6298 -12176 -12686 -6642 -3561 -6019 -9704 -13418 -17811 -19101
447 -19101 -13146 -7583 -10256 -16391 -18288 -17706 -17786 -16172 -11078 -10215 -14839 -16780 -12489 -10085 -12034 -10014
$$ packed form
335A332R680K904l298p931j0849o283N753J2022M792n148p673o177m317J564P703
350e926O833p70n290m038k885j39L200M400K306J030m47k376m299k255M074O721
366A39N257Q09l635o292m240J605Q347P764K308m869p926n644K575P884O515J401
382A1998m711n248l940M13M061M855J579k409l097k016r45k69J412J759R66J368
398E776p17m515n033q13M466M982K365j945m865n852k315M702P719L231l139n268
414a221m450j541M166O610K385k906m108j312k20J50K970K198o93k596o9P91k532
431b378k401O20K900L09n78n64m206n878n10O044L081k458l685l714m393j290
447a9101N955N563k673o135j897N82q0J614N094Q63m624j941M291K404j949K020
$$ plain form
463 -10014 -6257 -6857 -7673 -2896 767 -3601 -6887 -686 6672 5719 4419 7089 7179 3357 5755 14346
479 14346 17371 12838 12084 13740 11579 11852 20087 24806 17049 11004 16673 21816 18468 16263 20443
494 20443 20800 14691 14889 20709 19150 13613 15259 17981 13974 11312 18083 20556 9669 4850 13946
509 13946 19820 13707 9517 13344 13343 9164 12862 19112 15734 10372 15437 20066 14327 12910 23631
524 23631 27073 15894 11967 24011 29872 23275 20944 25359 23548 20804 27511 33087 24983 18485
538 18485 26427 30600 21703 18238 29198 30917 16646 11706 21672 23946 15272 12608 15246 9329
552 9329 4600 11572 12924 -2264 -9698 2159 6593 -7199 -14476 -5829 -6736 -20099 -21808 -10991
566 -10991 -11916 -22415 -22968 -21356 -28739 -29434 -15461 -12460 -30408 -36903 -20210 -13479 -26283 -29521
$$ packed form
463a0014L757o00q16M777L663m368l286O201P358r53j300K670R0l822K398Q591
479A4346L025m533p54J656k161K73Q235M719p757o045N669N143l348k205M180
494B0443L57o109J98N820j559n537J646K722m007k662O771K473j0887m819R096
509A3946N874o113m190L827jm179L698O250l378n362N065M629n739j417J0721
524B3631L442j1179l927J2044N861o597k331M415j811k744O707N576q104o498
538A8485P942M173q897l465J0960J719j4271m940R966K274q674k664K638n917
552I329m729O972J352j5188p434J1857M434j3792p277Q647r07j3363j709J0817
566a0991r25j0499n53J612p383o95J3973L001j7948o495J6693O731j2804l238
$$ plain form
580 -29521 -15871 -13146 -23152 -21096 -11904 -14483 -19177 -9083 -2911 -13672 -14735 1644 3822 -14611
594 -14611 -15982 7224 14938 -2231 -8200 2834 4241 -1787 5802 14155 3964 -3175 8263 11850
608 11850 -4119 -4626 17302 20154 -4690 -11210 8032 12117 -3491 -4656 6268 1778 -7743 -1879
622 -1879 955 -14766 -17382 1783 5061 -19415 -25538 -5081 -3277 -26135 -27940 -5987 -3900 -21116
636 -21116 -23184 -16089 -22396 -23891 -5781 -1051 -22903 -29035 -6629 -1266 -22316 -21731 4478 7042
650 7042 -16493 -19549 -863 980 -8707 -2072 5526 -6843 -10680 7321 8296 -15920 -17315 12586
664 12586 18304 -9423 -17720 1776 3822 -11591 -6764 9675 2816 -12387 -6174 -620 -13495
677 -13495 -11748 14070 13509 -18679 -24431 4503 11106 -12585 -15272 5284 4970 -12122 -10131 -291
$$ packed form
580b9521J3650K725j0006K056R192k579m694J0094O172j0761j063J6379K178j8433
594a4611j371K3206P714j7169n969J1034J407o028P589Q353j0191p139J1438L587
608A1850j5969n07K1928K852k4844o520J9242M085j5608j165J0924m490r521N864
622a879K834j5721k616J9165L278k4476o123K0457J804k2858j805K1953K087j7216
636b1116k068P095o307j495J8110M730k1852o132K2406N363k1050N85K6209K564
650G042k3535l056J8686J843r687O635P598j2369l837J8001R75k4216j395K9901
664A2586N718k7727q297J9496K046j5413M827J6439o859j5203O213N554j2875
677a3495J747K5818n61l2188n752K8934O603k3691k687K0556l14j7092J991R840
$$ plain form
691 -291 -10077 -14920 3163 8744 -14690 -20762 2123 3584 -21924 -20311 10680 13517 -14271 -20548
705 -20548 -3084 -625 -6358 4453 11541 -5574 -12267 7430 13111 -7073 -6097 22329 24932 -4231
719 -4231 -10091 13982 19175 2653 5148 18947 12051 127 8608 12828 -2879 -2717 21874 22967
733 22967 -6610 -13496 10205 15122 -5876 -6092 15329 13762 -5195 -5847 3089 -1541 -1919 15928
747 15928 17427 -7786 -14344 8542 14471 -5550 -6405 16062 15435 -9118 -12334 4572 5343 -3766
761 -3766 2645 7114 -7039 -12481 2532 3568 -16630 -15803 10274 12266 -14558 -22439 -4765 -182
775 -182 -9710 -4551 6027 -3621 -15987 -8359 -1230 -9022 -6268 11011 7919 -16482 -19495 3246
789 3246 8967 -7669 -9435 4614 2832 -9385 -7854 -1240 -6950 -7785 6030 7567 -10161 -15637
$$ packed form
691b91r786m843J8083N581k3434o072K2885J461k5508J613L0991K837k7788o277
705b0548J7464K459n733J0811P088j7115o693J9697N681k0184R76K8426K603k9163
719d231n860K4073N193j6522K495J3799o896j1924Q481M220j5707J62K4591J093
733B2967k9577o886K3701M917k0998k16K1421j567j8957o52Q936m630l78J7847
747A5928J499k5213o558K2886N929k0021q55K2467o27k4553l216J6906P71r109
761c766O411M469j4153n442J5013J036k0198Q27K6077J992k6824p881J7674M583
775a82r528N159J0578r648j2366P628P129p792K754J7279l092k4401l013K2741
789C246N721j6636j766J4049j782j2217J531O614n710q35J3815J537j7728n476
$$ plain form
803 -15637 -645 2929 -9238 -5911 11863 9139 -9787 -12890 254 4951 3672 9907 9554 -3187
817 -3187 -7155 6151 10641 532 1011 15121 13133 -4715 -7112 5698 8204 959 3168 8216
831 8216 24 -6967 -2427 559 -6010 -3444 8770 5239 -12665 -15830 -2699 720 -5936 -3876
845 -3876 3775 -1945 -12473 -10365 -4223 -4251 -1614 6057 1654 -12045 -13709 -1139 3120 -3766 -2752
860 -2752 4802 236 -9758 -8114 62 189 -664 3429 2530 -5223 -6898 487 1654 -2927 1319 10873
876 10873 7138 -5323 -6575 1895 5526 6772 10540 9457 340 -3556 2730 7567 6867 9280 12470
891 12470 5972 -3233 -1342 7988 9605 5339 6242 8093 3396 -555 2239 4008 2976 5922 10959
906 10959 7553 -1407 -2750 3421 5517 5832 9331 11477 4623 -2724 282 6890 9630 11591 12850
$$ packed form
803a5637J4992L574j2167L327J7774k724j8926l103J3144M697j279O235l53j2741
817c187l968J3306M490j0109M79J4110j988j7848k397J2810K506p245K209N048
831H216q192o991M540K986o569K566J2214l531j7904l165J3131L419o656K060
845c876P651n720j0528K108O142k8K637P671m403j3699j664J2570M259o886J014
860b752P554m566r994J644Q176J27q53M093q99p753j675P385J167m581M246R554
876A0873l735j2461j252Q470L631J246L768j083r117l896O286M837p00K413L190
891A2470o498r205J891R330J617m266R03J851m697l951K794J769j032K946N037
906A0959l406q960j343O171K096L15L499K146o854p347L006O608K740J961J259
$$ plain form
921 12850 7520 505 1443 8848 11385 9237 10493 12183 6901 1719 4150 8707 9100 8631 10429 8538
937 8538 2780 396 3877 5362 5106 7718 9280 3156 -4147 -3549 1376 3106 3884 5179 2419 -4956
953 -4956 -7833 -3959 -182 944 1673 1153 -4530 -9968 -8016 -1959 -258 -1526 -1153 -2502 -6736 -8680
969 -8680 -5183 -2283 -2190 -1071 102 -2902 -7154 -7253 -4025 -1589 -204 2021 1407 -3953 -8371 -6118
985 -6118 -1162 2106 3689 3077 -1633 -6598 -6395 -814 2854 3781 2988 1032 -2879 -4683 -1696 2169
1001 2169 3231 2367 1887 123 -2982 -4061 -1862 277 919 1551 1319 -2586 -6361 -6822 -3797 -378
1017 -378 1106 1057 -1863 -7179 -8920 -5351 -656 2190 1513 -718 -4204 -6416 -4004 1103 3997 4017
1033 4017 2396 923 -1600 -1828 991 3983 4715 4807 4012 1846 -654 -921 1209 4058 5110 4896 2842
$$ packed form
921A2850n330p015R38P405K537k148J256J690n282n182K431M557L93m69J798j891
937H538n758k384L481J485k56K612J562o124p303N98M925J730P78J295k760p375
953d956k877L874L777J126P29n20n683n438J952O057J701j268L73j349m234j944
969h680L497K900R3J119J173l004m252r9L228K436J385K225o14n360m418K253
985f118M956L268J583o12m710m965K03N581L668R27p93j956l911j804K987L865
1001B169J062q64m80j764l105j079K199K139O42O32k32l905l775m61L025L419
1017c78J484m9k920n316j741L569M695K846o77k231l486k212K412N107K894K0
1033D017j621j473k523k28K819K992P32R2p95k166k500k67K130K849J052k14k054
$$ plain form
1050 2842 -748 -3592 -2683 1216 3904 4204 2132 -1638 -4985 -4793 -460 3387 4047 2240 -839 -2933
1066 -2933 -4088 -1194 1942 3100 2017 545 -748 -2794 -3105 -1033 755 1178 688 108 -2231 -4876
1082 -4876 -4749 -2041 797 1461 1309 -1470 -5487 -5990 -2907 1784 3340 2682 772 -1974 -3784 -1425
1098 -1425 3572 6025 5113 2977 1671 -121 197 2978 5504 4983 3980 3520 1688 -792 -711 1391
1114 1391 2444 2162 1920 327 -3023 -5047 -3380 -123 963 757 5 -2735 -6644 -5716 -495 2873
1130 2873 1933 226 -971 -3015 -3586 -93 3821 3424 1434 1162 283 -1594 -1225 2176 4108 1817
1146 1817 983 2163 438 -2838 -1994 1332 2062 1234 1338 -46 -3639 -4702 -308 3342 1982 903
1162 903 1225 -1533 -4368 -2057 3905 4839 1583 -172 -34 -2278 -2603 1279 3447 627 -2124 -131
$$ packed form
1050B842l590k844R09L899K688L00k072l770l347J92M333L847O60j807l079k094
1066b933j155K894L136J158j083j472j293k046l11K072J788M23m90n80k339k645
1082d876J27K708K838O64j52k779m017n03L083M691J556o58j910k746j810K359
1098a425M997K453r12k136j306j792L18K781K526n21j003m60j832k480Q1K102
1114A391J053k82k42j593l350k024J667L257J086k06p52k740l909R28N221L368
1130B873r40j707j197k044n71L493L914l97j990k72q79j877L69L401J932k291
1146A817q34J180j725l276Q44L326P30q28J04j384l593j063M394L650j360j079
1162I03L22k758k835K311N962R34l256j755J38k244l25L882K168k820k751J993
$$ plain form
1178 -131 -586 -4979 -5157 -356 325 -3184 -3706 -1456 -4155 -7505 -5032 -1041 -1331 -2605 -1235 -2195 -7242
1195 -7242 -5993 1156 4193 452 -1310 1054 -178 -2946 430 5836 4595 1138 1994 2827 30
1210 30 -44 5193 6063 310 -513 3465 2898 -3035 -2416 2946 2787 -986 -679 403 -3291 -5147 -500
1227 -500 2579 -1436 -2857 478 -1468 -7451 -4938 3082 3199 -3255 -4340 -1449 -3248 -5087 -862
1242 -862 1694 -2606 -5088 -1136 -1399 -6680 -5661 1614 1269 -5748 -4997 904 -770 -6232 -3624 1943
1258 1943 486 -1445 1592 1667 -3814 -2540 5999 7222 894 317 6159 4141 -1160 2521 9979 7966
1274 7966 1658 2818 5167 2351 1816 7206 6590 -616 -896 6006 4604 -3429 -2276 4759 3322 -3599
1290 -3599 -1897 2175 -2090 -5716 -1410 1760 -3137 -3979 336 -2134 -9364 -6350 3447 1664 -7408
$$ packed form
1178a31m55m393j78M801O81l509n22K250k699l350K473L991k90j274J370r60n047
1195g242J249P149L037l741j762K364j232k768L376N406j241l457Q56Q33k797
1210C0p4N237Q70n753q23L978n67n933O19N362j59l773L07J082l694j856M647
1227e00L079m015j421L335j946n983K513Q020J17o454j085K891j799j839M225
1242h62K556m300k482L952k63n281J019P275l45p017P51N901j674n462K608N567
1258A943j457j931L037P5n481J274Q539J223o328n77N842k018n301L681P458k013
1274G966o308J160K349k816n35N390o16p206k80O902j402q033J153P035j437o921
1290c599J702M072m265l626M306L170m897q42M315k470p230L014R797j783r072
$$ plain form
1305 -7408 -7439 -1122 -2824 -7262 -3291 346 -4170 -6876 -2317 -1651 -7336 -5966 1591 -55 -8289 -5972
1321 -5972 3108 83 -7692 -4714 2985 955 -3353 75 1719 -3130 -3126 4742 5177 -2415 -1574 6097
1337 6097 3943 -4107 -78 8511 5693 -2137 -276 5202 2152 -873 4052 5256 -1843 -1817 5368
1352 5368 3773 -4749 -2639 5709 3124 -5573 -3260 4077 1023 -5577 -1852 2241 -1677 -3615 1146
1367 1146 400 -6849 -4791 3927 2572 -6640 -5489 2033 -333 -6677 -3077 3301 -774 -6191 -2346
1382 -2346 1121 -3198 -3292 2573 903 -6516 -3599 5241 3465 -5332 -3412 4649 3157 -2356 459
1397 459 4705 467 -2063 3234 5761 533 56 5930 4570 -2004 937 9555 6921 -1565 499
1412 499 7689 5909 1477 3838 6464 2145 986 6521 6827 415 701 6650 5393 -1284 687 7358
$$ packed form
1305g408l1O317j702m438L971L637m516k706M559O66n685J370P557j646q234K317
1321e972R080l025p775K978P699k030m308L428J644m849MP868M35p592Q41P671
1337F097k154q050M029Q589k818p830J861N478l050l025M925J204p099K6P185
1352E368j595q522K110Q348k585q697K313P337l054o600L725M093l918j938M761
1367A146p46p249K058Q718j355r212J151P522k366o344L600O378m075n417L845
1382b346L467m319r4N865j670p419K917Q840j776q797J920Q061j492n513K815
1397D59M246m238k530N297K527n228m77N874j360o574K941Q618k634q486K064
1412D99P190j780m432K361K626m319j159N535L06o412K86N949j257o677J971O671
$$ plain form
1428 7358 4548 -2552 -292 5321 2990 -764 1514 2641 -1485 -1352 2973 2275 -4026 -3708 2617 1130
1444 1130 -5014 -3226 1890 -299 -5047 -3419 446 -2057 -4508 -1746 -1021 -5062 -4279 698 -334
1459 -334 -5437 -4474 897 -203 -4885 -2812 1663 78 -3928 -1999 871 -758 -1328 1720 1397 -2687
1475 -2687 -1329 3747 2928 -1612 -242 3880 3067 -328 1379 4251 1978 345 2712 4139 1913
1490 1913 1188 3542 2107 -368 1948 6152 3744 -1285 -607 2628 2368 555 1521 1842 -566 -1463
1506 -1463 729 1326 -857 -1326 579 -602 -2950 -1707 773 -1062 -4063 -2532 537 -762 -2349
1521 -2349 -2097 -2244 -3165 -1850 1061 -159 -3246 -3348 -796 -957 -1826 -275 1353 -551 -2765 -863
1537 -863 1051 160 -60 914 667 -995 222 1993 898 -740 971 2971 1860 -327 783 1858
$$ packed form
1428G358k810p100K260N613k331l754K278J127m126J33M325o98o301L18O325j487
1444A130o144J788N116k189m748J628L865k503k451K762P25m041P83M977j032
1459c34n103R63N371j100m682K073M475j585m006J929K870j629n70L048l23m084
1475b687J358N076q19m540J370M122q13l395J707K872k273j633K367J427k226
1490A913p25K354j435k475K316M204k408n029O78L235k60j813R66L21k408q97
1506a463K192N97k183m69J905j181k348J243K480j835l001J531L069j299j587
1521b349K52j47r21J315K911j220l087j02K552j61q69J551J628j904k214J902
1537h63J914q91k20R74k47j662J217J771j095j638J711K000j111k187J110J075
$$ plain form
1553 1858 572 725 2360 2439 977 91 903 610 -101 1380 2624 790 -1422 -138 658 214 -220
1570 -220 1317 1301 -752 -1576 -85 -97 -431 -93 1047 -470 -2119 -915 466 -479 -1503 281 898
1587 898 -289 -1605 -193 -634 -1339 -134 1675 1005 -907 -823 226 -484 -4 1981 2790 256 -1325
1604 -1325 -188 1128 1077 1698 2426 938 -918 -432 1271 983 -205 346 871 -281 -1081 -153 -41 -1281
1622 -1281 -1678 186 841 -855 -1793 -1789 -1701 -1585 17 901 -683 -2879 -2564 -1097 -636 -185 825 384
1640 384 -1587 -2300 -662 171 -310 114 224 -288 -1126 -692 238 18 -606 445 949 256 -1009 -387 215
1659 215 -123 593 1964 1858 -88 -841 -163 779 1097 2361 2230 837 -754 -229 1425 1333 1506 1411 695
1678 695 -779 -975 232 817 683 0 181 -263 -1345 -1401 -922 -871 -825 -412 -187 -1072 -2151 -1511 -1268 -661
$$ packed form
1553A858j286J53J635P9j462q86Q12k93p11J481J244j834k212J284P96m44m34
1570b20J537j6k053q24J491j2l34L38J140j517j649J204J381r45j024J784O17
1587H98j187j316J412m41p05J205J809o70j912Q4J049p10M80J985Q09k534j581
1604a325J137J316n1O21P28j488j856M86J703k88j188N51N25j152q00R28J12j240
1622a281l97J864O55j696r38MQ8J16J602Q84j584k196L15J467M61M51J010m41
1640C84j971p13J638Q33m81M24J10n12q38M34R30k20o24J051N04o93j265O22O02
1659B15l38P16J371j06j946p53O78R42L18J264j31j393j591N25J654r2J73r5p16
1678F95j474j96J207N85j34o83J81m44j082n6M79N1M6M13K25q85j079O40K43O07
$$ plain form
1698 -661 -370 780 50 -1495 -1905 -652 562 979 1311 932 -463 -946 -285 1220 1563 1269 967 369
1716 369 -383 -261 181 492 682 426 364 -457 -787 -947 -488 -173 -1 728 270 -878 -1696 -782 -96 307
1736 307 902 963 -190 -1710 -1486 -282 909 1299 1016 -378 -1354 -1590 -528 271 437 63 -673 -801
1754 -801 -1713 -1225 -427 -261 -479 -308 -79 -941 -1585 -800 -231 242 788 1311 725 -739 -627 665 1646
1773 1646 1965 2251 1804 407 -485 728 1920 2065 1458 855 -38 -1091 -445 585 790 18 -100 -260
1791 -260 -929 -1747 -1097 -646 -786 -1045 -299 -142 -2173 -2453 -1033 -254 -223 394 570 -475 -2203 -1260 352
1810 352 1194 936 811 211 -1458 -1366 412 1504 565 66 386 -304 -1343 -704 554 602 -136 144 722
1829 722 -379 -1207 110 1075 660 842 2083 1175 -902 -609 1462 1927 1783 2066 2022 64 -1150 350
$$ packed form
1698f61K91J150p30j545m10J253J214M17L32l79j395m83O61J505L43k94l02n98
1716C69p52J22M42L11J90k56o2q21l30j60M59L15J72P29m58j148q18R14O86M03
1736C07N95O1j153j520K24J204J191L90k83j394r76k36J062P99J66l74p36j28
1754h01r12M88P98J66k18J71K29q62o44P85N69M73N46N23n86j464J12J292R81
1773A646L19K86m47j397q92J213J192J45o07o03q93j053O46J030K05p72j18j60
1791b60o69q18O50M51j40k59P46J57k031k80J420P79L1O17J76j045j728R43J612
1810C52Q42k58j25o00j669R2J778J092r39m99L20o90j039O39J258M8p38K80N78
1829G22j101q28J317R65m15J82J241r08k077K93K071M65j44K83m4j958j214J500
$$ plain form
1847 350 2237 1566 727 1316 -21 -2007 -1530 1032 889 -894 -991 -226 -1356 -2661 -1462 -1 -993
1864 -993 -1357 -203 -158 -2060 -2075 385 603 -246 406 1792 127 -1565 -920 1740 1924 889 1272 1319
1882 1319 -919 -1412 1429 2334 441 -97 943 -8 -1811 -799 1767 998 -972 -77 740 -592 -1205
1899 -1205 541 1164 -175 96 2038 937 -2015 -1390 1320 1653 -26 795 1080 -591 -2504 -421
1915 -421 1949 561 -646 299 -291 -3124 -1696 1228 724 -1942 -1609 113 -1137 -2932 -1116 911
1931 911 -387 -1549 -81 211 -2128 -2180 858 1339 -805 -39 1836 231 -2662 -910 2274 1863 -146
1948 -146 638 1052 -1423 -1586 1373 2269 -304 -474 1337 125 -2674 -935 2323 1331 -1436 -278 1173
1965 1173 -387 -1712 886 1879 -68 191 2269 1269 -1373 -558 3141 2376 -298 825 2917 445
$$ packed form
1847C50J887o71q39N89j337j986M77K562j43j783r7P65j130j305J199J461r92
1864i93l64J154M5j902j5K460K18q49O52J386j665j692O45K660J84j035L83M7
1882A319k238m93K841R05j893n38J040r51j803J012K566p69j970Q95Q17j332o13
1899a205J746O23j339K71J942j101k952O25K710L33j679Q21K85j671j913K083
1915d21K370j388j207R45n90k833J428K924n04k666L33J722j250j795J816K027
1931I11j298j162J468K92k339n2L038M81k144P66J875j605k893J752L184m11k009
1948a46P84M14k475j63K959Q96k573j70J811j212k799J739L258r92k767J158J451
1965A173j560j325K598R93j947K59K078j000k642Q15L699p65k674J123K092k472
$$ plain form
1981 445 -1969 746 3088 1484 133 1521 808 -1855 -1223 2540 1804 -1362 -1434 1337 -499 -2949
1997 -2949 -912 1983 -64 -2636 -784 156 -2118 -2373 165 161 -2415 -1775 823 -1361 -4279 -2749
2013 -2749 700 -141 -2685 -2001 -463 -2846 -3837 -821 563 -1812 -2689 -651 -1438 -3760 -2013 1282
2029 1282 169 -2972 -1912 632 -470 -2482 -422 1650 95 -1182 1589 1383 -1420 -622 2855
2044 2855 2512 -358 465 3198 1218 -1571 1224 4214 2367 306 1575 1788 -315 -88 3000 2672
2060 2672 -49 164 2094 1004 -1530 -120 2928 1226 -1583 -186 1636 -383 -1670 666 1563
2075 1563 -708 -1121 1146 387 -2374 -1338 1847 886 -1552 -222 1270 -370 -2288 -77 1858 153
2091 153 -1175 66 80 -1933 -376 2132 1534 -944 -606 1664 705 -994 1039 2642 750 -476
$$ packed form
1981D45k414K715K342j604j351J388p13k663O32L763p36l166p2K771j836k450
1997b949K037K895k047k572J852R40k274k55K538mk576O40K598k184k918J530
2013b749L449q41k544O84J538k383r91L016J384k375q77K038p87k322J747L295
2029A282j113l141J060K544j102k012K060K072j555j277K771k06k803P98L477
2044B855l43k870Q23K733j980k789K795K990j847k061J269K13k103K27L088l28
2060B672k721K13J930j090k534J410L048j702k809J397J822k019j287K336Q97
2075A563k271m13K267p59k761J036L185r61k438J330J492j640j918K211J935j705
2091A53j328J241J4k013J557K508n98k478L38K270r59j699K033J603j892j226
$$ plain form
2107 -476 907 2007 213 -273 1954 1911 229 548 2092 521 -1450 -232 2333 1706 -535 115 333
2124 333 -677 -860 1106 1474 -425 -1039 -70 -84 -1316 -379 1414 179 -2278 -1032 458 -344 -1340
2141 -1340 -487 511 -330 -716 449 76 -1452 -1102 1191 941 -501 -78 853 -2 -684 639 2089 1055
2159 1055 94 771 1177 533 914 2141 1738 -49 623 1589 1304 246 1244 1809 929 138 746 880 -166
2178 -166 57 1039 1006 -90 -24 621 -136 -787 -13 866 2 -879 -141 -232 -1092 -946 144 97 -722 -1116 -550
2199 -550 -1159 -1158 -531 318 -673 -1714 -1242 -422 -1024 -1092 -421 -127 -1270 -1026 -269 -109 -1174 -897 -365 -404
2219 -404 -933 -76 294 -867 -1615 -71 679 -41 0 -511 -400 -941 32 1046 -57 -1201 -894 -182 -565
2238 -565 -245 51 -44 -992 -1058 -247 136 -904 -651 -243 -390 -951 -430 97 -703 -1603 -408 333 -387 -474
$$ packed form
2107d76J383J100j794m86K227m3j682L19J544j571j971J218K565o27k241O50K18
2124C33j010j83J966L68j899o14R69j4j232R37J793j235k457J246J490q02r96
2141a340Q53R98q41l86J165l73j528L50K293k50j442M23R31q55o82J323J450j034
2159A055r61O77M06o44L81J227m03j787O72R66k85j058R98N65q80p91O08J34j046
2178a66K23R82l3j096O6O45p57o51P74Q79q64q81P38r1q60J46J090m7q19l94N66
2199e50o09JO27Q49r91j041M72Q20o02o8O71K94j143K44P57J60j065K77N32l9
2219d04n29Q57L70j161p48J544P50p20M1n11J11n41R73J014j103j144L07P12l83
2238e65L20K96r5r48o6Q11L83j040K53M08j47n61N21N27q00r00J195P41p20q7
$$ plain form
2258 -474 -236 -458 -957 -404 870 651 -550 -485 108 308 -363 538 617 -22 -553 -42 499 15 -118 16
2278 16 490 -377 -144 507 124 -719 -64 309 23 -272 -234 93 -622 -734 116 230 -424 -701 -414 -234 -995
2299 -995 -884 238 -160 -1072 -922 -385 -684 -706 -124 58 -753 -971 -373 172 34 -450 159 119 -537 -153
2319 -153 804 392 -482 106 552 1182 529 594 938 227 91 969 1283 719 836 709 821 490 859 1590
2339 1590 686 257 173 1076 1029 505 411 788 240 -178 595 838 338 -226 229 137 268 181 227 168 -771 -134
2361 -134 415 233 -480 -793 -294 -455 -606 12 -174 -628 -858 -472 -113 -176 -533 -70 -665 -821 -107 484
2381 484 -139 -562 -129 193 -176 57 389 -64 -409 -651 149 496 -55 -74 143 -273 -613 27 179 -258
2401 -258 -454 -589 -245 -201 -662 -377 -621 -704 -393 -90 -160 -784 -698 -566 -791 -872 -401 -305 -635 -967 -667 -299
$$ packed form
2258d74K38k22m99N53J274k19j201O5N93K00o71R01P9o39n31N11N41m84j33J34
2278A6M74q67K33O51l83q43O55L73k86k95L8L27p15j12Q50J14o54k77K87J80p61
2299i95J11J122l98r12J50N37k99k2N82J82q11k18N98N45j38m84O09m0o56L84
2319a53R57m12q74N88M46O30o53O5L44p11j36Q78L14n64J17j27J12l31L69P31
2339A590r04m29q4R03m7n24r4L77n48m18P73K43n00n64M55r2J31q7M6n9r39O37
2361a34N49j82p13l13M99j61j51O18j86m54k30L86L59o3l57M63n95j56P14N91
2381D84o23m23M33L22l69K33L32m53l45k42Q00L47n51j9K17m16l40O40J52m37
2401b58j96j35L44M4m61K85k44q3L11L03p0o24Q6J32k25q1M71R6l30l32L00L68
$$ plain form
2423 -299 -571 -395 -63 -357 -616 -455 -102 289 -257 177 263 -387 -33 107 768 129 -36 645 1126 678
2443 678 794 920 645 661 986 1263 848 653 508 826 793 708 1297 944 389 233 777 1030 831 708 718
2464 718 228 131 712 914 666 239 611 538 410 248 986 794 301 570 1228 1036 290 957 890 715 567
2485 567 1262 1174 631 646 436 955 333 1006 1893 699 -169 310 1234 682 831 903 616 59 339 1248 1082
2506 1082 408 437 503 436 -171 283 888 173 -374 368 390 -260 -562 -238 -215 -664 -430 439 -297 -1081 -970
2527 -970 -421 -363 -790 -620 -285 -745 -1590 -829 54 -601 -901 -422 -563 -1269 -624 243 -87 -873 -439 507
2547 507 -397 -863 -398 262 -222 -525 187 365 -759 -883 -151 -139 -577 -159 453 -453 -1224 -1306 320 -461
2567 -461 -837 -178 -198 -1194 -1176 -373 -210 -896 -856 -129 -226 -1506 -860 -288 -588 -1492 -529 -251 -943 -1700 -982
$$ packed form
2423b99k72J76L32k94k59J61L53L91n46M34Q6o50L54J40O61o39j65O81M81m48
2443F78J16J26k75J6L25K77m15j95j45L18l3q5N89l53n55j56N44K53j99j23J0
2464G18m90r7N81K02k48m27L72p3j28j62P38j92m93K69O58j92p46O67o7j75j48
2485E67O95q8n43J5k10N19o22O73Q87j194q68M79R24n52J49P2k87n57K80R09j66
2506A082o74K9O6o7o07M54O05p15n47P42K2o50l02L24K3m49K34Q69p36p84J11
2527i70N49N8m27J70L35m60q45P61Q83o55l00M79j41p06O45Q67l30p86M34R46
2547E07r04m66M65O60m84l03P12J78j124j24P32J2m38M18O12r06p71q2J626p81
2567d61l76O59k0r96J8Q03J63o86M0P27r7j280O46N72l00r04R63K78o92p57P18
$$ [...]
8191g0
##END NTUPLES=NMR FID
##END=
