##TITLE=1H_BAU-j-FPBU
 CDCl3, 8 sc, 
 5.3.2019
##JCAMPDX= 6.0         $$ Bruker NMR JCAMP-DX V2.0
##DATA TYPE= NMR FID
##DATA CLASS= NTUPLES
##ORIGIN= UXNMR, Bruker Analytische Messtechnik GmbH
##OWNER= root
$$ XWIN-NMR		Version 3.5
$$ Tue Mar  5 14:50:51 2019 Russian Standard Time (UT+4h)  she@DPX200
##.OBSERVE FREQUENCY= 200.1316
##.OBSERVE NUCLEUS= ^1H
##.DELAY= (6, 6)
##.ACQUISITION MODE= SIMULTANEOUS
##.ACQUISITION SCHEME= undefined
##.AVERAGES= 8
##.DIGITISER RES= 18
##SPECTROMETER/DATA SYSTEM= spect
##.PULSE SEQUENCE= zg30
##.SOLVENT NAME= CDCl3
##.SHIFT REFERENCE= (INTERNAL, CDCl3, 0, 15.7039)
##AUDIT TRAIL= $$ (NUMBER, WHEN, WHO, WHERE, WHAT)
$$ ##TITLE= Audit trail, XWIN-NMR		Version 3.5
$$ ##JCAMPDX= 5.01
$$ ##ORIGIN= Bruker BioSpin GmbH
$$ ##OWNER= she
$$ F:/spectra/data/she/nmr/H-F/1/audita.txt
$$ ##AUDIT TRAIL=  $$ (NUMBER, WHEN, WHO, WHERE, WHAT)
(   1,<2019-03-05 14:49:19.00 +0400>,<she>,<DPX200>,
      <created by zg, POWCHK disabled, PULCHK disabled
       configuration hash MD5:
       00 E9 B6 7A A2 85 ED C7 34 08 36 98 17 FE 4E 26
       data hash MD5: 16K
       D7 4F C2 58 AB 9F CF C4 76 2E 36 5F 96 E3 58 18>)
$$ ##END=
$$ 
$$ hash MD5
$$ F8 07 76 F3 EE 29 CB 4D 49 7A B9 53 91 F5 94 54
##$RELAX= 
##$RELAX= 
##$RELAX= 
##$RELAX= 
##$RELAX= 
##$RELAX= 
$$ Bruker specific parameters
$$ --------------------------
##$DU= <F:/spectra>
##$EXPNO= 1
##$NAME= <H-F>
##$PROCNO= 1
##$TYPE= <nmr>
##$USER= <she>
##$AMP= (0..31)
100 100 100 100 100 100 100 100 100 100 100 100 100 100 100 100 100 100 
100 100 100 100 100 100 100 100 100 100 100 100 100 100 
##$AQSEQ= 0
##$AQ_mod= 1
##$AUNM= <au_zg>
##$AUTOPOS= <>
##$BF1= 200.13
##$BF2= 200.13
##$BF3= 200.13
##$BF4= 200.13
##$BF5= 200.13
##$BF6= 200.13
##$BF7= 200.13
##$BF8= 200.13
##$BYTORDA= 1
##$CFDGTYP= 0
##$CFRGTYP= 5
##$CHEMSTR= <none>
##$CNST= (0..31)
1 1 145 1 1 1 1 1 1 1 1 1 1 1 1 1 1 1 1 1 1 1 1 1 1 1 1 1 1 1 1 1 
##$CPDPRG= <>
##$CPDPRG1= <>
##$CPDPRG2= <>
##$CPDPRG3= <>
##$CPDPRG4= <mlev>
##$CPDPRG5= <mlev>
##$CPDPRG6= <mlev>
##$CPDPRG7= <mlev>
##$CPDPRG8= <mlev>
##$CPDPRGB= <>
##$CPDPRGT= <>
##$D= (0..31)
0 1.2 0 0 0 0 0 0 0 0 0 0.03 0 0 0 0 0 0 0 0 0 0 0 0 0 0 0 0 0 0 0 0 
##$DATE= 1551782958
##$DBL= (0..7)
120 120 120 120 120 120 120 120 
##$DBP= (0..7)
150 150 150 150 150 150 150 150 
##$DBP07= 0
##$DBPNAM0= <>
##$DBPNAM1= <>
##$DBPNAM2= <>
##$DBPNAM3= <>
##$DBPNAM4= <>
##$DBPNAM5= <>
##$DBPNAM6= <>
##$DBPNAM7= <>
##$DBPOAL= (0..7)
0.5 0.5 0.5 0.5 0.5 0.5 0.5 0.5 
##$DBPOFFS= (0..7)
0 0 0 0 0 0 0 0 
##$DE= 6
##$DECBNUC= <off>
##$DECIM= 24
##$DECNUC= <off>
##$DECSTAT= 4
##$DIGMOD= 1
##$DIGTYP= 9
##$DL= (0..7)
0 120 120 120 120 120 120 120 
##$DP= (0..7)
150 150 150 150 150 150 150 150 
##$DP07= 0
##$DPNAME0= <>
##$DPNAME1= <>
##$DPNAME2= <>
##$DPNAME3= <>
##$DPNAME4= <>
##$DPNAME5= <>
##$DPNAME6= <>
##$DPNAME7= <>
##$DPOAL= (0..7)
0.5 0.5 0.5 0.5 0.5 0.5 0.5 0.5 
##$DPOFFS= (0..7)
0 0 0 0 0 0 0 0 
##$DQDMODE= 0
##$DR= 18
##$DS= 0
##$DSLIST= <SSSSSSSSSSSSSSS>
##$DSPFIRM= 0
$$ [...]
##$SUBNAM2= <"">
##$SUBNAM3= <"">
##$SUBNAM4= <"">
##$SUBNAM5= <"">
##$SUBNAM6= <"">
##$SUBNAM7= <"">
##$SUBNAM8= <"">
##$SUBNAM9= <"">
##$SW= 24.9336934301222
##$SWIBOX= (0..15)
0 0 2 0 0 0 0 0 0 0 0 0 0 0 0 0 
##$SW_h= 4990.01996007984
##$TD= 16384
##$TD0= 1
##$TE= 0
##$TE2= 300
##$TE3= 300
##$TEG= 300
##$TL= (0..7)
0 120 120 120 120 120 120 120 
##$TP= (0..7)
150 150 150 150 150 150 150 150 
##$TP07= 0
##$TPNAME0= <>
##$TPNAME1= <>
##$TPNAME2= <>
##$TPNAME3= <>
##$TPNAME4= <>
##$TPNAME5= <>
##$TPNAME6= <>
##$TPNAME7= <>
##$TPOAL= (0..7)
0.5 0.5 0.5 0.5 0.5 0.5 0.5 0.5 
##$TPOFFS= (0..7)
0 0 0 0 0 0 0 0 
##$TUNHIN= 0
##$TUNHOUT= 0
##$TUNXOUT= 0
##$USERA1= <user>
##$USERA2= <user>
##$USERA3= <user>
##$USERA4= <user>
##$USERA5= <user>
##$V9= 5
##$VALIST= <valist>
##$VCLIST= <CCCCCCCCCCCCCCC>
##$VD= 0
##$VDLIST= <DDDDDDDDDDDDDDD>
##$VPLIST= <PPPPPPPPPPPPPPP>
##$VTLIST= <TTTTTTTTTTTTTTT>
##$WBST= 1024
##$WBSW= 4
##$XGAIN= (0..3)
0 0 0 0 
##$XL= 0
##$YL= 0
##$YMAX_a= 598123
##$YMIN_a= -900313
##$ZGOPTNS= <>
##$ZL1= 120
##$ZL2= 120
##$ZL3= 120
##$ZL4= 120
##$ABSF1= 10
##$ABSF2= 0
##$ABSG= 5
##$ABSL= 3
##$ALPHA= 0
##$AQORDER= 0
##$ASSFAC= 0
##$ASSFACI= 0
##$ASSFACX= 0
##$ASSWID= 0
##$AUNMP= <proc_1d>
##$AZFE= 0.1
##$AZFW= 0.1
##$BCFW= 1
##$BC_mod= 2
##$BYTORDP= 1
##$COROFFS= 0
##$CY= 11.3945322036743
##$DATMOD= 1
##$DC= 2
##$DFILT= <>
##$DTYPP= 0
##$F1P= 18.9103706918063
##$F2P= -1.10871071338519
##$FCOR= 0.5
##$FTSIZE= 0
##$FT_mod= 4
##$GAMMA= 1
##$GB= 0.15
##$INTBC= 1
##$INTSCL= 1
##$ISEN= 128
##$LB= 0.24
##$LEV0= 0
##$LPBIN= 0
##$MAXI= 10000
##$MC2= 0
##$MEAN= 0
##$ME_mod= 0
##$MI= 1.114404
##$NCOEF= 0
##$NC_proc= 0
##$NLEV= 6
##$NOISF1= 3.799351
##$NOISF2= 2.8
##$NSP= 1
##$NTH_PI= 0
##$NZP= 0
##$OFFSET= 15.70392
##$PC= 1
##$PHC0= -8862.806
##$PHC1= 16.00013
##$PH_mod= 1
##$PKNL= yes
##$PPARMOD= 0
##$PSCAL= 0
##$PSIGN= 0
##$REVERSE= no
##$SF= 200.130013532006
##$SI= 16384
##$SIGF1= 3
##$SIGF2= 2
##$SINO= 400
##$SIOLD= 16384
##$SREGLST= <1H.CDCl3>
##$SSB= 0
##$STSI= 0
##$STSR= 0
##$SW_p= 3612.71676300578
##$SYMM= 0
##$S_DEV= 0
##$TDeff= 0
##$TDoff= 0
##$TI= <>
##$TILT= no
##$TM1= 0
##$TM2= 0
##$TOPLEV= 0
##$USERP1= <user>
##$USERP2= <user>
##$USERP3= <user>
##$USERP4= <user>
##$USERP5= <user>
##$WDW= 1
##$XDIM= 8192
##$YMAX_p= 0
##$YMIN_p= 0
$$ End of Bruker specific parameters
$$ ---------------------------------
##NTUPLES= NMR FID
##VAR_NAME=  TIME,          FID/REAL,        FID/IMAG
##SYMBOL=    X,             R,               I
##VAR_TYPE=  INDEPENDENT,   DEPENDENT,       DEPENDENT
##VAR_FORM=  AFFN,          ASDF,            ASDF
##VAR_DIM=   8192,          8192,            8192
##UNITS=     SECONDS,       ARBITRARY UNITS, ARBITRARY UNITS
##FACTOR=    0.0002004,     1,               1
##FIRST=     0,             0,               0
##LAST=      1.6414764,     0,               0
##MIN=       0,             -900313,         0
##MAX=       1.6414764,     598123,          0
$$ Real data points
##PAGE= N=1
##DATA TABLE= (X++(R..R)), XYDATA
$$ plain form
0 0 0 0 0 -8 8 -16 16 -16 32 -40 48 -56 78 -96 113 -136 168 -200 238 -280 327 -382 442 -511 588 -675
26 -675 768 -876 994 -1122 1265 -1420 1597 -1788 1993 -2221 2471 -2747 3049 -3380 3741 -4145
42 -4145 4590 -5080 5625 -6237 6932 -7715 8612 -9652 10880 -12343 14127 -16359 19252
55 19252 -23161 28761 -37502 53149 -89724 346511 -113425 -601199 598123 494685 -546223
66 -546223 -429671 486103 99538 -599086 -257106 237626 -162855 -435284 -130198 55430
76 55430 -94463 -63335 14190 8584 50023 59019 -59979 71527 273562 79427 -126513
87 -126513 112688 156662 -169157 -97061 223869 -10822 -268517 62401 159570 -264221 -169465
98 -169465 303775 71846 -319253 105900 413013 -124723 -288334 322854 331332 -272726
$$ packed form
0@%%%qJ6k4L2l2M8p2Q8j04J34j74K09k49L04l68M38n18O07p09Q24r53J099j263
26f75J443j644J870k116K387k685L017l385L781m214M692n218N796o429P121p886
42d145Q735r670J0705j1862J3169j4647J6327j8264K0532k3223K6470l0486L5611
55A9252m2413N1922o6263R0651j42873M36235m59936m87774J199322j03438j040908
66e46223J16552R15774l86565o98624L41980M94732m00481k72429L05086J85628
76E5430j49893L1128P7525n606M1439Q996j18998J31506K02035j94135k05940
87a26513K39201M3974l25819P2096L20930k34691k57695L30918R7169m23791R4756
98a69465M73240k31929l91099M25153L07113n37736j63611O11188Q478o04058
$$ plain form
108 -272726 -116046 405726 65998 -385407 -3118 243194 -180333 -236350 146497 22449
118 22449 -278362 -57873 90882 -158315 -94584 207277 46031 -189132 57913 200312
128 200312 -78345 -97146 200417 140751 -120187 -26123 122354 -28364 -100975 19478 -5413
139 -5413 -52118 59169 8087 -145304 11189 139301 -106130 -112314 261330 179625 -231082
150 -231082 -52078 308163 15212 -255758 125402 280717 -169653 -251811 149845 92810
160 92810 -270003 -121763 155670 -60757 -226823 27298 81761 -151183 -75516 139783
170 139783 23579 -66551 117139 118153 -68884 11520 166390 49962 -27354 95277 70368
181 70368 -73388 -26802 50773 -36098 -53100 37545 -21331 -113646 -12521 38833 -94020
$$ packed form
108b72726J56680N21772l39728m51405L82289K46312m23527n6017L82847j24048
118B2449l00811K20489J48755k49197O3731L01861j61246k35163K47045J42399
128B00312k78657j8801K97563n9666k60938R4064J48477j50718p2611J20453k4891
139e413m6705J11287n1082j53391J56493J28112k45431o184L73644q1705m10707
150b31082J79004L60241k92951k70970L81160J55315m50370q2158M01656n7035
160I2810l62813J48240K77433k16427j66066K54121N4463k32944P5667K15299
170A39783j16204r0130J83690J014j87037Q0404J54870j16428p7316J22631k4909
181G0368j43756M6586P7575q6871j7002R0645n8876r2315J01125N1354j32853
$$ plain form
192 -94020 -65974 115559 43594 -119221 22683 145061 -50893 -102828 130641 114783 -105953
203 -105953 -25789 127122 -35999 -146234 30122 66712 -95551 -60732 65685 -34376
213 -34376 -129944 -149 61122 -48600 -28353 92371 30169 -69158 28117 95860 -4984
224 -4984 -10971 92662 47907 -41768 17610 46270 -37086 -28882 38117 -5801 -41153 10573
236 10573 -9666 -71905 -18028 37737 -19200 -29680 45342 20136 -63913 -11826 73553 9623
248 9623 -45977 38697 56477 -54648 -50480 50383 8354 -71916 2501 48600 -43700 -59067
260 -59067 21797 2997 -48459 9397 50776 -118 -14778 24475 16890 -4906 24382 45206
272 45206 19410 9169 22002 3176 -19856 5243 19294 -13525 -11878 16499 -17570 -53485
$$ packed form
192i4020K8046J81533p1965j62815J41904J22378j95954n1935K33469j5858k20736
203a05953Q0164J52911j63121j10235J76356L6590j62263L4819J26417j00061
213c4376r5568J29795O1271j09722K0247J20724o2202r9327R7275O7743j00844
224d984n987J03633m4755q9675N9378K8660q3356Q204O6999m3918l5352N1726
236A0573k0239o2239N3877N5765n6937j0480P5022k5206q4049N2087Q5379o3930
248I623n5600Q4674J7780j11125M168J00863m2029q0270P4417M6099r2300j5367
260e9067Q0864j8800n1456N7856M1379n0894j4660L9253p585k1796K9288K0824
272D5206k5796j0241J2833j8826k3032K5099J4051l2819J647K8377l4069l5915
$$ plain form
284 -53485 -10822 7378 -35376 -16789 29216 -11599 -46183 3660 16896 -26529 -8560 37427
296 37427 13866 -19270 3410 18354 -7276 -11447 19388 24590 1115 589 10711 -6868 -11230
309 -11230 17879 18532 -3146 11107 17139 -16736 -14708 19048 6437 -12075 10993 10273 -19990
322 -19990 -13094 2458 -13557 -15049 6907 4090 -13973 -12251 -3550 -9942 -14850 1756 16829
335 16829 3905 -8525 3022 1976 -12029 5048 24527 5061 -914 16814 2423 -15929
347 -15929 7029 18879 -582 2906 16042 2731 -9717 -2858 -80 -1021 2014 3262 2144 -5268
361 -5268 -16855 -13712 -4182 -7234 -6016 1811 -3996 -12070 -12631 -12068 -1100 10390 -839 -3312 18374
376 18374 11447 -14748 1655 27621 12612 502 16613 20384 4395 -6213 -2193 10198 11118
$$ packed form
284e3485M2663J8200m2754J8587M6005m0815l4584M9843J3236m3425J7969M5987
296C7427k3561l3136K2680J4944k5630m171L0835N202k3475n26J0122j7579m362
309a1230K9109O53k1678J4253O032l3875K028L3756j2611j8512K3068p20l0263
322a9990O896J5552j6015j492K1956k817j8063J722Q701o392m908J6606J5073
335A6829j2924j2430J1547j046j4005J7077J9479j9466n975J7728j4391j8352
347a5929K2958J1850j9461L488J3136j3311j2448O859K778r41L035J248j118p412
361e268j1587L143R530l052J218P827n807q074n61N63J0968J1490j1229k473K1686
376A8374o927k6195J6403K5966j5009j2110J6111L771j5989j0608M020J2391R20
$$ plain form
389 11118 -4137 -5414 3188 -8493 -21129 -10409 -2506 -5444 -4799 -7691 -10859 -5199 -7359 -12010
403 -12010 1349 9490 165 986 4644 -3372 -2148 5883 3349 7795 13643 689 -6900 5932
417 5932 4250 -5543 4875 12697 3532 -522 707 -1292 494 -26 -962 7015 7291 -4124 -7630
432 -7630 -7241 -8070 38 1020 -9914 -3658 3980 -15205 -20579 4127 7189 -10461 -3930 9544 3393
447 3393 -3444 -2386 1919 9702 10445 4242 7435 9994 1096 -3188 1862 9357 13863 3422 -8736
462 -8736 3036 9371 -10572 -8315 15859 4615 -16753 -927 8965 -12373 -16637 -104 -690
475 -690 -8456 -5913 -3669 -8413 -13439 -10091 171 3405 936 2569 382 -820 11563 13178 981
490 981 14477 29635 4181 -6760 23419 18146 -17590 -4442 22684 -1621 -24930 -6596 -2454
$$ packed form
389A1118j5255j277Q602j1681j2636J0720P903k938O45k892l168N660k160m651
403a2010J3359Q141r325Q21L658q016J224Q031k534M446N848j2954p589J2832
417E932j682r793J0418P822r165m054J229j999J786n20r36P977K76j1415l506
432g630L89q29Q108R82j0934O256P638j9185n374K4706L062j7650O531J3474o151
447C393o837J058M305P783P43o203L193K559q898m284N050P495M506j0441j2158
462h736J1772O335j9943K257K4174j1244k1368J5826R892k1338m264J6533n86
475f90p766K543K244m744n026L348J0262L234k469J633k187j202J2383J615j2197
490I81J3496J5158k5454j0941L0179n273l5736J3148K7126k4305k3309J8334M142
$$ plain form
503 -2454 -25432 -24478 -2747 -4870 -21796 -13745 753 -11552 -14792 12501 15735 -6484 9177
516 9177 31659 5435 -4313 28811 22986 -6451 14613 31058 -5173 -15033 15648 5292 -21801
529 -21801 -2054 15182 -13951 -25496 2667 3905 -23309 -11221 17728 -3485 -24481 7557
541 7557 15201 -25619 -15286 27081 309 -29497 8631 15073 -29987 -14572 25408 -5374 -25260
554 -25260 16704 16231 -25176 -2789 35528 574 -24225 26448 41792 -15512 -16388 40569 19340
567 19340 -33558 9298 50900 -10965 -36087 25097 18526 -36361 -2416 34495 -18830 -33657
579 -33657 19901 6853 -37088 -3348 21253 -24484 -28313 21120 4014 -42081 -9385 24161
591 24161 -21045 -31158 29279 19195 -44126 -8898 48239 -2774 -28685 43661 40951 -32521
$$ packed form
503b454k2978R54K1731k123j6926Q051J4498j2305l240K7293L234k2219J5661
516I177K2482k6224r748L3124n825k9437K1064J6445l6231r860L0681j0356k7093
529b1801J9747J7236k9133j1545K8163J238k7214J2088K8949k1213k0996L2038
541G557P644m0820J0333M2367k6772k9806L8128O442m5060J5415L9980l0782j9886
554b5260M1964m73m1407K2387L8317l4954k4799N0673J5344n7304q76N6957k1229
567A9340n2898M2856M1602o1865k5122O1184o571n4887L3945L6911n3325j4827
579c3657N3558j3048m3941L3740K4601m5737l829M9433j7106m6095L2696L3546
591B4161m5206j0113O0437j0084o3321L5228N7137n1013k5911P2346k710p3472
$$ plain form
603 -32521 2933 62609 3613 -27271 42129 35291 -36838 -5014 46442 -15520 -50788 16690
615 16690 21163 -51292 -30444 31721 -16888 -63827 7117 33673 -41608 -29385 49293 6593
627 6593 -51552 22384 55644 -27260 -19707 60959 16499 -47857 16897 47559 -28190 -26444 40373
640 40373 5125 -48350 3859 32624 -28937 -29023 33905 8832 -42547 11540 46540 -23809 -29961
653 -29961 46928 21807 -41374 16599 51541 -32617 -36797 47391 12791 -54000 11713 43686
665 43686 -47154 -45193 49755 16970 -62764 165 56269 -26134 -50555 46207 40950 -55422
677 -55422 -20170 61396 -1104 -54624 25261 38709 -51665 -31233 46211 -1995 -48949 15158
689 15158 21959 -42580 -10688 44918 -3551 -25958 35155 28234 -27314 11950 58360 1491
$$ packed form
603c2521L5454N9676n8996l0884O9400o838p2129L1824N1456o1962l5268O7478
615A6690M473p2455K0848O2165m8609m6939P0944K6556p5281J2223P8678m2700
627F593n8145P3936L3260q2904P553Q0666m4460o4356O4754L0662p5749J746O6817
640D0373l5248n3475N2209K8765o1561q6O2928k5073n1379N4087L5000p0349o152
653b9961P6889k5121o3181N7973L4942q4158m180Q4188l4600o6791O5713L1973
665D3686r0840J961R4948l2785p9734O2929N6104q2403k4421R6762n257r6372
677e5422L5252Q1566o2500n3520P9885J3448r0374K0432P7444m8206m6954O4107
689A5158O801o4539L1892N5606m8469k2407O1113o921n5548L9264M6410n6869
$$ plain form
701 1491 -24890 39602 35370 -33655 -5318 48187 -13467 -53578 20176 24343 -58309 -29856 38901
714 38901 -26277 -70493 18439 32543 -53343 -25508 48801 -7820 -50520 30908 48584 -30016
726 -30016 -14133 53527 7859 -41680 26245 53560 -27717 -32113 46882 19531 -48439 5375
738 5375 51367 -21622 -40164 36924 26245 -35384 921 34458 -18234 -23560 28747 9793
750 9793 -29472 975 11260 -29162 -17212 19986 -9775 -36491 2327 9210 -32581 -12368
762 -12368 34043 -4793 -39597 21108 40340 -27466 -12625 58073 11895 -47178 25260 60604
774 60604 -25697 -31120 49104 17102 -52227 4409 52006 -17894 -42088 25801 23667 -35381
786 -35381 -8702 41829 1817 -34124 11761 27666 -17829 -12631 24467 -2256 -29766 253
$$ packed form
701A491k6381O4492m232o9025K8337N3505o1654m0111P3754M167q2652K8453O8757
714C8901o5178m4216Q8932J4104q5886K7835P4309n6621m2700Q1428J7676p8600
726c0016J5883O7660m5668m9539O7925K7315q1277m396P8995k7351o7970N3814
738E375M5992p2989j8542P7088j0679o1629L6305L3537n2692n326N2307j8954
750I793l9265L0447J0285m0422J1950L7198k9761k6716L8818O883m1791K0213
762a2368M6411l8836l4804O0705J9232o7806J4841P0698m6178n9073P2438L5344
774F0604q6301n423Q0224l2002o9329N6636M7597o9900k4194O7889k134n9048
786c5381K6679N0531m0012l5941M5885J5905m5495N198L7098k6723k7510L0019
$$ plain form
798 253 3927 -25401 -12328 438 -29535 -25119 8011 -11614 -28947 7706 9759 -27875 -769
811 -769 44501 11522 -15944 30283 42996 -6116 4705 59527 29190 -27564 10710 47956
823 47956 -9307 -29970 28956 14835 -53174 -22736 29275 -20099 -51359 3142 6631 -43899
835 -43899 -21428 24305 -4651 -31143 2614 15086 -7994 424 21132 5074 -7626 10742
847 10742 13068 -2600 8984 19797 -6706 -12265 18921 10938 -17799 4855 20843 -15712 -16178
860 -16178 23878 4841 -27456 6854 20464 -24742 -18429 28389 3612 -36294 276 25262
872 25262 -18929 -27572 24145 19632 -31541 -13587 32457 3696 -26933 15976 31621 -17259
884 -17259 -16838 27409 12908 -16247 7556 14654 -13832 -5475 14742 -4146 -11772 8183 -2137
$$ packed form
798B53L674k9328J3073J2766k9973M416L3130j9625j7333L6653K053l7634K7106
811g69M5270l2979k7466M6227J2713m9112J0821N4822l0337n6754L8274L7246
823D7956n7263k0663N8926j4121o8009L0438N2011m9374l1260N4501L489n0530
835d3899K2471M5733k8956k6492L3757J2472k3080Q418K0708j6058j2700J8368
847A0742K326j5668J1584J0813k6503n559L1186p983k8737K2654J5988l6555m66
860a6178M0056j9037l2297L4310J3610m5206O313M6818k4777l9906L6570K4986
872B5262m4191q643N1717m513n1173J7954M6044k8761l0629M2909J5645m8880
884a7259M21M4247j4501k9155K3803P098k8486Q357K0217j8888p626J9955j0320
$$ plain form
897 -2137 -20838 2647 18346 -9731 -19840 7722 8728 -13624 -1207 19820 -2611 -19742
909 -19742 7578 13679 -10619 704 18170 -13101 -20989 21553 14311 -27011 -2784 28591 -11849
922 -11849 -27856 22398 26470 -22778 -16424 25574 11686 -18314 2029 21689 -4296 -17278
934 -17278 7375 11271 -8765 -2712 4204 -12592 -7950 11934 -5256 -20442 7771 10865 -21846
947 -21846 -9899 22799 1925 -20131 7236 18247 -5965 -5136 14283 7052 -4617 5907 8873
960 8873 -3607 1226 14227 -1117 -14625 6524 14149 -16183 -14175 20513 4411 -31571 -6333
973 -6333 22459 -7221 -22482 5692 7386 -15061 -7980 7256 -14 -3657 99 -4367 -2544 10274
987 10274 8019 -7690 -4023 15345 9046 -9697 4155 22777 -575 -17664 10933 22089 -6383
$$ packed form
897b137j8701K3485J5699k8077j0109K7562J006k2352J2417K1027k2431j7131
909a9742K7320O101k4298J1323J7466l1271p888M2542p242m1322K4227L1375m0440
922a1849j6007N0254M072m9248O354M1998j3888l0000K0343J9660k5985j2982
934a7278K4653L896k0036O053O916j6796M642J9884j7190j5186K8213L094l2711
947b1846J1947L2698k0874k2056K7367J1011k4212Q29J9419p231j1669J0524K966
960H873j2480M833J3001j5344j3508K1149P625l0332K008L4688j6102l5982K5238
973f333K8792k9680j5261K8174J694k2447P081J5236p270l643L756m466J823J2818
987A0274k255j5709L667J9368o299j8743J3852J8622k3352j7089K8597J1156k8472
$$ plain form
1000 -6383 -10763 8465 1530 -9997 549 1489 -6998 -3569 -4568 -12855 -2058 7655 -7869 -16810
1014 -16810 1284 10679 -5584 -11319 8146 12666 -8918 -8596 17540 14924 -10565 -4284 13855
1027 13855 5216 -3344 4076 2726 -1049 4564 -1637 -7307 6088 8594 -10186 -10006 10295 7809
1041 7809 -11093 -9738 8037 7681 -9547 -9449 7386 4582 -12941 -7598 6831 102 -8467 -4852
1055 -4852 -2038 1655 2815 -6974 -5491 11127 6544 -8753 2962 18358 3802 -8255 7259
1068 7259 18141 5784 -6921 1303 13013 2289 -11608 -931 8812 -5988 -15626 -3673 2001
1081 2001 -5258 -11364 -10898 -1819 4118 -7411 -12351 5446 8714 -8763 -5570 13602 10645 -4936
1095 -4936 -3049 8897 11015 12 -4498 5832 8789 -3158 -4822 5575 4781 -3405 -3474 307
$$ packed form
1000f383m380J9228o935j1527J0546R40q487L429r99q287J0797R713j5524q941
1014a6810J8094R395j6263n735J9465M520k1584L22K6136k616k5489O281J8139
1027A3855q639q560P420j350l775N613o201n670J3395K506j8780J80K0301k486
1041G809j8902J355J7775l56j7228R8J6835k804j7523N343J4429o729q569L615
1055d852K814L693J160r789J483J6618m583j5297J1715J5396j4556j2057J5514
1068G259J0882j2357j2705Q224J1710j0724j3897J0677R743j4800r638J1953N674
1081B001p259o106M66R079N937j1529m940J7797L268j7477L193J9172k957j5581
1095d936J887J1946K118j1003m510J0330K957j1947j664J0397p94q186o9L781
$$ plain form
1109 307 4133 4229 -4617 -5857 6969 5446 -7401 -2094 8073 -1080 -9536 -2129 2774 -1432 -8079
1124 -8079 -8894 -1759 416 -7693 -8412 621 926 -4227 -2043 2933 5852 4693 -881 2859 14778
1139 14778 9851 -2353 3970 13047 4276 -2796 2064 3501 136 -5571 -9501 -2476 2305 -9831
1153 -9831 -15257 -1483 3033 -8207 -9258 1507 5361 -1984 -5257 5613 12598 1353 -5134 8110
1167 8110 11365 -1354 -1331 6224 1648 -2759 -1278 -2422 -1726 417 -6075 -6521 3049 1646 -6833 -1395
1183 -1395 5017 1074 -1575 3041 5077 2890 -774 349 4349 355 -3782 -192 -1404 -5953 -2063
1198 -2063 -2297 -8778 -3189 2911 -7001 -6818 7781 4109 -7408 3627 12763 3051 59 9390 9360
1213 9360 2391 2583 5957 4210 -1398 -1823 -37 -4097 -6912 -2552 -5853 -11366 -3590 -833 -11519
$$ packed form
1109C07L826R6q846j240J2826j523j2847N307J0167r153q456P407M903m206o647
1124h079q15P135K175q109p19R033L05n153K184M976K919j159n574L740J1919
1139A4778m927j2204O323R077q771p072M860J437l365n707l930P025M781j2136
1153i831n426J3774M516j1240j051J0765L854p345l273J0870O985j1245o487J3244
1167H110L255j2719K3P555m576m407J481j144O96K143o492m46R570j403q479N438
1183a395O412l943k649M616K036k187l664J123M000l994m137L590j212m549L890
1198b063k34o481N589O100r912J83J4599l672j1517J1035R136r712k992R331l0
1213I360o969J92L374j747n608m25J786m060k815M360l301n513P776K757j0686
$$ plain form
1228 -11519 -6774 5759 -3032 -8714 7353 9342 -4164 1956 12806 3768 -519 8982 7592 -1193
1242 -1193 1237 5437 129 -3840 840 785 -6365 -4424 4272 -1843 -10048 1871 6641 -8814 -5526
1257 -5526 12727 1207 -13118 4336 11094 -8984 -7085 8318 -1588 -12390 -137 3858 -8382
1270 -8382 -7180 1932 -1003 -6356 1525 7237 -333 -1263 10885 10019 436 9025 15754 1384 569
1285 569 16199 6160 -9269 5576 8488 -14155 -11146 7407 -7134 -22801 -5593 1188 -16180
1298 -16180 -13761 2440 -2663 -13268 -557 10419 -1581 -5058 12375 12003 -4314 4878 19990
1311 19990 2534 -7607 12326 10576 -9736 99 10784 -8775 -10527 9359 -130 -15475 1585
1324 1585 8806 -10386 -7266 13014 5174 -11568 641 13783 -847 -8568 8430 7252 -13112
$$ packed form
1228a1519M745J2533q791n682J6067J989j3506O120J0850r038m287R501j390q785
1242a193K430M200n308l969M680n5p150J941Q696o115q205J1919M770j5455L288
1257e526J8253j1520j4325J7454O758k0078J899J5403r906j0802J2253L995j2240
1270h382J202R112k935n353P881N712p570r30J2148q66r583Q589O729j4370q15
1285E69J5630j0039j5429J4845K912k2643L009J8553j4541j5667J7208O781j7368
1298a6180K419J6201n103j0605J2711J0976j2000l477J7433l72j6317R192J5112
1311A9990j7456j0141J9933j750k0312R835J0685j9559j752J9886r489j5345J7060
1324A585P221j9192L120K0280p840j6742J2209J3142j4630p721J6998j178k0364
$$ plain form
1337 -13112 -5998 11689 -4912 -17703 3242 3703 -18447 -5675 12889 -7278 -14404 11054 8179
1350 8179 -10267 6681 19914 -1259 -5149 18290 14579 -5798 2821 16188 -342 -11757 5773
1363 5773 8377 -13876 -12052 5883 -6704 -18874 1796 3657 -19415 -7712 14677 -5487 -15512
1376 -15512 13226 12102 -14261 474 21725 -161 -11713 11972 12785 -10730 -4302 13916 -154
1389 -154 -14376 4277 11248 -10692 -9318 13560 3346 -13375 7339 15818 -10433 -5664 20419
1402 20419 3735 -15058 8679 12447 -15686 -8426 14215 -4270 -20376 -916 2897 -15190
1414 -15190 -8349 7769 -6130 -16073 5009 11667 -7628 -1870 20248 4830 -12978 15367 27707
1427 27707 -5774 -7782 22347 7660 -17477 7591 18180 -15469 -16936 10472 -1621 -20202
$$ packed form
1337a3112P114J7687j6601j2791K0945M61k2150J2772J8564k0167p126K5458k875
1350H179j8446J6948J3233k1173l890K3439l711k0377Q619J3367j6530j1415J7530
1363E773K604k2253J824J7935j2587j2170K0670J861k3072J1703K2389k0164j0025
1376a5512K8738j124k6363J4735K1251k1886j1552K3685Q13k3515O428J8218j4070
1389a54j4222J8653O971k1940J374K2878j0214j6721K0714Q479k6251M769K6083
1402B0419j6684j8793K3737L768k8133P260K2641j8485j6106J9460L813j8087
1414a5190O841J6118j3899r943K1082O658j9295N758K2118j5418j7808K8345J2340
1427B7707l3481k008L0129j4687k5137K5068J0589l3649j467K7408j2093j8581
$$ plain form
1439 -20202 284 7061 -18001 -15001 11407 3982 -15628 94 13241 -6974 -9692 16096 11759
1452 11759 -13401 -668 16978 -4347 -10367 14555 6513 -17343 737 15099 -8158 -8730 14387
1465 14387 2543 -14383 6724 15010 -7836 -5786 15592 3713 -14465 3562 15020 -9228
1477 -9228 -14710 11001 5007 -22476 -5670 16276 -9963 -21003 10257 7539 -22072 -2608 22109
1490 22109 -5030 -16073 14775 13110 -12464 3150 22144 -459 -12284 10631 12971 -7536
1502 -7536 -2662 12087 -3054 -15177 4680 10356 -10666 -8407 7973 -5636 -13855 9243 9190
1515 9190 -15620 -5089 12428 -6504 -10273 15537 6361 -19969 -2281 17413 -4590 -11893 11674
1528 11674 7763 -16481 -4160 19839 3205 -14541 5647 13347 -9850 -5322 20385 4597
$$ packed form
1439b0202K0486O777k5062L000K6408p425j9610J5722J3147k0215k718K5788m337
1452A1759k5160J2733J7646k1325o020K4922q042k3856J8080J4362k3257n72K3117
1465A4387j1844j6926K1107Q286k2846K050K1378j1879j8178J8027J1458k4248
1477i228n482K5711n994k7483J6806K1946k6239j1040L1260k718k9611J9464K4717
1490B2109k7139j1043L0848j665k5574J5614J8994k2603j1825K2915K340k0507
1502g536M874J4749j5141j2123J9857N676k1022K259J6380j3609q219K3098n3
1515I190k4810J0531J7517j8932l769K5810r176k6330J7688J9694k2003p303K3567
1528A1674l911k4244J2321K3999j6634j7746K0188P700k3197M528K5707j5788
$$ plain form
1540 4597 -18305 4156 16430 -10593 -8953 15991 -456 -20745 1898 11465 -11494 -10588 8759
1553 8759 -1558 -13791 2019 8904 -6667 -6334 8405 2339 -8119 4331 11922 -4372 -4828
1566 -4828 12191 3735 -11075 6691 14231 -9793 -7346 15159 617 -16250 7260 14673 -12732
1579 -12732 -10669 12764 2266 -13924 2735 10623 -9607 -11946 7884 5293 -11942 -2350 9544
1592 9544 -7729 -13278 10535 10774 -13915 -5359 14066 -1522 -10176 12196 11833 -9665 -2743 12288
1606 12288 1844 -2115 8909 3479 -7771 1367 8344 -2084 -4825 3931 -723 -10852 -1667
1619 -1667 8635 -4777 -13169 1938 4062 -12059 -3909 12243 -4166 -15139 6079 9753 -9237
1632 -9237 -1927 12823 -1680 -9496 8931 10276 -5007 -676 10614 1701 -6206 5510 11032
$$ packed form
1540D597k2902K2461J2274k7023J640K4944j6447k0289K2643R567k2959R06J9347
1553H759j0317j2233J5810O885j5571L33J4739o066j0458J2450P591j6294m56
1566d828J7019q456j4810J7766P540k4024K447K2505j4542j6867K3510P413k7405
1579a2732K063K3433j0498j6190J6659P888k0230k339J9830k591j7235R592J1894
1592I544j7273n549K3813K39k4689Q556J9425j5588q654K2372l63k1498O922J5031
1606A2288j0444l959J1024n430j1250R138O977j0428k741Q756m654j0129R185
1619a667J0302j3412q392J5107K124j6121Q150J6152j6409j0973K1218L674j8990
1632i237P310J4750j4503p816J8427J345j5283M331J1290q913p907J1716N522
$$ plain form
1645 11032 -2591 -6080 7072 5311 -8422 -1779 8049 -4293 -9373 3244 -68 -10142 -881
1658 -881 2971 -9492 -6365 4598 -3306 -8405 3456 4274 -6281 -2140 6518 2000 -1694 5228
1672 5228 6852 -1067 -733 9541 6959 -3975 1633 9904 -2231 -6950 8626 6637 -10792 -4473
1686 -4473 7701 -3546 -8680 3076 1571 -9281 -4710 2958 -1741 -4519 -1006 -799 -3895 -1969
1700 -1969 2204 1265 -2752 -93 2722 -1536 425 7531 1728 -5156 4885 8115 -2218 466 9142
1715 9142 1240 -4336 4144 5562 -1546 328 2422 -2797 -2715 1806 -755 -4770 -2692 20 -2963
1730 -2963 -7043 -1944 3105 -4880 -8617 1951 3101 -6674 -1841 5789 -970 -3822 4173 3229 -718
1745 -718 4044 4410 -138 2197 5816 1947 1342 3946 3101 434 -102 2105 3041 -1557 -3119 1148
$$ packed form
1645A1032j3623l489J3152j761j3733O643R828j2342n080J2617l312j0074R261
1658h81L852j2463L127J0963p904n099J1861Q18j0555M141Q658m518l694O922
1672E228J624p919L34J0274k582j0934N608Q271j2135m719J5576j989j7429O319
1686d473J2174j1247n134J1756j505j0852M571P668m699k778L513K07l096J926
1700a969M173r39m017K659K815m258J961P106n803o884J0041L230j0333K684Q676
1715I142p902n576Q480J418p108J874K094n219Q2M521k561m015K078K712k983
1730b963m080N099N049p985l737J0568J150r775M833P630o759k852P995r44l947
1745g18M762L66m548K335L619l869o05K604q45k667n36K207R36m598j562M267
$$ plain form
1761 1148 -611 -5251 -1008 646 -5888 -4938 214 -3899 -5164 1074 -1751 -6595 -306 2714 -2904
1776 -2904 -1211 4130 1178 -1592 2356 5010 3179 669 2377 5628 3105 158 3552 4765 -1007
1791 -1007 -601 2986 -395 -2107 838 -1728 -4208 -84 -1466 -5528 -1476 -854 -5079 -2906 717
1806 717 -2641 -3655 1121 612 -1496 -68 1756 2074 570 196 3055 3236 -861 1314 5022 368
1822 368 -1306 3181 1330 -1925 2897 2247 -3217 -310 2808 -1406 -1847 1660 -350 -2503 -297 -1146
1838 -1146 -1910 -221 -2132 -3349 -1102 -577 -1873 -2373 -2198 175 738 -2413 -635 5050 810 -2770
1854 -2770 4357 5901 -524 1243 5850 1222 304 4174 1653 -870 1689 -218 -2836 -507 -392
1869 -392 -3686 -3263 -1321 -1827 -3437 -3013 -567 -439 -4245 -1169 3602 -281 -4169 3445 4695 -3261
$$ packed form
1761A148j759m640M243J654o534R50N152m113j265O238k825m844O289L020n618
1776b904J693N341k952k770L948K654j831k510J708L251k523k947L394J213n772
1791a007M06L587l381j712K945k566k480M124j382m062M052O22m225K173L623
1806G17l358j014M776n09k108J428J824L18j504l74K859J81m097K175L708m654
1822C68j674M487j851l255M822o50n464K907L118m214m41L507k010k153K206q49
1838a146p64J689j911j217K247N25j296n00J75K373N63l151J778N685m240l580
1854b770P127J544o425J767M607m628r18L870k521k523K559j907k618K329J15
1869c92l294M23J942n06j610M24K446J28l806L076M771l883l888P614J250p956
$$ plain form
1885 -3261 -21 5960 12 -3132 3854 3026 -1726 848 2237 -987 345 2016 82 -328 1183
1900 1183 963 -322 792 1936 520 -2272 -379 3549 -1987 -4919 1872 1188 -7246 -3126 4330
1915 4330 -4142 -7411 2035 1347 -5576 -462 3456 -1600 -1074 4382 2457 -518 2898 4948 1473
1930 1473 261 3840 4245 -1264 -1357 4382 703 -5019 -150 2191 -5578 -3387 3204 -2822 -6307 2120
1946 2120 708 -6596 228 4929 -3482 -3570 4580 2003 -3555 731 4298 -1212 -2845 2579 3310 -2684
1962 -2684 -2005 4166 1357 -3405 3195 5897 -2593 -545 7935 955 -3753 6503 4873 -6531 -872
1977 -872 7482 -3046 -8209 1370 1140 -7977 -5796 418 -2841 -7417 -3524 -361 -2933 -2867 1621 529
1993 529 -1592 5280 6735 -1751 2231 11847 3046 -4004 8722 10013 -5074 -2155 9016 -60
$$ packed form
1885c261L240N981n948l144O986q28m752K574J389l224J332J671j934m10J511
1900A183k20j285J114J144j416k792J893L928n536k932O791o84q434M120P456
1915D330q472l269R446o88o923N114L918n056N26N456j925k975L416K050l475
1930A473j212L579M05n509r3N739l679n722M869K341p769K191O591o026l485Q427
1946B120j412p304O824M701q411q8Q150k577n558M286L567n510j633N424P31n994
1962b684O79O171k809m762O600K702q490K048Q480o980m708J0256j630j1404N659
1977h72Q354j0528n163R579k30r117K181O214l259m576L893L163k572O6M488j092
1993E29k121O872J455q486L982R616q801p050J2726J291j5087K919J1171r076
$$ plain form
2007 -60 -7672 1465 1524 -7268 -3865 1586 -4573 -6731 632 956 -6057 -2670 5703 54 -7287 2975
2023 2975 8924 -3824 -5473 8336 4227 -8432 1176 8502 -3963 -4698 5378 472 -5429 3679
2037 3679 3903 -5574 476 8106 -1120 -4488 5977 6505 -5158 -3205 7943 2673 -8882 -1100
2051 -1100 7227 -4386 -8846 3482 627 -10841 -2033 4538 -7643 -5461 7137 -1778 -9860 5473
2065 5473 9081 -6706 -2894 11970 4136 -7145 4449 11656 -890 -4868 7378 7024 -5156
2078 -5156 -1119 8008 -1225 -6249 4825 2775 -8842 -205 7055 -7317 -7963 7914 513 -13370
2092 -13370 339 8587 -8382 -10108 6429 2874 -10684 -3127 7331 -2417 -7023 4614 5676
2105 5676 -4479 -102 9024 230 -3513 10089 7683 -7223 2799 14703 -2223 -8416 11018
$$ packed form
2007f0p612R137N9q792L403N451o159k158P363L24p013L387Q373n649p341J0262
2023B975N949j2748j649J3809m109j2659R608P326j2465p35J0076m906n901R108
2037C679K24r477O050P630r226l368J0465N28j1663J953J1148n270j1555P782
2051a100Q327j1613m460J2328k855j1468Q808O571j2181K182J2598q915q082J5333
2065E473L608j5787L812J4864p834j1281J1594P207j2546l978J2246l54j2180
2078e156M037R127r233n024J1074k050j1617Q637P260j4372o46J5877p401j3883
2092a3370J3709Q248j6969j726J6537l555j3558P557J0458r748m606J1637J062
2105E676j0155M377R126q794l743J3602k406j4906J0022J1904j6926o193J9434
$$ plain form
2118 11018 7528 -12862 -3455 11249 -4438 -13217 2229 3438 -11463 -6584 4928 -3535 -9988
2131 -9988 1775 4248 -7226 -2644 9578 748 -8558 7207 10689 -6133 -1674 14338 1722
2144 1722 -9957 7842 10422 -8360 -3554 11255 -1004 -10372 4515 6688 -8806 -4857 7439
2157 7439 -1482 -9729 2583 6801 -7502 -6792 8163 1407 -11539 1475 10106 -7610 -8940 9887
2171 9887 3013 -11481 2166 9847 -6821 -6447 10262 3291 -8164 4262 8725 -5361 -3457
2184 -3457 10605 3416 -8111 2010 9710 -4248 -7143 8727 4534 -11870 -2809 10406 -3902
2197 -3902 -11045 5698 4006 -12357 -3000 9498 -4406 -8357 6200 1977 -9056 1973 9845
2210 9845 -4170 -6171 8391 5180 -7139 1181 11648 -955 -8179 6438 9282 -6520 -3154
$$ packed form
2118A1018l490k0390R407J4704j5687q779J5446J209j4901M879J1512q463o453
2131i988J1763K473j1474M582J2222q830r306J5765L482j6822M459J6012j2616
2144A722j1679J7799K580j8782M806J4809j2259r368J4887K173j5494L949J2296
2157G439q921q247J2312M218j4303P10J4955o756j2946J3014Q631j7716j330J8827
2171I887o874j4494J3647P681j6668L74J6709o971j1455J2426M463j4086J904
2184c457J4062p189j1527J0121P700j3958k895J5870m193j6404R061J3215j4308
2197c902p143J6743j692j6363R357J2498j3904l951J4557m223j1033J1029P872
2210I845j4015k001J4562l211j2319Q320J0467j2603p224J4617K844j5802L366
$$ plain form
2223 -3154 10121 -92 -10043 4650 7382 -8818 -4081 7880 -3893 -10388 4726 4117 -10233
2236 -10233 -3923 6627 -3213 -9001 3627 5763 -6137 -3897 7732 2546 -5835 3926 9474 -3126
2250 -3126 -3580 9834 4311 -6227 4801 8983 -5963 -4728 9226 1220 -9255 2489 4886
2263 4886 -8570 -5310 7001 -647 -9620 -686 4018 -5591 -5692 5451 2276 -8603 -2145 7390
2277 7390 -631 -4981 5992 4103 -7031 1033 10249 -690 -4319 7139 2994 -6326 3260 9528
2291 9528 -2758 -4996 5012 2420 -5140 485 4766 -3572 -6919 1542 2951 -5291 -3456 3361
2305 3361 -3042 -7750 2481 4400 -6690 -3335 6128 -1813 -6116 5546 5454 -5375 -592 7804
2319 7804 -90 -3131 5175 4629 -2929 -64 5361 832 -2534 2410 4254 -2693 -2796 4075 1605
$$ packed form
2223c154J3275j0213r951J4693K732j6200M737J1961j1773o495J5114o09j4350
2236a0233O310J0550r840n788J2628K136j1900K240J1629n186q381R761N548j2600
2250c126m54J3414n523j0538J1028M182j4946J235J3954q006j0475J1744K397
2263D886j3456L260J2311p648q973Q934M704r609j01J1143l175j0879O458R535
2277G390q021m350J0973j889j1134Q064R216j0939l629J1458m145r320R586O268
2291I528j2286k238J0008k592p560N625M281q338l347Q461J409q242J835O817
2305C361o403m708J0231J919j1090L355R463p941m303J1662r2j0829M783Q396
2319G804p894l041Q306n46p558K865N425m529l366M944J844o947j03O871k470
$$ plain form
2334 1605 -5314 675 4019 -5176 -5392 4043 -166 -6894 590 2077 -6497 -3059 4424 -879 -4918
2349 -4918 882 1554 -3667 -660 5086 1752 -3053 719 4876 1532 -210 5181 2993 -3453 840
2364 840 7381 1155 -1986 3864 1046 -5534 1097 5373 -3008 -5092 276 -1663 -4514 13 341
2379 341 -4776 -4084 -555 -991 -2087 -314 673 -2947 -3119 2908 3578 -2185 -261 5319 608 -2318
2395 -2318 5431 5800 -2461 -61 5478 1240 -501 4171 2038 -2204 559 2155 -1013 -1033 401 -1379
2411 -1379 -3278 -1408 113 -2478 -4096 -1236 270 -4138 -3674 1599 -454 -4512 932 3121 -2549
2426 -2549 -846 5005 1370 -459 4126 2600 -1039 2540 5106 1167 256 2089 1467 -318 -107 1473
2442 1473 139 -3112 -2561 246 -790 -2897 -782 -2377 -4785 -403 1251 -3126 -1710 1796 -2634
$$ packed form
2334A605o919N989L344r195k16R435m209o728P484J487q574L438P483n303m039
2349d918N800O72n221L007N746l334m805L772M157l344j742N391k188o446M293
2364H40O541o226l141N850k818o580O631M276q381k084N368j939k851M527L28
2379C41n117O92L529m36j096J773R87l620j72O027O70n763J924N580m711k926
2395b318P749L69q261K400N539m238j741M672k133m242K763J596l168k0J434j780
2411a379j899J870J521k591j618K860J506m408M64N273k053m058N444K189n670
2426b549J703N851l635j829M585j526l639L579K566l939r11J833o22j785K11J580
2442A473j334l251N51K807j036k107K115j595k408M382J654m377J416L506m430
$$ plain form
2457 -2634 -3475 4226 3128 -3265 -1092 3687 1323 -200 2329 2898 88 -820 935 3093 2046 -535
2473 -535 309 521 277 2079 640 -1772 915 1837 -3357 -1329 4495 -880 -5519 -175 2691 -2803
2489 -2803 -2908 319 -1021 -2495 -1228 -248 -675 -994 -1678 -803 354 561 1019 -148 -188 2717 2660 -307
2507 -307 1425 4558 265 -607 4260 2431 -1626 1387 2218 -1617 222 1768 -2907 -3689 644 -545
2523 -545 -3800 -2642 -280 -1960 -3801 -1652 1191 -759 -3693 -44 3606 -165 -813 2851 1159
2538 1159 89 3607 2866 372 3262 3085 -1396 1887 4900 -385 -2641 1416 1047 -2526 -1137 185
2554 185 -1886 -3402 -2678 -605 -1177 -3175 -1993 -954 -2129 -1054 1698 -1061 -1648 2564 1407 -1921
2570 -1921 2868 4544 -1375 -28 5295 2280 -1251 2622 3022 -653 -159 1604 -6 -1126 -552 -753
$$ packed form
2457b634q41P701j098o393K173M779k364j523K529N69k810r08J755K158j047k581
2473e35Q44K12k44J802j439k412K687R22n194K028N824n375m639N344K866n494
2489b803j05L227j340j474J267R80m27l19o84Q75J157K07M58j167m0K905n7k967
2507c07J732L133m293q72M867j829m057L013Q31l835J839J546m675p82M333j189
2523e45l255J158K362j680j841K149K843j950k934L649L650l771o48L664j692
2538A159j070L518p41k494K890j77m481L283L013n285k256M057l69l573J389J322
2554A85k071j516P24K073n72j998J182J039j175J075K752k759n87M212j157l328
2570a921M789J676n919J347N323l015l531L873M00l675M94J763j610j120N74k01
$$ plain form
2586 -753 -1361 -1594 -620 -1561 -3188 -1672 1265 -2115 -3315 1696 647 -3831 257 3872 -1475 -2015
2602 -2015 3421 778 -1578 2741 2266 -1816 355 3322 -203 -1019 2174 1865 -1359 -1006 2765 1882
2618 1882 -2435 -845 2979 -308 -3028 1448 1648 -3761 -1362 2368 -2289 -2951 1866 -1531 -4999
2633 -4999 999 2126 -4578 -2130 3171 -677 -3535 1060 2963 -861 -1399 2671 2823 -502 327 4142
2649 4142 770 -1089 3941 3060 -2820 624 5225 -1950 -3671 4519 1681 -6108 -745 4109 -3525
2664 -3525 -4766 1718 -241 -5178 -1381 1479 -2297 -2962 804 928 -2365 -474 3889 157 -2444
2679 -2444 3771 4333 -2516 936 6942 60 -3390 5626 4506 -4243 807 6016 -2126 -3989 3704
2694 3704 1967 -5812 -1685 2588 -2448 -4799 746 1184 -5066 -3339 2674 -680 -6130 817 3574
$$ packed form
2586g53o08k33R74r41j627J516K937l380j200N011j049m478M088L615n347n40
2602b015N436k643k356M319m75m082K171K967l525q16L193l09l224L53L771q83
2618A882m317J590L824l287k720M476K00n409K399L730m657o62M817l397l468
2633d999N998J127o704K448N301l848k858M595J903l824n38M070J52l325Q29L815
2649D142l372j859N030q81n880L444M601p175j721Q190k838p789N363M854p634
2664c525j241O484j959m937L797K860l776o65L766J24l293J891M363l732k601
2679b444O215N62o849L452O006o882l450R016j120q749N050N209q142j863P693
2694C704j737p779M127M273n036k351N545M38o250J727O013l354n450O947K757
$$ plain form
2709 3574 -4330 -2939 5899 1525 -5488 3045 5967 -3061 -384 7357 1056 -2987 4351 4990 -2196
2724 -2196 611 5368 -159 -3079 2974 3874 -3685 -2973 3626 328 -6621 -395 4083 -5121 -6441
2739 -6441 3466 755 -8390 -927 3867 -5133 -4812 5035 247 -6127 2142 5100 -2792 -1589 6367
2754 6367 2339 -3914 2190 6948 -22 -2723 4423 4489 -3633 -448 6563 -851 -5365 3221 2316 -6558
2770 -6558 -926 4392 -4926 -6572 4274 664 -7439 -744 4484 -4084 -4595 4067 2611 -4895 -574
2785 -574 5251 325 -3161 4113 4874 -3172 -729 7010 1090 -4714 3967 5242 -4834 -1309 7203
2800 7203 -1178 -6697 3348 3816 -6537 -2619 4665 -2229 -6906 1043 2879 -3873 -3873 2502 70
2815 70 -4532 275 3897 -2400 -3280 4369 1987 -3594 2792 5580 -3418 -1691 7369 1378 -5145 3524
$$ packed form
2709C574p904J391Q838m374p013Q533K922r028K677P741o301m043P338O39p186
2724b196K807M757n527k920O053R00p559P12O599l298o949O226M478r204j320
2739f441R907k711r145P463M794r000L21R847m788o374Q269K958p892J203P956
2754F367m028o253O104M758o970k701P146O6q122L185P011p414m514Q586r05q874
2770f558N632N318r318j646J0846l610q103O695N228q568n11Q662j456p506M321
2785e74N825m926l486P274P61q046K443P739n920n804Q681J275j0076L525Q512
2800G203q381n519J0045M68j0353L918P284o894m677P949J836o752%O375k432
2815G0m602M807L622o297q80P649k382n581O386K788q998J727R060n991o523Q669
$$ plain form
2831 3524 5288 -4142 -1458 6027 285 -5208 1394 3752 -3330 -2584 3611 693 -5456 -901 4426
2846 4426 -2433 -5925 2661 2542 -6599 -2078 5307 -2721 -5824 2848 2091 -4513 303 4538 -2068
2861 -2068 -1619 4956 2067 -2289 2354 3927 -341 -365 4427 2531 -2840 -145 4081 -580 -3943 1748
2877 1748 1879 -5899 -2268 3729 -2747 -6859 1440 1193 -6644 -1691 4192 -2714 -5675 2593 2797 -2530
2893 -2530 -116 4106 722 -1453 2625 4146 513 -267 2877 1901 -832 2138 3222 -2072 -1595 3426
2909 3426 -179 -4107 2206 2052 -5632 -2158 3868 -1637 -4556 1346 633 -3834 -788 2378 -1093
2924 -1093 -3211 440 1278 -1388 -1048 2139 811 -2627 719 3612 -1087 -1852 4109 1719 -2948 1929
2940 1929 4392 -1956 -960 4687 818 -2384 1810 1964 -2015 -572 1831 -976 -2418 -507 -217 -2044
$$ packed form
2831C524J764r430K684P485n742n493O602K358p082P46O195k918o149M555N327
2846D426o859l492Q586j19r141M521P385q028l103Q672p57o604M816M235o606
2861b068M49O575k889m356M643J573m268k4M792j896n371K695M226m661l363N691
2877A748J31p778L631N997o476m112Q299k47p837M953N883o906k961Q268K04n327
2893b530K414M222l384k175M078J521l633p80L144r76k733K970J084n294M77N021
2909C426l605l928O313j54p684L474O026n505k919N902p13m467L046L166l471
2924a093k118L651Q38k666L40L187j328l438L346K893m699p65N961k390m667M877
2940A929K463o348R96N647l869l202M194J54l979J443K403k807j442J911K90j827
$$ plain form
2956 -2044 -1817 -209 -1002 -3420 -967 1799 -1558 -2815 2037 676 -2978 1703 4667 -1818 -1868 3804
2972 3804 1606 -1562 2778 2951 -2278 -391 2827 499 -844 907 513 -1483 -1003 1651 1127 -2236
2988 -2236 -1935 951 -1106 -2608 1104 808 -3825 -1720 1858 -1864 -1872 2332 -659 -3421 1863 2933
3004 2933 -1751 -334 3171 457 -754 2473 3121 316 -501 1475 1251 -520 -103 1573 -515 -2901
3020 -2901 117 300 -3543 -1774 1427 -3054 -4035 1361 -470 -4006 113 2384 -2133 -1606 2600 890
3036 890 -987 1898 2756 590 -142 2361 2512 545 297 1895 745 -1202 1509 2633 -1597 -1176
3052 -1176 1906 -1439 -2554 2502 695 -4929 -1423 2007 -2336 -2819 1119 -880 -3919 -957 1573
3067 1573 -385 -1732 -91 -125 -948 417 2897 1127 -1747 1432 3679 -353 496 4866 1400 -2309
$$ packed form
2956b044K27J608p93k418K453K766l357j257M852j361l654M681K964o485n0N672
2972C804k198l168M340J73n229J887L218k328j343J751l94j996M80K654n24l363
2988b236L01K886k057j502L712k96m633K105L578l722qM204k991k762N284J070
3004B933m684J417L505k714j211L227O48k805q17J976k24j771M17J676k088k386
3020b901L018J83l843J769L201m481r81N396j831l536M119K271m517N27M206j710
3036H90j877K885Q58k166p32K503J51j967k48J598j150j947K711J124m230M21
3052a176L082l345j115N056j807n624L506L430m343m83L938j999l039K962K530
3067A573j958j347J641l4q23J365K480j770k874L179K247m032Q49M370l466l709
$$ plain form
3083 -2309 2080 4106 -868 -245 2518 -826 -2011 1290 -18 -2568 -725 -533 -3137 -2185 359 -876
3099 -876 -3594 -2399 727 -537 -3248 34 2504 -1640 -2578 3040 2267 -2322 1780 3943 -1113 22
3115 22 4290 1495 -448 3207 2674 -1471 889 3155 864 -1350 605 1190 -1194 -2251 834 972
3131 972 -3236 -2686 1121 -1848 -3651 534 123 -3741 -1295 1264 -2384 -1557 2254 -555 -3223 1745
3147 1745 3103 -964 -76 3148 814 -586 1616 3430 904 -603 1533 2401 -621 -335 2571 149
3163 149 -2735 727 1594 -2662 -1210 1770 -3021 -3505 1727 83 -4124 -731 1443 -2457 -2285 1945
3179 1945 1249 -1381 -137 1604 1055 -382 1318 2193 437 -447 2565 1151 -1008 1973 2448 -2490
3195 -2490 -958 2888 -765 -3138 1526 1077 -3603 -1393 1576 -1731 -2592 262 -452 -2467 -1000 929
$$ packed form
3083b309M389K026m974O23K763l344j185L301j308k550J843J92k604R52K544j235
3099h76k718J195L126j264k711L282K470m144r38N618p73m589M102K163n056J135
3115B2M268k795j943L655n33m145K360K266k291k214J955N85k384j057L085J38
3131I72m208N50L807k969j803M185m11l864K446K559l648Q27L811k809k668M968
3147A745J358m067Q88L224k334j400K202J814k526j507K136Q68l022K86K906k422
3163A49k884L462Q67m256J452K980m791m84N232j644m207L393K174l900J72M230
3179A945o96k630J244J741n49j437J700Q75j756q84L012j414k159K981M75m938
3195b490J532L846l653k373M664m49m680K210K969l307q61K854p14k015J467J929
$$ plain form
3211 929 -262 -1675 255 1171 -837 -730 2851 1719 -2045 770 3633 -648 -762 3443 1042 -2478
3227 -2478 2167 2902 -1737 -306 2450 -845 -2088 1419 639 -2032 -1307 477 -1068 -2227 -822 596
3243 596 -1509 -2776 760 863 -2627 -287 2560 -1438 -1980 3104 1385 -2095 1390 3205 -1381 -453
3259 -453 3497 828 -1269 1590 1873 -768 -328 1451 282 -1330 227 975 -691 -2375 812 1239
3275 1239 -2942 -1534 2331 -1023 -3592 1254 836 -3781 -627 2180 -2111 -2030 2026 328 -2165 1024
3291 1024 2060 -570 225 2387 1345 23 1542 3120 1519 -634 1828 2458 -1153 -406 2771 -743
3307 -743 -3536 335 656 -4064 -2065 1153 -3132 -3844 490 -320 -3694 -911 872 -1611 -1087 1504
3323 1504 1071 -542 662 2746 1694 81 1759 3717 309 -178 3679 1994 -2055 1024 2717
$$ packed form
3211I29j191j413J930R16k008J07L581j132l764K815K863m281j14M205k401l520
3227b478M645P35m639J431K756l295j243L507p80k671P25J784j545j159J405J418
3243E96k105j267L536J03l490K340K847l998n42N084j719l480L485J815m586R28
3259d53L950k669k097K859K83k641M40J779j169j612J557P48j666j684L187M27
3275A239m181J408L865l354k569M846m18m617L154K807m291Q1M056j698k493L189
3291A024J036k630P95K162j042j322J519J578j601k153K462O30l611P47L177l514
3307g43k793L871L21m720J999L218m285p12M334q10l374K783J783k483N24K591
3323A504m33j613J204K084j052j613J678J958l408m87L857j685m049L079J693
$$ plain form
3338 2717 -1562 -1133 2307 -1358 -2869 697 -309 -3304 -922 759 -2680 -2699 689 -100 -2585 -1577
3354 -1577 495 -310 -1865 -614 1751 -592 -1337 2464 2027 -762 1813 3701 -452 350 4769 1552
3370 1552 -1471 2377 3169 -1394 -596 2121 -350 -1977 -336 90 -1515 -1779 -811 -1357 -2395 -1308
3386 -1308 -180 -1812 -2328 490 -243 -2560 10 2002 -1340 -1721 2854 1288 -1746 1519 2657 -914
3402 -914 5 2690 676 -775 1790 1390 -86 569 1557 632 -753 271 1531 48 -1796 1044
3418 1044 865 -1973 -1177 1547 -1672 -3261 139 -401 -3541 -1208 583 -2649 -2150 939 -337 -1506
3434 -1506 844 1119 159 481 2087 2013 1139 1435 2367 1846 559 1872 2153 -603 -406 2145 -450 -2229
3452 -2229 777 86 -3283 -809 1002 -2980 -2482 1067 -354 -2971 67 1053 -1722 -1092 774 628
$$ packed form
3338B717m279M29L440l665j511L566j006k995K382J681l439j9L388p89k485J008
3354a577K072q05j555J251K365k343p45L801m37k789K575J888m153Q02M419l217
3370A552l023L848P92m563P98K717k471j627J641M26j605k64R68n46j038J087
3386a308J128j632n16K818p33k317K570J992l342l81M575j566l034L265J138l571
3402i14R19K685k014j451K565m00j476O55R88r25j385J024J260j483j844K840
3418A044j79k838P96K724l219j589L400n40l140K333J791l232M99L089j276j169
3434a506K350K75r60L22J606p4q74K96R32n21j287J313K81k756J97K551k595j779
3452b229L006o91l369K474J811l982M98L549j421k617L038R86k775O30J866j46
$$ plain form
3468 628 -712 -536 722 634 -903 161 1075 -328 -420 1454 162 -788 1687 1214 -1415 1403 2878
3485 2878 -611 -315 2637 866 -1490 1451 1598 -1399 -1097 554 -980 -1901 -968 -669 -1485 -2233 -298
3502 -298 477 -1631 -1464 1605 315 -1678 1749 2736 -673 472 3077 591 -297 2434 932 -1259
3518 -1259 1239 1052 -2108 -878 781 -1070 -2180 -406 38 -796 -1572 211 615 -1364 -822 1893
3534 1893 556 -1276 1294 1744 -1419 -113 2815 -623 -1784 1976 1070 -2211 267 1824 -1400
3549 -1400 -1100 2013 595 -1009 719 1649 210 -555 1005 1588 -1131 -1372 1013 20 -2670 -578
3565 -578 637 -2759 -2327 814 -1670 -3327 685 595 -2946 291 2801 -883 -737 3015 2379 -337
3581 -337 1774 3633 1195 61 1889 2210 240 -903 1615 593 -2751 -517 1252 -2992 -2904 1128
$$ packed form
3468F28j340J76J258q8j537J064R14j403r2J874j292r50K475m73k629K818J475
3485B878l489K96K952j771k356K941J47k997L02J651j534r21R33K99q16p48J935
3502b98P75k108J67L069j290j993L427R87l409J145K605k486q88K731j502k191
3518a259K498j87l160J230J659j851j110J774M44q34p76J783M04j979N42K715
3534A893j337j832K570M50l163J306K928l438j161L760r06l281K478J557l224
3549a400L00L113j418j604J728R30j439p65J560N83k719k41K385r93k690K092
3565e78J215l396M32L141k484j657M012r0l541L237K510l684J46L752o36k716
3581c37K111J859k438j134J828L21j970j143K518j022l344K234J769m244Q8M032
$$ plain form
3597 1128 -1160 -4186 124 848 -2913 -1555 2297 -650 -2130 1083 1150 -1397 -241 1800 -320 -1272
3613 -1272 1285 2052 -450 -715 2132 1717 -1632 717 3885 -66 -1825 3097 2377 -1700 1107 3121
3629 3121 -1528 -1503 2206 -312 -3099 15 49 -3591 -2468 300 -1419 -3436 -1395 -18 -1476 -2325
3645 -2325 903 1570 -1951 -461 3715 1035 -977 3053 3095 -1451 1339 4734 392 -1204 3160 1779
3661 1779 -1863 713 2293 -1042 -1943 715 141 -2017 -1249 808 -1152 -2622 -221 1068 -2091 -2140
3677 -2140 1214 -341 -3169 661 2376 -2647 -1387 2768 -66 -2361 2169 2172 -1880 262 3302 571
3693 571 -937 1853 2102 -213 244 2302 1296 -1228 479 2555 -1176 -2062 1642 7 -3242 -351
3709 -351 1362 -3101 -3377 1432 -831 -3979 -167 1166 -2768 -1924 2277 727 -1440 343 2166 461
$$ packed form
3597A128k288l026M310P24l761J358L852k947j480L213O7k547J156K041k120r52
3613a272K557P67k502k65K847m15l349K349L168l951j759M922p20m077K807K014
3629C121m649K5L709k518k787L114L4l640J123K768j719k017K041J377j458q49
3645b325L228O67l521J490M176k680k012M030M2m546K790L395m342j596M364j381
3661A779l642K576J580l335r01K658n74k158P68K057j960j470K401J289l159m9
3677b140L354j555k828L830J715n023J260M155k834k295M530Lm052K142L040k731
3693E71j508K790K49k315M57K058j006k524J707K076l731q86L704j635l249K891
3709c51J713m463k76M809k263l148L812J333l934Q44M201j550k167J783J823j705
$$ plain form
3725 461 358 2231 1802 -317 366 2692 732 -1068 1820 1721 -2407 -664 2983 -1008 -2727 1399
3741 1399 329 -3455 -219 1775 -2316 -2587 652 -221 -2069 1 1111 -1418 -1836 498 1319 -880
3757 -880 -976 1497 203 -1934 1376 2818 -1285 -866 3234 507 -1127 2434 2169 -1662 5 3042
3773 3042 90 -1422 1397 486 -1901 -834 915 -902 -2685 -1017 15 -1598 -2248 484 122 -2322
3789 -2322 -129 2122 -918 -1571 2401 922 -1706 1389 2976 -613 -151 3117 968 -271 1359
3804 1359 983 -932 41 1427 78 -1368 -468 563 -1045 -1276 563 159 -2854 -1336 1523 -790
3820 -790 -2392 754 241 -2688 -23 2150 -1128 -1738 1528 -16 -1281 1277 1748 -826 -485 1636
3836 1636 1408 426 622 1260 103 -696 1534 2121 -336 -772 1526 160 -1618 1207 1067 -2598 -1123
$$ packed form
3725D61j03J873m29k119O83K326j960j800K888r9m128J743L647l991j719M126
3741A399j070l784L236J994m091k71L239q73j848K070J110k529m18K334Q21k199
3757h80r6K473j294k137L310J442m103M19M100k727j634L561k65l831J667L037
3773C042k952j512K819r11k387J067J749j817j783J668J032j613o50K732l62k444
3789b322K193K251l040o53L972j479k628L095J587l589M62L268k149j239J630
3804A359l76j915R73J386j349j446R00J031j608k31J839m04l013J518K859k313
3820g90j602L146n13k929K665K173l278o10L266j544j265K558M71k574L41K121
3836A636k28r82J96O38j157p99K230N87k457m36K298j366j778K825j40l665J475
$$ plain form
3853 -1123 1009 -1188 -1843 343 -483 -2834 -401 671 -777 -748 219 -16 -292 638 1483 738 -270
3870 -270 854 1883 292 -67 2439 1161 -1091 1263 1818 -1237 -834 1408 -417 -1719 747 152
3886 152 -2075 -454 613 -953 -1335 10 -480 -917 -614 320 19 -1045 -501 1001 55 -159 1037
3903 1037 430 -1148 996 2296 -376 -391 2003 294 -1074 1535 1964 -1057 -546 1047 -321 -670
3919 -670 507 -311 -1235 -934 -580 -229 -757 -1073 -589 -1056 -1346 359 546 -1385 -682 1226 -668 -76
3937 -76 2408 861 -626 1563 2176 -10 1218 2214 178 -125 1454 1141 68 -268 -116 -52 -650 -823
3955 -823 -343 -616 -1985 -750 -82 -1622 -988 108 -1445 -1625 946 31 -1641 585 881 -774 425
3972 425 1994 501 -198 1492 1043 437 776 531 132 476 1044 831 311 -342 199 650 -332 -227 912
$$ packed form
3853a123K132k197o55K186q26k351K433J072j448K9R67k35k76R30Q45p45j008
3870b70J124J029j591l59K506j278k252K354N55l055M03K242j825j302K466n95
3886A52k227J621J067j566l82J345m90m37L03R34l01j064N44J502r46k14J196
3903A037o07j578K144J300k672j5K394j709j368K609M29l021N11J593j368l49
3919f70J177q18r24L01L54L51n28l16M84m67k90J705J87j931P03J908j894N92
3937g6K484j547j487K189O13k186J228R96k036l03J579l13j073l36J52O4n98j73
3955h23M80k73j369J235O68j540O34J096j553j80K571r15j672K226K96j655J199
3972D25J569j493o99J690m49o06L39k45l99L44N68k13n20o53N41M51r82J05J139
$$ plain form
3991 912 -672 -1640 347 -99 -1955 -309 -171 -2163 -894 699 -1109 -1638 8 -497 -910 317 855
4008 855 -67 95 802 1003 1176 954 1503 1356 610 1060 2082 646 -733 1117 700 -1478 168 858
4026 858 -1909 -1851 413 -975 -2204 -290 -578 -1881 -683 338 -445 -688 36 -14 115 365 828 766
4044 766 -380 -32 1506 714 -250 1094 774 -744 578 1795 -179 -253 2355 606 -556 1837 1511
4061 1511 -1076 -312 1334 -228 -1367 -257 -544 -1796 -1587 -706 -504 -1659 -1519 -573 -875 -1663 257
4078 257 483 -1352 306 1908 24 -219 2774 1642 -336 1632 2617 -5 417 1696 524 -372
4094 -372 604 629 -615 -448 -329 -163 -1053 -1024 79 -1102 -1945 0 694 -2374 -1026 1003 -1042 -1988
4112 -1988 922 386 -2319 -98 1071 -775 -757 1065 315 -776 965 1913 539 432 1617 1740 711
$$ packed form
3991I12j584r68J987m46j856J646J38j992J269J593j808n29J646n05m13J227N38
4008H55r22J62P07K01J73k22N49j47p46M50J022j436j379J850m17k178J646O90
4026H58k767N8K264j388j229J914k88j303J198J021p83k43P24n0J29K50M63o2
4044G66j146L48J538p92r64J344l20j518J322J217j974p4K608j749j162K393l26
4061A511k587P64J646j562j139J110k87j252K09Q81K02j155J40R46l02p88J920
4078B57K26j835J658J602j884k43K993j132j978J968R85k622M22J279j172q96
4094c72R76K5j244J67J19J66q90K9J103j181q43J945O94l068J348K029k045r46
4112a988K910n36k705K221J169j846J8J822p50j091J741R48j374j07J185J23j029
$$ plain form
4129 711 446 1824 996 -927 814 1360 -1358 -1111 1201 -854 -2829 101 260 -2720 -1613 179
4145 179 -1871 -2362 506 -135 -1906 -183 847 362 -309 1019 1602 17 197 1958 1440 -599 819
4162 819 2050 -246 -998 1826 1132 -1628 578 1741 -1686 -916 1607 -476 -2241 579 307 -1487
4178 -1487 -991 548 -693 -1713 -215 466 -1007 -1642 159 161 -1525 -215 1850 -404 -1312 1669 1365
4195 1365 -1514 1146 2604 -528 -271 2792 943 -1229 923 1345 -804 -233 1104 -224 -1314 -595
4211 -595 262 -1029 -1891 100 233 -1724 -1419 1195 -213 -1996 649 1179 -1547 30 2153 -240
4227 -240 -929 2114 1412 -1234 943 1465 -429 -454 1379 619 -551 -445 642 70 -991 -218 729 -871
4245 -871 -928 1204 -18 -1851 325 772 -2127 -855 1349 -712 -2406 1013 1058 -1844 -413 1612
$$ packed form
4129G11k65J378q28j923J741N46k718K47K312k055j975K930J59k980J107J792
4145A79k050m91K868o41j771J723J030m85o71J328N83j585J80J761n18k039J418
4162H19J231k296p52K824o94k760K206J163l427P70K523k083j765K820k72j794
4178a487M96J539j241j020J498O81j473o35J801Kj686J310K065k254r08K981l04
4195A365k879K660J458l132K57L063j849k172K152M22k149N71J337j328j090P19
4211e95Q57j291q62J991J33j957L05K614j408j783K645N30k726J577K123k393
4227b40o89L043p02k646K177N22j894k5J833p60j170J06J087n72j061P73R47j600
4245h71n7K132j222j833K176M47k899J272K204k061j694L419M5k902J431K025
$$ plain form
4261 1612 -182 -831 1365 1500 35 463 1428 1021 -56 931 1859 -294 -1018 1372 832 -1854 -103
4278 -103 1652 -1806 -2053 1010 -94 -2639 -229 474 -1808 -1015 843 -542 -1059 366 647 -528
4294 -528 2 1060 633 -154 446 1856 459 -676 1167 1410 -865 164 2476 -403 -1181 1670 678
4311 678 -1554 499 1319 -1633 -1607 799 -319 -1959 -563 210 -1064 -1181 -104 -84 -956 -1035 196 125
4329 125 -1515 425 1139 -809 -298 2263 823 -1007 1782 1637 -652 1188 2324 -339 -149 1472
4345 1472 572 -474 735 468 -768 -878 167 -62 -1434 -1263 -239 -790 -1955 -920 272 -1688
4361 -1688 -1776 550 -57 -1460 899 1226 -1224 189 2488 -8 -660 1913 1235 -129 819 1793 487
4378 487 124 837 688 263 -192 51 256 -702 -277 717 -813 -1395 268 180 -1967 -166 431 -1879 -1569
$$ packed form
4261A612j794o49K196J35j465M28R65m07j077R87R28k153p24K390n40k686J751
4278a03J755l458k47L063j104k545K410P03k282P93J858j385n17J425K81j175
4294e28N30J058m27p87O00J410j397j135J843K43k275J029K312k879p78K851r92
4311F78k232K053Q20k952K6K406j118j640J396P73j274j17J077K0q72p9J231p1
4329A25j640J940P14j948N11K561j440j830K789j45k289J840J136k663J90J621
4345A472r00j046J209k67j236j10J045k29j372J71J024n51j165J035J192j960
4361a688q8K326o07j403K359L27k450J413K299k496o52K573o78j364R48R74j306
4378D87l63P13j49m25m55K43K05r58M25R94j530n82J663q8k147J801N97k310L10
$$ plain form
4397 -1569 1037 -869 -1541 704 337 -1406 226 1063 -153 -374 1172 856 605 480 1443 1467 291
4414 291 703 1809 673 -507 927 922 -605 40 1347 -1415 -1213 385 -541 -1852 -206 -295 -2379
4431 -2379 -1295 -18 -652 -950 -98 -289 -572 -296 651 833 -247 255 985 758 -97 1417 1157 -465
4449 -465 397 1924 87 -404 1373 692 -876 772 1040 -971 -153 624 -738 -529 611 -86 -1074
4466 -1074 -1150 -331 -212 -1197 -1041 42 -654 -1775 -315 1038 -894 -529 1284 -13 -686 1268 1018
4483 1018 -306 1017 2099 -26 663 1348 535 -256 921 439 -234 -262 -141 -435 -791 -930 -445 -541 -1540
4502 -1540 -424 523 -1194 -1281 788 -600 -1538 863 665 -1347 109 1216 -215 211 1193 66 -39
4519 -39 872 800 204 481 554 706 460 181 770 367 -819 -23 774 -496 -791 407 -722 -1578 62
$$ packed form
4397a569K606j906o72K245l67j743J632Q37j216k21J546l16k51j25R63K4j176
4414B91M12J106j136j180J434nj527O45J307k762K02J598r26j311J646q9k084
4431b379J084J277o34k98Q52j91k83K76R47J82j080N02P30k27q55J514k60j622
4449d65Q62J527j837m91J777o81j568J648K68k011Q18P77j362K09J140o97r88
4466a074p6Q19J19r85J56J083o96j121J460J353j932L65J813j297o73J954k50
4483A018j324J323J082k125O89O85q13p91J177m82o73k8J21k94l56j39M85r6r99
4502a540J116R47j717q7K069j388r38K401j98k012J456J107j431M26R82j127j05
4519c9R11p2n96K77P3J52k46k79N89m03j186P96P97j270k95J198j129q56J640
$$ plain form
4538 62 380 -1411 -467 510 -824 -1026 571 133 -1310 91 801 -191 166 735 549 396 403 920 892 241
4558 241 507 1094 -148 -409 979 470 -1262 -73 337 -1387 -856 587 -763 -1627 453 -415 -1278
4575 -1278 -563 3 -673 -219 285 49 -143 -21 672 701 -30 57 1119 649 -301 1348 1097 -655 651
4594 651 1392 -454 -460 1537 -443 -1226 687 443 -1089 -223 102 -530 -1125 -240 -64 -460 -1050 -423 -655
4613 -655 -812 -522 164 -444 -929 758 925 -1082 -8 1650 -232 -565 1747 974 -878 694 1433
4630 1433 -557 227 1266 179 -577 -15 48 -395 -583 -135 -440 -1038 -1152 222 -268 -1706 -525 445
4648 445 -1391 -840 910 -486 -970 918 582 -954 631 1344 -183 288 1618 452 -303 1043 1298
4665 1298 568 104 503 676 -3 -48 844 468 -1093 -332 550 -1179 -1376 716 -655 -2101 28 117
$$ packed form
4538F2L18j791R44R77j334k02J597m38j443J401P10r92L57N69j86j53PN17k8o51
4558B41K66N87j242k61J388n09j732J189M10j724N31J443j350q64K080q68q63
4575a278P15N66o76M54N04k36j92J22O93K9p31Q7J062m70r50J649k51j752J306
4594F51P41j846oJ997j980p83J913k44j532Q66L25o32n95Q85J76l96n90O27k32
4613f55j57K90O86o08m85J687J67k007J074J658j882l33K312p73j852J572P39
4630A433j990P84J039j087p56N62O3m43j88M48l05n98j14J374m90j438J181R70
4648D45j836N51J750j396m84J888l36j536J585P13j527M71J330j166p55J346K55
4665A298p30m64L99J73o79m5Q92l76j561P61Q82j729j97K092j371j446K129Q9
$$ plain form
4683 117 -2060 -1096 444 -1074 -1257 680 99 -1115 25 633 -73 -49 1050 1114 337 306 1243 1603 429
4702 429 793 1664 -195 -140 1555 516 -1429 458 701 -1120 -721 581 -1232 -1672 57 -252 -1568
4719 -1568 -1106 -50 -1131 -1129 -237 -65 -208 -583 560 876 -468 422 1523 208 -349 1822 1445 -511
4737 -511 1165 2077 133 406 1746 712 -546 808 519 -740 -248 42 -556 -1218 -615 -529 -824 -1154
4755 -1154 -1140 -403 -1276 -986 22 -896 -1490 793 628 -1010 66 1196 -329 -358 2017 705 -278 1232
4773 1232 1475 -276 513 1364 1097 -178 137 603 -58 -321 -355 199 -631 -908 64 -385 -1470 -312 124
4792 124 -1732 -825 1075 -668 -1550 727 64 -859 302 782 -526 128 1287 267 168 433 926 309
4810 309 -17 918 905 48 -260 1127 431 -761 416 1148 -1018 -697 967 -448 -1634 24 49 -1263
$$ packed form
4683A17k177R64J540j518j83J937n81j214J140O08p06K4J099O4p77l1R37L60j174
4702D29L64Q71j859N5J695j039j945J887K43j821L99J302j813m40J729l09j316
4719a568M62J056j081KQ92J72j43l75J143L16j344Q90J101j315n57K171l77j956
4737e11J676R12j944K73J340j034j258J354k89j259M92K90n98o62O03Q6k95l30
4755a154J4P37q73K90J008r18n94K283j65j638J076J130j525k9K375j312r83J510
4773A232K43j751P89Q51k67j275L15M66o61k63l4N54q30k77R72m49j085J158M36
4792A24j856R07J900j743q82K277o63r23J161M80j308O54J159j020r9K65M93o17
4810C09l26R35j3q57l08J387o96j192J177P32k166L21J664j415j186J658K5j312
$$ plain form
4828 -1263 -582 357 -731 -831 381 -101 -336 254 404 70 -306 528 859 215 -366 801 1006 -422
4846 -422 520 1363 -628 -745 576 167 -1119 532 820 -1015 -358 598 -313 -764 432 -107 -332 -52
4864 -52 302 -125 -351 -70 415 -248 -608 310 614 -899 -86 1310 -102 -704 1111 788 -474 871
4882 871 1317 -562 -190 1104 39 -815 197 98 -1406 -334 -70 -492 -587 -586 -257 -456 -902 176 323
4901 323 -749 -417 806 54 -426 961 857 -922 630 1489 -74 -168 1312 268 -471 753 733 -334
4919 -334 70 467 -25 -342 -217 -50 -172 -702 -124 275 -857 -681 231 -306 -1532 -224 548 -1455 -731
4938 -731 770 -592 -654 858 496 -414 534 838 -115 581 1217 821 294 799 864 593 174 358 727 -79
4958 -79 -328 556 -230 -1136 -279 302 -1595 -998 274 -1096 -1512 130 -106 -1454 -673 169 -458 -673 334
$$ packed form
4828a263O81R39j088j00J212m82k35N90J50l34l76Q34L31o44n81J167K05j428
4846d22R42Q43j991j17J321m09j286J651K88j835O57R56r11m51J196n39k25K80
4864e2L54m27k26K81M85o63l60R18L04j513Q13J396j412o02J815l23j262J345
4882H71M46j879L72J294j065q54J012r9j504J072K64m22r5JL29j99m46J078J47
4901C23j072L32J223p52m80J387j04j779J552Q59j563r4J480j044p39J224k0j067
4919c34M04L97m92l17J25J67j22n30N78L99j132J76R12n37j226J308P72k003P24
4938g31J501j362o2J512l62r10R48L04r53O96O36l96n27N05O5k71m19J84L69q06
4958g9k49Q84p86r06Q57N81j897N97J272j370m16J642k36j348P81Q42o27k15J007
$$ plain form
4977 334 255 -39 134 607 646 99 298 1118 301 35 1273 1180 -134 625 1443 -431 -416 1106 -205 -986
4997 -986 639 296 -1222 -292 21 -980 -918 -157 -673 -1068 -883 -476 -454 -583 -359 402 -423 -751 482
5016 482 754 -271 314 1255 68 262 1543 776 -322 1147 1298 -267 216 1334 224 -469 504
5033 504 -5 -410 -320 -314 -604 -783 -322 -438 -526 -1258 -387 -209 -1269 -604 395 -647 -906 493 427 -823
5053 -823 401 1054 -408 67 1610 224 -103 1366 1109 368 292 845 150 -135 46 370 220 -526 -365
5072 -365 296 -980 -1028 369 -920 -1628 -84 1 -1441 -507 490 -1241 -1098 700 -45 -699 388 438
5090 438 -161 456 870 637 716 382 665 783 80 563 935 -109 -250 1449 332 -836 355 442 -1299
5109 -1299 -306 720 -669 -1147 63 -283 -1480 -264 1 -1179 -772 103 -68 -334 -239 159 2 175
$$ packed form
4977C34p9k94J73M73L9n47J99Q20q17k66J238r3j314P59Q18j874J5J522j311p81
4997i86J625l43j518R30L13j001O2P61n16l95J85M07K2j29K24P61q25l28J233
5016D82K72j025N85R41j187J94J281p67j098J469J51j565M83J118j110o93R73
5033E04n09m05R0Ok90j79M61j16q8p32Q71J78j060O65R99j042k59J399o6j250
5053h23J224O53j462M75J543j386l27J469k57p41p6N53o95k85J81L24j50p46J61
5072c65O61j276m8J397j289p08J544Q5j442R34R97j731J43J798p45o54J087N0
5090D38n99O17M14k33P9l34K83J18p03M83L72j044j41J699j117j168J191Q7j741
5109a299R93J026j389m78J210l46j197J216K65j180M07Q75j71k66R5L98j57J73
$$ plain form
5127 175 338 1255 621 -78 1133 838 -148 632 1314 -640 249 1215 290 -549 585 208 -1113 0
5145 0 303 -884 -957 52 -646 -655 -366 -244 -503 -1000 -615 171 -203 -514 272 384 -588 45 1303 -69
5165 -69 -336 1156 546 -167 1169 873 -494 285 1073 219 -58 766 -37 -131 66 482 58 -671 -847 6
5185 6 -337 -1114 139 -225 -1119 -259 513 -256 -716 1143 13 -813 422 1055 -377 16 1136 238 -53
5204 -53 787 675 -202 -178 332 197 3 30 283 -86 -323 225 472 -890 -876 784 -456 -872 404 -28
5224 -28 -1277 -429 590 -244 -474 640 -321 -717 367 576 -239 288 382 606 247 192 674 615 -248 255
5244 255 850 -417 -437 677 207 -800 638 58 -1238 -513 284 -941 -991 462 -355 -1214 -213 314
5262 314 -431 -33 -20 352 -90 328 507 470 -350 340 1384 94 -197 1049 380 -940 647 1109 -544
$$ packed form
5127A75J63R17o34o99J211k95r86P80O82j954Q89R66r25q39J134l77j321J113
5145@L03j187p3J009o98rK89J22k59m97L85P86l74l11P86J12r72O33J258j372
5165f9k67J492o10p13J336k96j367P79P88q54k77Q24q03r4J97M16m24p29j76Q53
5185Fl43p77J253l64q94Q60P72p69m60J859j130q26J235O33j432L93J120q98k91
5204e3Q40j12q77K4N10j35j94K7K53l69k37N48K47j362J4J660j240m16J276m32
5224b8j249Q48J019q34k30J114r61l96J084K09q15N27R4K24l59n5M82n9q63N03
5244B55N95j267k0J114m70j007J438n80j296P25P97j225n0J453q17q59J001N27
5262C14p45L98J3L72m42M18J79l7q20O90J044j290k91J246o69j320J587M62j653
$$ plain form
5281 -544 -236 1049 -370 -711 522 2 -914 -332 130 -603 -606 -401 -323 -919 -1125 96 143 -768 -406 444
5301 444 -85 -696 1066 449 -729 324 1172 70 276 1258 385 -472 1041 1119 -148 262 828 70
5319 70 -556 73 333 -478 -498 -307 -413 -639 -859 -248 -779 -933 100 342 -1045 -415 892 -293 -673
5338 -673 971 311 -614 610 883 173 290 780 447 58 357 694 562 -5 460 424 -201 -204 405 -117
5358 -117 -975 69 464 -848 -796 31 -1095 -1321 -25 -271 -1055 -533 260 -948 -455 506 -83 -799 478
5377 478 797 592 433 574 910 323 678 1143 755 -253 426 1207 -155 -247 890 163 -1481 -59 286
5396 286 -1095 -461 -304 -858 -1038 -83 -59 -805 -425 -148 -474 -342 58 228 -220 -583 696 589 -262 220
5416 220 1104 69 -476 1131 503 -250 714 1011 -102 363 922 -185 -440 605 223 -468 -45 -47 -682
$$ packed form
5281e44L08J285j419l41J233n20r16N82M62p33lK05P8n96k06J221M7r11L62Q50
5301D44n29o11J762o17j178J053Q48j102K06R82q73q57J513P8j267M10N66p58
5319G0o26O29K60q11k0J91j06k26k20O11n31j54J033K42j387O30J307j185l80
5338f73J644o60r25J224K73p10J17M90l33l89K99L37j32n67M65l6o25lO09n22
5358a17q58J044L95j312N2Q27j126k26J296k46p84N22P93j208M93R61n89p16J277
5377D78L19k05j59J41L36n87L55M65l88j008O79P81j362r2J137p27j644J422L45
5396B86j381O34J57n54j80R55K4p46L80K77l26J32M00J70m48l63J279j07q51M82
5416B20Q84j035n45J607o28p53R64K97j113M65N59j107k55J045l82o91M23ko35
$$ plain form
5435 -682 -550 -775 -215 -742 -1314 -534 -301 -667 -410 473 -273 -598 793 753 -387 614 1246 -251 202
5454 202 1051 661 -143 807 592 165 347 452 -40 -361 198 -13 -110 -773 -506 -103 -918 -543 211 -287
5474 -287 -1252 -198 246 -851 -343 322 -811 -914 481 111 -622 260 536 -261 50 901 556 230 -64
5493 -64 694 811 250 690 860 34 -192 434 189 -603 309 245 -997 -519 332 -519 -1320 14 -338 -952
5513 -952 -152 -193 -756 -299 174 -62 -87 -68 -6 49 154 512 663 206 -405 832 784 -437 422 918 -343
5534 -343 76 764 104 -585 570 305 -1046 55 438 -608 -288 175 -270 -498 -421 -321 -83 -389 -450
5553 -450 114 -18 -551 199 471 -347 127 967 78 -189 789 519 -373 669 844 -519 33 654 -279
5572 -279 -405 235 192 -483 -316 -50 -284 -289 -786 -127 -555 -822 -37 338 -820 -479 690 9 -325 505
$$ packed form
5435f82J32k25N60n27n72P80K33l66K57Q83p46l25J391m0j140J001O32j497M53
5454B02Q49l90q04R50k15m27J82J05m92l21N59k11r7o63K67M03q15L75P54m98
5474b87r65J054M44j097N08O65j133j03J395l70p33Q82K76p97L11Q51l45l26k94
5493f4P58J17n61M40J70q26k26O26k45p92R12o4j242M78Q51q51q01J334l52o14
5513i52Q00m1n63M57M73k36k5J9O2N5J05L58J51m57o11J237m8j221Q59M96j261
5534c43M19O88o60o89J155k65j351J101L83j046L20M63m45k28P7J00K38l06o1
5553d50N64j32n33P50K72q18M74Q40q89k67R78k70q92J042J75j363N52O21r33
5572b79j26O40m3o75J67K66k34nm97O59m28k67P85L75j158L41J169o81l34Q30
$$ plain form
5592 505 273 -509 583 668 -69 311 856 16 -134 549 511 8 110 260 53 -179 20 -236 352 -447
5612 -447 -417 130 -723 -737 413 -386 -648 236 -292 -867 -117 487 -196 -342 740 20 -146 928 577 202
5632 202 230 716 336 540 121 662 31 220 528 363 -326 -16 419 -275 -865 56 32 -1210 -528 49
5652 49 -1075 -327 66 -582 -721 62 144 -548 65 542 91 113 595 244 285 331 408 608 321 391 970 733
5674 733 -160 547 656 -587 -108 467 -433 -687 466 -106 -972 -54 -158 -692 -822 -334 -505 -774 -366
5693 -366 -389 93 -194 62 44 -182 -212 599 650 -288 555 985 34 416 993 395 -234 991 498 -375 570
5714 570 476 -34 -322 385 -288 -517 -378 -140 -774 -439 -427 -113 -797 -919 -326 -181 -807 -366 490 -525
5734 -525 -724 714 334 -397 1085 690 -132 441 1031 178 165 749 359 6 236 482 -268 -386 -232 295
$$ packed form
5592E05k32p82J092Q5p37L80N45q40j50O83l8n03J02J50k07k32J99k56N88p99
5612d47L0N47q53j4J150p99k62Q84n28n75P50O04o83j46J082p20j66J074l51l75
5632B02K8M86l80K04m19N41o31J89L08j65o89L10M35o94n90R21k4j242O82N77
5652D9j124P48L93o48j39P83Q2o92O13M77m51K2M82l51M1M6P7K00k87P0N79k37
5674G33q93P07J09j243M79N75r00k54J153n72q66R18j04n34j30M88j71k69M08
5693c66k3M82k87K56j8k26l0Q11N1r38Q43M30r51L82N77n98o29J225m93q73R45
5714E70r4n10k88P07o73k29J39K38o34L35J2L14o84j22N93J45o26M41Q56j015
5734e25j99J438l80p31J482l95q22N73N90q53j3N84l90l53K30K46p50j18J54N27
$$ plain form
5754 295 23 -570 -130 -181 -873 -312 257 -682 -868 210 -192 -1149 64 223 -673 -172 800 -216 -445
5773 -445 704 19 -192 127 761 256 288 435 781 493 237 370 347 -492 16 803 -330 -506 340 -199
5793 -199 -1219 10 -159 -1029 -978 353 -499 -654 -97 -303 -407 -130 414 -222 -290 129 137 479 170 518
5813 518 558 135 102 929 247 -520 358 860 -495 173 718 -223 -182 534 167 -803 71 233 -726 -265 214
5834 214 -85 -574 -504 -236 -183 -670 -278 170 43 -481 481 711 -635 633 684 -354 6 1200 214 -181
5854 -181 708 740 -117 292 645 -161 -220 -104 -255 -354 -348 -318 -153 -571 -392 132 -212 -827 -153 82 -775 -81
5876 -81 444 -402 -308 373 158 -501 736 756 -401 139 771 370 23 306 322 -170 228 197 533 -190 -278
5897 -278 405 263 -922 23 361 -844 -587 484 -387 -691 369 -99 -1140 66 501 -605 -356 215
$$ packed form
5754B95k72n93M40n1o92N61N69r39j86J078m02r57J213J59q96N01R72j016k29
5773d45J149o85k11L19O34n05L2J47L46k88k56J33k3q39N08P87j133j76Q46n39
5793a99j020J229j69q70N1J331q52j55N57k06j04K77N44o36o8M19QL42l09L48
5813E18M0m23l3Q27o82p67Q78N02j355O68N45r41M1P16l67r70Q74J62r59M61M79
5834B14k99m89P0K68N3m87L92M48j27n24R62K30j346J268N1j038L60J194r86l95
5854a81Q89L2q57M09L53q06n9J16j51r9OL0J65m18J79N24l44o15O74K35q57O94
5876h1N25q46R4O81k15o59J237K0j157N40O32m01l47K83J6m92L98l1L36p23q8
5897b78O83j42j185R45L38j205K57J071q71l04J060m68j041J206M35j106K49N71
$$ plain form
5915 215 53 -177 338 314 -41 77 145 593 391 5 207 580 -282 392 859 -340 -210 508 -153 -837
5935 -837 123 -448 -872 -482 291 -342 -479 89 -353 -593 -178 36 -274 -400 -35 499 40 102 517 547 250
5956 250 168 850 256 -388 763 551 -398 431 709 -292 -61 416 -520 -466 32 -377 -467 -66 -384 -357 -620
5977 -620 -395 -486 -67 -355 -206 -63 -418 -52 479 -417 -396 823 442 -224 646 932 76 181 788 396
5997 396 -89 1157 84 -19 171 6 239 -220 -280 -475 -254 -541 -402 -52 -590 -633 -196 45 -876 -217
6017 -217 -113 -691 -258 345 -203 -55 822 47 55 781 678 493 600 760 440 475 533 272 397 390 69 332
6039 332 171 12 342 -5 -496 44 109 -779 -541 294 -643 -951 -175 -486 -612 -59 1 -308 -4 21 73
6060 73 23 318 252 347 -1 245 512 465 222 481 380 -118 243 396 -160 -285 557 98 -713 411 -237
$$ packed form
5915B15j62k30N15k4l55J18O8M48k02l86K02L73q62O74M67j199J30P18o61o84
5935h37R60n71m24L90P73o33j37N68m42k40M15K14l10j26L65N34m59O2M15L0k97
5956B50q2O82n94o44J151k12r49Q29K78j001K31M77r36N4M98m09r0M01l18K7k63
5977f20K25r1M19k88J49J43l55L66N31q96K1J219l81o66Q70K86q56J05O07l92
5997C96m85J246j073j03J90j65K33m59o0j95K21k87J39L50n38m3M37K41r21O59
6017b17J04n78M33O03n48J48Q77p75QP26j03j85J07J60l20L5N8k61J25pl21K63
6039C32j61j59L30l47m91N40O5q88K38Q35r37l08P76l11j26N53O0l09L04K5N2
6060G3n0K95o6R5l48K46K67m7k43K59j01m98L61J53n56j25Q42m59q11J124o48
$$ plain form
6081 -237 -654 -296 13 -706 -528 101 -459 -437 -484 -526 -101 -311 -266 74 187 152 55 244 -282 180 999 73
6103 73 143 1003 39 147 417 404 -242 444 179 14 161 141 -548 -424 -246 -140 -228 -229 -349 -403 -183 -303 -10
6126 -10 -73 -169 -439 232 -265 -90 834 130 -155 549 674 171 91 566 89 -127 668 378 -131 277 178 -282
6148 -282 202 -257 -55 65 -251 -137 -260 -466 -308 -133 -347 -611 327 -115 -599 100 203 -398 56 543
6168 543 50 -199 151 125 371 539 490 -182 360 315 221 120 135 49 353 27 -68 468 -149 -70 271 317 -677
6191 -677 -75 100 -932 -372 195 -390 -682 -119 -173 -450 -100 19 26 113 273 38 367 280 290 300 365 162
6213 162 510 372 33 433 297 -304 69 231 -687 -289 125 -244 -728 -118 -403 -584 -233 -137 -492 -159
6233 -159 363 -326 -137 -57 321 291 -33 -109 401 150 81 422 290 210 388 992 34 -7 719 175 -673 250
$$ packed form
6081b37m17L58L09p19J78O29n60K2m7m2M25k10M5L40J13l5r7J89n26M62Q19r26
6103G3P0Q60r64J08K70j3o46O86k65j65J47k0o89J24J78J06q8jj20n4K20j20K93
6126a0o3r6k70O71m97J75R24p04k85P04J25n03q0M75m77k16P95k90n09M08r9m60
6148b82M84m59K02J20l16J14j23k06J58J75k14k64R38m42m84O99J03o01M54M87
6168E43m93k49L50k6K46J68m9o72N42m5r4j01J5q6L04l26r5N36o17P9L41M6r94
6191f77O02J75j032N60N67n85k92N63n4k77L50J19PQ7J60k35L29q7J0J0O5k03
6213A62L48j38l39M00j36o01L73J62r18L98M14l69m84O10k85j81L51R6l55L33
6233a59N22o89J89Q0L78l0l24p6N10k51o9L41j32q0J78O04r58m1P26n44q48R23
$$ plain form
6255 250 179 -551 -453 232 -546 -460 -220 -292 -218 -372 -311 -81 -123 -128 -287 -72 -204 260 384 -129 -39 421 -68
6278 -68 20 788 720 -205 447 817 -111 -105 537 -30 17 614 141 -142 131 17 80 -415 -218 -404 -482 -666 -487
6301 -487 341 -764 -547 291 136 -581 431 -149 -864 90 401 -148 -263 629 455 -193 607 599 196 90
6321 90 338 431 101 28 208 176 -549 -223 296 -369 -821 243 -489 -961 -202 3 -1069 -499 -32 -337 -434
6342 -434 -44 -282 -492 337 252 44 -4 528 133 140 408 382 655 209 326 757 226 -77 575 333 -654 -2
6364 -2 401 -232 -363 168 -494 -763 -32 -35 -692 -426 -250 -343 -243 -236 -239 -146 -333 -180 300 -193 -188 467 341 -243
6388 -243 447 846 -14 247 894 -94 -80 598 145 -203 427 470 -146 -138 284 -432 -28 -174 -44 -175 -340
6409 -340 -134 -15 -427 -761 288 -278 -935 43 531 -525 -471 411 -17 -263 594 537 17 532 791 86
$$ packed form
6255B50p1p30R8O85p78Q6K40p2P4j54O1K30m2nj59K15j32M64J24n13R0M60m89
6278f8Q8P68o8r25O52L70r28OO42n67M7N97m73k83K73j14O3m95J97j86p8j84J79
6301d87Q28j105K17Q38j55p17J012n80p15R54L11n49j15Q92j74o48Q00qm03j06
6321I0K48R3l30p3J80l2p25L26N19o65m52J064p32m72P59K05j072N70M67l05r7
6342d34L90k38k10Q29q5k08m8N32l95PK68k6K73m46J17M31n31l03O52k42r87O52
6364bM03o33j31N31o62k69P31lo57K66J76r3J00PlR3j87J53M80m93NO55j26n84
6388b43O90L99q60K61O47r88J4O78m53l48O30M3o16QM22p16M04j46J30j31j65
6409c40K06J19m12l34J049n66o57R78M88j056N4Q82m28k46Q57n7n20N15K59p05
$$ plain form
6429 86 292 756 197 -127 412 200 265 10 -165 209 -380 -567 -38 340 -689 -233 -47 -472 -548 60 -215
6450 -215 -1180 87 128 -255 -112 269 -384 149 475 35 114 343 264 668 447 241 537 5 -143 481 575
6471 575 -267 -66 674 -86 -463 182 62 -806 -300 116 -687 -518 -170 -606 -147 107 -57 -302 -203 -261 221
6492 221 185 -197 201 354 -188 -71 493 72 404 857 182 -199 466 464 -569 140 230 -372 -501 559 -300
6513 -300 -372 -244 85 -190 -129 -158 -72 -200 -389 -123 -158 -257 -69 357 -522 -171 323 300 -329 237 664 -249
6535 -249 92 577 -61 -109 457 185 144 240 -166 -216 -101 59 -196 -140 -245 -497 -229 -276 -526 129 -359 -705
6557 -705 -199 523 -715 157 389 -132 -182 373 39 -146 263 553 -153 332 376 -209 4 325 438 -135
6577 -135 208 228 222 225 -138 132 -208 -520 155 -101 -1003 -370 191 -447 -590 114 52 -491 45 84 -612 224
$$ packed form
6429H6K06M64n59l24N39k12O5k55j75L74n89j87N29L78j029M56J86m25p6O08k75
6450b15r65J267M1l83J43L81o53N33L26m40P9K29p9M04k21k06K96n32j48O24R4
6471E75q42K01P40p60l77O45j20q68N06M16q03J69L48m36M59K54j64k45R9n8M82
6492B21l6l82L98J53n42J17N64m21L32M53o75l81O65kj033P09R0o02j29J060q59
6513c00p2J28L29k75O1k9Q6j28j89K66l5r9J88M26q79L51M94k3o29N66M27r13
6535b49L41M85o38m8N66k72m1R6m06n0J15J60k55N6j05k52K68m7k50O55m88l46
6557g05N06P22j238Q72K32n21n0N55l34j85M09K90p06M85M4n85K13L21J13n73
6577a35L43K0oLl63K70l40l12O75k56r02O33N61o38j43P04o2n43N36L9o96Q36
$$ plain form
6599 224 360 137 -51 266 505 276 613 106 229 134 -4 447 408 -147 -76 439 -480 -251 292 -403 -413
6620 -413 58 -181 -740 -271 -50 -771 -312 -90 -269 -361 -26 -215 203 -149 89 229 2 178 384 97
6640 97 217 473 587 29 504 688 -102 -36 174 -86 -524 93 160 -326 -409 86 -326 -603 -114 -240 -537
6661 -537 -387 -236 -64 -151 -530 -607 -43 -276 93 179 339 235 541 246 78 823 281 295 635 830 191
6682 191 288 532 81 -131 144 -139 -343 -235 -187 -53 -139 -282 -574 -359 -638 -470 411 -446 -673 361 -279
6703 -279 -797 24 170 -646 279 411 72 305 628 435 18 353 440 136 170 467 3 -108 287 86 -56
6724 -56 -235 -327 -108 -18 -196 100 -257 -579 -125 -48 -699 -342 -67 -501 -633 83 479 -449 178 140 -28 124
6746 124 378 142 21 424 384 489 283 292 311 396 -146 279 504 -176 -148 92 -406 -242 694 -348 -887 56
$$ packed form
6599B24J36k23j88L17K39k29L37n07J23r5j38M51l9n55P1N15r19K29N43o95j0
6620d13M71k39n59M69K21p21M59K22j79r2L35j89M18l52K38J40k27J76K06k87
6640I7J20K56J14n58M75J84p90O6K10k60m38O17O7m86q3M95m12k77M89j26k97
6661e37J50J51J72q7l79p7N64k33L69Q6J60j04L06k95j68P45n42J4L40J95o39
6682A91R7K44m51k12K75k83k04J08M8J34q6j43k92K15k79J68Q81q57k27J034o40
6703b79n18Q21J46q16R25J32l39K33L23j93m17L35Q7l04L4K97m64j11L95k01j42
6724e6j79r2K19R0j78K96l57l22M54P7o51L57K75m34j32P16L96r28O27l8j68J52
6746A24K54k36j21M03m0J05k06RJ9Q5n42M25K25o80K8K40m98J64R36j042n39R43
$$ plain form
6768 56 -325 -669 -286 -198 -701 -174 26 -298 -501 -257 -102 44 -56 93 371 167 -173 741 525 -265 133
6789 133 737 -20 263 879 186 -273 216 180 -178 -67 63 -68 -480 -138 -38 -410 -255 -249 -224 -357 -420 -54
6811 -54 -170 -683 -13 -145 -679 172 582 -276 -183 398 692 -145 444 629 -270 251 431 74 -162 -8 367
6832 367 81 89 142 247 -370 -79 35 -138 -663 -353 -22 -519 -387 361 -281 -726 143 446 -665 242 421
6853 421 -302 -93 530 365 89 230 343 376 219 356 134 165 85 625 129 -163 -131 34 -553 -580 251 -103
6875 -103 -854 -269 59 -829 -5 244 -479 -259 327 -274 -348 535 154 130 42 296 319 169 104 444 396 160
6897 160 -6 318 52 -358 235 303 -481 199 133 -420 -44 491 -176 -591 -188 -236 -413 -418 193 -100 -597 -152
6919 -152 96 -48 170 36 199 83 57 329 26 -188 397 449 32 414 446 -182 -309 533 241 -603 114
$$ packed form
6768E6l81l44L83Q8n03N27K00l24k03K44J55J46j00J49K78k04l40R14k16p90L98
6789A33O04p57K83O16o93m59M89l6l58J11J30j31m12L42J00l72J55OK5j33o3L66
6811e4j16n13O70j32n34Q51M10q58R3N81K94q37N89J85q99N21J80l57k36J54L75
6832C67k86QN3J05o17K91J14j73n25L10L31m97J32P48o42m45Q69L03j111R07J79
6853D21p23K09O23j65k76J41J13L3j57J37k22L1q0N40m96k92L2J65n87k7Q31l54
6875a03p51N85L28q88Q24K49p23K20N86o01p4Q83l81k4q8K54K3j50o5L40m8k36
6897A60j66L24k66m10N93O8p84O80o6n53L76N35o67m15M03m8j77nO11k93m97M45
6919a52K48j44K18j34J63j16k6K72l03k14N85N2m17L82L2o28j27Q42k92q44P17
$$ plain form
6940 114 102 -744 -64 -7 -452 -269 -74 -361 -309 -397 -34 -260 -392 -72 46 70 -199 175 464 -439 206 661
6962 661 116 -49 126 552 -438 407 337 -157 -46 760 199 219 34 -160 -158 -384 -115 -39 -270 -379 -570 -432
6984 -432 -509 -248 -69 -673 -396 285 -15 -552 362 153 -344 35 312 139 334 553 34 -100 382 307 265
7005 265 39 285 305 443 -152 307 96 -414 -272 82 -428 -619 71 -169 -468 -272 -135 -810 -377 181
7025 181 -232 -130 227 -291 105 111 114 164 168 158 488 742 -164 407 524 50 143 197 -20 -97 441 106 -624 287
7049 287 428 -486 -698 234 -352 -201 -133 -462 -442 -408 -134 41 -118 -114 149 -19 -192 -153 -12 98 83 490
7071 490 161 42 586 583 -99 390 378 266 247 799 66 60 586 264 -75 62 -67 -366 -103 -394 -159 -298
7093 -298 -365 -248 -302 -505 -342 -120 -194 -593 108 -83 -406 -56 430 -40 -176 476 -120 -7 234 130 34
$$ packed form
6940A14j2q46O80N7m45J83J95k87N2q8L63k26j32L20J18K4k69L74K89r03O45M55
6962F61n45j65J75M26r90Q45p0m94J11Q06n61K0j85j94Kk26K69P6k31j09j91J38
6984d32p7K61J79o04K77O81l00n37R14k09m97L79K77j73J95K19n19j34M82p5m2
7005B65k26K46K0J38n95M59k11n10J42L54n10j91O90k40k99J96J37o75M33N58
7025A81m13J02L57n18L96OLN0Mj0L30K54r06N71J17m74R3N4k17p7N38l35p30R11
7049B87J41r14k12R32n86J51O8l29K0L4K74J75j59MK63j68j73L9J41J10j5M07
7071D90l29j19N44lo82M89j2j12j9N52p33oN26l22l39J37j29k99K63k91K35j39
7093b98o7J17n4k03J63K22p4l99P01j91l23L50M86m70j36O52n96J13K41j04r6
$$ plain form
7114 34 224 150 -57 172 -100 121 33 96 -395 -54 -181 -389 -38 -303 -637 -207 375 -281 -476 -35 -314
7135 -314 -366 -81 -182 -307 50 98 -182 167 357 119 -67 361 56 454 338 89 597 213 -168 171 427
7156 427 -322 61 179 -173 -202 349 -327 -557 -53 -88 -733 -85 -184 -534 -538 -39 -11 -243 -43 -306 186 210
7178 210 126 209 191 200 371 793 49 368 497 -2 -109 382 43 -468 187 -40 -535 -175 237 -395 -512 -10
7200 -10 -402 -157 -186 -214 -41 -223 -110 152 -144 -385 99 247 192 74 443 -62 -81 512 371 -336 28 524
7222 524 -354 -28 392 29 -20 115 103 -34 -245 -162 -183 -202 -305 -327 -64 -444 -177 10 -375 -419 -187 -16
7244 -16 -362 221 -240 -271 25 463 24 140 383 193 127 349 325 73 364 206 193 108 -233 254 38 -190
7266 -190 -347 -101 -246 -588 -57 111 -435 -141 185 -395 -258 330 -602 -248 264 222 -42 427 211 -170
$$ packed form
7114C4J90p4k07K29k72K21q8O3m91L41j27k08L51k65l34M30N82o56j95M41k79
7135c14n2K85j01j25L57M8k80L49J90k38j86M28l05L98j16k49N08l84l81L39K56
7156D27p49L83J18l52k9N51o76k30N04l5o45O48r9l50mM99K8k32K00k63M92K4
7178B10q4Q3j8RJ71M22p44L19J29m99j07M91l39n11O55k27m95L60M12o32j17N02
7200a0l92K45k9k8J73j82J13K62k96k41M84J48n5j18L69n05j9N93j41p07L64M96
7222E24q78L26M20l63m9J35j2j37k11Q3k1j9j03k2K63l80K67J87l85m4K32J71
7244a6l46N83m61l1K96M38m39J16K43j90o6K22k4k52K91j58j3q5l41M87k16k28
7266a90j57K46j45l42N31J68n46K94L26n80J37N88r32L54N12m2k64M69k16l81
$$ plain form
7286 -170 300 150 199 228 -191 364 282 112 -33 497 -175 -123 124 487 -547 -27 168 -463 -434 -5 -312
7307 -312 -588 -79 -128 -777 -279 110 -344 -5 192 -289 26 86 179 -12 -3 230 366 616 -96 394 419 209
7329 209 153 228 369 281 460 6 -321 216 69 -331 -181 302 -254 -445 -141 -467 -279 -295 -467 -572 -611 -103
7351 -103 -102 -118 -187 80 27 -63 254 653 -104 68 360 617 -196 837 395 -191 378 183 -21 -189 350 5
7373 5 -303 -75 -462 -210 -386 -355 -146 -144 -601 -288 97 -287 -489 204 -74 -547 89 -36 -497 -41 282 -138
7395 -138 -2 275 360 183 505 515 -142 319 163 14 325 -182 -52 123 0 -280 116 -495 -540 222 -362
7416 -362 -747 -284 99 -727 -310 192 -430 -413 88 -229 -261 303 289 -47 121 294 263 103 152 353 610 216
7438 216 -193 413 404 -35 178 243 -139 312 454 -632 -300 237 -356 -616 119 -286 -504 -296 -46 -119 -239
$$ packed form
7286a70M70j50M9K9m19N55q2j70j45N30o72N2K47L63j034N20J95o31K9M29l07
7307c12k76N09m9o49M98L89m54L39J97m81L15O0R3j91RK33J36K50p12M90K5k10
7329B09n6P5J41q8J79m54l27N37j47m00J50M83n56j91L04l26J88j6j72j05l9N08
7351a03Jj6o9K67n3r0L17L99p57J72K92K57q13J033m42n86N69j95k04j68N39l45
7373El08K28l87K52j76L1K09Km57L13L85l84k02O93k78m73O36j25m61M56L23m20
7395a38J36K77Q5j77L22J0o57M61j56j49L11n07J30J75j23k80L96o11m5P62n84
7416c62l85M63L83q26M17N02o22J7N01l17l2N64j4l36J68J73l1j60M9K01K57l94
7438B16m09O06rm39K13O5l82M51J42j086L32N37n93k60P35m05k18K08K50p3j20
$$ plain form
7459 -239 -225 -152 75 -118 100 7 -60 -61 350 314 -113 535 427 -325 301 412 235 -154 381 -238 37 169
7481 169 246 -418 -18 123 -359 -294 -310 -346 -144 -105 -143 20 -56 -314 -233 12 -450 226 200 -424 -140 337 -113
7504 -113 -171 362 74 -35 331 314 209 113 227 -8 99 68 -114 247 -121 -385 -253 -52 -118 -7 -280 -554
7526 -554 -9 102 -790 -483 -102 -131 -448 421 370 -147 277 48 -58 70 371 -168 99 314 87 210 22
7547 22 28 179 80 -113 280 -29 -276 -339 30 -53 -643 -98 -164 -427 8 143 -133 -144 -88 -407 -133 113 46
7570 46 19 302 142 145 198 264 -81 -23 161 117 484 84 168 258 10 130 270 -238 -338 192 -55 -662 -355
7593 -355 223 -131 -178 -99 -299 -166 -12 -236 -469 -45 -518 -434 -54 -142 174 377 281 51 222 -58 116 509
7615 509 498 -386 -50 395 -180 105 422 -331 -201 -4 68 -376 31 -165 -351 -265 18 -382 -466 -235 -120
$$ packed form
7459b39J4P3K27j93K18r3o7jM11l6m27O48j08p52O26J11j77l89N35o19K75J32
7481A69P7o64M00J41m82O5j6l6K02L9l8J63p6k58Q1K45m62O76k6o24K84M77m50
7504a13n8N33k88j09L66j7j05r6J14k35J07l1j82L61l68k64J32K01o6J11k73k74
7526e54N45J11q92L07L81k9l17Q69n1n17M24k29j06J28L01n39K67K15k27J23j88
7547B2OJ51r9j93L93l09k47o3L69q3n90N45o6k63M35J35k76j1N6l19K74K46o7
7570D6k7K83j60LN3O6l45N8J84m4L67m00Q4R0k48J20J40n08j00N30k47o07L07
7593c55N78l54m7P9k00J33J54k24k33M24m73Q4L80q8L16K03r6k30J71k80J74L93
7615E09j1q84L36M45n75K85L17p53J30J97P2m44M07j96j86Q6K83m00q4K31J15
$$ plain form
7636 -120 -192 -275 -646 -216 27 -133 106 -54 -15 -7 526 -212 136 598 462 -120 360 389 135 198 33 -356
7658 -356 269 -172 -394 -244 -160 -426 -235 -247 -233 -293 -195 -573 -274 -169 -473 29 310 -146 -49 478 216 -67
7680 -67 212 334 -410 221 366 254 254 465 137 297 390 -35 231 473 -104 67 -246 -147 -16 262 -513 -158
7702 -158 311 -358 -850 -260 -227 -696 -12 -32 -313 -286 79 76 -118 207 130 13 79 367 534 224 67 177
7724 177 74 -5 275 557 -41 -11 325 -131 -106 -4 -138 -333 -161 -91 -561 -145 52 -418 -231 -229 -589 -358
7746 -358 -289 156 23 94 -145 59 118 -42 287 489 -112 -191 467 374 34 500 183 85 24 662 -94 52
7768 52 62 -311 -280 -203 -187 -400 91 -513 -404 -207 -258 -457 -171 -279 -203 32 -256 -148 -186 -28 -195 11 456
7791 456 122 244 723 -236 -231 290 269 -232 87 263 -89 -219 147 -108 107 -30 -268 10 -153 -550 -398
$$ packed form
7636a20p2q3l71M30K43j60K39j60L9QN33p38L48M62j36n82M80K9k54O3j65l89
7658c56O25m41k22J50Q4k66J91j2J4o0R8l78K99J05l04N02K81m56R7N27k62k83
7680f7K79J22p44O31J45j12%K11l28J60R3m25K66K42n77J71l13R9J31K78p75L55
7702a58M69o69m92N90L3m69O84k0k81K7L65lj94L25p7j17O6K88J67l10j57J10
7724A77j03p9K80K82n98L0L36m56K5J02j34j95J72P0m70M16J97m70J87Kl60K31
7746c58O9M45j33P1k39K04N9j60L29K02o01p9O58r3l40M66l17r8o1O38p56J46
7768E2J0l73L1P7J6k13M91o04J09J97n1j99K86j08P6K35k88J08l8J58j67K06M45
7791D56l34J22M79r59NN21k1n01L19J76l52j30L66k55K15j37k38K78j63l97J52
$$ plain form
7812 -398 -31 -679 -141 -66 -344 -63 283 -568 -187 88 25 -355 350 265 135 229 159 98 330 426 14 303
7834 303 24 169 165 227 -104 286 484 -61 288 68 -186 -70 13 -394 -218 244 -301 -491 -21 123 -413
7855 -413 48 -151 49 -133 346 81 57 -37 -109 100 130 28 206 0 92 53 494 -23 -100 326 118 -146
7877 -146 168 1 -79 -390 -247 -455 -88 -101 -586 -191 -129 -27 -187 61 -149 -200 -57 -88 93 272 26 158
7899 158 323 75 28 198 101 -141 345 441 -319 341 345 -298 -375 155 182 -142 23 -228 127 157 -490 -305 42
7922 42 120 -11 108 -190 -210 106 -55 -346 293 208 -459 247 41 -117 94 251 -87 359 648 356 188
7943 188 156 258 -195 -199 -31 -40 -208 -326 -23 89 -253 -355 -62 -282 -368 125 274 -480 -162 380 25 -45
7965 -45 225 -103 -33 368 204 -172 326 347 151 127 -34 193 182 364 156 139 59 -301 71 335 -276 -283 10
$$ packed form
7812c98L67o48N38P5k78K81L46q51L81K75o3l80P05q5j30R4p0o1K32R6m12K89
7834C03k79J45mO2l31L90J98n45L49k20k54J16Q3m07J76M62n45j90M70J44n36
7855d13M61j99K00j82M79k65k4r4p2K09L0j02J78k06R2l9M41n17p7M26k08k64
7877a46L14j67q0l11J43k08L67j3m85L95O2J02j60K48k10n1J43l1J81J79k46J32
7899A58J65k48m7J70r7k42M86R6p60O60Mo43p7N30K7l24J65k51L55L0o47J85L47
7922D2P8j31J19k98k0L16j61k91O39q5o67P06k06j58K11J57l38M46K89k92j68
7943A88l2J02m53mJ68rj68j18L03J12l42j02K93k20q6M93J49p54L18N42l55p0
7965d5K70l28P0M01j64l76M98K1j96k4j61K27j1J82k08j7q0l60L72K64o11pK93
$$ plain form
7988 10 -466 -344 14 -392 -250 10 -74 -556 109 -34 -512 203 340 -108 -149 -47 184 250 511 -73 225
8009 225 314 58 397 186 138 135 352 -294 -41 41 228 -360 -67 -188 -392 10 -386 -395 -205 -235 -214 23 -242
8032 -242 -143 -260 -78 -200 284 134 -165 260 38 233 192 513 -180 57 267 393 -235 790 145 -215
8052 -215 207 239 87 -75 256 -188 -160 -93 -196 -542 -136 -342 -41 -228 -780 -311 -62 -288 -37 314 -303
8073 -303 -310 82 123 -234 284 242 -133 458 379 75 188 548 121 209 0 248 158 56 -132 51 76 -175 -262
8096 -262 39 -356 -290 306 -141 -637 121 -118 -607 62 115 -498 -56 125 -297 -18 34 217 -59 100 -100
8117 -100 57 100 186 79 126 526 -340 202 98 -286 438 76 -239 121 -192 -695 123 -90 -312 -138 -43
8138 -43 -466 -212 -283 17 -85 -175 -9 219 70 -85 207 76 -144 3 244 103 138 293 64 195 93
$$ packed form
7988A0m76J22L58m06J42K60q4m82O65j43m78P15J37m48m1J02K31O6K61n84K98
8009B25Q9k56L39k11m8lK17o46K53Q2J87n88K93j21k04M02l96rJ90l0K1K37k65
8032b42R9j17J82j22M84j50k99M25k22J95m1L21o93K37K10J26o28J025o45l60
8052b15M22L2j52j62L31m44K8O7j03l46M06k06L01j87n52M69K49k26K51L51o17
8073c03pL92M1l57N18m2l75N91p9l04J13L60m27Q8k09K48r0j02j88J83K5k51q7
8096b62L01l95O6N96m47m96P58k39m89O69N3o13M42J81m22K79N2J83k76J59k00
8117a00J57M3Q6j07M7M00q66N42j04l84P24l62l15L60l13n03Q18k13k22J74R5
8138d3m23K54p1L00j02r0J66K28j49j55K92j31k20J47K41j41L5J55k29J31j02
$$ plain form
8159 93 422 -188 299 99 -41 -196 206 -94 -287 -136 -475 6 -341 -36 -72 -40 -224 -275 -103 -416 -66
8180 -66 -14 -57 -171 198 41 -46 102 349 -371 -15 381
$$ packed form
8159I3L29o10M87k00j40j55M02l00j93J51l39M81l47L05l6L2j84n1J72l13L50
8180f6N2m3j14L69j57q7J48K47p20L56L96
8191C81
$$ Imaginary data points
##PAGE= N=2
##DATA TABLE= (X++(I..I)), XYDATA
$$ plain form
0 0 0 0 0 8 -8 8 -8 16 -24 24 -28 40 -48 56 -69 82 -103 120 -141 165 -192 223 -257 297 -341 389 -441
27 -441 503 -567 637 -717 805 -903 1007 -1123 1250 -1390 1542 -1708 1892 -2095 2322 -2569
43 -2569 2841 -3150 3501 -3896 4344 -4866 5479 -6209 7091 -8188 9601 -11485 14123 -18097
57 -18097 24736 -37810 72973 -353639 -900313 335833 438774 -672035 -637863 344985
67 344985 68556 -674366 -245905 426773 65868 -305406 26387 250612 30713 10177
77 10177 163895 168732 139782 122877 -13606 10835 163857 15373 -182952 44123 158973
88 158973 -160370 -184605 134659 -8221 -270045 53363 259841 -128426 -151379 284945
98 284945 118363 -304046 56788 430922 -60428 -329441 211634 266729 -359435 -272268
$$ packed form
0@%%%Qj6J6j6K4m0M8n2O8q8J04j25J51j85K23k61L06l57M15m80N54o38P30q30
27d41R44j070J204j354J522j708J910k130K373k640K932l250L600l987M417m891
43b569N410n991O651p397Q240r210J0345j1688J3300j5279J7789k1086K5608l2220
57a8097M2833o2546J10783m26612n46674J236146J02941j110809L4172R82848
67C44985k76429p42922M28461O72678l60905l71274L31793K24225k19899k0536
77A0177J53718M837k8950j6905j36483K4441J53022j48484j98325K27075J14850
88A58973l19343k4235L19264j42880k61824L23408K06478l88267k2953M36324
98B84945j66582m22409L60834L74134m91350k69013N41075N5095o26164Q7167
$$ plain form
108 -272268 320252 78908 -422585 -78854 247708 -174141 -309102 138214 139684 -182222
118 -182222 989 214147 -48271 -96808 199433 110604 -136178 83364 258800 -45800
128 -45800 -164197 108536 89981 -171773 -66835 148497 5612 -135806 -19065 -563
138 -563 -68580 39055 71310 -56587 33745 157030 -66561 -144509 182408 167953 -217660
149 -217660 -91328 278495 8169 -339503 -6065 220270 -179806 -281285 153533 152860
159 152860 -250678 -152641 183312 25622 -165526 97126 211728 -49094 -52104 170647
169 170647 78346 -60694 108276 153426 -54640 -40316 107792 -9318 -126422 8314
179 8314 43083 -94717 -70499 23640 -59384 -106382 3292 8433 -64442 23837 90275 -43495
$$ packed form
108b72268N92520k41344n01493L43731L26562m21849j34961M47316J470l21906
118a82222J83211K13158k62418m8537K96241q8829k46782K19542J75436l04600
128d5800j18397K72733j8555k61754J04938K15332j42885j41418J16741J8502
138e63o8017J07635L2255j27897R0332J23285k23591p7948L26917j4455l85613
149b17660J26332L69823k70326l47672L33438K26335m00076j01479M34818o73
159A52860m03538R8037L35953j57690j91148K62652J14602k60822l010K22751
169A70647r2301j39040J68970M5150k08066J4324J48108j17110j17104J34736
179H314L4769j37800K4218R4139q3024m6998J09674N141p2875Q8279O6438j33770
$$ plain form
191 -43495 -66251 98010 65822 -90109 28746 169254 -23367 -138274 64064 81973 -136455
202 -136455 -71004 127286 -4253 -155174 1311 68833 -93688 -70978 99326 42993 -70143
213 -70143 35493 101484 -24740 -36938 97750 70368 -37752 32507 96777 -25980 -74020
224 -74020 34704 25948 -63248 -9059 39447 -52846 -75481 2167 -13618 -48184 16304 27400
236 27400 -39118 -11709 42435 -11194 -33171 48873 49681 -33989 -7337 62807 -4986 -75708
248 -75708 8936 58014 -36551 -49132 46881 11356 -84968 -17417 62444 -8107 -32653 51975
260 51975 37879 -39049 394 55428 12271 -5635 40812 32829 -13818 -7808 9474 -12792
272 -12792 -17990 8328 1273 -27926 -19635 -10374 -38951 -35172 11075 2964 -30009 2010 19981
$$ packed form
191d3495k2756J64261l2188j55931J18855J40508j92621j14907K02338J7909k18428
202a36455O5451J98290j31539j50921J56485O7522j62521K2710J70304n6333j13136
213g0143J05636O5991j26224j2198J34688k7382j08120P0259O4270j22757m8040
224g4020J08724q756q9196N4189M8506r2293k2635P7648j5785l4566O4488J1096
236B7400o6518K7409N4144n3629k1977Q2044Q08q3670K6652P0144o7793p0722
248g5708Q4644M9078r4565j2581R6013l5525r6324O7551P9861p0551k4546Q4628
260E1975j4096p6928L9443N5034m3157j7906M6447p983m6647O010J7282k2266
272a2792n198K6318p055k9199Q291R261k8577L779M6247q111l2973L2019J7971
$$ plain form
285 19981 -28822 -24865 33396 16973 -16339 28266 42961 -16480 -19494 29424 17007 -11683
297 -11683 16258 34507 -1317 -21640 2328 11259 -6452 -1200 18409 4300 -13868 646
309 646 1527 -20300 -4033 18203 -6362 -15548 9797 -5506 -33653 -7916 10816 -10315 -6216
322 -6216 11155 -10058 -23353 -847 6661 -3232 5698 17116 5693 -8657 -952 12420 6306
335 6306 888 16077 18525 -3722 -3109 10928 -4725 -9876 16475 14002 -10320 17 7103 -17384
349 -17384 -16866 8143 5458 -6476 -1663 -3389 -14582 -14169 -7579 -1152 1506 -3684 -3606 -78 -8354
364 -8354 -10458 2577 7968 5500 9232 8496 6887 9145 -178 -1688 22705 24455 -3011 982 19788
379 19788 -1707 -20046 1392 14083 -1347 -12198 -10104 -6063 -9462 -20444 -15188 3432 96
$$ packed form
285A9981m8803L957N8261j6423l3312M4605J4695n9441l014M8918j2417k8690
297a1683K7941J8249l5824k0323K3968Q931j7711N252J9609j4109j8168J4514
309F46Q81k1827J6267K2236k4565r186K5345j5303k8147K5737J8732k1131M099
322f216J7371k1213j3295K2506P508r893Q930J1418j1423j4350P705J3372o114
335F306n418J5189K448k2247O13J4037j5653n151K6351k473k4322J0337P086k4487
349a7384N18K5009k685j1934M813j726j1193M13O590O427K658n190P8L528q276
364h354k104J3035N391k468L732p36j609K258r323j510K4393J750k7466L993J8806
379A9788k1495j8339K1438J2691j5430j0851K094M041l399j0982N256J8620l336
$$ plain form
392 96 -14069 -8018 -1075 -8112 -5579 2646 6169 11705 9167 -2408 1766 9127 2397 4511 14948
407 14948 8876 2181 3793 -2548 -3849 5852 2118 -2850 9149 5789 -11966 -8079 2543 -2553
421 -2553 -2831 4425 2483 -2838 -7784 -11830 -4220 1883 -3348 -3963 -735 -5064 -5288 -4114 -10017 -1822
437 -1822 13487 2466 -7347 10633 11540 -10547 -3377 17958 14769 4862 4999 3860 3067 2185 -1534
452 -1534 3280 9746 1646 -6879 -4571 -1848 -1661 -6832 -11382 1648 9954 -10655 -17603 3321 -1652
467 -1652 -20936 -2053 15551 -5672 -16873 -709 344 -8581 -779 8504 6039 899 2020 7446
481 7446 8381 5275 9046 12822 10324 14310 10798 -5880 -1777 14079 -3561 -16570 9188 7159
495 7159 -32619 -26722 5941 -10205 -30921 -6130 6976 -15534 -18139 5160 7409 -5442 5639
$$ packed form
392I6j4165O051O943p037K533Q225L523N536k538j1575M174P361o730K114J0437
407A4948o072o695J612o341j301R701l734m968J1999l360j7755L887J0622n096
421b553k78P256j942n321m946m046P610O103n231o15L228m329k24J174n903Q195
437a822J5309j1021r813J7980R07k2087P170K1335l189r907J37j139p93q82l719
452a534M814O466q100q525K308K723J87n171m550J3030Q306k0609o948K0924m973
467a652j9284J8883J7604k1223j1201J6164J053q925P802R283k465n140J121N426
481G446R35l106L771L776k498L986l512j6678M103J5856j7640j3009K5758k029
495G159l9778N897L2663j6146k0716K4791J3106k2510k605K3299K249j2851J1081
$$ plain form
508 5639 24795 15042 3170 20539 22874 -1179 7202 32237 10219 -11334 12897 9875 -25203
521 -25203 -11393 14413 -13853 -28639 3199 -693 -32410 -15799 9537 -10461 -21227 8422
533 8422 13615 -16470 -12349 17336 4257 -17914 10778 25122 -15227 -17498 23624 6467 -27796
546 -27796 8399 28917 -14857 -12344 29383 5056 -23217 17838 30865 -10757 -856 36227
558 36227 4102 -29400 15300 37714 -16174 -25829 28589 14393 -44700 -13057 36543 -14939
570 -14939 -47776 14332 22203 -40097 -20634 26903 -15459 -38582 18872 19923 -32064 -10198
582 -10198 23849 -15262 -25929 26022 21126 -27790 -4054 35425 -3461 -23704 33061 37039
594 37039 -24895 -3555 56176 10745 -33737 29201 42833 -31918 -13911 51067 -2251 -53135
$$ packed form
508E639J9156r753j1872J7369K335k4053Q381K5035k2018k1553K4231l022l5078
521b5203J3810K5806k8266j4786L1838l892l1717J6611K5336j9998j0766K9649
533H422N193l0085M121K9685j3079k2171K8692J4344m0349k271M1122j7157l4263
546b7796L6195K0518m3774K513M1727k4327k8273M1055J3027m1622R901L7083
558C6227l2125l3502M4700K2414n3888r655N4418j4196n9093L1643M9600n1482
570a4939l2837O2108P871o2300J9463M7537m2362k3123N7454J051n1987K1866
582a0198L4047l9111j0667N1951m896m8916K3736L9479l8886k0243N6765L978
594C7039o1934K1340N9731m5431m4482O2938J3632p4751J8007O4978n3318n0884
$$ plain form
606 -53135 10180 21873 -50121 -29086 33419 -17048 -63288 2418 24181 -43209 -30323 41299
618 41299 8125 -46362 14301 53086 -19042 -23459 57358 30832 -40476 16352 60229 -22433
630 -22433 -36383 47771 20958 -54202 -174 45342 -29781 -44404 29475 12576 -46074 2
642 2 41510 -17519 -32773 31605 21186 -34685 7389 50983 -14249 -38581 34827 24697 -46669
655 -46669 -3738 47192 -26792 -49585 34879 18439 -58578 -4931 47439 -30769 -45053 49496
667 49496 30532 -58819 -8829 62296 -9481 -49270 41075 47594 -52810 -33413 57555 9095
679 9095 -58689 13922 47207 -41690 -38391 48994 15666 -45823 14714 43155 -23160 -9923
691 -9923 52030 10115 -29301 28106 35965 -25567 -4228 43997 -8682 -47808 12932 23488
$$ packed form
606e3135O3315J1693p1994K1035O2505n0467m6240O5706K1763o7390J2886P1622
618D1299l3174n4487O0663L8785p2128m417Q0817k6526p1308N6828M3877q2662
630b2433j3950Q4154k6813p5160N4028M5516p5123j4623P3879j6899n8650M6076
642BM1508n9029j5254O4378j0419n5871M2074M3594o5232k4332P3408j0130p1366
655d6669M2931N0930p3984k2793Q4464j6440p7017N3647N2370p8208j4284R4549
667D9496j8964q9351M9990P1125p1777l9789R0345O519j00404J9397R0968m8460
679I095o7784P2611L3285q8897L299Q7385l3328o1489O0537K8441o6315J3237
691i923O1953m1915l9416N7407P859o1532K1339M8225n2679l9126O0740J0556
$$ plain form
703 23488 -44817 -30451 29501 -18253 -66909 3678 29986 -47309 -32973 46266 -375 -57308
715 -57308 24125 57159 -29270 -19483 63534 19483 -40909 28717 58240 -24469 -25152 48737 16350
728 16350 -45150 10272 46857 -30621 -46356 36129 25585 -49198 -9044 47570 -18290 -50395
740 -50395 27734 32452 -37672 -14357 32605 -15198 -35546 18955 12043 -34153 -8184 17013
752 17013 -19964 -18319 22681 2124 -28690 9019 28427 -11546 -4569 40648 10947 -30085
764 -30085 21411 50326 -15187 -20266 47663 15251 -53179 6703 55349 -26380 -48819 34437
776 34437 19275 -57209 -11282 49054 -14929 -49582 20572 30928 -33391 -18637 36675 2987
788 2987 -40223 3164 28759 -19413 -26169 14582 -2714 -34963 -3821 13481 -17174 -11708 11249
$$ packed form
703B3488o8305J4366N9952m7754m8656P0587K6308p7295J4336P9239m6641n6933
715e7308Q1433L3034q6429R787Q3017m4051o0392O9626K9523q2709o83P3889l2387
728A6350o1500N5422L6585p7478j5735Q2485j0544p4783M0154N6614o5860l2105
740e0395P8129M718p0124K3315M6962m7803k0348N4501o912m6196K5969K5197
752A7013l6977J645M1000k0557l0814L7709J9408l9973O977M5217k9701m1032
764c0085N1496K8915o5513n079O7929l2412o8430N9882M8646q1729k2439Q3256
776C4437j5162p6484M5927O0336o3983l4653P0154J0356o4319J4754N5312l3688
788B987m3210M3387K5595m8172o756M0751j7296l2249L1142J7302l0655N466K2957
$$ plain form
801 11249 -9677 -11249 26091 16753 -7928 22507 33084 -4728 9118 51864 21002 -17725
813 -17725 20627 38139 -14036 -17869 30567 6984 -51981 -19568 26289 -23580 -55401 2567
825 2567 6413 -57036 -31121 33183 -5635 -46740 8077 27395 -23347 -9330 42372 16615
837 16615 -19410 12361 31690 2798 1128 22503 8642 -9449 7211 13658 -5543 -2457 10515
850 10515 -9442 -17903 11969 10608 -21461 -6978 16110 -14088 -21666 19003 9608 -28850 -1816
863 -1816 21507 -18923 -21351 26647 11342 -32600 -1649 31294 -9197 -25420 24298 26814 -24811
876 -24811 -13395 35816 11832 -28057 8175 31407 -15651 -23770 23995 14541 -24347 -5265
888 -5265 12318 -14074 -12362 13322 -1802 -17013 3103 2344 -16405 2297 20586 -5775 -18488
$$ packed form
801A1249k0926j572L7340r338k4681L0435J0577l7812J3846M2746l0862l8727
813a7725L8352J7512n2175l833M8436k3583n8965L2413M5857m9869l1821N7968
825B567L846o3449K5915O4304l8818m1105N4817J9318n0742J4017N1702k5757
837A6615l6025L1771J9329k8892j670K1375j3861j8091J6660O447j9201L086J2972
850A0515j9957q461K9872j361l2069J4483K3088l0198p578M0669r395l8458K7034
863a816K3323m0430k428M7998j5305m3942L0951L2943m0491j6223M9718K516n1625
876b4811J1416M9211k3984l9889L6232K3232m7058q119M7765r454l8888J9082
888e265J7583k6392J712K5684j5124j5211K0116p59j8749J8702J8289k6361j2713
$$ plain form
901 -18488 9160 15154 -9370 -3277 18377 763 -18865 5745 17957 -9019 -7442 14692 -6890
914 -6890 -20120 18528 19133 -24437 -9140 28054 -4151 -26930 19860 28889 -23161 -21806 24257
927 24257 13985 -21919 -4893 18897 -5021 -21709 3532 11736 -10924 -9455 5075 -6236
939 -6236 -7587 11677 1394 -16739 7202 18212 -12451 -7868 26355 8772 -19227 5356 22141
952 22141 -3656 -9083 12734 6719 -9424 -1309 4892 -6448 -5368 7080 -3929 -17833 274
965 274 11196 -14942 -17515 16009 7826 -28095 -7330 26222 -1463 -23632 7395 16159 -8980
978 -8980 -5180 13908 5678 -3361 3078 3517 2432 11372 8590 -6866 -4174 13304 8460 -10717
992 -10717 -1828 16198 -3408 -22682 3051 17702 -12028 -20246 3965 1881 -13549 -4064 2239
$$ packed form
901a8488K7648N994k4524O093K1654j7614j9628K4610J2212k6976J577K2134k1582
914f890j3230L8648O05m3570J5297L7194l2205k2779M6790R029n2050J355M6063
927B4257j0272l5904J7026K3790k3918j6688K5241Q204k2660J469J4530j1311
939f236j351J9264j0283j8133K3941J1010l0663M583L4223j7583k7999K4583J6785
952B2141k5797n427K1817o015j6143Q115O201j1340J080J2448j1009j3904J8107
965B74J0922k6138k573L3524q183l5921K0765L3552k7685k2169L1027Q764k5139
978h980L800J9088q230r039O439M39j085Q940k782j5456K692J7478m844j9177
992a0717Q889J8026j9606j9274K5733J4651k9730q218K4211k084j5430R485O303
$$ plain form
1005 2239 -7811 -5059 213 -5066 1804 11413 -2102 -11110 7203 17461 615 -6807 10387
1018 10387 15391 -5498 -8421 15789 14406 -12898 -8917 13134 4085 -9839 -2011 1077 -4669
1031 -4669 -445 -1511 -7543 1647 6108 -10266 -10821 9727 7947 -11858 -9563 8216 7436 -9606
1045 -9606 -9694 7900 6582 -10794 -6315 10057 3974 -6895 -964 5609 6049 5528 -968 -1184 12355
1060 12355 9747 -6460 1445 16359 2078 -12367 1617 11995 -2388 -15132 -5420 6056
1072 6056 -3746 -17329 -7055 5481 -7442 -16238 -1516 6711 -2684 -7266 -2357 5825 10537 684
1086 684 -4272 10652 14864 -3215 -3601 14885 11467 -6194 -4163 8146 7582 -4078 -8522 1198
1100 1198 5689 -5214 -8107 2999 3292 -6130 -5651 423 2752 1260 -5086 -6325 4829 4271 -9324
$$ packed form
1005B239j0050K752N272n279O870R609j3515r008J8313J0258j6846p422J7194
1018A0387N004k0889k923K4210j383k7304L981K2051r049j3924P828L088n746
1031d669M224j066o032R190M461j6374n55K0548j780j9805K295J7779p80j7042
1045i606q8J7594j318j7376M479J6372o083j0869N931O573M40n21o496k16J3539
1060A2355k608j6207P905J4914j4281j4445J3984J0378j4383j2744R712J1476
1072F056r802j3583J0274J2536j2923q796J4722Q227r395m582M909Q182M712r853
1086F84m956J4924M212j8079l86J8486l418j7661K031J2309n64j1660m444R720
1100A198M491j0903k893J1106K93r422M79O074K329j492o346j239J1154n58j3595
$$ plain form
1115 -9324 -5927 6045 -1451 -10942 -2367 4189 -1487 -7052 -4175 3393 5868 -1153 -2166 7039 8091
1130 8091 1599 3300 8808 8765 5224 113 1867 10148 4786 -8970 -4284 6102 -3294 -11767 -5783
1145 -5783 -2159 -6206 -9487 -9178 -2036 3162 -5982 -10405 3837 10550 -1217 -3029 8771 11029
1159 11029 2300 -1235 7069 12039 599 -7276 4525 8266 -6043 -8016 1792 -1371 -7095 -3013
1173 -3013 -1953 -2688 -13 -3025 -4012 4812 4954 -3479 228 7849 2484 -2296 2022 3758 -8 -3464
1189 -3464 -2501 636 -1894 -6408 -2720 -742 -4270 -1508 1525 -3576 -2 8007 834 -2087 10974
1204 10974 9525 -3611 3472 13464 2355 -4625 4476 4182 -5070 -5392 -1614 -3550 -8097 -7793 -3750
1219 -3750 -5518 -7557 -2713 -1911 -6434 681 6542 -1932 -229 12094 6051 -3169 10096 13732 -2182
$$ packed form
1115i324L397J1972p496r491Q575O556n676n565K877P568K475p021j013R205J052
1130H091o492J701N508m3l541n111J754Q281n362j3756M686J0386r396q473N984
1145e783L624m047l281L09P142N198r144m423J4242O713j1767j812J1800K258
1159A1029q729l535Q304M970j1440p875J1801L741j4309j973R808l163n724M082
1173c013J060p35K675l012r87Q824J42q433L707P621n365m780M318J736l766l456
1189c464R63L137k530m514L688J978l528K762L033n101L574Q009p173k921J3061
1204A0974j449j3136P083R992j1109o980R101k94r252l22L778j936m547L04M043
1219c750j768k039M844Q02m523P115N861q474J703J2323o043r220J3265L636j5914
$$ [...]
8191A16
##END NTUPLES=NMR FID
##END=
