##TITLE=1H_BAU-J-FN
 CDCl3, 8 sc, 
 17.12.2019
##JCAMPDX= 6.0         $$ Bruker NMR JCAMP-DX V2.0
##DATA TYPE= NMR FID
##DATA CLASS= NTUPLES
##ORIGIN= UXNMR, Bruker Analytische Messtechnik GmbH
##OWNER= root
$$ XWIN-NMR		Version 3.5
$$ Tue Dec 17 16:44:33 2019 Russian Standard Time (UT+4h)  she@DPX200
##.OBSERVE FREQUENCY= 200.1315
##.OBSERVE NUCLEUS= ^1H
##.DELAY= (6, 6)
##.ACQUISITION MODE= SIMULTANEOUS
##.ACQUISITION SCHEME= undefined
##.AVERAGES= 8
##.DIGITISER RES= 18
##SPECTROMETER/DATA SYSTEM= spect
##.PULSE SEQUENCE= zg30
##.SOLVENT NAME= DMSO
##.SHIFT REFERENCE= (INTERNAL, DMSO, 0, 15.7039)
##AUDIT TRAIL= $$ (NUMBER, WHEN, WHO, WHERE, WHAT)
$$ ##TITLE= Audit trail, XWIN-NMR		Version 3.5
$$ ##JCAMPDX= 5.01
$$ ##ORIGIN= Bruker BioSpin GmbH
$$ ##OWNER= she
$$ F:/spectra/data/she/nmr/H-F/1/audita.txt
$$ ##AUDIT TRAIL=  $$ (NUMBER, WHEN, WHO, WHERE, WHAT)
(   1,<2019-12-17 16:42:51.89 +0400>,<she>,<DPX200>,
      <created by zg, POWCHK disabled, PULCHK disabled
       configuration hash MD5:
       00 E9 B6 7A A2 85 ED C7 34 08 36 98 17 FE 4E 26
       data hash MD5: 16K
       AB E7 72 22 A9 56 58 14 FC 86 1B 85 EC 74 79 EA>)
$$ ##END=
$$ 
$$ hash MD5
$$ C9 A9 0A CE 3B 01 38 90 B2 70 D2 1C 70 A5 1F AD
##$RELAX= 
##$RELAX= 
##$RELAX= 
##$RELAX= 
##$RELAX= 
##$RELAX= 
$$ Bruker specific parameters
$$ --------------------------
##$DU= <F:/spectra>
##$EXPNO= 1
##$NAME= <H-F>
##$PROCNO= 1
##$TYPE= <nmr>
##$USER= <she>
##$AMP= (0..31)
100 100 100 100 100 100 100 100 100 100 100 100 100 100 100 100 100 100 
100 100 100 100 100 100 100 100 100 100 100 100 100 100 
##$AQSEQ= 0
##$AQ_mod= 1
##$AUNM= <au_zg>
##$AUTOPOS= <>
##$BF1= 200.13
##$BF2= 200.13
##$BF3= 200.13
##$BF4= 200.13
##$BF5= 200.13
##$BF6= 200.13
##$BF7= 200.13
##$BF8= 200.13
##$BYTORDA= 1
##$CFDGTYP= 0
##$CFRGTYP= 5
##$CHEMSTR= <none>
##$CNST= (0..31)
1 1 145 1 1 1 1 1 1 1 1 1 1 1 1 1 1 1 1 1 1 1 1 1 1 1 1 1 1 1 1 1 
##$CPDPRG= <>
##$CPDPRG1= <>
##$CPDPRG2= <>
##$CPDPRG3= <>
##$CPDPRG4= <mlev>
##$CPDPRG5= <mlev>
##$CPDPRG6= <mlev>
##$CPDPRG7= <mlev>
##$CPDPRG8= <mlev>
##$CPDPRGB= <>
##$CPDPRGT= <>
##$D= (0..31)
0 1.2 0 0 0 0 0 0 0 0.06 0 0.03 0 0 0 0 0.0002 0 0 0 0 0 0 0 0 0 0 0 0 
0 0 0 
##$DATE= 1576586571
##$DBL= (0..7)
120 120 120 120 120 120 120 120 
##$DBP= (0..7)
150 150 150 150 150 150 150 150 
##$DBP07= 0
##$DBPNAM0= <>
##$DBPNAM1= <>
##$DBPNAM2= <>
##$DBPNAM3= <>
##$DBPNAM4= <>
##$DBPNAM5= <>
##$DBPNAM6= <>
##$DBPNAM7= <>
##$DBPOAL= (0..7)
0.5 0.5 0.5 0.5 0.5 0.5 0.5 0.5 
##$DBPOFFS= (0..7)
0 0 0 0 0 0 0 0 
##$DE= 6
##$DECBNUC= <off>
##$DECIM= 24
##$DECNUC= <off>
##$DECSTAT= 4
##$DIGMOD= 1
##$DIGTYP= 9
##$DL= (0..7)
0 120 120 120 120 120 120 120 
##$DP= (0..7)
150 150 150 150 150 150 150 150 
##$DP07= 0
##$DPNAME0= <>
##$DPNAME1= <>
##$DPNAME2= <>
##$DPNAME3= <>
##$DPNAME4= <>
##$DPNAME5= <>
##$DPNAME6= <>
##$DPNAME7= <>
##$DPOAL= (0..7)
0.5 0.5 0.5 0.5 0.5 0.5 0.5 0.5 
##$DPOFFS= (0..7)
0 0 0 0 0 0 0 0 
##$DQDMODE= 0
##$DR= 18
##$DS= 0
##$DSLIST= <SSSSSSSSSSSSSSS>
$$ [...]
##$SUBNAM2= <"">
##$SUBNAM3= <"">
##$SUBNAM4= <"">
##$SUBNAM5= <"">
##$SUBNAM6= <"">
##$SUBNAM7= <"">
##$SUBNAM8= <"">
##$SUBNAM9= <"">
##$SW= 24.9337058887773
##$SWIBOX= (0..15)
0 0 2 0 0 0 0 0 0 0 0 0 0 0 0 0 
##$SW_h= 4990.01996007984
##$TD= 16384
##$TD0= 1
##$TE= 0
##$TE2= 300
##$TE3= 300
##$TEG= 300
##$TL= (0..7)
0 120 120 120 120 120 120 120 
##$TP= (0..7)
150 150 150 150 150 150 150 150 
##$TP07= 0
##$TPNAME0= <>
##$TPNAME1= <>
##$TPNAME2= <>
##$TPNAME3= <>
##$TPNAME4= <>
##$TPNAME5= <>
##$TPNAME6= <>
##$TPNAME7= <>
##$TPOAL= (0..7)
0.5 0.5 0.5 0.5 0.5 0.5 0.5 0.5 
##$TPOFFS= (0..7)
0 0 0 0 0 0 0 0 
##$TUNHIN= 0
##$TUNHOUT= 0
##$TUNXOUT= 0
##$USERA1= <user>
##$USERA2= <user>
##$USERA3= <user>
##$USERA4= <user>
##$USERA5= <user>
##$V9= 5
##$VALIST= <valist>
##$VCLIST= <CCCCCCCCCCCCCCC>
##$VD= 0
##$VDLIST= <DDDDDDDDDDDDDDD>
##$VPLIST= <PPPPPPPPPPPPPPP>
##$VTLIST= <TTTTTTTTTTTTTTT>
##$WBST= 1024
##$WBSW= 4
##$XGAIN= (0..3)
0 0 0 0 
##$XL= 0
##$YL= 0
##$YMAX_a= 172209
##$YMIN_a= -107379
##$ZGOPTNS= <>
##$ZL1= 120
##$ZL2= 120
##$ZL3= 120
##$ZL4= 120
##$ABSF1= 10
##$ABSF2= 0
##$ABSG= 5
##$ABSL= 3
##$ALPHA= 0
##$AQORDER= 0
##$ASSFAC= 0
##$ASSFACI= 0
##$ASSFACX= 0
##$ASSWID= 0
##$AUNMP= <proc_1d>
##$AZFE= 0.1
##$AZFW= 0.1
##$BCFW= 1
##$BC_mod= 2
##$BYTORDP= 1
##$COROFFS= 0
##$CY= 11.3945322036743
##$DATMOD= 1
##$DC= 2
##$DFILT= <>
##$DTYPP= 0
##$F1P= 16.9975609425685
##$F2P= -3.02152046262296
##$FCOR= 0.5
##$FTSIZE= 0
##$FT_mod= 4
##$GAMMA= 1
##$GB= 0.15
##$INTBC= 1
##$INTSCL= 1
##$ISEN= 128
##$LB= 0.24
##$LEV0= 0
##$LPBIN= 0
##$MAXI= 10000
##$MC2= 0
##$MEAN= 0
##$ME_mod= 0
##$MI= 1.114404
##$NCOEF= 0
##$NC_proc= 0
##$NLEV= 6
##$NOISF1= 3.799351
##$NOISF2= 2.8
##$NSP= 1
##$NTH_PI= 0
##$NZP= 0
##$OFFSET= 15.70392
##$PC= 1
##$PHC0= -9789.384
##$PHC1= 19.00081
##$PH_mod= 1
##$PKNL= yes
##$PPARMOD= 0
##$PSCAL= 0
##$PSIGN= 0
##$REVERSE= no
##$SF= 200.130013532006
##$SI= 16384
##$SIGF1= 3
##$SIGF2= 2
##$SINO= 400
##$SIOLD= 16384
##$SREGLST= <1H.CDCl3>
##$SSB= 0
##$STSI= 0
##$STSR= 0
##$SW_p= 3612.71676300578
##$SYMM= 0
##$S_DEV= 0
##$TDeff= 0
##$TDoff= 0
##$TI= <>
##$TILT= no
##$TM1= 0
##$TM2= 0
##$TOPLEV= 0
##$USERP1= <user>
##$USERP2= <user>
##$USERP3= <user>
##$USERP4= <user>
##$USERP5= <user>
##$WDW= 1
##$XDIM= 8192
##$YMAX_p= 0
##$YMIN_p= 0
$$ End of Bruker specific parameters
$$ ---------------------------------
##NTUPLES= NMR FID
##VAR_NAME=  TIME,          FID/REAL,        FID/IMAG
##SYMBOL=    X,             R,               I
##VAR_TYPE=  INDEPENDENT,   DEPENDENT,       DEPENDENT
##VAR_FORM=  AFFN,          ASDF,            ASDF
##VAR_DIM=   8192,          8192,            8192
##UNITS=     SECONDS,       ARBITRARY UNITS, ARBITRARY UNITS
##FACTOR=    0.0002004,     1,               1
##FIRST=     0,             0,               0
##LAST=      1.6414764,     0,               0
##MIN=       0,             -107379,         0
##MAX=       1.6414764,     172209,          0
$$ Real data points
##PAGE= N=1
##DATA TABLE= (X++(R..R)), XYDATA
0@%%%%%%%%%Kj0J6j6J6k4L2l2M0m8N6o5P3q8J04j20J37j55J75j99K27k58K90l25
33a72L62m03M51n03N60o22O89p64Q47r38J037j149J276j416J574j755J963k206
51a169K497k849L286l843M585n632P233j0023J6316n9320k310K3438p7974O25
65a05140M7934J7021l4177L119J8638n087j7358K2383J6234k8698k9073L7877
77e6327M0075l6156n4971K7828N3503j7478m7203J1232K7513j3334j4234K0908
89e8644K761k8996J263L9778M450m3909j0620N0828K8895m1099l2925L7371L9720
102a1127j8748k2845J9735J4294j4003P196K5501j1297k7849K0567L9149j4801
114E772m1319R089M4750L845l8607j1375K9744J0700k0174k189J4874j1036j7684
$$ plain form
0 0 0 0 0 0 0 0 0 0 0 2 -8 8 -8 8 -16 16 -16 24 -24 32 -33 40 -48 56 -64 73 -82 93 -106 121 -137 153 -172
33 -172 190 -213 238 -265 295 -327 362 -402 445 -493 544 -605 671 -745 829 -926 1037 -1169
51 -1169 1328 -1521 1765 -2078 2507 -3125 4108 -5915 10401 -48919 -51229 -27791 -105765 -105140
65 -105140 -57206 -40185 -74362 -71243 -52605 -57692 -75050 -52667 -36433 -65131 -94204 -56327
77 -56327 -16252 -52408 -107379 -79551 -26048 -43526 -90729 -79497 -51984 -65318 -79552 -58644
89 -58644 -55883 -84879 -83616 -43838 -39388 -83297 -93917 -43089 -14194 -55293 -88218 -50847 -11127
102 -11127 -29875 -52720 -32985 -18691 -32694 -25498 3 -11294 -39143 -18576 20573 5772
114 5772 -35547 -26458 18292 22137 -16470 -27845 1899 12599 -7575 -9764 5110 -5926 -23610
127b3610K2079K2198l0607k8627L1795L2870k9550l7034J9576L5289r747k9196
139b4564M63J6322j891q382Q176J680k1810m446K9311N859l8584j2764L8221J3692
153A283l7365j8273K7017J5041j9013j0156J1371L71j1432O621J7255q755k4163
166e0198P743L1649k517l3744M70L5396L907l0032l181K2719K248j2831M987P232
180a6152j2844n593J8847J0313k0621j6078J8336K1246j5288k3471J1728K4872
192d705q771k0774Q630J6060q358o442J5861L037j8091Q70K4707N571k0469n615
206a8489K0646J2147j3319j0240J3578J2836q909p065J0287L281j0577M539J5596
219B4311q221j9631Q804K1184o961k0724K747J6671j481j4283k144J0626J433
$$ plain form
127 -23610 -1531 20667 -9940 -38567 -6772 26098 -3452 -40486 -20910 14379 4632 -24564
139 -24564 -24101 -7779 -9670 -18052 -9876 -8196 -30006 -34452 -5141 718 -37866 -50630 -12409 1283
153 1283 -36082 -54355 -27338 -12297 -31310 -41466 -30095 -29724 -41156 -34535 -17280 -26035 -50198
166 -50198 -42455 -10806 -13323 -47067 -46597 -11201 -7294 -37326 -40507 -17788 -15540 -28371 -23384 -16152
180 -16152 -28996 -34589 -15742 -5429 -26050 -42128 -23792 -2546 -17834 -41305 -29577 -4705
192 -4705 -13476 -34250 -25620 -9560 -17918 -24360 -8499 -5462 -23553 -22683 2024 7595 -12874 -18489
206 -18489 2157 14304 985 -9255 4323 17159 8250 1185 11472 14753 4176 8715 24311
219 24311 16090 -3541 5263 26447 19486 -1238 1509 18180 16699 2416 272 10898 12331
232A2331r776j342P521l457r908P099J1212j0834j4616J0515J4164r817j2415
245i323P780Q348o598n638M831L459l814k491M626J887p533k944J0146O043j2634
260c855p557J2594Q034j0932o403J0346L103q436r24O394o73m464J371L405j929
275G4n032K23O282Q48q011l100P837J328p771j36O705k544o760M496M822n301
291f040k637N877K377m657k140L650M270P7m011K19N442P04m258J444N564k462
307C419l595L967J995m360J24L930j433m660R77K045j617j044o71j146J47n68
323b490j733R28J466k724k248L472R02l846O94N050j800l059L107J701j158J080
339f58J632j119M00J756o92l86J629o85k351K024j52k220M08J870k924k561K653
$$ plain form
232 12331 2555 1213 8734 5277 -4631 2468 13680 2846 -11770 -1255 12909 3092 -9323
245 -9323 -1543 6805 207 -5431 -600 2859 -955 -3446 1180 3067 -4466 -7410 2736 8779 -3855
260 -3855 -11412 1182 9216 -1716 -8119 2227 5330 -3106 -4030 2364 1691 -2773 -1402 2003 74
275 74 -4958 -4735 1547 2395 -5616 -8716 -879 449 -7322 -7458 -753 -3297 -10057 -5561 -739 -6040
291 -6040 -8677 -2800 -423 -5080 -7220 -3570 700 777 -3234 -3015 2427 3131 -1127 317 5881 3419
307 3419 -176 3791 5786 1426 1550 5480 4047 -613 364 2409 792 -252 -923 -2069 -1922 -2490
323 -2490 -4223 -3295 -1829 -4553 -6801 -3329 -2427 -6273 -5579 -529 -2329 -5388 -2281 -580 -1738 -658
339 -658 974 -145 255 2011 1319 933 2562 1877 -474 1550 1398 -822 -414 1456 -1468 -4029 -1376
356a376K17l392Q16J728j997j119J478K4m59J862J87j180J748K139j609J205L431
373C703q91q01K534J069j346J064K442k166q12K241n95j859Q39J27k266m67N11
390C327j993j128J835j954k435J748J72l049R59K608k039j436K645O12j140J867
406E99J735j291J145K161m98M89K468k79j504K488N26k068Q79J669k185j493K189
423G030o21l349O15J208k504j809R67n92j753O74o33j545J099M39k152R92K145
440B11j850j071L387j61k158K500K323k218j187L265L79j977M48P55q19m25l78
457A024j349N87k75k059p89K099k824l495K873J986m803k300M352j3l469r0K912
474e633j218p47J109J063l85l53M85K248Q99k807r46N337J267n500L2N537l65
$$ plain form
356 -1376 -1159 -4551 -3735 -2007 -4004 -5123 -3645 -3621 -4080 -2218 -2031 -3211 -1463 676 -933 272 3703
373 3703 2812 2011 4545 5614 4268 5332 7774 5608 4796 7037 6442 4583 5422 5549 3283 2816 3327
390 3327 1334 206 2041 87 -2348 -600 -428 -3477 -2518 90 -1949 -3385 -740 -128 -1268 599
406 599 2334 1043 2188 4349 3851 4340 6808 6529 5025 7513 8039 5971 6850 8519 6334 4841 7030
423 7030 6409 3060 3675 4883 2379 570 1537 945 -808 -134 -767 -2312 -1213 -774 -2926 -1934 211
440 211 -1639 -2710 677 516 -1642 858 3181 963 -224 3041 3420 1443 1891 2646 1827 1402 1024
457 1024 -325 262 -13 -2072 -2861 -762 -3586 -7081 -4208 -2222 -7025 -9325 -4973 -4986 -8455 -8545 -5633
474 -5633 -6851 -7598 -6489 -5426 -5811 -6164 -5679 -3431 -2532 -5339 -6285 -948 319 -5181 -5149 388 23
491B3n229J861L538l176k560L517J109l406j589K911K246k184l911K180N591q78
507D3n629K055O698k061l806N066L560m405p03P510J292o376L31Q195J846o225
523G391k316N889M344l982m432L975L712m801k231O077l71q152J517R506l716
538A2410j0374K883R712k266q827R9O680R06n539p58M449n10m755K593O148n167
554G684q328O676J0110q440j1158P386R951o431r444M001N602l802m439K466J885
569C719n982k517P155K861j0937n925J1521O877j3091q587J1596P449r707n703
583a1271P430J826o057J039P077l665q154L679J1243k434j3426M09J5311K191
597E198j5366l307J3515L171j0549Q5Q045l824o527Q822O783j0373q502J1620
$$ plain form
491 23 -5206 -3345 193 -2983 -5543 -2026 -917 -4323 -5912 -3001 -755 -2939 -6850 -4670 921 43
507 43 -5586 -3531 3167 1106 -2700 2366 5926 1521 818 8328 9620 3244 3575 11770 13616 7391
523 7391 5075 10964 15308 11326 6894 10869 14581 9780 7549 13626 13255 5103 6620 16126 12410
538 12410 2036 4919 14631 12365 3538 3637 10317 11223 5684 4926 9375 8865 4110 6703 12851 7684
554 7684 -644 6032 16142 7702 -3456 3930 13881 7450 -1994 2007 7609 3807 -632 1834 3719
569 3719 -2263 -4780 2375 5236 -5701 -11626 -105 6772 -6319 -14906 -3310 4139 -5568 -11271
583 -11271 -3841 -2015 -8072 -7033 44 -3621 -11775 -8096 3147 713 -12713 -12304 3007 5198
597 5198 -10168 -13475 40 3211 -7338 -7253 792 -3032 -9559 -737 6046 -4327 -12829 -1209
611a209J0975q972j3196P644J4088l689j2869K999J0870k865o714O429M480j0619
625b648j861J5093K929j6977m448J7905O665j5232p917J2005Q637p955p038O050
639E208L816o068Q7R263l476j3410M872J7887m661j9781K273J9512q40j6774j095
654c187J1918J014q565J006M991m861n525P804Q307j1987j2508J2360J6006j1549
668E224j8334R160J7229o948j3383N206Q625n146l398Q159M00j0768K38J5175
682A1439K668j7343o509J8016J0532j6085j2058J3822J0333j1138o699Q955J109
695G042r781L968J0931p861j4296O711J7699n286j9643L87J8518L161j6207m384
709i041J2634L023r368J178Q385o321p727J2073R805j4743j1973J5045J5063j1628
$$ plain form
611 -1209 9766 794 -12402 -4758 9330 5641 -7228 -4229 6641 3776 -2938 3491 7971 -2648
625 -2648 -4509 10584 13513 -3464 -7912 9993 16658 1426 -6491 5514 14151 6196 -842 5208
639 5208 9024 2956 3043 12306 8830 -4580 292 18179 13518 -6263 -3990 15522 14682 -2092 -3187
654 -3187 8731 9745 1180 2186 7177 2316 -3209 4595 12902 915 -11593 767 16773 5224
668 5224 -13110 -3950 13279 6331 -7052 -1846 6779 1633 -1765 6394 6794 -3974 -3736 11439
682 11439 14107 -3236 -9745 8271 18803 2718 -9340 4482 14815 3677 -3022 5933 7042
695 7042 -2739 1229 12160 4299 -9997 -3286 14413 9127 -10516 -10129 8389 11550 -4657 -9041
709 -9041 3593 6616 -2752 -1574 6811 490 -7237 4836 14641 -102 -12075 2970 18033 6405
723F405j5393P566J4247l978j1476K362P561m245n400O973K897j2552l891J6437
737G513L937j9382p497J8134Q219j5262r417J0442O634o933l990N348P9o541K949
752e767R976m219j4246M593J7775k115j9545K74J9239J587j5151j174J0589j056
766G60o549M269N089p306n433R657P873j0190j1103R507J4491p739j5506O411
780e769J3429l808j0052N025N607o115j968R601L23j1394p83J3840K927j3370
794b507n605J2828P727j0212q861P520P371o694m133O392k62q550K821J0330n227
809B938j1808M297J2476k992j2681J028J0757J066q647j853O492N15n006K346
823a072N674n650p111Q157Q374r577r417R062Q948p386r311M788P242l913n385
$$ plain form
723 6405 -8988 -1422 12825 8847 -2629 -267 7294 3049 -2351 4622 7519 -5033 -8924 7513
737 7513 11450 -7932 -15429 2705 10924 -4338 -13755 -3313 3321 -3612 -7602 -2254 -2175 -8716 -5767
752 -5767 4209 -10 -14256 -9663 8112 5997 -13548 -13274 5965 7552 -7599 -8773 1816 760
766 760 -5789 -1520 3569 -3737 -9170 487 8360 -1830 -12933 -3426 11065 3326 -12180 -5769
780 -5769 7660 3852 -6200 -1175 4432 -1683 -3651 5950 6273 -5121 -5904 7936 10863 -2507
794 -2507 -8112 4716 12443 2231 -6630 890 8261 1567 -2566 3826 3564 -4986 -2165 8165 2938
809 2938 -8870 -4573 7903 4911 -7770 -6742 4015 5081 -3566 -5419 1073 1588 -3418 -1072
823 -1072 4602 -1048 -8159 -2 8372 -1205 -10622 -1560 7388 2 -9309 -4521 2721 -1192 -6577
838f577J938K517l975j968N167J433q247l141R594L746j0791m602J0177M341q721
853i109l455P068K223n034Q38M481j771l891K846O601j742p201J489R502r7q735
869e987R8Q774P99p434P17O026k018l587M066K743m700l042N274M248m719m638
885c380L895N329k512n178K347N544k624m136L486L229m203j336N659J397o481
900A036k60N879J436n157j692M108K140l108k002K574K195k719j960K912M72l900
916A954K02M720j528n666J240N141j476m306Q74K930j132k245L30J716n65j800
932C89J13K114j002l151J291L476k231l914K106L185k719k258K314N75j826n73
948b111J457l28j118N2M14K87j132j158J437J884k509j539K413J735k590j074
$$ plain form
838 -6577 -4639 -2122 -6097 -8065 -2898 -1465 -9712 -12853 -3259 487 -10304 -14906 -4729 -388 -9109
853 -9109 -12564 -5496 -3273 -8307 -7469 -2988 -4759 -8650 -5804 797 -945 -8146 -6657 2845 2748 -5987
869 -5987 -5889 2885 3684 -3750 -3033 2993 975 -2612 1454 4197 -503 -3545 1729 5977 1258 -3380
885 -3380 515 5844 3332 -1846 501 6045 3421 -715 2771 6000 1797 461 6120 7517 1036
900 1036 776 6655 8091 2934 1242 5350 7490 4382 2380 4954 7149 4430 2470 5382 5854 1954
916 1954 2156 6876 5348 -318 922 6063 4587 281 1155 4085 2953 708 1038 2754 2189 389
932 389 502 2616 1614 -1537 -246 3230 999 -2915 -809 2376 -343 -2601 -287 288 -1538 -2111
948 -2111 -654 -982 -2100 -2048 -1634 -1347 -2479 -3637 -2200 -316 -2825 -4364 -1951 -216 -2806 -3880
964c880K759L9k098N02J783q32o65R20N62m22q0j94P54R83q82q72J418J043k078
983a240P14J789j023j411J367Q85j248k18J271k12r79N94K17k77L28k94p81Q59
1001C41L12j233K01J174j013j032J369J36j266J41J202r82o69R62Q4m67M57O39
1019C56r11N70K68m98L0J246q10n46J037L76r22M24P66o14q61Q90M86r81M27L37
1039A070q90k97M81r25l23O88J55j208J13M03j326J22J075j154q78J109L04j207
1057b688J45J226q97k33Q14m00L09N84k94Q4L75N30p93N46J435r27l38J364K45
1076A087j349Q34P11o60m33P43J53j034N09N26o56LK76o30L24L08q98o88J371
1095D97k41j764N37J565j306p26J130K99j444K82J038k93q25P86J67M99k75JN0
$$ plain form
964 -3880 -1121 -1082 -3180 -2678 -895 -1727 -2392 -1472 -910 -1332 -1412 -1606 -852 131 -751 -1623 -205 838 -1240
983 -1240 -526 1263 240 -1171 196 1081 -167 -385 886 674 -305 289 506 229 557 263 -518 341
1001 341 653 -580 -379 795 -218 -1250 119 255 -1011 -870 332 -650 -1319 -357 -273 -740 -283 356
1019 356 -555 15 283 -215 -185 1061 251 -295 742 1118 196 620 1386 772 -89 801 1287 306 733 1070
1039 1070 180 -117 364 -561 -884 -196 -41 -1249 -1136 -733 -2059 -1937 -862 -2016 -2894 -1785 -1481 -2688
1057 -2688 -2543 -1317 -2214 -2447 -1633 -2033 -1724 -1140 -1434 -1350 -975 -445 -1238 -692 743 -184 -522 842 1087
1076 1087 -262 572 1283 623 190 933 1086 52 561 1087 431 434 710 80 404 712 -186 -874 497
1095 497 256 -1508 -971 594 -712 -1438 -308 -9 -1453 -1171 -133 -426 -1251 -465 -298 201 -74 -73 -23
1114b3J239J81j390J253J323j354k19K273l08k042P56K148p34j446R02Q36o49
1131B746n53J11M58J09o17j134J275J82j962l73K123j428k284J378J932k352k152
1148b541K193J160k142m28R78J68o57k08M18O38n83q82J451J814k159j867L397
1165G50J903l322j274L371O83k515L86K000m79j386J02J528o0k427L91K376n1
1182A976l141q85L917j21m272j32L784j032l351R72K544k112k179K613J865k936
1198b490k434K909K490j611l133J544M011j207l565K003L311j742k180L339J700
1213B945l844q64N103Q29m334j091M852J773m136k016L365K259k871k021K380
1228B329J562l685l75L998o64n982J120O327j648o370P77N516p57n328L30L529
$$ plain form
1114 -23 1216 1397 7 1260 2583 1229 1010 3283 2975 933 1689 3837 3103 1657 2559 3395 2746
1131 2746 2193 2304 2762 2871 2254 1120 2395 2577 615 242 2365 937 -1347 31 1963 -389 -2541
1148 -2541 -348 812 -1330 -1758 -780 -612 -1269 -1477 -1059 -421 -1004 -1886 -435 1379 -780 -2647 750
1165 750 2653 -669 -1943 1428 2111 -404 -18 1982 1503 117 219 1747 1687 -740 -349 2027 1976
1182 1976 -1165 -2050 1867 1746 -2526 -2658 1126 94 -3257 -2285 259 -1853 -4032 -1419 446 -2490
1198 -2490 -4924 -2015 475 -1136 -4269 -2725 1286 79 -3486 -1483 1828 86 -2094 1245 2945
1213 2945 -899 -1763 3340 4169 -165 -1256 3596 5369 1233 -783 2582 4841 1970 -51 2329
1228 2329 3891 206 -169 3829 3165 -2817 -1697 4630 2982 -3388 -2611 2905 2148 -3180 -2850 679
1244F79m16k625L91K884j757l060K644M081l231n243M052O326m463n764M332N285
1260D115l261l477K844K405k900j146L170R06m283j212M943K394o005l536N994
1275I51M066o248m287N413K944n382j283M291q38m615K113M474k612n490J717
1290d786O778j357o663j0O812R37o441m31N514J1m855K194M459l797l917N597
1306D5M626o010m504N169N765l885o013L125N829k420m958K386L514l219k527
1321c077M760J872p293j580Q433J873r300k385P794K547o184k976M628K190l699
1336b397j563L635l00m032R10O149j847p486J598R092j254q947O71Q474p26o160
1352d183Q09M506j302l400L057K923l921l710N217N190n441o752N164P733m757
$$ plain form
1244 679 263 -2362 -1971 913 -844 -3904 -1260 2821 -410 -5653 -1601 4725 262 -5502 -1170 4115
1260 4115 854 -2623 221 2626 -274 -1420 1750 2656 -1627 -2839 2104 4498 -1507 -5043 951
1275 951 5017 -1231 -5518 -105 2839 -2543 -3826 465 -373 -4988 -2875 1599 -1013 -6503 -4786
1290 -4786 1992 635 -6028 -6038 774 1711 -4730 -5161 353 364 -4491 -2297 2162 -1635 -5552 45
1306 45 4671 -1339 -5843 -674 5091 1206 -4807 -1682 4147 1727 -3231 -845 2669 -550 -3077
1321 -3077 1683 3555 -3738 -5318 3115 4988 -4312 -6697 1097 3644 -2540 -5516 -888 1302 -2397
1336 -2397 -3960 -325 -625 -4657 -3747 2402 555 -6931 -5333 3759 2505 -6442 -5771 2703 1977 -4183
1352 -4183 -3374 1132 -170 -3570 -513 2410 -1511 -5221 -4 5186 -255 -7007 -1843 5890 1133
1367A133p584L949O654m203m059L605K217m269j093N437N48o821o25O907K393
1382D189p567l331P002L879n782l949N791K647n385k10N233j214n650K587P173
1397E413l538p100K997P657j316p551J62O553P43n727j28M821j020m282K679M318
1413D681m660m795O067N271o650n577O050N323m277n406L258L911k316k969K699
1428F10K054l508k015M808J787o510k067P593K520p691k948O813K715n418j976
1443c233L968P88l524M49L419j695l156J093M945j131o341J492P041q72p178R16
1459c019O129k07n337J659L516k056k925L456K640m293k921L794L905l551m564
1474c774L218M512k336m981K344L970k539k458L285J259m346l10N190m9m910j88
$$ plain form
1367 1133 -6451 -2502 4152 -51 -4110 -505 1712 -2557 -3650 1787 2335 -4486 -5111 1796 4189
1382 4189 -3378 -6709 293 4172 -1610 -5559 232 2879 -2506 -2716 2517 1303 -4347 -1760 5413
1397 5413 1875 -5225 -2228 5429 4113 -3438 -3276 3277 4020 -1707 -1835 2986 1966 -2316 363 4681
1413 4681 21 -4774 1293 6564 -86 -5663 387 5710 1433 -3973 -715 3196 880 -2089 610
1428 610 2664 -844 -2859 1949 3736 -2774 -4841 2752 5272 -2419 -5367 1446 4161 -1257 -3233
1443 -3233 735 1523 -2001 -1552 1867 172 -2984 -1891 3054 1923 -4418 -2926 4115 3243 -3935 -3019
1459 -3019 3110 2903 -2434 -775 2741 685 -2240 1216 3856 -437 -3358 436 4341 790 -3774
1474 -3774 -556 3956 1620 -3361 -1017 2953 414 -2044 1241 2500 -1846 -2156 3034 2985 -1925 -2113
1490b113N055J181m852j359L773K555l482k224L601J543l472k57L828m14m462
1505a099R23N054j517m935J399M515j326l770O88L073o46k237L97J706q09k110
1521f94J701K971k561l471L042L715l483l229L793K901l389k042K606J594k083
1536A371q11J569R08j805p94J998J125k966j571L206J343l058j513K899P02l032
1552d29j75K524n21k337J125J638j298j828J355K053o35k379n5K921M27k859k95
1569g68L034n71k655N75K607j314j871J770J236k142r66J602J008j515q94N36
1585c28Q48o74j148M87J370j245j120J232J276j941q72K469Q5j959j01J854L99
1602F32j719J33Q73J79n29r3J22J326q81j032J135L39j108j70J739n03j506M40
$$ plain form
1490 -2113 2942 4123 -729 -2088 1685 4240 758 -1466 2135 3678 206 -51 3777 3363 -1099
1505 -1099 -176 4878 3361 -1574 -175 4340 3014 -756 -68 3005 2359 122 519 2225 1416 -694
1521 -694 1007 3978 1417 -2054 988 4703 1220 -2009 1784 4685 1296 -746 1860 3454 1371
1536 1371 560 2129 3037 1232 438 2436 3561 595 -976 2230 3573 515 -998 1901 2603 -429
1552 -429 -604 1920 1399 -938 187 1825 527 -1301 54 2107 1472 -907 -962 1959 2386 -473 -768
1569 -768 2266 1695 -960 -385 2222 908 -963 807 2043 -99 -1065 537 1545 30 -864 -328
1585 -328 520 -154 -1302 -815 555 -690 -1810 -578 698 -1243 -2115 354 439 -1520 -1621 233 632
1602 632 -1087 -954 -81 98 -431 -524 -402 924 43 -989 146 485 -623 -793 946 443 -1063 -623
1620f23J346p69j129Q53N21p39p9M2M79M5n87O1Q37K31j288L98J831o02j467R25
1640B86R42p19l16P16J57p82K35K95j59L58P1k79m3l4l40m9J195j270m86P92N49
1661A119j130q6Q78m02o97M96N63n21OJ89n4l53M98l91j31Q57L6p47R0Q10n90
1682D40MN85j36o08L24J82j119O46L65j57n96L29j12k09J56r4m80L65J88o69j37
1703g33J046n23r51N37O94q12k10Q52j004l0M96j83j71O24m3n87L54Oj00N10J00
1724a28m09R3O11J1j073N26R30m47o67R94j19j36j61N53l58J16K12m18K07M87
1744H24l17o79P25K55o74P1P11q36k47R56k98q00M26O29n29l93K55L62l03N09
1764F47l10L99N71l54p75J000O80q72n72J457r9q34L87J019r04l35P00M25p34
$$ plain form
1620 -623 723 -46 -1175 -322 199 -540 -619 -577 -98 -53 -640 -579 258 489 -799 -401 1430 828 -639 286
1640 286 1228 509 193 909 1066 284 519 814 655 1013 1084 805 762 728 388 339 1534 264 -222 570 1119
1661 1119 -11 -97 781 379 -318 178 741 220 226 415 361 8 506 115 -16 841 877 130 220 1030 440
1682 440 444 1029 893 285 609 791 -328 318 683 526 -70 259 147 -62 94 0 -480 -115 73 -596 -733
1703 -733 313 -210 -1161 -624 70 -742 -952 -100 -1104 -1134 -638 -821 -992 -368 -411 -998 -644 -638 -738 -228 -128
1724 -128 -537 -444 167 178 -895 -369 561 114 -553 441 322 186 25 578 220 336 548 130 337 824
1744 824 507 -172 553 808 134 205 916 80 -167 789 491 -309 117 746 217 -176 79 441 138 647
1764 647 337 736 1307 953 178 1178 1858 986 414 1871 1772 938 1325 2344 1440 1105 1805 2230 1496
1783A496j19N30k36m54j08j00M78j31o19l18J335n57j370R42R44j276r14J595
1801A118K1r68l54J250j74r50Q4L52M52k96o56Q14N23n24j146J595K12j494j80
1820c21J904k87k124O13K108j123j020L16J524p51j070N42R22j8j259J86J324
1837A466n23j298P72J585j051k764J948J834j379j863J613R93j447n58P59N82
1853F69j353m51J423M5j178p44J811J115k333j302K943J137k497m97K480J60j682
1870b54P8K170m77j617N45J747k65j586K51K250n3k575p4K935k04k863K73K201
1888B482q78k175J305J631j958j946J884J577k091j960J856J993j441k358J614
1903d65K299j567j699J432J929k033j202L045R44l137n95L820L33k843j011L359
$$ plain form
1783 1496 1377 1907 1671 1217 1109 1009 1487 1356 737 419 1754 1197 -173 769 1713 437 -477 1118
1801 1118 1139 171 -183 1067 893 -57 27 379 831 535 -121 693 1216 692 -454 1141 1353 -141 -321
1820 -321 1583 1296 -828 -215 1893 770 -250 66 1590 839 -231 311 1233 1215 -44 142 1466
1837 1466 943 -355 417 2002 951 -1813 135 1969 590 -1273 340 1333 -114 -672 87 669
1853 669 -684 -1135 288 333 -845 -1589 222 1337 -996 -2298 645 1782 -715 -1212 1268 1428 -254
1870 -254 -176 1994 1517 -100 445 2192 1927 341 592 2842 2789 214 140 3075 2871 8 281 2482
1888 2482 1604 -571 734 2365 407 -1539 345 1922 -169 -2129 -273 1720 279 -2079 -465
1903 -465 1834 267 -1432 0 1929 -104 -1306 1739 2683 -454 -1049 2771 3104 261 -750 2609
1919B609O73k423r01K137O87j838q75K308j96k863N68K833q40l855R62L808j038
1936A756m219J134L238j298k798J114K126j057k006J593J727j750k468K404K990
1951B486k551l144K667L391k627l004K669K434l068j388K384J123k581p89K862
1966H64M62l243q51L722J107l969j517L773J491l776j272L280M10l223K62L073
1982E93j045l048J489L433k073l034R68L366o94l753M48L779k15l698J038K482
1998C6j212k691K005K771k792k614L348K732l159k725L081K615k578k152J948
2013a387K484j707k291K546J703k708j060L347J410l803j276M257J044m206j190
2028b837M342N34l138p12K785K77k588L16K519q8l566R64L722p09m286J243L928
$$ plain form
1919 2609 3282 859 -42 2095 2782 944 69 2377 2181 -682 -114 2719 1879 -1976 -1014 2794 1756
1936 1756 -2463 -1329 1909 611 -2187 -1073 1053 -4 -2010 -417 1310 -440 -2908 -504 2486
1951 2486 -65 -3209 -542 2849 222 -2782 -113 2321 -747 -2135 249 1372 -1209 -1998 864
1966 864 1326 -1917 -2768 954 2061 -1908 -3425 348 1839 -1937 -3209 71 481 -2742 -2480 593
1982 593 -452 -3500 -2011 1422 -651 -3685 -2717 649 -45 -3798 -3350 429 214 -3484 -2446 36
1998 36 -1176 -3867 -1862 909 -1883 -4497 -1149 1583 -1576 -4301 -1220 1395 -1183 -3335 -1387
2013 -1387 1097 -610 -2901 -355 1348 -1360 -2420 927 2337 -1466 -2742 1515 2559 -1647 -2837
2028 -2837 1505 2039 -1099 -1811 974 1251 -1337 -1021 1498 1410 -2156 -1192 2530 1821 -2465 -1222 2706
2045B706p70l960J019L717j060k895J450K348j711j793J948K180k520k237K339
2060G61L241k927l172K714L371k717k810K773K084k944j778L430M92l120m78L130
2076B050M72l654o00L421Q99l563j390L039J540l052j313K975O68l179J1L314
2092A638j204l381J360L677j975l101J103K862o22k724M98K327p79k012O51K496
2108H14j564k308J852K572k544k421K806K381k867j859K171K289k093j702K018
2123d55Q79j680o68J712R23k413l79K508P65k695j239L001J349l053j003L299
2139H51J66k465L65J791J1k121O88J656r2k095N30K327j80k555M25K907m72k408
2157f71M25K717j311k010J224J538j508j110J575J346j740j184J127J566j479
$$ plain form
2045 2706 1936 -2024 -1005 2712 1652 -1243 207 2555 844 -949 999 3179 659 -1578 761
2060 761 4002 1075 -2097 617 3988 1271 -1539 1234 3318 374 -1404 2026 2518 -602 -1080 2050
2076 2050 2522 -1132 -1732 1689 2588 -975 -2365 674 2214 -838 -2151 824 1492 -1687 -1676 1638
2092 1638 434 -2947 -1587 2090 115 -2986 -1883 979 357 -2367 -1869 458 -321 -2333 -1682 814
2108 814 -750 -3058 -1206 1366 -1178 -3599 -793 1588 -1279 -3138 -967 1322 -771 -2473 -455
2123 -455 424 -1256 -1924 -212 711 -1702 -2081 427 1192 -1503 -2742 259 1608 -1445 -2448 851
2139 851 1017 -1448 -1083 708 719 -1402 -714 942 850 -1245 -715 1612 1432 -1123 -698 2209 1737 -671
2157 -671 -246 2471 1160 -850 374 1912 404 -706 869 2215 475 -709 418 1984 505
2172E05j187J015K081j780j509J656J481j856j031K154L13j943m87K292K03k163
2188b56J09J628Q3j817n36J780O3j444k82J100J36j743k35J812l94k024P47J975
2206G02q10j856P70J296m60j264O04J169l23p84M71N12j37r92O31J040k85j807
2224a523J208J646j685j124J523R47j296o50R73L72j352K64O49J16q28n8K1P98
2242Ap59q30Q69O28q14r73J766j20o21J34J083k40q03R09K90k60k24K50Q55n01
2262F40n13N16P57j37r19QJ406l90j072N79N86o91o16O89K51l69l88N98L13l36
2282I12l32l1K75l2j66j12M10J27r06O55L84q10n4Q07j1o51j9N63q5l27K72l3
2304H36r1k52j90L18P02m61o13M80L30o40J35N81j43p88M14K28k4k57J68r4O9
$$ plain form
2172 505 -682 333 2414 634 -875 781 2262 406 -625 1529 1842 -101 -588 1704 1907 -256
2188 -256 -147 1481 1564 -253 -789 991 1054 -390 -672 428 564 -1179 -1414 398 4 -2020 -1273 702
2206 702 -108 -1964 -1194 102 -358 -1622 -1018 151 -172 -956 -485 27 -110 -1102 -471 569 284 -1523
2224 -1523 -315 1331 -354 -1478 45 992 -304 -954 19 391 -961 -697 -48 68 -760 -818 -797 1
2242 1 -758 -1588 -719 -91 -905 -1878 -112 -232 -853 -719 364 124 -679 230 520 260 36 286 1141 640
2262 640 127 643 1400 1263 344 352 1758 1368 296 875 1461 770 154 843 1094 725 337 935 1248 912
2282 912 580 549 824 792 626 514 924 1051 145 800 1184 374 320 1127 1116 465 446 1009 924 597 869 836
2304 836 745 493 303 621 1323 862 249 729 1059 419 554 1135 992 204 618 846 822 565 733 639 708
2325G08k05L52j2k93J30l97R9K66j58k39N88k95n04J09K50m66k93P38j87l42L13
2346A62l26l86K54Q1k02P0K65p6j21L14J70q11P54L15n98Q5M25l41l06J72P63
2367F63n47l10M80k87k49K54m17M0P5Ll99K17J02n39K35K2k06m45L38K07p80Q0
2389a463N83l37n92K55M69j10k75K96l9M26rl88K51K31l12l31Q11k61j87J12M71
2410c99k27k63K36L30r6K9j64L56k22J33J71j13L08m02j61N39J3k66o9J056q19
2431c0k71M10M96m51m36Q12l39J67m9L42j57K01K4j4M89l57j33K99N87n88l57
2452F45Q36P7q78J38J385q50l66L13J37j03l95L4N36j63n74l10N91M12q25m84
2472A56Q78k75r16Q9R85p43p05O20O6n10l96N27K10m13m42J90M17j15q83N00L47
$$ plain form
2325 708 503 855 843 550 680 283 382 648 490 251 839 544 40 149 399 -67 -360 378 191 -151 162
2346 162 -164 -550 -296 -215 -417 -347 -82 -158 -279 35 205 -606 148 463 -135 -50 375 34 -272 -100 663
2367 663 116 -194 286 -1 -250 4 -413 -373 -298 -295 -694 -477 -375 -914 -679 -657 -863 -1308 -970 -763 -1543 -1463
2389 -1463 -880 -1217 -1809 -1554 -1085 -1195 -1470 -1174 -1213 -787 -796 -1184 -933 -702 -1014 -1345 -534 -795 -982 -870 -399
2410 -399 -626 -889 -653 -323 -419 -390 -554 -198 -420 -287 -116 -229 79 -323 -484 55 68 -198 -267 789 -30
2431 -30 -301 109 605 154 -282 530 191 358 309 651 494 695 719 705 1194 837 704 1003 1590 1002 645
2452 645 1481 1558 680 818 2203 1353 987 1300 1437 1334 939 973 1509 1346 772 462 1053 1465 640 156
2472 156 1034 759 -157 -68 917 174 -531 89 155 -355 -751 -224 -14 -427 -869 -679 -262 -377 -1260 -760 -413
2493d13o37p39J016R21j132p59J188r1q29k30J511k74q88m47J034K28p27m73P28
2512a013M32j016j7J004L78j611M50J310l22j513N30J425n54q41Q49Q01n23p32
2530i63P03Q08o05o47N93J266n91j059O42J456j063j165J477P10j262m28J325
2547A197O50j237l99J280J51r61k90J183N15j024m84J053P77j665n14J657N23
2564B412j951k40J794L8j479K43J188k18j635M73J697r50j250j52J810m51j838
2581e09L01J589k47j837N69J420j325j554J755R64j478j121J371J142j744j066
2597a770J372J118j291j094J258R94j189j120J584J136j941j054K188J27j899
2612a581o55K297J27k077K49J662n1j832K84J578j51j714Q7J756L2j710K25K257
$$ plain form
2493 -413 -1050 -1789 -773 148 -984 -1743 -555 -646 -1475 -1705 -194 -468 -1356 -1803 -769 -541 -1268 -1741 -1013
2512 -1013 -581 -1597 -1614 -610 -232 -1843 -1393 -83 -405 -1918 -1388 37 -517 -1358 -509 292 -231 -963
2530 -963 -260 548 -57 -704 -111 1155 564 -495 147 1603 540 -625 852 1562 300 -128 1197
2547 1197 1847 610 211 1491 1642 681 391 1574 2089 1065 581 1634 2411 746 232 1889 2412
2564 2412 461 221 2015 2053 574 817 2005 1787 152 625 2322 1372 122 -30 1780 1329 -509
2581 -509 -208 1381 1134 -703 -134 1286 -39 -1593 162 1126 -352 -1473 -102 1040 -704 -1770
2597 -1770 -398 720 -571 -1665 -407 587 -602 -1722 -138 998 -943 -1997 191 318 -1581
2612 -1581 -2236 61 188 -1889 -1640 22 -29 -1861 -1577 1 -150 -1864 -1777 -21 11 -1699 -1474 783
2630G83r48j968P75K312q09j719Q50J614p88j523J278J153j018j198J187J223
2646A204j132j674J538J861j854j449J636J468j645j482K122Q38j851o03J743
2661G20O06j994j61J993j60j571m35K154O18k100n41K089M99k102q23K366J95
2678A353k062N43J931p07k098P72J732n94j920Q86J539p64j619L42J762p44j616
2695a264Q64J887j280j839J796J532j809j549J693J296j649j131J418J098j127
2710f4j488J749R31j544p84J781P20j825o25J984N47k331l77K394J50k246l6J961
2728H97J15j968L03J527k9j587P0J797n44j312r3K124l32k053N37J926q61j733
2746a216J076J756j290j498J466J089j166j038J107Q84j142j179J426R55j052
$$ plain form
2630 783 -165 -2133 -1358 954 145 -1574 -724 890 102 -1421 -143 1010 -8 -1206 -19 1204
2646 1204 72 -1602 -64 1797 -57 -1506 130 1598 -47 -1529 593 1431 -420 -1023 720
2661 720 1326 -668 -829 1164 1004 -567 -1002 1152 1770 -330 -871 1218 1717 -385 -1208 1158 1353
2678 1353 -709 -166 1765 1058 -1040 -268 1464 870 -1050 -164 1375 611 -1008 -666 1096 352 -1264
2695 -1264 -400 1487 207 -1632 164 1696 -113 -1662 31 1327 -322 -1453 -35 1063 -64
2710 -64 -1552 197 1128 -416 -1200 581 1301 -524 -1149 835 1382 -949 -1326 1068 1218 -1028 -1064 897
2728 897 1012 -956 -653 874 845 -742 -672 1125 581 -731 -824 1300 968 -1085 -548 1378 517 -1216
2746 -1216 -140 1616 326 -1172 294 1383 217 -821 286 1170 28 -1151 275 1230 178
2761A78j458J167J597j624r26J885M48j430n40J734L07j569j58J651L80j620l95
2778c73J602P0j018k26R49M32j449j07J463K44j794K30K080q05j847J048J258
2795A757m76j409M93J127o19r63N19P92k83j066L99J261p33r38P77R70j086r36
2813d14J580P39j289p99J127N48j345J4J032K49j049k63J129J59j163k39R77L27
2831A320j040l47J380r6j338j5J518k87j170M92Q66n22j117M53M82k1p75K75Q61
2850I19m15q94K08P32k24j002N12Q93p74q76J083L84j137J76M44L77o61l39L03
2869b91M27k74o42N50P41n95o97L05J136j040n87O67N22j116n8Q38j93n78K0O25
2889b40m06j34k01M11L74j017Q9N54pp79j82J007m66p04K88P81n58o84O07K66
$$ plain form
2761 178 -1280 -113 1484 -140 -1066 819 1267 -163 -703 1031 1338 -231 -389 1262 1642 22 -373
2778 -373 1229 1299 281 55 1004 1436 -13 -120 1343 1587 -207 23 2103 1298 -549 499 1757
2795 1757 1281 -128 365 1492 873 -90 429 1221 938 -128 271 1532 799 -139 638 1608 522 -414
2813 -414 1166 1905 616 -183 944 1492 147 161 1193 1442 393 130 1259 1418 255 16 993 1320
2831 1320 280 -67 1313 1217 -121 -136 1382 1095 -75 417 1283 761 -356 97 579 558 -217 58 919
2850 919 504 -390 -182 550 326 -676 -164 729 -45 -921 162 546 -591 -415 29 406 -255 -594 -291
2869 -291 136 -138 -780 -230 511 -84 -781 -476 660 -380 -967 -300 222 -894 -952 -114 -307 -885 -865 -240
2889 -240 -646 -780 -981 -570 -196 -1213 -1124 -570 -577 -1356 -1538 -531 -997 -1701 -1413 -632 -1190 -1874 -1267 -1001
2909a001k03m33L55L42j23r2p6L07J09m82L26L60k86o83P85L30m32l95P48J0o62
2930a196K74N97j96j71K6lO59r38j30K62N92l49l67P16M5o56K32O70l70l91J15
2951e79O03k93l08L80K29l01K17M15l52L4R6M7J30K82o01J93M80L1n40L56M40
2972I59m25j82M44k35L3J95o8J71k10r4K5j30O5m09J6K40J27l07j97L77n61Q3
2994h3N57k51p92N57K2j73n2l23K30j44K39l5o4J55k12k62M76K79n53mN29l86
3016b90KK66j47p1j77J40m0j47Q0K30K5k03J7m9L25k1n75ML52m8l24K02r8J8J08
3041d21J09j2j73L03j19l91O15k60M9J46Q6M7l37N61m0k93N15Ro84N62M44j63
3063E53l46O25m21k59J30L0L76j86o3p1L15o3m29O9j18M63j95m59N14j70n08K81
$$ plain form
2909 -1001 -1204 -1637 -1282 -940 -1063 -1155 -1231 -924 -815 -1297 -971 -611 -897 -1580 -795 -465 -897 -1292 -544 -534 -1196
2930 -1196 -922 -325 -521 -692 -666 -669 -10 -948 -1078 -816 -224 -573 -940 -224 -179 -835 -603 67 -303 -694 -579
2951 -579 24 -269 -577 -197 32 -269 -52 363 11 45 141 188 318 600 -1 192 672 703 163 519 959
2972 959 534 352 796 561 594 789 721 892 682 588 613 483 548 139 155 395 522 215 18 395 -166 -83
2994 -83 474 223 -569 -12 10 -163 -215 -538 -308 -452 -213 -248 -312 -157 -369 -631 -155 124 -429 -433 96 -290
3016 -290 -288 -22 -169 -240 -417 -277 -317 -464 -384 -154 -129 -332 -315 -364 -39 -60 -635 -631 -279 -327 -651 -449 -547 -529 -421
3041 -421 -312 -324 -497 -194 -313 -704 -89 -349 -300 -154 -68 -21 -358 203 163 -130 385 394 -290 272 716 553
3063 553 207 832 411 152 282 312 688 502 439 368 683 620 191 260 142 605 410 -49 465 295 -213 68
3085F8K01m27p8N86o28K83k07J90k58R6N5k2R3J9k21K17L05n72m25O95J51p19
3107e98K45N98k72m98L57j24J84j38L7k08J94k52m7K83K82m78J29rJ20p23M93
3128d25J32r6m60N86j16k49j15M00p0k0k74K26K55m25j11M41K41j89m81L11L84
3149e5p76J93P68q1j045L34O69j57r99Q05K76l84k33K05L66k02k45j82O78j81
3169b46o79L7Q58m34m03K11Q93p97n09P57R2m26o67O81J97j36l52J80J41j03j73
3190h78K34N81l29m36K90M89l90n92Q56N30j071J94N75P3q75K31P49k84m75N1
3210d77O08K22q02LR99k01n33J33J084n10j178P30P45k77p57K56R06p85o07N69
3230A28N06m83m22P01K64j83r02M99J231j139q10J091N19o80m92P70J34o17n46
$$ plain form
3085 68 269 -158 -236 350 -278 5 -202 -12 -270 -174 -119 -141 -48 -29 -250 -33 272 -300 -725 -30 121 -598
3107 -598 -353 245 -27 -525 -168 -292 -108 -246 -209 -417 -223 -475 -522 -239 43 -435 -306 -315 -195 -918 -425
3128 -425 -293 -389 -849 -263 -379 -628 -743 -343 -413 -433 -707 -481 -226 -651 -762 -321 -80 -269 -750 -439 -55
3149 -55 -831 -638 130 49 -996 -662 7 -150 -1149 -344 -68 -452 -685 -480 -114 -316 -561 -743 -65 -246
3169 -246 -925 -888 -30 -464 -867 -656 237 -560 -1069 -312 -220 -646 -1313 -632 -435 -571 -923 -743 -602 -705 -878
3190 -878 -644 -63 -392 -828 -538 -49 -439 -1031 -175 355 -716 -522 53 126 -749 -518 231 -53 -528 -477
3210 -477 131 353 -449 -446 553 352 -181 -48 1036 526 -652 78 823 546 -211 45 951 166 -441 128
3230 128 634 151 -271 430 694 511 -391 108 1339 200 -610 481 1000 320 -172 598 732 115 -431
3249d31J264%j102r5R85n3n07p73J259L00j207n31J280j3j340N69J261o24j498
3268a256P52J075o59p72K88R15n81j008P45O43l09j037M57Q10k92j073O24J004
3286C26p77r95J070N56q40k47L85P34j064k82R28L44r13n00R56M99j001k97J326
3305B08J13j109j51J256J86j175k69J398l4j042J78J229l60r43k7J222K42j357
3323d35p3J080N3j155K08J307j71j270L80J205n21j157Q82Q63p37r53J081N69
3341A156q18l82L06M75k82q45P68R07j043o34Q99O44j328m59J350K25j215k82
3359e58J105K68j366OJ140k13m52l24P86N6r76J02J127N1j714L97J022k12r71
3378g26L1J310p60n92J50J284q58r51P56R41q83q06P70L19p5j009N39J141p58
$$ plain form
3249 -431 833 833 -269 -364 621 568 61 -712 547 847 -360 -891 389 376 -964 -395 866 242 -1256
3268 -1256 -504 571 -88 -860 -572 343 -238 -1246 -501 142 -167 -1204 -747 63 -229 -1302 -678 326
3286 326 -451 -1446 -376 180 -660 -907 -522 212 -852 -1134 -206 138 -775 -1275 -319 180 -821 -1118 208
3305 208 321 -788 -939 317 503 -672 -941 457 423 -619 -441 788 428 -515 -542 680 922 -435
3323 -435 -508 572 625 -530 -322 985 814 -456 -76 1129 608 -549 333 1196 459 -494 587 1156
3341 1156 338 -44 262 737 455 -390 378 1285 242 -392 507 1151 -177 -636 714 939 -276 -558
3359 -558 547 815 -551 -545 595 382 -70 -394 392 448 -528 -426 701 752 -962 -565 457 245 -726
3378 -726 -695 615 -145 -737 -587 697 -161 -1112 -356 585 -298 -1104 -334 -15 -90 -1099 -560 581 -177
3397a77j194J225O59j167m81J317L66j167m43J195K42q49j70O00K92p25n41J051
3415C3N41j042m44J296J30j262p7J219j80q28K49Q11k53p57K30O33k29p07N13
3434a24N93P1j144J01J145n77o36J1J436o63r70Q30P16q56l94P04N97p18m65L59
3454A6Q26q90l57Q35M09n99n88O15P12p20q27J071K06q06k2Q47k12p49Q5P30n8
3475E24n37l5K77L30q64lP08K08m90k46O98m2o19K86P61m96o96R4P73m66m85N71
3497B51J24om93L23N25m39n01M79L27j12o98J65P73l73n36O15L35n82m32P59K9
3518E33m76L36j31n61L53j28K68K52k33k17K17L71o99m1M89J84l79k89O15j51
3538C13r43Q07N10m27n03K58M59j9p72N31J60k6k9k10M15k38k99l1P89m06k90
$$ plain form
3397 -177 -1371 -146 513 -654 -1135 182 548 -619 -1062 133 375 -474 -644 -44 248 -477 -1018 33
3415 33 574 -468 -912 384 514 -748 -825 394 214 -614 -365 446 193 -564 -334 299 70 -637 -124
3434 -124 469 540 -604 -503 642 65 -571 -560 876 213 -757 73 789 -67 -461 243 840 122 -343 16
3454 16 842 -48 -405 430 839 240 -348 267 979 259 -568 503 709 -97 -119 728 516 -233 -148 582 524
3475 524 -13 -48 229 559 -305 -308 400 608 118 -128 570 528 -91 195 956 460 -236 -142 631 165 -320 251
3497 251 375 369 -124 199 724 285 -216 263 590 478 -220 -55 718 345 -191 424 759 177 -255 504 533
3518 533 57 393 262 -299 54 -74 194 446 213 -4 213 584 -115 -156 333 517 138 -151 464 313
3538 313 -630 177 687 260 -243 15 474 455 -317 214 374 348 319 109 524 286 -13 -44 745 339 49
3559D9M54J40o48j8L06O9k89m0J59kL7j84M3M38m27k31R0M71k63m08M42l6j59
3582gk88O58n33j4M19j12j36k0k76N10j69j2j06j05K71j08l05L10k08k31L1N57
3604A26k20m00R2M09n24J25J04J91l57K08l12K82rm58M39K33k75l26J46P02o14
3625d38r6N28j98j70j80O32n71J82k33P4p2R1j23J61N49m12j37O2M02n88qM99
3647d6j49k30K24O4N20p22L78J9k7P3j15j27J07j45o4J72K71k54k27K50L33n52
3669b47J22L68n69L12J45O7l71J69j02n6L82k34j93K95j85p9L67l80qj09K09J20
3691B3j82l62P31l38k18M0J06J76j69j52k2K32k84J05K56k19J30j87J59Q0o68
3712g63K83K08jm4j4K05o7J4N9k3j03k2J51m8K05k15k63P4O00m82Q6J39P2m41
$$ plain form
3559 49 503 643 -5 -23 283 352 63 23 182 180 217 33 76 514 87 -144 -54 417 154 -254 188 152 -7
3582 -7 -295 363 -170 -184 235 123 -13 -33 -309 201 32 20 -86 -191 80 -28 -333 -23 -231 -462 -431 126
3604 126 -94 -494 -402 7 -517 -392 -288 -97 -454 -246 -558 -276 -285 -743 -304 -71 -346 -672 -526 176 -438
3625 -438 -534 -6 -204 -374 -554 78 -493 -311 -544 -470 -542 -451 -574 -413 136 -276 -413 -351 51 -537 -545 -46
3647 -46 -195 -425 -201 -137 383 -339 39 58 31 104 -11 -138 -31 -176 -240 -68 203 -51 -278 -28 305 -247
3669 -247 -125 243 -326 -14 131 198 -173 -4 -106 -162 220 -14 -207 88 -97 -176 191 -189 -197 -306 -97 23
3691 23 -159 -521 210 -128 -346 -306 -200 -24 -193 -345 -367 -135 -419 -314 -58 -277 -147 -334 -175 -95 -763
3712 -763 -480 -272 -273 -317 -331 -126 -193 -179 -120 -143 -246 -268 -117 -165 40 -175 -438 -364 236 -246 -160 -21 51 -390
3736c90K38O9k48R1K81P9k02J13K67k29N00n99L56K7j47M4p7K04m77pM25m8q2
3759A88q5L70l12k48K19M77m46J88J10j3k19j87o8J54J37r1j51K36P4o98M69L81
3781D85o04J2J40K60k74k16K15N4m54K73J22P4k41J22K07k30J34m59J61K01k71
3802b89l18M62n8m18Q6N37J31n40K14K91j58r8p0J48P3m51L88K06K04q42M99L81
3824C78m24k68N58j6n45N8L54K40r6k54J08J34k97m31O96J77k85m58N70L98o59
3845f2j53O47R5o37j69P29J62o45M11O9j17l85J35N05l92m09M79L17n53j9J56
3866A64L77k33l91O11Q0k19n58L28M35l55o32M32M88n66j35M26n2l01k90L69L36
3887C14k30l84M20K29n90m2N57N10r93P9N7N66q67MM79J48l90j16L43J50l33l64
$$ plain form
3736 -390 -152 -83 -331 -240 41 120 -82 31 298 69 569 -30 326 353 206 250 173 377 -100 -107 318 270 188
3759 188 103 473 161 -87 132 609 163 351 461 448 229 42 -26 128 265 174 23 259 333 -365 104 485
3781 485 -119 -107 33 293 19 -197 18 72 -382 -109 13 87 -154 -32 175 -55 79 -380 -219 -18 -289
3802 -289 -607 -145 -203 -621 -535 2 133 -407 -193 98 -60 -158 -228 -80 -7 -458 -70 136 340 -502 -3 378
3824 378 -46 -314 244 228 -317 -259 95 335 239 -15 93 227 -70 -501 195 372 87 -371 199 597 -62
3845 -62 -215 432 527 -110 -279 450 612 -33 378 447 330 -55 80 585 193 -216 263 580 27 8 164
3866 164 541 308 -83 528 608 389 -169 159 594 239 -393 39 527 -39 -174 252 200 -101 -391 -22 314
3887 314 84 -300 120 349 -241 -283 274 784 -209 -130 -73 493 -374 -370 109 257 -133 -249 94 244 -89 -453
3909d53N16L53p80J18O21mo85K18N58l33p14P83M02n02o45O82J80j99m39Q06j42
3930C41l95l13N28N75o46j87K29K96l14q97J153K90o20J42J02j76j92k81R64p9
3950E20n67R2M71k11p68K84P79r6q58K97N35l45k09J94O47n26n76J76N69k14k50
3971e6j10N06l18l72L51M67j72n57M22J60l39l87M31K76l61k44N25L04m45o63
3991e82R53j27n65j20M71K50n22j06N10J27r16q1J075J9r06k3P76P8p16l17R98
4012B76nr79M52Q06j22r19L64N55k9q04L98N6J91k47l56M16j53n62L44P15k70
4033A27m24J15L58k87o06O96J52k86k78M62K30l60k64N37M7o00n7Q18J33q92p0
4054d49P78k7m41l68R67l62n42L91M91k64n38K58O77j28m99m90R23o4n85J25N00
$$ plain form
3909 -453 63 416 -364 -246 375 371 -314 -96 462 129 -585 198 600 98 -547 135 315 116 -323 483 341
3930 341 -54 -367 161 736 90 -97 132 428 114 -783 370 660 40 182 284 108 -84 -365 599 520
3950 520 -47 45 516 305 -463 -179 600 504 -354 -57 478 133 -76 118 765 239 -337 -161 408 194 -56
3971 -56 -166 340 22 -350 1 468 296 -261 161 321 -18 -405 26 302 -59 -303 222 526 81 -582
3991 -582 371 244 -321 -441 30 280 -242 -348 162 289 -627 -708 367 386 -520 -543 233 311 -405 -722 276
4012 276 271 -708 -256 550 428 -491 -127 428 399 -405 -7 49 240 -7 -363 53 -100 -662 -318 397 127
4033 127 -297 -182 176 -111 -717 -21 131 -155 -433 29 259 -101 -365 172 219 -381 -438 380 513 -379 -449
4054 -449 329 302 -139 -507 460 98 -444 -53 438 174 -364 -106 571 443 -56 -546 377 313 -272 -147 353
4075C53j40n08K43N17k59q04Q48P1k72m16M75L95n55q4q6O60n04j95K66N03o09
4096a01k73N91L36p55J71L90J3n14k90O03J35n22J30L50J33p27o9P46M7o42rN72
4118C15l55j20J65L73r5m78m1N77j90k28pK8L59n58l5N61Rn88L15K18j95m05K50
4141a25J27L0m42L81L66m16j81O29m95J90l52O44j22m21J9J35J53k40k92L82N76
4162E46p59k91Q21l2n47m1N07M5n43R7M92l32k21J2L78J21q23N70L49q2k68j14
4184a15R7L24n31K01N4J18l77J62L1J2mjJ78j86MJ06J63k50k90L5L76j09j76N60
4208C82k42l03j63K63K40J38o20O96Jo53L10J48J94n71Q7N3j34M29l22J22K05
4229B60l21J87l22L57m43L44J62j95m9J72l2L8m40N05k8r9j81n2K67K39l48J3
$$ plain form
4075 353 213 -295 -52 465 206 -598 250 321 49 -367 108 503 -52 -136 -222 438 -66 -261 5 508 -101
4096 -101 -374 217 553 -202 -31 359 372 -142 -432 171 306 -216 -86 264 397 -330 -399 347 394 -248 -257 315
4118 315 -40 -160 5 378 283 -195 -236 341 151 -77 -84 -56 303 -255 -290 271 280 -308 7 225 30 -375 -125
4141 -125 2 32 -410 -29 337 -79 -260 369 -126 64 -288 356 234 -187 -168 -33 120 -120 -412 -30 546
4162 546 -213 -504 317 285 -262 -303 204 249 -294 -197 295 -37 -258 -246 132 253 -570 0 349 267 -1 -115
4184 -115 -18 306 -225 -24 30 148 -229 -67 -36 -24 -28 -29 149 -37 -33 73 236 -14 -304 -269 107 -2 -178 382
4208 382 140 -163 -326 -63 177 315 -305 391 392 -261 49 197 391 -180 -93 -40 -174 255 -67 55 260
4229 260 -61 126 -196 161 -282 62 224 29 -20 152 120 158 -282 223 195 96 -85 -137 130 369 21 34
4251C4L82n12m3O6L59k55k80M05n7n03M62K1n5j1J46j95n1J47q8N0j16J16o6j27
4275a71N06k70j19M38l73l89O4K74J79j97o1O2J43m9j10j3J2L56m7j92n9k77L3
4298b60J71K13l65K59O26q27J66r2K43k38q7K56l6k80K26RQ2K8l45J31P8Q5K4
4321F7O0r2j85j7L26J77j84k94K74k79K18j63K51m94K86N7O6j58L42r1k6J1k97
4344a45J25J84M33o25q1O12m75J82R0l6m87M32j01k0j33L06j93K87k80R6j07L08
4366C72L8l92q9N14l39K3K84j94j02j54M38l46J84l8r6m5j39j34J60M47k53k72
4388a33O4R0q8M8R5j08Lj59M81l76J87j00J87j78K24j37j61J24k78L44K2K56l13
4411I4p8K69l02q9J67K04k70k7J51j51P2P3Lj67K4j45J28n3K29j7l88L26r5o6
$$ plain form
4251 34 416 -96 -139 -73 286 31 -249 156 99 -404 58 79 24 13 159 -36 -87 60 -28 22 -94 22 -44 -171
4275 -171 335 65 -54 384 11 -378 -314 -40 139 -58 -119 -57 86 37 -73 -86 -74 282 235 43 -16 -293 -260
4298 -260 -89 124 -241 18 644 -183 -17 -109 134 -104 -191 65 29 -251 -25 -16 66 94 -251 -120 -42 43 67
4321 67 127 35 -150 -167 159 336 152 -142 132 -147 71 -92 159 -335 -49 8 74 -84 258 167 141 152 -145
4344 -145 -20 164 597 -28 -109 503 28 210 300 264 -223 209 108 88 -45 261 68 355 75 171 64 372
4366 372 410 18 -71 443 104 127 411 217 115 -39 399 53 237 199 103 58 -81 -215 -55 392 139 -133
4388 -133 -69 21 -67 -19 76 -32 -29 -188 293 -83 104 4 191 13 237 100 -61 63 -215 129 151 407 94
4411 94 16 285 -17 -106 61 265 -5 -32 119 -32 40 113 116 -51 -27 -172 -44 -97 132 115 -273 53 -42 -108
4435a08N46l51j42J1K61j81m2J74qO5j96QJ16l81L23j21k38O93m20j93L24R0m72
4458b42P55k34m3k39M06k75r5K34k8l37J91q9j55M46m33K59R1j08M41m72J45q2
4480A36k2k96L39Q8l51j7N00j18l57M04r8P2n06Q19k79l47P2j36O69m59p9j51
4502a17L74j67m05K04L49l21k81M17J04j85Jr2K50l79K13J42JJ97m94R4L61O5
4524C31o09J42N62q41p9P49K2l64l82N12k10L7j27J67R0m15J98p9J69m32K22L69
4546C2N5m83j30M46N6m80L11L7K29l34K49q6j14k93M79k2p4lk54M98j34n08N63
4569D0J83l56r8K60j7j64k92L85K40n89L2L29k3J78l12K74l7l45N0Q4L68n58L19
4592d9l0M86m47k1N72j98n44K19J43K03p46N35Q0n7j60m7K7J49l35J37M61l56
$$ plain form
4435 -108 438 87 -55 -44 217 36 -6 168 160 225 29 37 153 -228 95 -26 -264 429 9 -184 140 230 -242
4458 -242 513 279 236 -3 403 128 33 267 239 -98 93 4 -151 295 -138 121 212 104 545 73 218 136
4480 136 114 -182 157 245 -106 -123 377 259 -98 306 208 280 -226 593 314 -33 39 -97 572 113 34 -117
4502 -117 257 90 -315 -111 238 -83 -364 53 157 -28 -27 -119 131 -248 -35 107 108 305 -189 -95 266 331
4524 331 -278 -136 426 -415 -494 255 277 -87 -469 43 -167 -130 -257 -90 0 -415 -217 -296 -127 -559 -337 32
4546 32 87 -396 -526 -80 -24 -504 -193 -156 73 -261 -12 -98 -212 -505 -26 -48 -122 -125 -379 119 -15 -523 40
4569 40 223 -133 -231 29 12 -152 -444 -59 181 -408 -376 -47 -70 108 -204 70 33 -312 -262 -178 190 -368 -49
4592 -49 -79 407 -40 -61 511 313 -231 -12 131 334 -412 123 203 146 -14 -61 -34 115 -220 -83 378 22
4614B2O6m84N42j25m38M39L38l08l16L38L23j67l27J94K65l22j33l9K78l49O8
4635a35K07N9k95k40O12M5m51j25K54L79n60jL39J55m87MP3M92k90l27M92l6l65
4658b01L2N00k32l98j9N31k60o91O54P8J45n96L37M79k22l54M41M7l38o8l2M54
4680B87j19m75M69j39j87J51K33K69m20k57K94K21o05m0M51J43l11l65O25m9J44
4701C20m15K8N79p02j83P71j8q78M50M16j80k88mK79k5l11K87J15l67P0K7K81
4723B52J05l71M48k24p5j87K01M13n57J76J56M4k16m8K12R6k03k90L86K99r42
4744c25m6L89K58k73m8K03J93m23q5M33k4k44K14J01r9m71M71Q6j80m29J70K94
4766A65j24J23K12k8O2l15l01K88Q6l32L26R2m84O5k1M15%m33M12J53m22j3j78
$$ plain form
4614 22 88 -396 146 21 -417 22 360 52 -264 74 397 230 -97 97 362 40 -93 -132 146 -203 -135
4635 -135 72 131 -164 -404 208 253 -198 -323 -69 310 -250 -251 88 243 -244 -240 -167 325 35 -292 200 164 -201
4658 -201 -169 331 99 -299 -318 213 -47 -738 -84 -6 139 -457 -120 359 137 -217 224 271 -67 -135 -167 287
4680 287 168 -307 162 23 -164 -13 220 489 69 -188 106 327 -278 -318 133 276 -35 -400 225 176 320
4701 320 -95 -67 512 -190 -373 398 380 -498 -48 368 188 -100 -104 175 150 -161 126 241 -126 -56 -29 252
4723 252 357 -14 434 210 135 -52 149 562 5 181 337 381 165 117 329 425 222 -68 318 617 -325
4744 -325 -371 18 276 3 -45 158 351 -72 -157 276 252 8 222 323 224 -247 224 310 130 -299 -129 165
4766 165 41 164 376 348 410 95 -206 82 168 -164 162 254 -230 -165 -186 229 229 -204 208 361 -61 -74 -252
4789b52M78m2l23J03M03k31k01J11L01m05j12K03Q3k46j25P65n10J27k09J7p7
4810a42j90J80m0P1M1j88L04M34m21l67M36np14K67N46m05M6j19L71o8K6j27l8
4833a02J98k0l09K60j8j97k5J63n9l7L15j79j48K61N9J97m27N2K7K53k32j56m5
4856a69K41mk91jL44j28n8M5K36j41j37n4L35k54l05N11p6K5n1J43j60l35K04
4879h0J82K7L17k72Q7k34k32j2K14j61j46L96K3J3k30K07k67M01n23L4L93kk15
4902h0Q5M53l50R4j54o5N0j83Q4L42l31J61n5j30M5j99K34pJ18m15O0L59j34k08
4926b26rOK36j94J00J62k80l6J71L2k13L33n16K25L6j35K95k35O30l28q1K08l19
4949a38J66J2J27l55OK37l50j10J70J76l4lk44J89k8JJ17K00m9m10J02j18M98
$$ plain form
4789 -252 226 184 -139 -36 367 136 -65 46 347 -58 -170 33 116 -130 -255 510 0 127 -82 -65 -142
4810 -142 -332 -152 -192 -121 -80 -268 36 470 49 -318 118 113 -601 -334 212 -193 -147 -266 105 37 63 -64 -102
4833 -102 96 76 -233 27 9 -188 -213 -50 -109 -146 169 -10 -158 103 162 359 -68 -16 11 264 32 -124 -169
4856 -169 72 68 -223 -224 120 -8 -66 -21 215 74 -63 -117 218 -36 -341 170 94 119 68 211 51 -284 -80
4879 -80 102 129 446 174 261 27 -205 -217 -3 -164 -310 86 109 122 -108 99 -168 233 -290 -256 137 135 -80
4902 -80 5 458 108 202 48 -17 33 -150 -66 276 -55 106 51 -79 -34 -233 1 -6 112 -303 -243 116 -18 -226
4926 -226 -235 -229 7 -187 -87 75 -205 -241 -70 -38 -251 82 -434 -209 -173 -308 -13 -248 382 54 -27 181 -138
4949 -138 28 40 167 -188 -182 55 -295 -405 -235 -59 -93 -96 -340 -151 -179 -178 -61 139 90 -320 -218 -336 162
4972A62k61j1o3J88k84L05r9J59R4j27L2J5l9N1N9l20K21P0j79k17J72M26j01
4995B53l39M47r3m0k55J73J16k71M4K49j56j20P5p8L38k99K35L9j73j8J21l39
5017i1M56J4n1k98K43j99p0R9j53J66l38M30j71J44j62j78Q7K16p3k5J93m01k6
5040a88N00k48j35K82j15K03l42j69L96j34j83K3K59j67j39n3L84j30j81K36k95
5061a96K44M7m8L1J17r7j20Q0J86r2j60K05l33j50L70n7N1j3L6K21k54L09m1j77
5085A59j83j13J43LK34M5k41j6oL18j26J56k28jj16K5k23L97j77K86O0m86O04
5108E14j88n72L63O9q1nK04j18o3l8J79J51l47L5J01J90k39j0j76J30L01n85L11
5131A26L1Jj72K96J57k61k89K66O7mk54N4K69o58M80J60m2j27L0nQ7m6l63M08
$$ plain form
4972 162 -99 -110 -173 15 -269 36 -63 96 190 63 95 110 71 122 181 -139 82 152 -27 -244 -72 354 253
4995 253 -86 361 268 228 -27 146 262 -9 35 284 128 8 83 5 343 44 279 318 145 127 248 -91
5017 -91 365 379 328 30 273 74 4 103 -50 116 -222 208 37 181 19 -159 -72 144 71 46 239 -162 -188
5040 -188 312 64 -71 211 96 299 -43 -212 184 50 -133 -110 149 -18 -157 -210 174 44 -137 99 -196
5061 -196 48 95 47 78 195 98 -22 58 244 152 -8 197 -136 -286 84 27 78 65 101 322 68 377 336 159
5085 159 -24 -137 6 9 243 288 47 31 25 343 217 373 145 144 28 53 -170 227 50 336 396 -90 514
5108 514 326 -246 117 186 105 100 304 186 123 85 264 415 68 103 204 394 155 145 -31 99 400 -185 126
5131 126 157 158 -14 282 439 178 -111 155 222 218 -36 18 287 -371 109 269 227 100 130 125 212 166 -197 211
5155B11m6k17P2M99l97j97K60J36k32J53j53m4Q8j24L57pm51l8J37J10K5mJ22
5178B60J34m02j82M04j78r6k56M11J35k92J84k3j18J20j41N6j16m9l39N63K60
5199C35n31l6K95j2l95M84J73l93k87K72L41n08K83J33n11J03k7K54J44R1n21
5220c13p0J38K7K00J43n1M3n58N07M01o19l5M92j07k21j40L93j15k31k39N42j17
5242G0k9j91lL8J08m3J88M9m42K42K24q7j47J6p1m6J02j72O00m77mK47J65n6j90
5267I1o2J00l37nK04O08k97n60K17K95m56K33L1N7L57n27K54K4m93L78j12k25
5289b25K39j69M58n6p67M72J38J29k68k85O60k09k64M4K02J35n98J48L80m0k94
5310a70K98J20j96m20J18J48l02L24O7L74l63k74J13L00J2k07J25l28q6J62l8
$$ plain form
5155 211 165 -52 20 519 122 -75 185 321 89 242 89 45 133 9 366 359 -92 -130 7 117 142 138 260
5178 260 394 -8 -190 214 36 -60 -316 95 230 -62 122 99 -19 101 -40 16 -100 -149 -488 75 335
5199 335 -196 -232 63 51 -344 140 313 -80 -367 -95 246 -262 21 154 -357 -254 -281 -27 117 208 -313
5220 -313 -383 -245 -218 -18 125 74 117 -441 66 467 -152 -187 305 198 -23 -163 230 115 -116 -355 187 70
5242 70 41 -150 -153 -115 -7 -50 138 187 -255 -13 211 124 -23 -7 -78 -124 -22 -194 406 -71 -75 172 337 281 91
5267 91 29 129 -208 -213 -9 599 302 -258 -41 254 -202 31 62 119 476 -51 203 227 -266 112 0 -225
5289 -225 14 -155 303 247 -520 -48 90 219 -49 -334 326 117 -147 -103 99 234 -364 -216 164 124 -170
5310 -170 128 248 52 -368 -250 -102 -404 -80 -13 361 -2 -276 -163 137 149 -58 67 -261 -347 -185 -223
5331b23L24p0j55K14k13m5l71N39J99k86j05R1l6j33L61j45jk37K33%pk9k95N72
5355A82o7R9q0L5j20l30M41J48j09j74R8J55k83K2K95j56l22L36K6L6j9Lk55J35
5379I6L6l19M50P3l25K36N4K32l95o4K10K5m54R3L22n0j0K6k27J99k11L64n4k61
5403D6Nm5L50qk33MM7n2j19K64k10O8k9j67J06K15k78J01L3p6K31k94M18k73j97
5428i3J03Qj14L6j35L70k55l28L01J84k01n0K34m7q4K96m23J31J13l37J57K18
5450H4k19M0K3K94l38P2J65j63L6k13L53Om10J24K05P2k06J65Q6J95m69J80j9
5473F3k18r0J94K09m3l08K36J9J9l60L63m5Q3k61J37j90J97k33P2N22l24j98J39
5496a7K61p0l40J91m3J20j3o1j20K70j23j58L90p8m89M37j70l68M65k39L09j5
$$ plain form
5331 -223 101 31 -124 90 -123 -168 -539 0 199 -87 -192 -101 -137 -270 91 -54 -55 -292 -59 -59 -66 -95 -390 182
5355 182 115 214 134 169 49 -281 160 308 199 25 123 278 -5 17 312 156 -166 170 196 232 213 216 -39 96
5379 96 132 -187 263 336 11 247 301 533 138 74 284 309 -145 -52 270 220 210 236 9 208 -3 361 307 46
5403 46 51 6 356 348 115 119 166 114 -5 259 49 117 88 -79 27 242 -36 65 98 22 253 -41 377 104 -93
5428 -93 10 18 -96 -60 -195 175 -80 -408 -107 77 -124 -174 60 13 -71 225 -198 -67 46 -291 -134 84
5450 84 -135 -95 -72 222 -116 -44 121 -42 -6 -219 134 140 -270 -146 59 131 -75 90 176 371 -98 82 63
5473 63 -155 -245 -51 158 115 -193 43 62 81 -279 84 39 122 -139 -2 -192 5 -228 -156 366 42 -156 -17
5496 -17 244 174 -166 25 -18 102 89 28 -92 178 55 -103 287 209 -280 157 -13 -381 84 -155 154 139
5518A39N4n3p1NK0K6l0l13J78N8K61j57k92K03Jk36K52r7r8J18j2K30j78L3K61
5543C02l75k1K68j65P6k63J42R7l04J27R6P9K4j52Q3K78l70M10o25M80j44o0Q6
5566F9k19ok47M43L66k94k64ON6j01p7O7J72J22k8k10K41j10o8o7jL67l67Q1Q3
5591A4j07j4J62q4j92K18m5k38K70J24o2K80k47j94L13J24n20k34N67L1j80L6
5613B2K64k40r8N4M3K19j05k41j8m8J79L9N1n3j22K4k03M32l51K43n2n5J33k17
5637a00K32l66K40j61K29k0K8k83k9O69n15J34J35k80L84l40Q6k15K24j45K10
5658A17K04o11L21j2L9L62n73O6J60K11n5L9J07m91J16M1k7R4n5j15LJ52j4P2
5682A51j19Q9J55k85m3k16P6K31j18J85m8L9n7j14M5K66n93N19j72k93J59J6k
$$ plain form
5518 139 193 140 69 74 94 120 90 -223 -45 13 274 117 -175 28 29 -207 45 -52 -150 -32 -44 186 8 41 302
5543 302 -73 -94 174 9 85 -178 -36 61 -243 -116 -20 59 83 -69 14 292 -78 332 -293 187 43 -17 69
5566 69 -150 -156 -403 40 406 112 -152 -146 -90 -191 -268 -201 -29 93 65 -145 96 -14 -82 -149 -150 217 -150 -69 14
5591 14 -93 -107 55 -29 -221 -3 -48 -286 -16 108 46 326 79 -115 198 322 -198 -432 135 166 -14 22
5613 22 286 46 -52 2 45 264 159 -82 -100 -148 31 70 121 68 -54 -30 -233 199 -152 91 39 -16 117 -100
5637 -100 132 -234 6 -155 74 54 82 -201 -230 439 -76 58 193 -87 297 -43 43 -172 52 -93 117
5658 117 321 -290 31 19 58 420 -153 -87 73 284 229 268 375 -116 0 41 14 108 53 -62 -59 93 79 151
5682 151 32 121 276 -9 -52 -268 -192 39 -79 106 58 97 40 -74 -29 237 -356 163 -9 -302 -143 -127 -129
5705a29k26K04J77m78N61k50K29k72J87m6k56K69N0k73L92l41r1rK89k28J99j49
5727a91L35m43J30J01Q4j30K42k89J0J9l3L77k11J56k83j07J78K53k40k72L97
5748H3p4K8J93l87m4R5J55l5R6k56M32m72K86q0Q1j58j3L3R8J66nj86Q3M8m0l9
5774H8k04K57r1K27l51LJ21J69k5j63j16K54K74m76R8j62J60k4J26l56O37m32
5796A4PK94l03K34l83J14K26j86N7P8J64j50l32L47p5M8j00j11K73k06J7j75q4
5819b32N39k20J02j62p1k24J65r8K16nK9J45j69N4k3J35k00j25K92k23O4J50l22
5842a83K7o9J55J55P2k81J5L18k32J97k61J81J17m40K29J79m3nj80r2J78n8l09
5865c30P75r83P63j53p0j61O9n1K0J38l32K53J22l35K91J49O7k15j7J29l22J99
$$ plain form
5705 -129 -355 -151 26 -452 109 -141 88 -184 3 -43 -299 -30 20 -253 139 -202 -293 -302 -13 -241 -42 -191
5727 -191 144 -299 -169 -68 16 -114 128 -161 -151 -132 -165 212 1 157 -126 -233 -55 198 -42 -314 83
5748 83 9 37 230 -157 -201 -106 49 14 110 -146 286 -186 100 20 101 -57 -70 -37 61 227 222 36 119 167 127 88
5774 88 -116 141 50 277 -74 -71 50 219 194 31 -85 169 443 -33 65 -97 63 39 165 -191 446 14
5796 14 21 315 12 246 -137 -23 203 17 74 152 316 166 -166 181 106 154 54 -57 216 10 27 -148 -232
5819 -232 307 87 189 27 -44 -268 -103 -201 15 10 39 184 15 69 46 181 -19 -144 148 -75 -11 139 -183
5842 -183 -156 -225 -70 85 157 -124 -109 209 -23 174 -87 94 211 -229 0 179 136 131 -49 -141 37 -21 -330
5865 -330 445 -538 225 72 2 -159 -90 -141 -121 17 -315 -62 60 -275 16 165 232 17 0 129 -193 6
5887FJ92j17k37j08k9M42r6j76j83L09k04Q6p2K83M7j10j37L84l13K09k07J89
5909A58k51J21K46n3k36J37J6q2J28j13Nj24j9q3k2N96k90l5r9N0k72n4M69l13
5933a20l6K86Q5l21l2J22q6J42k17M4j1J65K90m79N3O20m97q8K27k96j74L17o
5956a2j8P4No7j96L36m09M94l59k39K70K32o4o1P1j08K09k07r8J98j77qK07j55
5980h2j10M9K97l90M60o11K62r6K76o4J13k00j07M36o4n2j73j07M42j13k63k2
6002a19K39N6m53O2J97p9K45j84K52j47j65j8L49k91r3J03K23m18O9L93m23M5
6024a57K26j26L01k75L09p3m1k96j80N64r9m67J44L13n1l29J56J20K26o14L10
6045c9J57k6L7j37LN64n86l80O07k25j78P6R7m5j28O2M14m49K64M5k90N34k77
$$ plain form
5887 6 198 81 -156 -264 -293 149 53 -123 -306 3 -201 -115 -187 96 143 33 -104 280 -33 176 -31 158
5909 158 -93 28 274 221 -15 122 138 56 184 71 76 -48 -67 -150 -172 424 134 99 0 50 -222 -276 193 -120
5933 -120 -156 130 215 -106 -138 -16 -102 40 -177 -133 -144 21 311 -168 -115 505 8 -80 147 -149 -323 -6 -12
5956 -12 -30 44 49 -18 -214 122 -287 207 -152 -391 -121 111 47 -14 57 -51 158 -49 -147 51 -126 -134 73 -82
5980 -82 -192 -143 154 -236 224 -387 -125 -221 55 -9 104 -96 -203 233 169 117 -56 -163 279 166 -97 -119
6002 -119 120 176 -277 -215 -18 -97 148 -36 216 69 -96 -114 235 -56 -149 -46 177 -241 -172 221 -202 -157
6024 -157 69 -57 244 -31 278 205 164 -132 -312 252 153 -314 -170 143 92 -237 -81 39 265 -349 -39
6045 -39 118 92 129 -8 -5 559 -27 -407 200 -25 -203 -127 -30 -75 -203 -141 273 -176 88 133 -157 377 100
6068A00j88K07k91J09M66n84N66o53M22l07O7J04j57K96j44Q1n4k08q5K25O3Q6
6090A21l73J97L53j94O2r3j00N7n4m55M16K93k65l4L41j96l0p4j55K01n1r2K48
6113A23k18j06K59m51L78kl6M06K3n23p7P2M6k70L60P5l43K3K88O5K89l95M7k40
6137b07k69L75R0K76l21j77j2L79j11l6o0n6k35N49o6J43j57k39L27l44J86L22
6159C57n50J30J23Nr9J64j00L06k81K4r1R5j34O4j04J45j43K15P4k08R5j44j12
6182a69K53M7l2K1m9j6q5K62k73J47k97M50m93N22k65l4K48j15j54o7K80j38J26
6205A69l9k40J42M8q0J85j27p2J37j60J29k69K32L6j23k93K11j68K59M7l2k58
6227b66M66k08q0K36j64J16k72J00m0j59M0L83j34k47J03n5j94O35j32m0j73O2
$$ plain form
6068 100 -88 119 -172 -63 403 -181 385 -268 154 -153 -86 18 -139 157 13 94 40 -168 -253 -28 35 121
6090 121 -252 -55 298 104 166 73 -27 30 -24 -479 -63 230 -35 -69 272 76 46 -28 -183 18 -33 -125 123
6113 123 -95 -201 58 -393 -15 -17 -53 353 376 -147 -224 -152 -106 -376 -16 59 -284 -261 27 92 381 -14 33 -207
6137 -207 -476 -101 -11 265 -56 -233 -245 134 23 -13 -73 -129 -364 185 119 262 105 -134 193 -151 35 357
6159 357 -193 -63 60 65 -34 130 30 336 55 79 -12 83 -51 13 -91 54 -89 126 200 -8 87 -57 -169
6182 -169 84 131 99 120 71 55 -30 232 -41 106 -191 259 -234 288 23 -11 237 122 -32 -99 181 43 169
6205 169 130 -110 32 80 0 185 58 -14 123 -37 92 -177 55 91 -32 -325 -114 -282 -23 24 -8 -266
6227 -266 200 -8 -88 148 -16 100 -172 -72 -112 -271 -231 152 18 -229 -126 -181 -375 260 128 88 -85 -23
6249b3N2j8j68K38l96O37n48K60r0j91J86r3j62L06j49k3M83j07R0j22P1j87J05
6272A51N2k94K85j05j2P0N3K0o9O1k95K43KOK8l95N0Q4J80L9o9k58J70L4J3l7
6298GK59k69O8K23j07m3p2j3L67l24J84k61K1m2lJ59j39N69p91M17k5q9j62J1
6322e5J48r0J74p4p5P1k38J91j08J29P6Nj18J1k76N51l03J61K9k40l4j11L39m1
6346A22k67j08L34j30J25j82p3J09J23l0k7k74L11m1j93J64J00P6j31J68k79q1
6368a84J07m4L70j76m2j25K71q1J3j01Q3l53N9M07j06j94p7l0J82J24k70L30n11
6391c48N11o5N0K9J52l61j41O9K47j30o3r8K05k16Q9J6l5J01J15m9j83q4J05k24
6415c08N18j26P1j85J01K4r6J93n36M90j95L32l36l1O1J67J7j77r0K18j0r4O6
$$ plain form
6249 -23 29 11 -157 81 -315 322 -226 34 -56 -247 -61 -154 -316 -10 -159 -182 301 194 284 162 233 46 151
6272 151 203 -91 194 89 77 147 200 220 151 212 -83 160 162 168 196 -199 -149 -65 115 154 85 -173 -3 31 44 7
6298 7 266 -3 65 288 181 138 66 53 420 96 280 19 40 -2 -5 154 15 584 -207 210 185 96 -66 -55
6322 -55 93 3 177 103 28 99 -139 52 -56 73 149 154 36 47 -229 322 19 180 209 -31 -65 -176 163 122
6346 122 -145 -253 81 -49 76 -106 -179 -70 53 23 -4 -278 33 -8 -201 -37 63 139 8 176 -103 -184
6368 -184 -77 -121 249 73 31 -94 177 96 109 8 91 -262 -203 204 98 -96 -173 -203 -21 103 -167 163 -348
6391 -348 163 98 148 177 329 -32 -173 -104 143 13 -50 -148 57 -159 -70 -54 -89 12 127 78 -105 -189 -84 -308
6415 -308 210 84 155 -30 71 95 -1 192 -344 146 -49 283 -53 -84 -23 144 161 -16 -106 112 102 8 74
6438G4O8j77j5k2J41j31L6r3J71N1j50j89K50j25R5J24n7m18K88j8K22k59j1J00
6462d5J38K8k81M05j77l05N6j8j14K16J65k65J63r7m4J21J35l28jL34o1L3j47
6485h9O1J83l05J13j9o0J15l0J34j71K96l51p7J81L91j08k79k84j42J91N99m21
6507g2O6m0K2j61N4J17j55L52l21M63k18k31K36j93L1j90L68j99q5M80m32J66
6529E8k50L31q0O5M04n50K31l2j48K40l92N93n20j46J80J8J36J68m38o5M28m5
6551A86n6R8m60L52o0QM2j85K90k97j30K24K04j63P0k12K62j23n6j48K17R7l6
6574A24J63Q1l53K85l40l1O8k14J92P2K1m2lJ90k85j15P1k3K46j06q2J62J0R8
6598A89m63K62J87r0k57K67n8l05P4n0M47k60R6J28j34K1N4j64J2L41l12m2k3
$$ plain form
6438 74 142 -35 -50 -72 69 -62 -26 -119 52 103 -47 -236 14 -111 -16 108 51 -367 -79 -97 125 -134 -145 -45
6462 -45 93 121 -160 245 68 -237 -181 -199 -313 -97 68 -197 -34 -131 -175 -54 81 -247 -248 86 25 58 -89
6485 -89 -28 155 -150 -37 -56 -116 -1 -31 103 -68 228 -123 -200 -19 372 264 -15 -299 -441 -250 349 -72
6507 -72 -6 -46 -24 -185 -131 -14 -169 183 -138 325 107 -124 112 -81 -50 -240 128 -71 -156 324 -108 58
6529 58 -192 139 59 124 528 -22 209 177 29 269 -123 470 -50 -196 -16 2 138 306 -132 -197 231 186
6551 186 130 228 -232 120 60 68 110 -75 215 -82 -212 12 216 53 123 -89 173 50 -6 -154 63 160 124
6574 124 287 368 15 300 -40 -71 -3 -217 -25 47 68 26 23 213 -72 -187 -116 -139 107 1 -81 81 91 189
6598 189 -274 -12 175 85 -172 95 37 -268 -194 -244 203 -57 39 167 33 54 108 -56 -44 297 -15 -57 -80
6621h0M9k7Ro5p0J2J31J1J03j07p7J13k31k9M68j62P6l27n2M19j71j3N8j06r5
6646a63J95O0m6J46Kl74J87Q0k0q3Q5j70J03j3m07M25J66j97J42o6j08K18j80
6669a8K02o4l65Q6M47r9k34k82L12L40k38l90M18j4j38K65k33J16N4j29J0L38
6691C84j73j86L07k93j40J53P4j59R2K6l0j45k32M48n0J71m43Q4J57j13J60k92
6713b00K70j44M9J14j0k46J00J07O1L7l82M22r5k94K6L20j77j13k13M88r0j64
6735a34n2J80M06l51q3J51k17j5K8J82O8n03O4M39m27L22r8J19j23L7q7K03j63
6758e4K4K0J58j35Q2n9k38m9K61j92J24J96l22m0K20k4J07K3J68l94L09j96j3
6781b4Pk84L35L6j54k53K43R0K45l32N8j15K87k59J42k26lM31n2j48J0p8J1Kj6
$$ plain form
6621 -80 -31 -58 -49 -114 -184 -172 -41 -30 73 -34 -111 2 -229 -258 210 48 124 -203 -255 164 -7 -20 38 -68 -163
6646 -163 32 92 46 192 194 -180 7 87 67 -16 69 -101 2 -11 -418 7 173 -24 118 52 -56 162 -18
6669 -18 184 120 -245 -159 288 189 -45 -327 -15 325 87 -303 115 101 -37 228 -5 111 165 36 46 384
6691 384 211 25 332 39 -101 52 126 -33 59 85 55 -90 -322 126 76 247 -196 -112 45 -68 92 -200
6713 -200 70 -74 -25 89 79 -167 -67 40 101 138 -244 178 83 -211 -185 135 -42 -155 -368 120 30 -134
6735 -134 -186 -6 400 49 -34 117 -100 -115 -87 95 163 -340 -276 163 -264 58 -40 79 -44 -7 -94 109 -54
6758 -54 -30 -10 148 13 95 36 -202 -251 10 -182 -58 138 -184 -224 -4 -28 79 102 270 -124 185 -11 -24
6781 -24 -17 -301 34 70 -84 -337 -94 -4 241 -91 -33 -148 139 -120 22 -204 -207 224 172 24 34 -44 -33 -31 -47
6806d7J8J98m89J99j86M51j95j03M07k16j27j90J32%KJ74j00L5l2j87M16p2j41
6829e3q3L41k73N9q9K72k48j12p5J90j38K53K09k66k18M33j62MJ03l46K01p5J79
6852A06l88L90k54J01l6q5L69K8o5k23J00J30j54J24L2k29k9J94MM4j61J3R8l39
6876b30N5J8J41r1P5j42K86k63k4L84m3N8p6k75j45J09O2O2L9m8j99J42j7q0J12
6901i0j20M1Q1p9mJ69j67R2o2N0K11k37L59k20k05J59J85J01l80J91j6l11J58
6924i4K41j93K72j14Lj56J44j97J5K02j37n1K00l50M42O0k05Qj46Q3K22l16J98
6947A31j51K15Q9l23L82l51n8j49L69J78j93l7J3k09J03j51N8J06J89j54K01k48
6969A0K56j93n41N15o8oj06R4j40K8J03j48j42L18J53k53R2j04Q6K01j03J3q5
$$ plain form
6806 -47 -29 169 -320 -121 -307 144 -51 -154 253 37 -90 -280 -148 -148 -146 28 -72 -37 -69 -256 160 88 -53
6829 -53 -136 205 -68 -9 -98 174 -74 -186 -261 -71 -209 44 253 -13 -231 202 40 44 147 -199 2 -73 106
6852 106 -282 108 -146 -45 -81 -166 203 231 166 -57 43 173 19 143 175 -54 -83 111 115 159 -2 11 109 -230
6876 -230 -175 -157 -16 -107 -32 -174 112 -151 -175 209 166 224 148 -127 -272 -163 -101 -39 0 -48 -247 -105 -122 -202 -90
6901 -90 -210 -169 -88 -167 -171 -2 -169 -77 -139 -89 122 -115 244 24 -181 -22 163 264 -116 75 59 -252 -94
6924 -94 147 -46 226 112 115 -41 103 -94 -79 123 -14 -65 135 -215 227 287 82 90 -56 27 249 -67 131
6947 131 -20 195 284 -39 343 -8 -66 -215 154 332 139 102 115 -94 9 -142 -84 22 211 57 258 10
6969 10 266 73 -468 47 -21 -27 -133 -39 -179 -151 -48 -196 -338 -20 133 -120 -28 -132 -46 155 52 65 -20
6992b0o1J55k72O41j69k01K6k23n7Q0j26J78J41J86l21j41m3K27J14j43l42J79
7014a92n9K46j91L80j43k5k52J47K74k04J21j08M71o29KM7k10J91q5K34J21l28
7036a92K44j10J84n0J1K48k32l1j69QJ17K4O4j09K04j60K00k20LL70k26l68J43
7059d7m7l4K12j21L29k86k00L36R7j70R0m09N37m69K31k76K3K80J76l67K42o7
7081F0M4l03K42k8j82M05k69L26n14J85N7k02p1L24o2j02R3K3l39O9K94j47J67
7104G0k98K06j37K52p8mk08K54ll16J17P2K2j99J59o0K33J50M4n92L45J12P6j67
7128E0M1k16M42k76j56K91j77l9j76M11l59j81K28k0m2J6K2J58j12J0K34J02j43
7151A08m8R0k03K38k46J86m90O42m19J46M22m08j66K2j3J38r7K18k19r6J11r9
$$ plain form
6992 -20 -81 74 -198 443 274 73 99 -124 -181 -101 -227 -49 92 278 -43 -184 -227 0 114 -29 -371 -192
7014 -192 -251 -5 -196 184 41 16 -236 -89 185 -19 102 -6 465 -164 -162 -115 -325 -134 -219 15 136 -192
7036 -192 52 -58 126 76 87 335 103 72 -97 -89 28 52 116 7 211 51 251 31 34 404 178 -190 -47
7059 -47 -94 -128 84 -37 292 6 -194 142 239 69 159 -250 287 -182 49 -227 -204 76 252 -115 127 60
7081 60 104 -199 43 15 -167 238 -31 295 -219 -34 23 -179 -250 74 12 -90 3 26 -313 -244 50 -97 70
7104 70 -228 -22 -159 93 15 11 -197 57 54 -262 -145 -73 -51 -250 -91 -151 82 232 276 -316 29 141 217 50
7128 50 91 -125 317 41 -115 176 -1 -40 -216 195 -164 -345 -117 -137 -179 -163 -141 17 -95 -85 149 251 108
7151 108 60 150 -53 185 -61 125 -365 277 -142 4 426 18 -148 -126 -139 -1 -98 120 -99 -195 -84 -183
7173a83K65j94J98N0Lj65J02M9j99L44k76J1J36k07l15K12M34k73N6Q3O5l19R9
7196b4j18R1JJ45j65j67Q3p3L01l2P2k55K60k30J56j18K66j86k55M56k25r8j35
7219b50J28J94j63l9k29L91Q9Jj80n3K49k48J80k67L19J35j73K1J3M1P3K3m22
7242a67K21J81k17j10J24o5r9L89l64J32j86p3K29K43l7k07k72K55r6j15J74J61
7264A01K5k9j18J78j86J2L30l59P9l1pp7J84k3j45L69o50L39pO0J68k34j32K33
7288H0l4L4n7j4m2J62l0j93K6k06J88J28M7k84L68k18K12k81j4q7L04j44J91k19
7312h3m7lL48l51R2j58K73K5k00K68r8J02j11R9M2J06k66j10qM6L4n7Q4K86k96
7337A7j5J98m4K7k66l78M76k0l6n7J66R2N7k78N0M3j02qM2J26l18L64O7j91j37
$$ plain form
7173 -183 82 -112 86 136 139 -26 76 125 -74 270 -6 5 141 -66 -381 -169 265 -8 48 131 196 -123 -24
7196 -24 -142 -51 -50 95 -70 -237 -154 -227 74 42 114 -141 119 -111 45 -73 193 7 -248 208 -17 -115 -250
7219 -250 -122 72 -91 -130 -359 32 121 122 -58 -111 138 -110 70 -197 122 257 84 105 118 159 232 255 -167
7242 -167 54 235 18 -92 32 -33 -132 257 -107 25 -161 -234 -5 238 201 -6 -278 -23 -119 -234 -60 101
7264 101 126 97 -21 157 -29 -17 313 -46 33 2 -5 -82 102 79 -66 303 -347 -8 -15 45 213 -21 -153 80
7288 80 46 80 23 9 -33 129 99 -94 -68 -274 -86 42 89 -195 173 -45 167 -114 -128 -215 89 -55 136 -83
7312 -83 -130 -133 215 -136 -44 -202 71 96 -104 164 66 168 57 156 198 304 38 -72 -80 -34 0 -57 27 313 17
7337 17 2 200 156 183 -83 -461 15 -5 -41 -98 68 160 217 -61 -11 32 -70 -78 -36 90 -228 136 203 12 -125
7362a25K72l51L04M4j62k24M23j67R3k09K16K02m23O5p0J98l89K71q9L25j87J37
7384A54j80j39J98r8P0J50K3k33P4J60r4J6j81P4L93r3k83K37l61K09j68n9O8
7407f3l4P5l02K84M0J53L6r5K56n89K18L4J41j69k8K59l39R3n8l38L71KJ12n85
7431e26L75M65r8l83Q6J23l6L0j78K65l11M11k07j89K98O9p5j70M6J29j01J58
7453A81p9j18j71K34j7J7j00R3k34l0M2n8L80m6k37K61o9J50m4k8k58Q1P6j1K26
7478B41l19J21j67k65L50K99m02n5m3K71Q0j37n5J16K27k30j1J63j57K86k15l4
7500F4k37K64r1K05l01K11j80J03j92J22j03R2K2O3k06J21J28j20L06l83J98k64
7522a78P6K48M2K11m37m6j07J81j46p4m5L36J65k17K05j42k29J57N2J01k22J44
$$ plain form
7362 -125 147 -204 100 144 -18 -242 181 14 107 -102 114 316 -107 -42 -112 86 -303 -32 -121 204 17 154
7384 154 -26 -165 33 -65 5 155 178 -55 19 179 85 101 -80 -6 387 294 11 248 -113 96 -72 -131 -63
7407 -63 -97 -22 -324 -40 0 153 189 94 350 -239 -21 13 154 -15 -43 216 -123 -30 -88 -426 -55 -53 59 -526
7431 -526 -151 314 216 -167 -81 42 6 36 -142 123 -188 223 16 -173 125 194 119 -51 -5 124 23 181
7453 181 102 -16 -187 47 30 47 -53 40 -194 -224 -182 -240 140 94 -143 118 49 199 155 127 -131 -50 26 15 241
7478 241 -78 43 -124 -389 -39 260 -142 -197 -240 31 111 -26 -81 35 262 32 21 184 27 313 98 64
7500 64 -173 91 0 205 -96 115 -65 38 -154 -32 -135 -43 -21 42 -164 -43 85 -35 271 -112 86 -178
7522 -178 -102 146 188 399 -38 -84 -191 -10 -156 -230 -275 61 226 9 214 72 -157 0 52 153 -69 75
7544G5k6o9j74J88L7k79J09J18K31l29J83n6k6K80m51K20k80M82o1q3k11J29J04
7567A11p2l4p7P5j47L54l07J08l8K7j21j4J57j69K30q1P0j05M2P7j6K4n3O2j81
7592g8L09l08lN8M24k53J42n31L63n8k79J62J94l07R2o9K01Rk98M97j64K58k47
7615A14l44L23k47O2J84l15K85j41L04k25j82L20m20N11j97k93m7L92J05k06J34
7636A17k75J24k91N4K02n9M79n47L3J99j87L69o08L59j60L16l45L08qk52J93j91
7658a70M3ml3j35K60M4j21J47q5J44l35K22m0L60m02n6k0j53L93J14j71L1k57
7681b24J48j3k1J94k45P1j5J22O8j07L82K8j52k83o7J32j70K34Q8j34k5J44k20
7704f5j62J56N8K2l22L71j82J22n3J16j6M4j11k01J47P9J62J62k69J51J38j45
$$ plain form
7544 75 49 -20 -194 -6 31 -248 -139 -21 210 -119 64 8 -18 262 -189 31 -249 233 172 89 -122 7 111
7567 111 39 5 -72 3 -144 210 -97 11 -27 0 -121 -135 22 -147 83 2 72 -33 9 86 70 94 41 103 -78
7592 -78 231 -77 -80 -22 402 149 291 -240 123 65 -214 -52 142 -165 -73 -142 59 68 -230 267 103 361 114
7615 114 -230 93 -154 -92 92 -223 62 -79 225 0 -182 138 -282 229 32 -261 -308 84 189 -17 117
7636 117 -158 -34 -325 -271 -69 -128 351 -196 -163 36 -151 218 -390 -31 -191 125 -220 88 80 -172 21 -170
7658 -170 -127 -131 -164 -299 -39 5 -116 31 -54 90 -245 -23 -63 297 -105 -161 -181 -334 59 173 2 33 -224
7681 -224 -76 -89 -110 84 -161 -90 -105 17 85 -22 360 388 236 -47 -114 18 -152 82 170 36 11 155 -65
7704 -65 -227 -71 -13 9 -313 58 -124 -2 -55 61 45 89 -22 -223 -76 3 165 327 58 209 347 202
7726B02R5m08m1K93k15p2J88k3J14l19L91r4j4r0K31l20l4J36r6L90k95j27N3
7749e5j45%J5L88q1J81l00L1q9L1L54o71K08K70p6N7l36K70L7%k45o8L57n4o9
7774A0j97L08J2J04m10L35j33m1l5J54l9J38l23J00k90K30J68R2j87J66k48J65
7796G9m3j05j93J57J16l9J08M6JJ27m87L27o8K9j18J27j15l03J52L67k17J83j21
7819A0J73r4k08j2K1K67j14mL75m06K1k22J58P1n8j98J76j9j53K96l25J94Q7k22
7843a86J87n0J17O1l36K02k55M70l82K94k03K17k27K25j06R6J63l77K91q3j39
7864b1j11J26l35M02l50L06J9m09M66K7j60K65k06k7M1K18l40j03O8J18P4l09
7886b41M42n03l9M65m2j1l95M45l10J38P2o0QR5R3j08j27K40l67M19K9q8j60j78
$$ plain form
7726 202 297 -111 -152 141 -74 -146 42 19 133 -186 205 111 97 7 238 -82 -116 20 -76 314 19 -108 -55
7749 -55 -200 -200 -185 203 122 303 3 34 -55 -24 330 -341 -133 137 61 118 -218 52 89 89 -156 -224 133 79 10
7774 10 -187 121 133 237 -173 162 29 -12 -47 107 68 206 -117 -17 -307 -77 91 183 -4 162 -86 79
7796 79 36 -69 -262 -105 11 -28 80 126 127 254 -233 94 26 55 -63 64 -51 -354 -202 165 -52 131 10
7819 10 183 89 -119 -131 -110 157 43 39 414 8 29 -193 -35 36 -22 -220 -44 -63 -216 80 -245 -51 36 -186
7843 -186 1 -49 68 129 -207 -5 -260 210 -172 122 -81 136 -91 134 28 124 287 -90 201 118 -21
7864 -21 -132 -6 -341 61 -289 17 36 -373 93 120 -40 225 19 -8 33 251 -89 -192 -124 -6 68 -241
7886 -241 201 -302 -341 124 82 71 -324 121 -189 -51 21 -39 -31 64 157 49 -78 162 -205 214 243 155 -5 -183
7910a83M05j00m18M17j38j06M10k70k9QR7M5k41J1J60J84l34m0J33J94k97o8K25
7933F5j96q2Q9K00r0j49L6K9P3J08J23j3l51M22k78J55j07n4M9j43M56m19J86
7956A09M1j19K33n88J78j65L17p9L5p8R3K62k86o0L35k89j37K37j92J29J62l51
7978b13J41O9r5J9J05J35r1k24K02k5l5m7m3J11Q6j65J14k15J37L4k4P8j85L83
8002B52j13J22j28P6l11J43O4l01K98j01K15j40j97j28Q7L77k40l2K0K57k03r5
8024g8J98k28K27k76J53p3j12M23k08k15m3R3R7j44K01L32k71ML5j10j54NL40
8047A96j68p1L28k57j22n6L62l91n7l7L49Q8p3o5j47L6L4Nk42M69l37L95o22M67
8071H4K00n41K62J12j4k06N1J65o8k7O9P1k33N35o30M73k81R5q3j79O2K38k67
$$ plain form
7910 -183 222 122 -296 121 -17 -123 287 17 -12 -4 93 138 -103 -92 68 252 -82 -122 11 205 -92 -160 65
7933 65 -131 -213 -124 76 -14 -163 -127 -98 -25 83 206 193 -158 264 -14 141 34 -20 29 -114 342 -77 109
7956 109 150 31 264 -324 -146 -311 6 -73 -38 -116 -23 239 -47 -107 228 -61 -198 39 -153 -24 138 -213
7978 -213 -72 -3 -98 -79 26 161 70 -154 48 23 -12 -59 -102 9 95 -70 44 -171 -34 0 -24 54 -131 252
8002 252 139 261 133 209 -102 41 105 -196 102 1 216 76 -121 -249 -162 215 -25 -57 -37 220 17 -78
8024 -78 120 -108 119 -157 -4 -77 -189 234 26 -189 -232 -139 -42 -186 15 347 76 80 115 5 -149 -144 196
8047 196 28 -43 285 28 -94 -150 212 -179 -236 -273 76 164 91 26 -121 -85 -51 -46 -288 181 -156 239 -383 84
8071 84 284 -257 5 117 103 -103 -52 113 45 18 87 158 -75 460 -170 303 22 117 34 -145 -83 155 -112
8094a12P0l3O3N4J9J76o29O10l88M1L01k25K2J69j94o1K07j86P2j20j41K39OK7
8118a3k0Q5j30o0M9K30k87K86m1j31K90l14j4j20J84j5j61o3K73l8J29j2p4k6
8142GJ22R9j39j77Q8LL70j94l22K33j41j73R2M33o63L21K3K0K39l49K16l25L80
8165A63j68L0m5M5O4k4l52K31L12j65j33j19K52Pl52J35J99m1j07J0r9J75J3l90
8189c59L03J67
$$ plain form
8094 -112 -42 -75 -12 42 61 237 -392 218 -170 -129 172 -53 -31 138 -56 -117 90 -96 -24 -144 -285 -46 -40 -13
8118 -13 -33 52 -78 -138 -89 141 -146 140 99 -32 258 -56 -70 -190 -6 -21 -182 -245 28 -10 119 107 33 7
8142 7 129 228 89 -88 0 3 373 179 -143 90 -51 -224 -132 301 -362 -41 -18 2 241 -108 108 -217 163
8165 163 -5 25 -20 25 89 65 -287 -56 256 91 -42 -161 91 98 -254 -119 80 39 -68 -58 -157 18 31 -359
8189 -359 -56 111
8191A11
$$ Imaginary data points
##PAGE= N=2
##DATA TABLE= (X++(I..I)), XYDATA
0@%%%%%%%%Qj6J6j6K4l2L3m1N0n8P2q5R8j14J32j53J77k02K29k62K98l36L79m27
32b26M80n38O02o70P45q28R18j019J131j252J384j534J699j884K093k329K599
49A371k912L281l718M249m912N769o924Q573j1143J5754k6606R9235R0192j08239
63F3970L039M5885J5818n0759l404J7219l365k5418J2025P269k8895k9666L0368
76E4086K6321m1535n5097K8819M9630k5547n6799J0683L3430j3765k3564J5003
88A665M796k5864j539L3836l69m2692p948M8287J8784m7070l2413L9276L6890
101B5639k7920l3324J7285J8288j6672m646J8132j0732k7911J5660L2138j9113
113a3176m1365J1570M3098l054m2959q765L4617J2460k3749p241J7923l728j5071
$$ plain form
0 0 0 0 0 0 0 0 0 0 8 -8 8 -8 16 -16 17 -24 26 -32 40 -45 53 -61 71 -82 95 -107 122 -140 158 -178 201 -226
32 -226 254 -284 318 -352 393 -435 483 -536 595 -657 727 -807 892 -992 1101 -1228 1371
49 1371 -1541 1740 -1978 2271 -2641 3128 -3796 4777 -6366 9388 -17218 82017 172209 63970
63 63970 67009 112894 128712 77953 74549 91768 88403 62985 75010 82279 53384 23718 54086
76 54086 80407 38872 -16225 12594 62224 36677 -20122 -9439 23991 10226 -13338 1665
88 1665 6461 -19403 -20942 12894 12525 -30167 -38115 10172 28956 -18114 -50527 -11251 25639
101 25639 -2281 -35605 -18320 -32 -16704 -21350 -3218 -13950 -41861 -26201 5937 -13176
113 -13176 -54541 -42971 127 -2927 -45886 -54651 -20034 -7574 -31323 -38564 -20641 -24369 -39440
126c9440J8607K0731k5423k4674L3322L2205k9497l4653K6489L8137j3945l1298
138b9439M799K4083P06j1172N103M638j4151j876K6209O034l4149q870L9509J3940
152B5364l7762j6209L3840J7781k2498j2737J5017N700r827L839J3800q210k0463
165a2365Q354K7475n378l3621R06L3879R33l4032m637K5148K289j9201j41P691
179b700j0101o729J4755P099k1002j3815J8745J8624j7114k2925J3878K4911j0391
192f765k2916R381J9054p556j0292J2753N170j6352r8K2410K771k2258n432K1073
206I43R281j7479j1093J3492J1791j1107j0993Q896N320j0633P0J2345p081j8338
220b4586Q644K0837q119k2002M586J9154k258j5591n7J2656J849r727j582R224
$$ plain form
126 -39440 -20833 -102 -25525 -50199 -16877 15328 -14169 -48822 -22333 15804 1859 -29439
138 -29439 -24640 -557 149 -11023 -5920 -1282 -15433 -17309 8900 14934 -19215 -28085 11424 25364
152 25364 -12398 -28607 5233 23014 516 -12221 2796 8496 -1331 2508 16308 8098 -12365
165 -12365 -4011 23464 18086 -15535 -14629 19250 20183 -13849 -18486 6662 8951 -10250 -10391 -2700
179 -2700 -12801 -19530 -4775 2324 -18678 -32493 -13748 4876 -12238 -35163 -21285 3626 -6765
192 -6765 -29681 -20300 -1246 -8802 -19094 -6341 -1171 -17523 -17621 4789 7560 -14698 -20130 943
206 943 10224 -7255 -18348 -4856 6935 -4172 -15165 -6269 -949 -11582 -11512 833 -6248 -24586
220 -24586 -15942 4895 -3224 -25226 -20640 -1486 -3744 -19335 -19392 -6736 -4887 -14614 -16196 -6972
234f972q38p753N625J0981r027j2765J1295J5056j0112j3221R191J0328o926o683
248a1821N438M450m333k657M324J635n800k063Q785M232j1901p483J2777P999
262C582j2433p073J0520M114r384k481P436l47n499O27L846k375l913J266N508
277f606K14p237j453P927K892p223m29P820q47o022M279O564m036l062O781L428
293B990m950j267N036M213j567l677L49N432Q99m784J39M896j862m851K808K985
309F789m629j323M593j274n139J521K988j600j710O17j82O70M16p94P26K610j504
326B775j955L842J801l589L91M287q77l960K298K066j767r32O25j488p81Q37j196
343B377j733M24q73k664P9M89k508j92J758k732k162L034R51k979M82L089j747
$$ plain form
234 -6972 -7810 -15563 -9938 1043 -7984 -20749 -9454 5602 -4510 -17731 -8540 1788 -5138 -11821
248 -11821 -6383 -1933 -6266 -8923 -4599 -2964 -8764 -10827 -2042 2190 -9711 -17194 -4417 3582
262 3582 -8851 -15924 -5404 -1290 -10674 -13155 -5719 -6066 -11565 -10938 -7092 -9467 -13380 -12114 -6606
277 -6606 -6392 -13629 -15082 -7155 -4263 -11486 -11915 -4095 -4942 -10964 -6685 -121 -4157 -7219 -438 2990
293 2990 -1960 -3227 1809 6022 4455 778 1127 6559 7458 2674 2813 7709 5847 996 3804 6789
309 6789 2160 837 5430 4156 -983 538 3526 1926 216 833 651 1321 1737 943 1669 4279 2775
326 2775 820 4662 6463 2874 3265 7552 6675 2715 5013 7079 5312 4380 5005 3517 2736 3573 2377
343 2377 644 1068 195 -2469 -2390 -1901 -4409 -4601 -2843 -5575 -7737 -4703 -3752 -6731 -6249 -3160 -4907
360d907r92K569Q52o50R18Q83j036J609J665j686k80K658j075k616J612R35k770
377b311k76J430k392k397J713O0k962L26J165k399o22J465r84n50K106m98j872
394h998K624K268k021R43L694p77j211L096J144q06J167J766j576J55K078r36
410B610j012J701q64k270N88Q56k725k03J020j936k381J894L15l321J072K076
426b580j919j502K578N30q18Q11J311m46J804J476r21Q58K964p63j071L260O06
443F178k623J730K370k110k060K737Q76l228N9J450j656r35n6m26O8o3j191m07
461G13J612m96k702K460L147l523j957M573J660l715M44L231m96j799J085J365
477E602o25p47j87P99K67k863j519L507O63o241j713N217r80n925N11L485l047
$$ plain form
360 -4907 -5899 -3330 -2478 -3128 -2210 -1327 -2363 -754 911 -775 -1055 1603 528 -2088 -476 459 -2311
377 -2311 -2587 -1157 -3549 -5946 -4233 -4173 -7135 -6809 -5644 -8043 -8665 -7200 -8184 -8734 -6628 -7126 -8998
394 -8998 -6374 -4106 -6127 -5184 -1490 -2267 -3478 -382 762 -44 1123 2889 1313 1468 3546 2610
410 2610 1598 3299 2435 165 753 1609 -1116 -1319 -299 -2235 -4616 -2722 -2407 -5728 -4656 -2580
426 -2580 -4499 -6001 -3423 -2893 -3711 -2900 -1589 -2035 -231 1245 324 1182 4146 3383 2312 5572 6178
443 6178 3555 5285 7655 5545 3485 6222 7098 3870 3929 5379 3723 2788 2732 2306 2374 2311 1120 713
461 713 2325 1829 -873 1587 4734 1211 -746 3827 5487 1772 2216 5447 4951 3152 4237 5602
477 5602 4977 4230 4043 4842 5109 2246 727 4234 4897 -1344 -3057 2160 1180 -4745 -4234 -749 -3796
494c796l516K382J501l731j373K848J858k769l182K328M860j207n774J771O517
509a283k099n118L874L740m763k034O342M43o783q21O960P59p089k429N599L297
525a405m991m902M018M246m327l163N374J140o888J220R452k149r607L902J0675
540B595j658r270J451R002J249n529k64N397J257m137J524N840l696o645O130
555C246R718p830j0574Q206J0760o953r914N291P619l729m863K964K631m093j927
570E52O492K424q567m476J1026O764j2431p794J2316Q329j0827o604Q326L702
584I232o605j84O125l173p658L822R886l752j2485P81J4225Q80j5254l416J4407
599F831L212j2531j957R116j992p044N742O718j0044p556J1405J0101j1227j2067
$$ plain form
494 -3796 -7312 -4930 -3429 -7160 -8533 -5685 -3827 -6596 -9778 -7450 -2590 -3797 -9571 -7800 -1283
509 -1283 -3382 -8500 -4626 -886 -5649 -7683 -1341 -898 -7681 -8502 -1542 -783 -7872 -10301 -4702 -1405
525 -1405 -6396 -11298 -7280 -3034 -7361 -10524 -5150 -4010 -10898 -9678 -226 -2375 -11982 -8080 2595
540 2595 937 -8333 -6882 2120 3369 -2160 -2424 2973 4230 93 1617 7457 3761 -2884 3246
555 3246 12964 5134 -5440 2766 13526 6573 -3341 1950 9569 5840 977 3941 6572 2479 552
570 552 7044 9468 901 -3575 7451 14215 1784 -6010 6306 14635 3808 -2796 5530 9232
584 9232 2627 2443 8568 5395 -2263 1559 11445 7693 -4792 -4011 10214 11094 -4160 -7576 6831
599 6831 10043 -2488 -4445 4671 2679 -4365 1377 8095 -1949 -9505 1900 12001 774 -11293
613a1293Q226J4001n326j3823L127J1819k490q991M475N433q381k552J2893K179
627I297j6597l020J7617N672j7128p191J3623Q517r841q221O955N359n367k047
641b372P276j884j1077L876J5471m633j9135L172K0058j902j8228p10J4493Q10
655E215r901k74N857k440n410O501O553r823j0459J2624J4463j2219j7332J0439
669f206J8362p719j5458N830J1298n125n520O025J663r171J07J2980J321j6788
683h401m889J7832Q842j7598j1951J4667J1678j2492q835R678L992q711J234J0540
697E586n827j2211P920J6699o025j8078L289J9998J669j6932l219J5080M792j0440
711B301k71R234l491p209J0022Q889j3235j0582J5159J3933j3675j5492R654J4989
$$ plain form
613 -11293 -3067 10934 5608 -8215 -5088 6731 4241 -4750 -275 5158 -3223 -5775 7118 9297
627 9297 -7300 -10320 7297 12969 -4159 -11350 2273 10790 949 -7272 -317 5042 -325 -2372
641 -2372 4904 3020 -8057 -4181 11290 6657 -12478 -9306 10752 8850 -9378 -10088 4405 5215
655 5215 -4686 -4960 897 -1543 -6953 -452 6101 -3722 -14181 -1557 12906 687 -16645 -6206
669 -6206 12156 4437 -11021 -5191 6107 982 -4538 1487 3150 -6021 -5914 7066 8387 -8401
683 -8401 -13290 4542 13384 -4214 -16165 -1498 10180 -2312 -11147 -1469 2523 -6188 -4954 5586
697 5586 -241 -12452 -4532 12167 6142 -11936 -8647 11351 13020 -3912 -7131 7949 12741 2301
711 2301 2030 11264 7773 564 10586 19475 6240 -4342 10817 24750 11075 -4417 5237 20226
725B0226n504j2981K243R404l084o372N218L486r743l614J4688L701j8464n985
739f781J9099Q532j7480r132J2942Q203q661n589O156J563n663J450Q014l883
753H770j2278L964J6360m185j9303O58J9238J03j7511k093J2257j99q700J991
767i28M766n713n729Q202O454j0544r814R943J2702r180j4848O407J4655m895
781A478j2010M253P275n174l538P883J026j0677m52J2948J523j3557m224J3164
795h2P028j1203q855R368Q448o986n577O774J901o545K372R355l609j0755N193
810c173J2814k823j2535K571J2047J007r199j679P814J691n266R99N454m119o329
825g26P475P344r189q679Q642R800q348j0309O352P889m719o418K715L670k997
$$ plain form
725 20226 14722 1741 3984 13388 10304 3932 9150 12636 2893 -721 13967 17668 -796 -6781
739 -6781 12318 20850 3370 -5762 7180 15383 6722 1133 7289 8852 3189 4639 12653 8770
753 8770 -3508 456 16816 12631 -6672 -6014 13224 13327 -4184 -6277 5980 5781 -2919 -928
767 -928 3838 -1875 -7604 598 7052 -3492 -13306 -3363 9339 159 -14689 -8282 6373 1478
781 1478 -10532 -6279 996 -4178 -7716 167 1193 -9484 -9936 3012 4535 -9022 -13246 -82
795 -82 6946 -4257 -13112 -3744 4704 -2282 -7859 -1085 816 -5729 -3357 5998 2389 -8366 -3173
810 -3173 9641 6818 -5717 -3146 8901 9908 709 -970 6844 8535 3269 4268 9722 5603 -726
825 -726 6749 14093 4904 -3775 4867 14667 6319 -3990 2362 10251 5532 -886 1829 5499 2502
840B502k526M241J568o934k374R366L200j0153m703J0777M642r542m162Q130K115
855F147n941l47M367j278m784J861N325l028p006J021Q001q32r538j236Q926J02
871A760q868J20N696j717n028K762L153m686k776M992L158n020m254L966N017
886a725k788n095K358N788k175m733L106M012l244k552N249J656o064l85O207
901c85J276n443j551M716K009l109k233L166K260k478j838L083J610l539K8M660
917B232q68m719J466N650j299m691J549L869o36k433O35K439l86j657K70K467
933C888n41k836J246L601k128l708K525L453k300l046K615J471k372o01J664L69
949C300j234l20R21J95p74q14J505J404j757j879J929J827k403j266K769L91k291
$$ plain form
840 2502 -24 4217 5785 -1149 -3523 5843 9043 -1110 -5813 4964 9606 64 -4098 4032 6147
855 6147 206 -141 4226 2948 -1836 25 5350 2322 -4684 -3663 4338 3506 -6032 -7268 1658 1760
871 1760 -7108 -6988 -1292 -3009 -8037 -5275 -2122 -6808 -9584 -4592 -1434 -6454 -10708 -6742 -1725
886 -1725 -4513 -9608 -7250 -1462 -3637 -8370 -5264 -1252 -4496 -7048 -1799 -143 -6207 -6592 -385
901 -385 891 -4552 -6103 -1387 622 -2487 -4720 -1554 706 -1772 -3610 -527 1083 -2456 -2428 2232
917 2232 1364 -3355 -1889 3761 2462 -2229 -680 3189 2553 120 755 3194 2808 1151 1421 3888
933 3888 3347 511 1757 5358 3230 -478 2047 5500 3200 154 2769 4240 1868 1267 2931 3300
949 3300 2066 1746 2667 2862 2088 1274 2779 4183 2426 547 2476 4303 1900 634 3403 3794 1503
966A503K13J915r26j253P78J85j85n98J44M92L13j240r17J263Q66j663k80J561
984B171p67j790R54J302j598o14J154j75j237L61N45m62j31l08m88R02J57j086
1002a110K6J305r36o36J005P08j060l00J237n20k40O4Q93l61j47M76n70K5P46
1021F05m93n33J138m91j220J155L48j159j27R02o52j485R92N95j530K06O00r71
1039b120o30Q10l87o90J188j37j102M23N60n88j03J155L3j369J358O18o49L07
1057a323J349o94n40J233J36n91O26L33l94J99P74r72L5J139p17r59J090M34j464
1076c06K05J052j024r06R32Rp57K27L03p45k20N95n37P7L16l78l76Q43M00j127
1096a417J28J550n11j340J480Q11j218OJ405j89o26P53Q38l80j99J87JR61J51
$$ plain form
966 1503 1716 3631 2705 1452 2230 2415 2230 1632 1776 2268 2581 1341 424 1687 2553 890 610 2171
984 2171 1404 -386 568 1870 272 -342 812 637 -600 -239 306 -156 -287 -595 -1083 -181 -24 -1110
1002 -1110 -1084 221 -715 -1351 -346 362 -698 -998 239 -281 -521 -457 436 75 -72 404 -166 -141 605
1021 605 112 -421 717 226 -994 161 509 -650 -777 125 -527 -2012 -1020 -425 -1955 -1749 -1149 -2120
1039 -2120 -2750 -1940 -2327 -3017 -1829 -1966 -3068 -2645 -2085 -2673 -2776 -1621 -1588 -2957 -1599 -981 -1630 -1323
1057 -1323 26 -668 -1208 25 161 -430 196 529 135 334 1108 136 171 1310 593 -366 724 1158 -306
1076 -306 -101 951 -73 -979 -47 -38 -795 -568 -265 -1010 -1230 -635 -1172 -1095 -779 -1157 -1533 -690 -290 -1417
1096 -1417 -1289 261 -250 -1590 -110 701 -517 -511 894 705 79 832 1670 1290 1091 1278 1279 2240 2391
1115B391q83N15Q85r82r39J769j5k117K20J524n65j923Q44J036j026q59R8K73
1133B46K33p19r83O76O02j389k96J762o56j819J180K119k155j181J840J714j601
1150d27p90J599N71m74l12P76N65o08r26J421J362j649j799K804J375l190j412
1167a114L062J226l162r36K428o70k475Q36J634j223k039K32K098p16k611p56
1183d186L386M50l981q9L910m64l438J207L022j706k220K779J752k379j690L061
1199e86K474j834k882K257L516j242l239J509L391j314k901K907K013l431j639
1214a001M795J303n463j070N159J171m379j916L201K288l044k272K464J614k715
1229A35j448M254k64n081J134N795j021o550J660N961o89n233N78M824k89k925
$$ plain form
1115 2391 1508 2023 2908 1926 987 2756 2741 624 844 2368 1803 -120 724 1760 734 -125 -27 246
1133 246 479 -240 -1223 -547 55 -1334 -1630 132 -524 -2343 -1163 956 -1199 -2380 -540 1174 -427
1150 -427 -1217 382 953 479 167 943 1508 900 -26 1395 2757 1108 -691 2113 3488 298 -1114
1167 -1114 1948 3174 12 -924 1504 834 -1641 -805 829 -394 -2433 -2201 -103 -819 -3430 -4186
1183 -4186 -800 -350 -4331 -4420 -510 -974 -4412 -3205 -183 -1889 -4109 -1330 422 -1957 -3647 -586
1199 -586 1888 54 -2828 -571 2945 1703 -1536 -27 3364 2050 -851 2056 4069 638 -1001
1214 -1001 3794 5097 -366 -1436 3723 4894 515 -1401 1800 4088 1044 -1228 1236 2850 135
1229 135 -1313 2941 2677 -2404 -1270 4525 3504 -3046 -1386 4575 3886 -1347 -769 4055 3766 841
1245H41N39L210j472k317K633L461l174m251L583O081m533o209M093N909l921
1260D473n081K985L091l337j715L302K39m120j320M429J387n823l177O043L184
1275D560o723m032N464L886n531k554M575M86m675J213M632k436m915K672O018
1290B640j453p090N79P491N31o650j037O591K63n485J712M339l222m067M900L928
1306C970n595m634N351N767n285n854L739N767k836n006J760L979k260l009L882
1321b64K272o188j620P607J719q249k291Q815K606o963l254O201K653l990j536
1336b482L521P65l691R54N111j530o754K090Q550j585q696R58Q813m50p389N97
1352a218N463r30m136K441K429l441k992M269M204n377n945N048P364n117p863
$$ plain form
1245 841 1380 4590 3118 801 3434 6895 3721 -530 3053 9134 4601 -1608 2485 8394 4473
1260 4473 -608 2377 5468 2131 416 3718 3957 -163 -1483 2946 4333 -1490 -4667 1376 4560
1275 4560 -2163 -6195 -731 3155 -2376 -4930 -355 131 -4544 -3331 1301 -1135 -6050 -3378 2640
1290 2640 1187 -5903 -5324 2167 2698 -3952 -4989 1602 1865 -3620 -1908 2431 -791 -4858 42 3970
1306 3970 -1625 -6259 -908 4859 -426 -6280 -2541 3226 390 -4616 -2856 1123 -1137 -4146 -264
1321 -264 2008 -4180 -5800 1807 3526 -4723 -7014 1801 4407 -2556 -5810 391 3044 -946 -2482
1336 -2482 1039 1804 -1887 -933 4178 2648 -4106 -2016 6534 4949 -3747 -2789 6024 5574 -1815 -1218
1352 -1218 4245 3315 -821 1620 4049 608 -2384 1885 6089 712 -5233 -185 7179 2062 -5801
1367e801M263O503l728n357L598L417m107j902M930K79n727p48O916J273p380
1382c571k637P168M049o565m300N993L312n534j592M933n39n521K397O440l672
1397C61p016L159P551k261q178R76P404r4o135n85M839j55m266J637M156l572
1413b179m387N219M567n868n718O299N654n358n433L734M845l168l294K557K718
1428A88l029k062M294J794n356k189P159K116p279k899P662K825o640j877M475
1443h18J735l561j75L382p58l455J054M862j390n722J683O593j012p180P88P022
1459C048j130n685R47M629j871l543L253K660l685k866L886L419l789m127L350
1474a504M858k813m912K522M546k283l606L410J904l737o25M347K32m905ON609
$$ plain form
1367 -5801 -1538 4965 1237 -4120 -522 2895 -1212 -3114 1816 2095 -3632 -4380 2536 3809 -3571
1382 -3571 -6208 960 5009 -1556 -5856 137 3449 -2085 -3677 1256 717 -4804 -2407 4033 361
1397 361 -6655 -3496 4055 1794 -6384 -5408 1996 1902 -4233 -4818 21 -134 -4400 -2763 1393 -2179
1413 -2179 -6566 -1347 3220 -2648 -8366 -2067 3587 -1771 -7204 -3470 1375 -1793 -5087 -2530 188
1428 188 -2841 -4903 -609 1185 -4171 -6360 799 2915 -4364 -7263 399 3224 -3416 -5293 -818
1443 -818 917 -2644 -2819 563 -195 -3650 -2596 2266 876 -4846 -3163 3430 2418 -4762 -3974 3048
1459 3048 1918 -3767 -2820 1809 -62 -3605 -352 2308 -1377 -4243 -357 3062 -727 -4854 -1504
1474 -1504 3354 541 -4371 -1849 2697 414 -3192 218 2122 -1615 -2240 2107 2339 -2566 -2560 3049
1490C049O22n484m07M012J921l861k195L239J964l423j031L269L10m292J013M289
1506B995j477m978J579M908j879l754N38L511o11k637J17K616o28j788J118K497
1522B127k103k838K809L568l447l339L284L113l340k557L097J733k255j642J835
1537D5P19j798r31K514P70k885j335K924J633l254j478K934J273l121l73K905
1553E42l6k080Q23J890j082j876J186K197p93k088O15K515j05k919J20L006k2
1570A893k861N35K044p07j927J273J154j740r13J782O35j086q95J069N88k83j231
1587f70Q78J024p95j221J365J514j808q14K241M89k191k15K372K25j696k25J031
1604A504J89o76k90L75O50j084n69O93L44r16k90J296m65j397O55J338r62r59
$$ plain form
1490 3049 3671 -1813 -2220 1792 3713 -148 -2343 896 2860 -563 -1594 1675 1985 -2307 -1294 2995
1506 2995 1518 -3460 -1881 3027 1148 -2606 -2068 1443 832 -1805 -1688 928 300 -1488 -370 2127
1522 2127 24 -2814 -5 3563 116 -3223 61 3174 -166 -2723 374 2107 -148 -1790 45
1537 45 764 -1034 -1965 549 1319 -1566 -2901 23 1656 -1598 -3076 -142 1131 -1990 -2363 542
1553 542 506 -1574 -751 1139 57 -1819 -633 1564 771 -1317 -702 1813 1708 -1211 -1091 1915 1893
1570 1893 -968 -433 1611 904 -1023 250 1404 -336 -1249 533 1168 82 -813 256 844 561 -670
1587 -670 208 1232 437 -784 581 2095 287 -527 1714 2203 12 -203 2169 2394 698 473 1504
1604 1504 1693 1017 727 1102 1752 668 99 792 1136 220 -70 1226 761 -636 19 1357 395 -564
1622e64Q65N97p64j61N45j22J75m96j51J039m6j012M48J036l36j383M75J138o76
1641F07r01R40K46r95J94M42k84k40j5l41j6L7O4K2L43o63n98R76L28n99m29J048
1663A66J21j135O34P79m89k55O31k34k63N53l43N1J91j12p63L02N24l35n00J029
1683E52l19q96O50J09l89J3N35k72j129N10M48k35m43N53o05N27J5k68j20Q29
1703F5p05q33Q15R04r25j64P35l69m25O70K46q27K66M93l35j50P17no55L65R9
1724a8m02M61N19q43j73J165q69p16P25M61m39m52O95k28n03L93l06O4JK39j184
1745a410N85M59n38N28L59k86r41J124L36j040K30J160l17n60M74N64l73p6K63
1764E41k6K28O9k07j0Q30p08o21R21K90j338L66J033n04j057N34L92j036J61N10
$$ plain form
1622 -564 301 898 134 -27 518 396 571 75 -76 963 917 -95 353 1389 1053 -330 145 1283 607
1641 607 -294 646 892 -103 91 533 249 9 -6 -347 -363 -326 -262 -240 103 -560 -1158 -182 146 -453 -882 166
1663 166 287 -848 -214 565 76 -179 452 218 -45 508 165 216 407 295 -468 -166 358 23 -477 552
1683 552 233 -663 -13 96 -293 -280 255 -17 -1146 -636 -188 -423 -866 -313 -918 -391 -376 -644 -764 65
1703 65 -640 -1473 -658 246 -679 -843 -108 -477 -902 -232 14 -813 -547 -54 -389 -539 178 173 -482 -117 -18
1724 -18 -420 41 560 -283 -456 709 -160 -876 -151 310 -129 -581 114 -114 -617 -224 -530 -466 -465 -226 -1410
1745 -1410 -825 -366 -904 -376 -17 -303 -1244 -120 216 -824 -594 566 249 -311 163 727 354 278 541
1764 541 515 743 812 605 595 1425 717 96 1017 1307 -31 335 1368 864 -193 341 733 -303 -142 368
1784C68P1p48J1J78P0O0q65K26R06j52r67N38J005q42p61P63J033j202j23Q41
1804D10j15o91J34O32O0l52k12K71Q75r71q42J119N11j253m71J661k64j522M45
1823e75J694p96j687J130R75n31j375L32J214k67q96r3J211j87j698P28J830r15
1841I4k276J475J740j581j477J531J248j457j019J413O21j265m5J123M89j128
1857e14l32J619J123j900j196K517J414k611q34K781L34j882q8K038k20k024N84
1874H09J477l50j995N24J815j37k389j58K527k65k566K6K414o88k066P93K116
1891A887j989j512K234J485k180j503K258K106j514k115J503K425j210j979J427
1906A323K153j736j750K513J466l169r44L208M81l309o12L217k5k640q52J900
$$ plain form
1784 368 439 -309 -298 -120 -50 10 -855 -629 277 125 -842 -304 701 -141 -902 -139 894 -308 -431 410
1804 410 295 -396 -262 370 430 78 -134 137 1012 41 -801 318 829 -424 -895 766 502 -1020 -575
1823 -575 1119 323 -1364 -234 741 210 -1165 -833 381 114 -782 -875 336 149 -1549 -821 1009 94
1841 94 -2182 -707 1033 -548 -2025 -494 754 -703 -1722 -309 312 -953 -998 125 614 -514
1857 -514 -846 773 1896 -4 -1200 1317 2731 120 -714 2067 2401 519 431 2469 2249 225 809
1874 809 2286 1936 -59 465 2280 2143 -246 -404 2123 1858 -708 -682 1732 1044 -1022 -229 1887
1891 1887 -102 -1614 620 2105 -75 -1578 680 2786 1272 -843 660 3085 1875 -104 1323
1906 1323 3476 1740 -10 2503 3969 800 -144 3064 3545 236 -376 2841 2816 176 -676 1224
1922A224O38k286o06K239N04k895j9K916n48l507Q08L867q11m369J455L618q37
1939A391l157J266K697j171j879J130K246j933j556J730K479k247k732K229L540
1954D033k451l432K633K376k155k246K537J597k732r93K812N05l282k48L258J088
1970C300l776j443L690J693l528j703L626R91l045o70L352o83l165J370L227j756
1986A480l419J470L352n42l836N55L499m26l302N87L097r34l249J889K874k476
2002F19k781L003K827l539k602L188K637k408k567J911K372k275j774J658J599
2017A868k520j578L054J583m303j127M402Q20m798q47M224P84m117m42L020M32
2033D55k777l55L066p11k677P12L487j023l820P32M317n90m338R73M212j348l525
$$ plain form
1922 1224 1862 -424 -1030 1209 1713 -1182 -1201 1715 1167 -2340 -1532 2335 1524 -2845 -1390 2228 1391
1939 1391 -1766 -500 2197 1026 -853 277 2523 590 -966 764 3243 996 -1736 493 4033
1954 4033 1582 -1850 783 3159 1004 -1242 1295 2892 160 -833 1979 2484 -798 -1046 2212 3300
1970 3300 -476 -1919 1771 3464 -64 -1767 1859 2850 -195 -865 2487 1804 -1361 9 3236 1480
1986 1480 -1939 -469 2883 2341 -1495 -940 2559 2133 -1169 -582 2515 1581 -1668 221 3095 619
2002 619 -2162 841 3668 129 -2473 715 3352 944 -1623 288 2660 385 -1389 269 1868
2017 1868 -652 -2230 824 2407 -1896 -3023 1379 2199 -2599 -3446 778 1562 -2555 -2997 23 455
2033 455 -2322 -2677 389 -322 -2999 -2287 1200 177 -3643 -2911 1406 816 -3522 -2549 1663 315 -3210
2050c210J759K651j405k334K049K114k754j861L018J840k372l095K649L198k100
2065A47l188K443K656k643j861K422J319l095j02L076N4l073m58L305Q65k880
2081a013j259L059J516k778j379L181O64l172N9L140l75l570J513L011j489l333
2097b225J766L206j279k875P83K564o57k633J109K382j396j934J502K368j824
2112H57k986K483K573k635k491K602K175k468j956K165J249j704j027J319R53
2127A109k336o33K372R77k803j094K779J488l316j004L465L25k699j31K067ok065
2144a505M80J953n40j956M53K012k43k648M44K680l93k623P75K326j060k217J159
2161i03J996j616j237J776J167k011p86J348J331r71j342Q27J480q85j590J072
$$ plain form
2050 -3210 -1451 1200 -205 -2539 -490 1624 -1130 -2991 27 1867 -505 -3600 -951 2247 147
2065 147 -3041 -598 2058 -585 -2446 -24 1295 -1800 -1902 1174 1228 -1845 -2303 1002 1867 -1013
2081 -1013 -2272 787 2303 -475 -1854 1327 1991 -1181 -1122 2018 1643 -1927 -414 2597 1108 -2225
2097 -2225 -459 2747 1468 -1407 -624 1940 1283 -1350 -241 2141 745 -1189 313 2681 857
2112 857 -2129 354 2927 292 -2199 403 2578 110 -1846 319 1568 -136 -1163 156 1109
2127 1109 -1227 -1860 512 1489 -1314 -2408 371 1859 -1457 -2461 1004 1329 -1370 -1501 566 560 -1505
2144 -1505 -1025 928 388 -1568 -1115 897 654 -1994 -1550 1130 737 -1886 -1111 1215 155 -2062 -903
2161 -903 1093 -523 -1760 16 1183 -828 -1614 -266 1065 94 -1248 -421 1059 174 -1416 -344
2177c44J821j559j658K065O84k049n12K321J40k211l2J893N1j739k69J562o6j319
2195a221m06J798J20j480n66J932J80k098M20K311o77j557O44J550r34j089Q35
2212b38Q03m19o64L00O86m29o96L74J276j307j016J135R38j108j121J159O57j382
2230a052q66J074M18q44l05R54J70q33k37Q19M46r54k35J025N60j152n17J645
2248A16K59r73L48P68l67p45O36P20k79r63Q61J8J22q43J63O11k1q95j67P88N7
2269B14j259K18J028l01j081R06N45q79J0J51J44mj8j15L92k44r4N5O04k05o23
2290e56O94N84q30l51M80N61j173O51P17n27n26L74J27l2j69l35K90L07m88J52
2310e0j51M16l72k07O43k23n50M45K78m91m49P36k8n82L12l27L46j00jm17N18
$$ plain form
2177 -344 1477 -82 -1740 325 1009 -1040 -1552 769 909 -1302 -1334 559 610 -1129 -1398 164 98 -1221
2195 -1221 -1627 171 291 -1189 -1755 177 357 -1741 -1321 990 313 -1244 -600 950 16 -1073 -238
2212 -238 565 146 -518 -218 468 39 -657 -283 993 -314 -1330 -195 743 -365 -1486 -327 330 -1052
2230 -1052 -1918 -844 -426 -1270 -1575 -621 -451 -1284 -1521 -702 -256 -1210 -1445 -420 140 -1012 -1529 116
2248 116 375 -598 -250 518 151 -594 42 762 483 -480 381 399 521 -322 -159 452 431 -464 -631 157 214
2269 214 -1045 -827 201 -100 -1181 -275 270 -609 -599 -448 -304 -308 -326 -441 -49 -293 -387 -332 272 67 -556
2290 -556 138 722 -108 -459 21 582 -591 60 777 250 -276 98 225 193 24 -311 -21 286 -202 -50
2310 -50 -201 215 -157 -364 279 56 -494 -49 229 -262 -711 25 -3 -585 -273 -600 -254 -354 -355 -772 -254
2331b54M36q79K0L39J24n66K78M31j77j38M29L8l13J35K90l30L01J75j76L99Q3
2352F45O1k00O63l00l09N32J06o85qP56l05l98M79m7P0k09L64m3l76j02j44L57
2374I07j27r1l81Q1L64j53O0K00P8m94L40K02m11J98K16J05m31J28J99l32j99
2395D59K20RK50J56n07j50O57o48l37J55N55o32m29N65l04o30K88%m58m43N12
2416g12l12J1r7O4N4K73o18j39J73J02k35j41P44o79o18R43J83r21K38M19K08
2437a060l37k46N22qK52m90J77J61o3l67P77J83m33n51J045k9l44J9J133n91q71
2458a121O88N77l76n64L96L08J3k73N6M05J77p90J7J161k64r08L63J008m73o65
2478b65Q99M72o63k00P14K28n36n2K35M78k48p97M89J149r11p42J021N53j163
$$ plain form
2331 -254 182 -697 -677 -338 -214 -780 -502 -71 -248 -386 43 81 -232 -97 193 -137 164 339 163 562 645
2352 645 706 506 1169 869 560 1092 1198 513 505 1261 956 558 1037 990 1060 851 1215 1172 796 694 550 907
2374 907 780 689 308 389 753 600 660 860 938 444 784 986 575 773 989 1094 663 791 990 658 459
2395 459 679 688 938 1094 587 437 1094 446 109 264 819 187 -242 323 19 -611 -323 -323 -781 -1224 -712
2416 -712 -1024 -1013 -1110 -1046 -992 -719 -1337 -1476 -1303 -1201 -1436 -1577 -833 -1512 -2130 -1187 -1004 -1925 -1687 -1268 -1060
2437 -1060 -1397 -1643 -1121 -1129 -877 -1367 -1190 -1029 -1092 -1459 -682 -499 -932 -1483 -438 -467 -811 -792 341 -250 -1121
2458 -1121 -433 144 -232 -796 -400 -92 -79 -352 -296 109 286 -504 -487 674 410 -498 -135 873 400 -265
2478 -265 634 1106 443 243 957 1185 649 597 832 1310 1062 265 754 1903 992 250 1271 1824 661
2497F61l78Q81L49j031j76Q40k68o88Q1M30M8q04k54P94j00p25m80J341l74o49
2517e02l41J479l43j479O04J219q01r88L07J062n33j039O43M40k26o30L39P04
2535h5m14j341P12J380j080j319J368R94j093q72Q98J307j511k24Q51K77q74k17
2553a243J565%j484j49J495M84j429l05J308P52k059k67K300k12j151k49J606
2570I62j38j839N56J197j10j273J03J447k6j352L04J509l59j593O83J275q42r08
2588d04R07J244j454j070J803O11j754k09J129R45j552o82R36Q86p94j592J391
$$ plain form
2497 661 283 1164 1513 482 306 1146 878 190 271 701 749 -55 -309 485 385 -340 -820 521 147 -502
2517 -502 -843 636 293 -1186 -582 637 -164 -1152 -845 217 -316 -1355 -712 -272 -498 -1128 -789 -85
2535 -85 -499 -1840 -1128 252 -828 -2147 -779 215 -878 -1750 -852 455 -1056 -1280 -429 -152 -1026 -1243
2553 -1243 322 322 -1162 -1311 184 668 -761 -1066 242 994 -1065 -1332 968 756 -395 -644 962
2570 962 824 -1015 -459 738 628 -645 -542 905 879 -473 -169 1340 981 -612 71 1346 504 -404
2588 -404 503 1747 293 -777 1026 1637 -117 -326 803 1748 196 -486 450 1336 542 -1050 341
$$ [...]
8191c0
##END NTUPLES=NMR FID
##END=
