##TITLE=1H_BAU-j-FCH3
 CDCl3, 8 sc, 
 5.6.2019
##JCAMPDX= 6.0         $$ Bruker NMR JCAMP-DX V2.0
##DATA TYPE= NMR FID
##DATA CLASS= NTUPLES
##ORIGIN= UXNMR, Bruker Analytische Messtechnik GmbH
##OWNER= root
$$ XWIN-NMR		Version 3.5
$$ Wed Jun  5 15:30:17 2019 Russian Standard Time (UT+4h)  she@DPX200
##.OBSERVE FREQUENCY= 200.13155
##.OBSERVE NUCLEUS= ^1H
##.DELAY= (6, 6)
##.ACQUISITION MODE= SIMULTANEOUS
##.ACQUISITION SCHEME= undefined
##.AVERAGES= 8
##.DIGITISER RES= 18
##SPECTROMETER/DATA SYSTEM= spect
##.PULSE SEQUENCE= zg30
##.SOLVENT NAME= CDCl3
##.SHIFT REFERENCE= (INTERNAL, CDCl3, 0, 15.7039)
##AUDIT TRAIL= $$ (NUMBER, WHEN, WHO, WHERE, WHAT)
$$ ##TITLE= Audit trail, XWIN-NMR		Version 3.5
$$ ##JCAMPDX= 5.01
$$ ##ORIGIN= Bruker BioSpin GmbH
$$ ##OWNER= she
$$ F:/spectra/data/she/nmr/H-F/1/audita.txt
$$ ##AUDIT TRAIL=  $$ (NUMBER, WHEN, WHO, WHERE, WHAT)
(   1,<2019-06-05 15:29:08.87 +0400>,<she>,<DPX200>,
      <created by zg, POWCHK disabled, PULCHK disabled
       configuration hash MD5:
       00 E9 B6 7A A2 85 ED C7 34 08 36 98 17 FE 4E 26
       data hash MD5: 16K
       86 5D BF A4 58 D0 FC 2F A5 CC 65 68 6D A8 36 73>)
$$ ##END=
$$ 
$$ hash MD5
$$ 0D AC 64 29 BF 0F 11 CD FE 65 A1 0F 4A 87 10 7C
##$RELAX= 
##$RELAX= 
##$RELAX= 
##$RELAX= 
##$RELAX= 
##$RELAX= 
$$ Bruker specific parameters
$$ --------------------------
##$DU= <F:/spectra>
##$EXPNO= 1
##$NAME= <H-F>
##$PROCNO= 1
##$TYPE= <nmr>
##$USER= <she>
##$AMP= (0..31)
100 100 100 100 100 100 100 100 100 100 100 100 100 100 100 100 100 100 
100 100 100 100 100 100 100 100 100 100 100 100 100 100 
##$AQSEQ= 0
##$AQ_mod= 1
##$AUNM= <au_zg>
##$AUTOPOS= <>
##$BF1= 200.13
##$BF2= 200.13
##$BF3= 200.13
##$BF4= 200.13
##$BF5= 200.13
##$BF6= 200.13
##$BF7= 200.13
##$BF8= 200.13
##$BYTORDA= 1
##$CFDGTYP= 0
##$CFRGTYP= 5
##$CHEMSTR= <none>
##$CNST= (0..31)
1 1 145 1 1 1 1 1 1 1 1 1 1 1 1 1 1 1 1 1 1 1 1 1 1 1 1 1 1 1 1 1 
##$CPDPRG= <>
##$CPDPRG1= <>
##$CPDPRG2= <>
##$CPDPRG3= <>
##$CPDPRG4= <mlev>
##$CPDPRG5= <mlev>
##$CPDPRG6= <mlev>
##$CPDPRG7= <mlev>
##$CPDPRG8= <mlev>
##$CPDPRGB= <>
##$CPDPRGT= <>
##$D= (0..31)
0 1.2 0 0 0 0 0 0 0 0 0 0.03 0 0 0 0 0 0 0 0 0 0 0 0 0 0 0 0 0 0 0 0 
##$DATE= 1559734148
##$DBL= (0..7)
120 120 120 120 120 120 120 120 
##$DBP= (0..7)
150 150 150 150 150 150 150 150 
##$DBP07= 0
##$DBPNAM0= <>
##$DBPNAM1= <>
##$DBPNAM2= <>
##$DBPNAM3= <>
##$DBPNAM4= <>
##$DBPNAM5= <>
##$DBPNAM6= <>
##$DBPNAM7= <>
##$DBPOAL= (0..7)
0.5 0.5 0.5 0.5 0.5 0.5 0.5 0.5 
##$DBPOFFS= (0..7)
0 0 0 0 0 0 0 0 
##$DE= 6
##$DECBNUC= <off>
##$DECIM= 24
##$DECNUC= <off>
##$DECSTAT= 4
##$DIGMOD= 1
##$DIGTYP= 9
##$DL= (0..7)
0 120 120 120 120 120 120 120 
##$DP= (0..7)
150 150 150 150 150 150 150 150 
##$DP07= 0
##$DPNAME0= <>
##$DPNAME1= <>
##$DPNAME2= <>
##$DPNAME3= <>
##$DPNAME4= <>
##$DPNAME5= <>
##$DPNAME6= <>
##$DPNAME7= <>
##$DPOAL= (0..7)
0.5 0.5 0.5 0.5 0.5 0.5 0.5 0.5 
##$DPOFFS= (0..7)
0 0 0 0 0 0 0 0 
##$DQDMODE= 0
##$DR= 18
##$DS= 0
##$DSLIST= <SSSSSSSSSSSSSSS>
##$DSPFIRM= 0
$$ [...]
##$SUBNAM2= <"">
##$SUBNAM3= <"">
##$SUBNAM4= <"">
##$SUBNAM5= <"">
##$SUBNAM6= <"">
##$SUBNAM7= <"">
##$SUBNAM8= <"">
##$SUBNAM9= <"">
##$SW= 24.9336996594482
##$SWIBOX= (0..15)
0 0 2 0 0 0 0 0 0 0 0 0 0 0 0 0 
##$SW_h= 4990.01996007984
##$TD= 16384
##$TD0= 1
##$TE= 0
##$TE2= 300
##$TE3= 300
##$TEG= 300
##$TL= (0..7)
0 120 120 120 120 120 120 120 
##$TP= (0..7)
150 150 150 150 150 150 150 150 
##$TP07= 0
##$TPNAME0= <>
##$TPNAME1= <>
##$TPNAME2= <>
##$TPNAME3= <>
##$TPNAME4= <>
##$TPNAME5= <>
##$TPNAME6= <>
##$TPNAME7= <>
##$TPOAL= (0..7)
0.5 0.5 0.5 0.5 0.5 0.5 0.5 0.5 
##$TPOFFS= (0..7)
0 0 0 0 0 0 0 0 
##$TUNHIN= 0
##$TUNHOUT= 0
##$TUNXOUT= 0
##$USERA1= <user>
##$USERA2= <user>
##$USERA3= <user>
##$USERA4= <user>
##$USERA5= <user>
##$V9= 5
##$VALIST= <valist>
##$VCLIST= <CCCCCCCCCCCCCCC>
##$VD= 0
##$VDLIST= <DDDDDDDDDDDDDDD>
##$VPLIST= <PPPPPPPPPPPPPPP>
##$VTLIST= <TTTTTTTTTTTTTTT>
##$WBST= 1024
##$WBSW= 4
##$XGAIN= (0..3)
0 0 0 0 
##$XL= 0
##$YL= 0
##$YMAX_a= 32249
##$YMIN_a= -42251
##$ZGOPTNS= <>
##$ZL1= 120
##$ZL2= 120
##$ZL3= 120
##$ZL4= 120
##$ABSF1= 10
##$ABSF2= 0
##$ABSG= 5
##$ABSL= 3
##$ALPHA= 0
##$AQORDER= 0
##$ASSFAC= 0
##$ASSFACI= 0
##$ASSFACX= 0
##$ASSWID= 0
##$AUNMP= <proc_1d>
##$AZFE= 0.1
##$AZFW= 0.1
##$BCFW= 1
##$BC_mod= 2
##$BYTORDP= 1
##$COROFFS= 0
##$CY= 11.3945322036743
##$DATMOD= 1
##$DC= 2
##$DFILT= <>
##$DTYPP= 0
##$F1P= 18.9103706918063
##$F2P= -1.10871071338519
##$FCOR= 0.5
##$FTSIZE= 0
##$FT_mod= 4
##$GAMMA= 1
##$GB= 0.15
##$INTBC= 1
##$INTSCL= 1
##$ISEN= 128
##$LB= 0.24
##$LEV0= 0
##$LPBIN= 0
##$MAXI= 10000
##$MC2= 0
##$MEAN= 0
##$ME_mod= 0
##$MI= 1.114404
##$NCOEF= 0
##$NC_proc= 0
##$NLEV= 6
##$NOISF1= 3.799351
##$NOISF2= 2.8
##$NSP= 1
##$NTH_PI= 0
##$NZP= 0
##$OFFSET= 15.70392
##$PC= 1
##$PHC0= -8658.241
##$PHC1= 19.60018
##$PH_mod= 1
##$PKNL= yes
##$PPARMOD= 0
##$PSCAL= 0
##$PSIGN= 0
##$REVERSE= no
##$SF= 200.130013532006
##$SI= 16384
##$SIGF1= 3
##$SIGF2= 2
##$SINO= 400
##$SIOLD= 16384
##$SREGLST= <1H.CDCl3>
##$SSB= 0
##$STSI= 0
##$STSR= 0
##$SW_p= 3612.71676300578
##$SYMM= 0
##$S_DEV= 0
##$TDeff= 0
##$TDoff= 0
##$TI= <>
##$TILT= no
##$TM1= 0
##$TM2= 0
##$TOPLEV= 0
##$USERP1= <user>
##$USERP2= <user>
##$USERP3= <user>
##$USERP4= <user>
##$USERP5= <user>
##$WDW= 1
##$XDIM= 8192
##$YMAX_p= 0
##$YMIN_p= 0
$$ End of Bruker specific parameters
$$ ---------------------------------
##NTUPLES= NMR FID
##VAR_NAME=  TIME,          FID/REAL,        FID/IMAG
##SYMBOL=    X,             R,               I
##VAR_TYPE=  INDEPENDENT,   DEPENDENT,       DEPENDENT
##VAR_FORM=  AFFN,          ASDF,            ASDF
##VAR_DIM=   8192,          8192,            8192
##UNITS=     SECONDS,       ARBITRARY UNITS, ARBITRARY UNITS
##FACTOR=    0.0002004,     1,               1
##FIRST=     0,             0,               0
##LAST=      1.6414764,     0,               0
##MIN=       0,             -42251,          0
##MAX=       1.6414764,     32249,           0
$$ Real data points
##PAGE= N=1
##DATA TABLE= (X++(R..R)), XYDATA
0 0 0 0 0 0 0 0 0 0 0 0 0 0 -2 8 -8 8 -8 8 -10 16 -16 17 -24 24 -32 32 -40 42 -48 56 -64 71 -79 89 -98 110
36 110 -122 137 -152 168 -185 203 -226 251 -275 307 -340 380 -426 477 -540 613 -701 817 -965
55 -965 1171 -1466 1946 -2848 5147 -24429 -42102 -17641 -34473 -42251 -33857 -21792 -27395 -27325 -22904
70 -22904 -19716 -21812 -15027 -7703 -10492 -18531 -8717 5570 -362 -14593 -4871 9916 3417 -7126
84 -7126 -18 5145 -417 -296 5183 -231 -6933 -120 8505 826 -10936 -4921 10044 6082 -9545
99 -9545 -5626 10659 8737 -1976 3221 11723 8309 8835 17339 15990 9493 16842 28277 24451 14974
114 14974 19571 32249 32044 20982 20726 31143 30870 22349 23954 27402 20117 18049 26240 22115 7711
129 7711 9999 21962 16432 1176 1403 11895 10989 -301 -3566 3565 4935 -1836 -1780 2306 -1916
144 -1916 -4254 4336 5542 -5667 -4814 8307 7812 -3476 -2638 6662 6832 830 115 3306 2781 -84
160 -84 1085 2193 -3899 -7494 -226 1456 -11217 -15805 -4627 -3051 -15887 -19049 -11061 -10827 -17029
175 -17029 -17824 -15430 -16187 -17274 -15114 -13466 -16195 -17745 -11484 -6393 -12255 -15723 -6192 -446 -7129
190 -7129 -8596 -521 1166 -2350 485 3925 949 303 5221 6717 1880 -630 4177 8153 2534
205 2534 -3697 1211 6631 312 -5129 -183 1509 -3647 -3366 -291 -3539 -5929 -1585 158 -3902
220 -3902 -5361 -1278 1864 -154 -3039 -51 4756 3094 512 4410 6831 3490 4812 9660 6913
235 6913 3039 7679 11249 6384 3262 6713 8750 5964 2776 3045 5179 3904 105 369 1989 -970
251 -970 -2772 13 -1075 -5606 -3725 -364 -3621 -6328 -3217 -1615 -3597 -3818 -2537 -1739 -1586 -1664 -902
268 -902 572 -308 -814 2298 3039 -684 -8 4425 2922 -1005 1013 3300 887 -618 325 -128 -1008
285 -1008 -1322 -2048 -2412 -2731 -3948 -3818 -2950 -4887 -5977 -3505 -3449 -6242 -4995 -2455 -3994 -4707 -2023
302 -2023 -1723 -2886 -1169 415 54 502 1309 1982 3343 3276 2236 3993 5647 3591 2954 5411 4940
319 4940 2834 3873 4394 2426 2288 2938 1341 614 1208 139 -836 -288 -1183 -1984 -1124 -1699 -2864 -1635
337 -1635 -1194 -2872 -1893 -149 -1352 -1633 587 719 -178 1317 2197 1797 2722 3356 2750 3780 4611 3427
355 3427 3633 5059 4167 3115 4256 3921 2479 2975 2940 1388 1407 1744 40 -443 469 -749 -1880 -950
373 -950 -1342 -2491 -1699 -1612 -2722 -1825 -1066 -2287 -1856 -163 -811 -1212 321 607 -160 1159 1526 740 1762
392 1762 2420 1134 1587 2769 1469 756 1982 1295 8 623 256 -1163 -767 -728 -2487 -2432 -1673 -3205
410 -3205 -3842 -2811 -3400 -4323 -3395 -3385 -4204 -3229 -2792 -3608 -2671 -1457 -2369 -1942 -212 -609 -956 740 938
429 938 172 1329 1996 966 1460 2322 1202 997 1829 980 176 691 -98 -957 -416 -1215 -2823 -2090 -1671
448 -1671 -3757 -3921 -2655 -3714 -4822 -3612 -3535 -4506 -3758 -3143 -3452 -2864 -2337 -2508 -1289 -435 -1278 -406
466 -406 1612 913 460 2504 2792 1530 2771 3994 2525 2244 3860 3433 2165 2425 2621 2390 1980 678
484 678 537 1670 661 -1195 -134 621 -1637 -1680 261 -976 -2597 -641 476 -1265 -1464 168 694
501 694 445 293 722 2117 2365 1402 2359 3766 2451 2286 4732 4066 1415 3160 5544 2996 965
518 965 3016 3912 1938 864 1339 1620 955 -249 -86 404 -1061 -1916 246 83 -3368 -2510 1242 -451
536 -451 -3734 -1495 1129 -640 -1751 -67 627 -85 288 1210 1307 178 298 2739 2864 -642 -632 3585
554 3585 2962 -1751 -827 2710 695 -1983 -276 158 -2127 -2162 -558 -1589 -3892 -3650 -1228 -1086 -4729
571 -4729 -5405 -1100 -200 -4583 -4622 -381 -831 -3483 -1208 473 -2030 -1654 2112 1698 -1645 -665 3375
588 3375 3683 4 -884 3245 4849 825 -527 3249 3323 128 1435 3358 -277 -1510 2923 3048
604 3048 -2395 -2876 2038 2418 -2173 -3531 -7 1755 -1367 -3055 -253 277 -2185 -776 1766 -1590
620 -1590 -3740 1657 3812 -2220 -3808 2213 3952 -798 -2408 1119 2594 332 -804 876 911 -1149
636 -1149 207 2609 -663 -4261 547 4244 -1746 -5607 88 3080 -1831 -4149 -937 134 -1780
651 -1780 -1855 -543 -1603 -3180 -998 1865 -1365 -5423 -1172 4107 -652 -5861 -1086 3529 -655 -3553
667 -3553 -203 743 -1624 -674 1268 -1104 -3302 -286 2982 -370 -4947 -1787 3932 809 -5210 -2250
683 -2250 3053 120 -3251 -158 819 -2075 -609 2731 -121 -3740 70 4540 1387 -3610 -966
698 -966 4847 3325 -2261 -833 4154 2604 -553 1937 3088 -402 690 5259 2585 -2539 557
713 557 6083 3430 -2062 -429 4680 4060 -436 -358 3283 2569 167 2150 3096 -726 -337 5069 3635
730 3635 -2837 -998 5583 3844 -2021 -1050 3625 3176 -132 -174 1966 1372 34 1792 2589 -1188 -1716
747 -1716 3809 3871 -2933 -2904 3952 3631 -2328 -2144 2240 1723 -818 -198 917 -374 -938 1440 2024 -1878
765 -1878 -3009 2201 3622 -2624 -4392 1854 3021 -2584 -3275 579 122 -2438 -1225 -326 -2776 -3354
781 -3354 -399 97 -3909 -5397 -1172 1072 -3808 -6563 -1932 398 -3937 -5239 -1746 -1964 -4291 -2397
797 -2397 -804 -3784 -4650 -822 432 -3278 -4800 -1172 1433 -1704 -4396 -1341 1594 -1335 -2856
812 -2856 123 109 -2382 -539 1748 -1318 -3214 560 2517 -1195 -3077 -7 2147 -74 -2377 -615
828 -615 1599 104 -1348 607 1120 -1333 -94 2919 551 -2326 1071 4069 836 -1483 1406 3471
844 3471 1760 220 1466 2796 1989 1231 2468 2778 765 1304 4124 2812 -546 1448 4649 2346
860 2346 -421 1688 3539 1790 769 1831 2173 1309 1281 2158 2043 562 614 2991 2667 -337 318 3500
878 3500 2313 -476 991 2861 1260 332 1636 1573 384 726 1608 1059 -171 -263 1204 1310 -1015
895 -1015 -1462 932 752 -2026 -1511 363 -1036 -2320 -870 -720 -2470 -2054 -779 -1464 -2546 -2225 -1265
912 -1265 -1109 -2158 -2635 -1151 -514 -2104 -2177 -402 -857 -2001 -818 57 -1503 -1465 268 -29 -1294 -824
930 -824 37 -137 -572 -939 -364 190 -642 -1225 -179 -68 -1362 -872 146 -1071 -1701 -182 -125 -1590 -1160
949 -1160 -184 -603 -953 -708 -595 -298 -225 -661 -224 397 -356 -358 824 504 -496 586 1281 191 169 1213
969 1213 932 339 865 944 527 841 813 482 778 614 169 637 839 -147 96 975 195 -352 542 565 -285
990 -285 174 559 -56 86 625 247 212 681 332 243 851 487 52 906 786 -18 478 1030 107 77 779
1011 779 209 -316 287 81 -556 -151 -133 -825 -515 -290 -1087 -846 -416 -1045 -1120 -370 -729 -1182 -415 -366 -981
1032 -981 -467 54 -523 -200 387 -17 35 751 554 392 1005 932 458 1097 1247 543 840 1286 524 359 941
1053 941 499 0 510 318 -495 -104 26 -757 -600 -344 -1036 -959 -540 -1034 -1287 -616 -946 -1324 -619 -444
1073 -444 -1067 -546 20 -559 -390 408 107 -45 567 483 323 820 856 450 898 1032 390 700 1114 302 194
1094 194 915 427 -344 300 320 -495 -291 46 -512 -601 -320 -629 -639 -201 -593 -632 32 -249 -692 337 391
1115 391 -443 175 1092 396 76 1048 1034 477 898 1046 734 938 868 627 858 659 45 518 705 -508
1135 -508 -595 499 -111 -1328 -539 -41 -1138 -1233 -503 -934 -1287 -821 -656 -734 -713 -813 -325 246 -414 -699
1155 -699 822 910 -304 292 1618 789 189 1411 1357 343 732 1484 874 223 333 685 619 -245 -920
1174 -920 15 200 -1412 -1589 -318 -1095 -2311 -1291 -832 -2359 -2395 -885 -1171 -2393 -1911 -785 -768 -1371
1192 -1371 -1491 -482 322 -568 -646 751 755 -379 753 1958 407 -141 1935 2209 90 177 1860 1639
1210 1639 300 109 908 929 170 -275 359 206 -1004 -426 800 -820 -2173 -15 1114 -1437 -2048
1227 -2048 382 802 -910 -798 451 473 -55 328 1115 837 118 974 2433 1198 -512 1410 3340
1244 3340 896 -712 1731 2527 325 -50 1359 814 -324 330 865 -296 -1283 -389 998 -440 -2574
1261 -2574 -1104 1220 -588 -2780 -740 875 -1043 -1583 390 107 -1360 -5 1540 8 -1233
1276 -1233 492 2238 900 -1063 115 2502 1384 -1055 217 1930 241 -873 1001 677 -1676
1291 -1676 -668 1347 -603 -2964 -1223 801 -794 -3132 -2202 0 -680 -2793 -2103 -204 -1233 -2260
1307 -2260 -261 139 -2291 -1369 1881 608 -2326 -413 2702 1422 -934 188 2335 1867 465 872
1323 872 2165 1198 340 2067 2400 -485 -490 2836 2178 -1838 -993 2351 1232 -1719 -1031 824 47 -1105
1341 -1105 -431 70 -961 -1344 395 905 -1647 -2036 1492 1931 -1766 -1821 2006 1944 -1046 -322 1747 843
1359 843 -133 1106 1499 -82 -348 1671 1943 -617 -1564 1355 2381 -1168 -2407 844 1353 -1741 -1674
1376 -1674 337 -752 -2008 -321 223 -2038 -2395 178 686 -1863 -2728 -72 1486 -1084 -2486 253
1392 253 1524 -871 -1033 1257 336 -1273 797 2013 -684 -1549 1298 2154 -617 -1742 456 1732
1408 1732 -249 -1829 -223 903 -1038 -1520 330 -374 -2473 -679 1238 -1404 -3071 -136 1492
1423 1492 -1128 -2315 -77 1219 -36 -1019 228 1219 260 112 1737 1473 -365 958 3407 1466
1439 1466 -896 1489 3662 1217 -379 1441 2464 941 288 1076 1124 136 83 1085 539 -1372 -660
1456 -660 1616 232 -2544 -990 1532 -202 -2229 -518 725 -758 -965 309 92 -857 -290 982
1472 982 587 -884 -320 1804 1303 -1114 -401 2195 1184 -962 311 1594 52 -499 909 504 -1084
1489 -1084 -436 778 3 -1541 -1328 197 26 -1929 -1967 -4 -327 -2123 -1442 -27 -1187 -1848 -164
1506 -164 3 -1692 -1081 676 129 -1180 -644 740 735 -346 -541 794 1022 -326 -31 1155 359 -671
1524 -671 665 1114 -742 -847 900 540 -1130 -795 271 -47 -835 -887 -246 -51 -753 -750 180 -123 -954
1543 -954 31 1070 -262 -672 1172 1505 -12 377 1615 1405 731 1170 1648 1367 1257 1255 1619 1404 732
1562 732 1041 1738 785 -199 910 1344 -278 -673 508 146 -934 -628 -325 -939 -1097 -805 -776 -1078 -1320
1581 -1320 -1108 -466 -672 -1465 -806 126 -558 -1064 71 310 -480 -100 633 158 -127 493 609 337 216
1600 216 408 484 483 -123 -145 441 36 -808 -287 68 -854 -1050 -315 -771 -1435 -826 -624 -1229 -1144 -779 -908 -807
1622 -807 -791 -857 -433 -147 -601 -361 376 -40 -235 518 689 57 476 1056 510 367 902 728 439 667 631
1643 631 364 598 342 48 359 249 -339 -86 241 -339 -527 114 -142 -614 -73 10 -434 -107 220 -104
1663 -104 80 412 224 405 798 558 454 1074 915 577 1108 1173 639 850 1195 664 536 928 521 211
1683 211 475 222 -195 65 -169 -597 -486 -325 -874 -809 -421 -918 -1125 -614 -782 -1132 -610 -457 -839 -539
1703 -539 -140 -522 -195 249 24 38 464 288 232 775 693 266 758 860 311 505 855 344 161 678 253
1724 253 -119 188 80 -290 -134 -104 -583 -406 -329 -787 -674 -300 -690 -838 -281 -408 -870 -360 -126 -589 -358
1745 -358 65 -241 -223 214 87 -19 261 225 38 403 287 -140 362 410 -186 24 432 -146 -442 166 -33
1766 -33 -523 -227 -54 -397 -433 -207 -423 -335 -213 -480 -260 5 -334 -389 234 35 -401 263 543 -176 -35
1787 -35 642 381 -64 377 479 287 260 191 244 402 154 -124 328 235 -457 -127 430 -361 -718 146 82 -805
1809 -805 -459 107 -281 -487 -140 -112 -135 -136 -135 157 220 -197 121 857 313 -258 652 1204 72 45 1086 887
1831 887 118 510 866 432 296 506 590 279 -50 138 599 136 -712 20 680 -397 -909 201 219 -816
1851 -816 -617 162 -385 -843 -220 33 -471 -744 -364 170 -216 -977 -442 572 -214 -1071 15 500 -581
1870 -581 -571 565 55 -982 -45 629 -313 -843 5 495 -60 -730 -327 607 61 -816 -79 649 -393
1889 -393 -626 680 498 -839 -58 1252 254 -742 313 1159 348 -365 219 928 553 -151 353 930 92
1908 92 -247 957 888 -685 -248 1460 588 -1010 -97 1203 209 -664 70 641 25 -391 93 490 -226
1927 -226 -468 632 865 -691 -677 1267 992 -960 -301 1358 567 -540 343 1002 95 -249 623 793
1945 793 -221 -401 800 997 -609 -948 890 930 -1105 -976 873 214 -1341 -446 480 -771 -1196 21
1963 21 89 -1227 -1228 89 207 -1239 -1638 35 466 -1278 -1589 297 135 -1476 -824 450 -731 -1427
1981 -1427 158 565 -1147 -1271 321 545 -962 -1315 132 676 -704 -1228 252 511 -983 -560 796
1998 796 -247 -1346 243 1222 -770 -1254 705 1183 -547 -915 516 1020 -179 -625 615 818 -427
2015 -427 -117 1226 392 -974 448 1833 -26 -1131 826 1558 -249 -713 793 1067 -100 -244 684
2032 684 602 -334 33 1114 426 -986 135 1792 285 -1181 537 1764 119 -672 925 1215 8
2049 8 134 1160 808 -95 407 1472 895 -504 234 1871 897 -854 341 1779 354 -748 692
2066 692 1061 -407 -222 892 280 -787 -224 794 164 -1197 -661 715 136 -1437 -826 760 -261
2083 -261 -1427 -238 414 -1024 -1130 428 -41 -1477 -694 602 -61 -1272 -779 467 140 -1144 -794
2100 -794 554 -27 -1133 -152 532 -784 -1082 503 397 -1309 -800 714 128 -1170 -639 483 45
2117 45 -908 -608 246 20 -813 -218 543 -430 -1001 395 753 -874 -789 844 593 -869 -358 732 268
2136 268 -448 -69 480 77 -342 -1 604 -65 -789 295 897 -521 -907 632 667 -723 -467 682 185
2155 185 -505 -17 465 -8 -270 236 642 176 -320 427 1070 138 -528 742 1211 -81 -125 1010 786
2174 786 -192 393 937 299 -132 554 758 195 -260 224 678 55 -614 123 672 -298 -703 231 183 -773
2194 -773 -426 407 -316 -845 -108 164 -398 -578 -82 182 -233 -567 -193 384 -92 -537 110 385 -408 -300
2214 -300 583 130 -621 100 584 -147 -407 62 233 -181 -293 -191 70 -96 -473 -207 161 -424 -672 81
2234 81 -28 -791 -418 241 -340 -649 -77 62 -353 -287 -18 -45 -31 -118 -53 155 17 -189 198 346 -222 -157
2256 -157 470 240 -349 136 388 -144 -178 210 48 -64 78 5 71 171 -100 63 387 129 -100 453 501
2277 501 -40 284 694 403 283 692 683 358 619 737 640 635 645 580 747 698 443 592 715 301 219 614 360
2300 360 -94 213 296 -73 -48 174 -149 -223 -119 -211 -338 -144 -337 -413 -156 -316 -625 -232 -151 -517 -286 -5
2322 -5 -288 -398 19 -13 -322 -23 -64 -267 -181 -19 -246 -130 -72 -291 -281 -32 -366 -491 -206 -345 -660 -380
2344 -380 -355 -728 -710 -445 -674 -780 -495 -702 -719 -592 -581 -777 -517 -563 -716 -457 -337 -625 -460 -147 -382 -457
2366 -457 -86 -137 -386 -139 -39 -347 -113 -11 -172 -108 36 -95 -96 128 -30 -253 147 70 -206 122 222 -127
2388 -127 3 353 100 -10 325 331 159 398 378 320 569 606 344 648 767 495 614 936 554 514 903 787
2410 787 450 669 768 511 463 604 435 397 494 365 310 464 237 144 378 277 -86 258 438 -53 -6 421
2432 421 217 -99 306 365 78 198 434 336 327 343 243 450 535 226 329 696 336 38 554 480 -33 162
2454 162 495 51 -145 230 141 -161 -130 -77 -162 -176 -469 -444 -101 -438 -700 -391 -206 -821 -744 -162 -521 -894
2476 -894 -450 -217 -768 -820 -394 -396 -562 -616 -512 -335 -500 -804 -515 -200 -684 -810 -145 -366 -1012 -597 -55
2497 -55 -631 -977 -351 -272 -668 -687 -414 -285 -496 -603 -335 -108 -516 -669 2 21 -716 -477 377 -57 -652
2518 -652 -25 408 -118 -396 261 280 -87 -50 178 310 -13 -108 329 504 -199 -219 706 512 -316 132 839
2539 839 187 -333 417 664 14 105 591 633 167 177 733 809 228 154 969 1009 129 425 1305 770 96 831
2561 831 1206 405 298 1078 995 322 339 917 889 252 52 740 846 -108 -82 670 355 -531 59 669 -248
2582 -248 -677 256 398 -757 -656 225 62 -680 -649 -62 0 -726 -751 15 -135 -949 -554 345 -396 -1129 -122
2603 -122 338 -820 -1032 55 141 -777 -668 -1 -51 -676 -625 -6 -119 -816 -493 374 -260 -1086 -225 624
2623 624 -475 -1013 214 529 -534 -512 435 194 -476 -207 375 177 -369 -132 710 289 -560 41 1026
2642 1026 116 -677 401 932 -186 -362 671 553 -360 53 738 302 -354 103 761 378 -408 49 996
2661 996 352 -572 246 1108 23 -342 772 813 -291 -26 981 480 -275 260 975 428 -292 42 900
2680 900 409 -364 135 862 97 -580 360 598 -547 -515 602 145 -958 -424 423 -163 -971 -532 78
2699 78 -284 -922 -591 -51 -489 -1128 -384 85 -954 -1139 70 -35 -1169 -836 237 -232 -1074 -574 126
2718 126 -314 -811 -346 94 -332 -761 -209 347 -460 -934 198 461 -807 -714 495 191 -819 -278 410
2737 410 -49 -597 27 293 -156 -412 150 563 -57 -498 377 784 -194 -454 777 654 -333 -6 924 395
2757 395 -230 507 803 253 -36 576 752 305 -64 557 1044 257 -109 834 991 -2 133 1061 616 -66
2777 -66 567 1052 387 125 753 1019 424 194 674 991 508 104 704 1049 315 149 997 741 -49 316
2797 316 1046 311 -164 526 695 33 -185 244 354 -66 -406 -45 172 -342 -553 36 17 -823 -678 101
2817 101 -394 -1104 -469 38 -701 -989 -400 -291 -718 -774 -422 -389 -641 -755 -380 -258 -830 -729 -69 -290 -966
2838 -966 -600 51 -536 -887 -293 -138 -611 -620 -226 -325 -539 -578 -311 -227 -519 -639 -153 -34 -650 -440 154 -169
2860 -169 -643 -126 218 -309 -352 102 81 -258 -68 146 123 -90 -78 273 364 -77 -84 500 371 -131 193 605
2882 605 191 -40 439 495 64 226 514 363 195 361 398 478 351 235 476 672 205 201 799 536 107 528
2904 528 699 249 277 652 495 302 438 484 409 334 221 232 376 157 13 294 243 -191 -55 254 -146 -320
2926 -320 87 -28 -427 -214 -23 -295 -285 -162 -300 -267 -223 -410 -261 -64 -339 -329 -38 -146 -366 -129 70
2947 70 -223 -192 123 -78 -237 45 28 -101 -30 -35 -117 14 -30 -164 42 88 -272 -160 103 -193 -302 54 -7
2970 -7 -331 -137 31 -216 -130 -101 -119 -138 -23 -182 -95 76 -80 -253 89 49 -218 20 225 -112 -32 245 32
2993 32 -76 121 135 -15 92 124 25 141 116 -64 86 233 -28 35 286 58 -126 171 206 -61 134 251
3015 251 103 49 297 139 90 304 195 28 254 199 28 301 210 -6 186 375 -21 -21 263 35 -33 134
3037 134 110 -140 3 -15 -193 -83 -54 -225 -170 21 -160 -214 40 -91 -321 24 21 -305 -57 91 -168 -160 56
3060 56 51 -92 66 60 21 84 51 -11 170 129 -147 75 219 -168 -176 121 -39 -260 14 19 -266 -131 -109 -282 -314
3085 -314 -257 -412 -337 -311 -451 -399 -210 -417 -642 -269 -265 -532 -411 -140 -429 -449 -110 -155 -381 -179 -103 -153 -231 -165
3109 -165 -149 0 -71 -219 33 120 -293 -136 294 54 -215 87 204 -88 -33 226 120 30 161 135 175 196 142
3132 142 291 410 151 122 543 489 99 344 733 333 179 629 644 206 385 669 440 314 388 512 540 322
3154 322 244 495 552 64 165 622 277 -24 359 503 27 3 453 238 -27 99 299 258 187 52 351 364
3176 364 83 50 462 381 -153 224 570 123 -188 456 458 -146 -71 266 23 -248 -82 14 -45 -328 -351 -89 -201
3199 -201 -687 -492 -42 -562 -899 -322 -129 -884 -860 -282 -441 -931 -675 -342 -610 -816 -578 -278 -475 -726
3219 -726 -526 -77 -317 -831 -286 110 -465 -670 25 42 -614 -373 140 -144 -555 -215 62 -168 -443 -282
3239 -282 43 -168 -591 -206 231 -251 -625 79 277 -402 -345 329 106 -453 -51 454 77 -207 142 501
3259 501 314 -102 200 559 335 -161 397 772 28 -56 651 529 -111 118 724 302 -53 314 533 289
3279 289 -45 240 561 298 -124 339 697 88 -144 574 721 -54 56 820 549 -108 384 860 373 63
3299 63 422 721 347 105 432 640 239 -113 426 659 -131 -243 520 353 -431 -111 488 -106 -601 -120
3319 -120 118 -340 -520 -153 -31 -411 -699 -203 113 -491 -709 27 68 -749 -550 180 -65 -659 -136 240
3339 240 -207 -460 103 255 -244 -383 96 257 -144 -419 165 291 -325 -482 318 140 -671 -169 388 -150
3359 -150 -626 -14 258 -401 -430 -4 108 -305 -473 -28 202 -346 -417 289 313 -443 -159 481 109 -459 137
3380 137 555 -91 -295 312 419 -42 -118 272 383 -4 -186 311 386 -224 -220 415 198 -547 -16 451 -136
3401 -136 -454 139 322 -244 -273 185 171 -133 -149 236 316 -132 -204 293 358 -271 12 598 140 -390 227 503
3423 503 -87 -226 285 247 -271 -173 196 85 -293 -279 70 41 -480 -376 120 -97 -659 -206 234 -340 -615
3444 -615 -16 57 -490 -306 84 32 -339 -244 152 46 -112 -168 251 268 -212 54 531 168 -169 266 601 3
3466 3 -78 470 369 -70 2 327 141 -29 -11 213 193 -138 -105 266 107 -369 -49 257 -197 -341 164 124 -366
3489 -366 -160 248 7 -207 56 153 134 -69 -53 218 160 -92 19 370 117 -153 266 363 -62 -116 352 102
3511 102 -162 37 194 60 -130 -17 44 -4 -111 -128 152 -16 -312 25 150 -168 -310 160 79 -254 -73
3532 -73 171 27 -123 -19 51 52 -61 -36 104 137 -106 -29 165 -82 -225 102 146 -213 -196 118 -28 -215 -42
3555 -42 22 -189 -157 -86 -93 -87 -127 -108 50 -1 -212 -9 195 -15 -125 179 215 -131 70 272 133 98 272 219 187
3580 187 237 226 207 277 171 52 283 191 -51 91 222 -84 -103 191 68 -202 2 -24 -147 -213 -171 -157 -175 -131
3604 -131 -266 -153 -70 -261 -207 42 -166 -324 -56 -55 -199 -64 53 -113 -147 59 -5 -121 -37 -13 -26 64 -105
3627 -105 -79 81 -34 -183 -52 118 -190 -145 38 -37 -165 -34 -23 -188 -99 -117 -238 -162 -82 -165 -99 -17 -75 -164
3651 -164 64 -53 -169 93 92 -143 -48 117 -77 -23 105 14 24 129 -7 -19 121 100 -29 123 82 -54 59
3674 59 171 -51 -31 171 49 -49 141 113 -57 22 168 60 153 204 143 182 298 127 141 307 243 169 311 362
3698 362 31 180 350 197 79 233 157 44 117 159 38 108 0 -87 37 -23 -205 -82 38 -213 -184 39
3720 39 -97 -208 -81 -80 -224 -122 -12 -102 -71 19 9 -9 5 11 -8 126 81 10 189 204 -84 85 260 1 -36
3745 -36 196 138 -40 52 122 -30 -64 -4 -158 6 -90 -138 -58 -62 -229 -178 51 -158 -370 -81 100 -231 -162 40
3769 40 -82 -243 -87 -49 -109 -104 -95 -83 -25 -84 -170 61 -10 -198 -39 170 -134 -217 103 -8 -163 -159 141 -124 -108
3794 -108 -112 20 -42 -120 -67 6 81 -148 -106 164 55 -210 127 220 -149 -75 189 74 -123 57 184 -1 39 18
3818 18 146 120 -100 -22 200 89 -150 76 228 -114 -182 131 133 -250 -114 118 -70 -229 -26 75 -86 -199
3840 -199 -77 97 25 -183 -45 244 -36 -172 197 274 -81 -29 360 127 -133 157 360 127 39 307 317 181
3862 181 -2 143 353 119 -25 291 452 -80 -166 307 177 -206 -42 252 -74 -277 48 76 -149 -177 -33
3883 -33 89 -123 -263 -8 96 -176 -326 203 140 -323 -194 264 37 -270 93 320 -46 -178 135 213 -14
3904 -14 -52 135 297 59 -176 170 267 -94 -192 311 155 -293 4 304 -66 -250 96 232 -92 -168 107 165
3926 165 -144 -144 166 113 -122 -203 212 188 -273 -145 323 82 -367 53 260 -138 -181 173 131 -218 -222 54 102
3949 102 -199 -242 57 80 -349 -212 164 110 -459 -102 197 -204 -389 47 120 -256 -227 121 111 -210 -171 107
3971 107 164 -194 -110 215 156 -268 -67 348 -49 -313 160 312 -168 -213 226 167 -230 -100 101 75 -147 -147 107
3994 107 37 -329 -171 251 6 -363 -18 250 -172 -325 115 139 -232 -147 233 91 -103 20 173 256 -73
4015 -73 -28 348 317 -73 107 511 85 -148 266 485 -3 -31 428 356 -34 70 331 220 -99 92 260 92
4037 92 -171 -97 247 77 -376 55 291 -133 -349 218 159 -209 -166 171 -44 -317 -25 44 11 -235 -116 136
4059 136 40 -267 -66 215 -153 -346 83 238 -233 -238 257 12 -315 -90 117 1 -195 -86 73 86 -230
4080 -230 -121 126 -40 -273 40 266 -138 -245 255 188 -186 -28 233 82 -117 36 219 121 -68 96 196
4101 196 30 -160 93 284 0 -119 151 274 -120 -115 249 82 -170 -7 206 -64 -158 32 95 -26 -178
4122 -178 -44 134 55 -205 0 199 -74 -150 237 119 -171 -70 270 14 -35 77 191 -18 -76 81 141 25
4144 25 -45 25 135 -43 -228 93 166 -208 -114 175 -29 -311 -50 43 -181 -195 -80 -2 -166 -242 -121 30 -147
4167 -147 -302 -98 56 -228 -243 141 35 -285 -55 120 -93 -73 54 65 -74 14 38 107 91 -49 63 202
4189 202 50 -121 122 204 -57 10 227 118 -56 86 203 -31 18 121 101 79 49 54 143 93 -35 108 158 56
4213 56 -50 179 178 -78 92 109 -13 -28 161 105 24 31 52 23 29 -9 39 42 -78 -103 46 139 -142 -109 91 -42 -135
4240 -135 46 18 -124 -76 53 -43 -73 -14 -30 -34 -14 -20 -48 72 -68 -28 70 99 -70 -38 132 -74 -131 70 14 -141
4266 -141 2 -60 -88 -46 -66 -36 -54 -71 -203 -78 -13 -138 -146 10 -97 -197 -54 -5 -122 -94 65 -71 -44 9 -9
4291 -9 5 40 78 59 148 105 13 185 224 5 91 182 60 44 241 204 81 79 64 69 164 121 42 104 110 18 42 95 -35
4320 -35 -12 118 11 -92 31 140 -63 -27 94 -32 -76 57 -70 -31 56 -67 -98 31 31 -130 -28 31 -164
4343 -164 -21 92 -79 -105 0 -23 -140 -44 60 -136 -27 -46 -85 -78 4 -111 -51 -13 -131 -91 76 3 -111 2
4367 2 60 -151 -83 28 -91 -66 -47 -32 -7 -10 -1 -27 24 38 -107 8 52 -69 -16 30 -93 -129 82 51 -112 13 57
4394 57 -70 -79 8 -46 -17 -95 -16 -76 12 -83 -25 74 -86 -83 105 147 -56 54 172 59 -30 213 205 52 104 188 129
4421 129 143 129 126 210 174 17 161 294 63 11 185 138 3 33 139 -5 -56 55 12 -18 -35 -68 -9 -3 -118 -172
4447 -172 56 -32 -197 -29 8 -196 -75 176 -11 -195 -33 29 -92 -128 3 -7 -38 -90 -36 73 -39 -95 -30
4470 -30 57 -130 -121 78 87 -212 -73 154 -133 -165 30 46 -124 -122 -73 -99 -99 -138 -65 81 -118 -191 12 70 -192 -133
4496 -133 119 -40 -194 -19 66 -182 -100 69 -37 -38 -33 -7 41 -63 -66 53 139 -115 -105 121 123 -223 72 264 -61
4521 -61 -78 177 179 8 115 179 160 93 99 201 196 52 72 275 193 -29 42 352 66 -82 156 297 -10 -26 259
4546 259 68 -22 17 140 84 -49 -72 127 130 -164 -132 171 -58 -212 -137 151 -218 -282 27 25 -147 -181 43 -48
4570 -48 -208 -98 -30 -35 -165 -200 23 29 -286 -108 134 -106 -265 19 121 -209 -146 148 67 -181 -38 148 -4
4593 -4 -102 -61 33 61 -163 -131 258 -22 -225 -15 219 -108 -188 125 110 -210 -199 116 46 -211 -74 69 -55 -113
4617 -113 -72 155 87 -176 7 222 -23 -265 151 154 -96 -88 170 53 -166 -10 161 44 -91 -3 153 65 -90
4640 -90 59 236 25 -129 80 297 -5 -86 262 174 -98 -16 287 2 -102 51 186 73 -40 0 147 50
4662 50 -114 23 208 -29 -217 130 200 -209 -135 172 -44 -212 -25 142 -115 -155 46 95 -16 -111 22 155
4684 155 -48 -212 73 233 -108 -101 141 94 -157 -12 202 18 -113 85 120 -2 2 24 116 37 -85 52 239
4707 239 -42 -102 195 155 -189 -65 209 106 -155 34 198 -67 -144 34 56 -50 -84 -14 106 -16 -191 70
4729 70 78 -102 -140 149 78 -203 -39 143 -64 -224 41 11 -132 -76 25 68 -74 -109 21 94 -95 -157 100 108
4753 108 -158 -72 148 -4 -183 34 123 -141 -76 89 57 -2 -39 34 136 -11 -76 59 62 -116 -86 137 58 -193
4777 -193 -71 174 -102 -150 13 59 -105 -3 -10 0 -76 -111 -2 32 -40 -195 79 30 -148 -137 133 -7 -178 82
4801 82 129 -162 -44 112 64 -58 -21 30 -26 -6 -70 104 201 3 8 164 117 -99 52 207 41 -16 188 122 28
4826 28 7 129 37 2 48 2 73 -66 -110 94 27 -88 -179 144 -29 -117 24 127 -71 -30 36 19 -71 6 -32 -9
4852 -9 26 36 -1 137 -41 -73 97 63 -46 -19 195 -64 -26 101 120 -21 75 86 4 94 47 37 87 25 -29 64 79
4879 79 -71 29 60 -14 -109 27 28 -38 -106 47 -18 -121 -46 -21 -60 -65 -80 -67 62 -44 -134 38 36 -78 -49 36 -79
4906 -79 -143 -7 46 -100 -9 -10 -61 10 -34 6 -37 -66 -18 -57 79 -61 -71 99 15 -154 -9 7 -138 -33 42 -62
4932 -62 -101 -12 26 46 -1 59 -21 47 33 -24 45 121 -28 -31 66 -7 -30 128 20 -84 8 68 -98 -62 20 5 -46 -41 -36
4961 -36 -22 58 14 -80 29 14 -30 44 87 -32 28 94 69 -31 110 82 12 136 101 47 77 36 47 81 76 30 69 136
4989 136 31 -10 102 31 -74 41 52 -57 -23 41 -11 -97 24 -18 -74 -15 -90 -146 -72 -8 -156 -24 -26 -120 -102 -34
5015 -34 -19 -89 -74 29 -70 -70 -51 -41 77 -50 -106 -2 69 -41 -40 89 -36 -69 105 -24 -42 58 39 -83 -49 87
5041 87 13 -11 102 -35 57 -22 -59 -37 39 38 -57 48 184 -30 -88 149 47 -59 27 61 -53 59 95 -22 61
5066 61 69 22 -7 30 -31 50 80 -13 15 90 38 -17 75 200 30 -24 132 4 -13 115 46 27 28 109 80 158 24 28 69
5095 69 67 -5 22 212 65 -62 116 166 -83 -7 126 87 0 29 68 -7 -8 -27 -7 46 -103 -76 49 -55 -156 -85
5121 -85 -42 -188 -231 -29 -144 -158 -122 -92 -164 -126 -140 -123 -42 -153 -169 -62 -43 -185 -115 41 -131 -178 -72 -7 -105 -99
5147 -99 73 -29 -36 -30 74 -16 -69 -37 -3 -23 -40 -35 33 37 -111 2 122 -109 -193 84 12 -107 -24 54 22 -19 18 43
5175 43 -30 -54 42 120 38 -25 31 101 -32 -65 143 157 -34 19 196 81 -50 95 128 111 12 97 118 97 31 83 201
5202 201 100 -59 205 220 50 45 173 144 -24 99 128 62 6 129 172 44 -6 46 154 41 -48 31 145 -10
5226 -10 -123 89 95 -88 -102 102 -8 -135 -33 38 -110 -114 -50 2 -84 -110 -55 18 -82 -180 -58 77 -114 -151 27
5251 27 -45 -171 -62 41 -111 -166 -45 60 -14 -96 -10 52 -26 -157 -14 110 -118 -77 108 112 -150 -13 95 -27
5275 -27 -182 20 114 -101 -74 -10 54 -90 -75 15 46 -126 -150 44 61 -83 -133 67 36 -207 -37 79 -57 -83
5299 -83 38 43 9 -41 8 20 -8 -37 30 135 -12 -120 148 63 -109 65 194 26 -128 75 89 35 13 131 138
5324 138 0 36 97 80 -56 -49 83 116 -54 -72 199 93 -131 -13 74 -41 -91 48 65 -175 -54 21 9 -75
5348 -75 -135 -28 23 -130 -83 50 -17 -168 -117 72 -127 -163 -44 101 -101 -110 32 -32 -78 -28 -29 44 -34 -116 75 54
5374 54 -125 -28 152 10 -111 53 188 -10 -49 125 106 -77 -3 89 27 15 9 5 59 -53 -22 96 116 -95 -58
5399 -58 128 16 -70 100 70 -116 6 71 25 -76 -37 70 18 -16 -31 80 57 -86 18 99 83 -27 124 162
5423 162 -61 53 120 101 12 29 123 99 39 85 95 101 -19 -19 82 86 -12 69 155 -25 -143 100 85 -103 -31 33 14
5450 14 -100 -32 43 -72 -44 -48 -29 46 -79 -113 -4 -29 -93 -53 43 -99 -73 -15 -130 -209 -60 32 -50 -75 -57 -30 -12
5477 -12 -123 -124 10 -27 -143 -76 11 -31 -134 -9 47 -144 -54 63 -75 -122 -55 39 -1 -61 -31 -29 54 -66 -128 27
5503 27 -8 -140 -4 33 -64 -86 85 9 -131 -64 1 -33 -72 18 -24 -30 -72 -21 6 23 -58 -95 15 -33 -91 -8 4 -83
5531 -83 15 111 0 -58 50 51 -3 15 54 38 48 114 90 66 115 35 10 168 10 81 128 122 25 100 163 34 -13 93
5559 93 57 49 79 15 8 146 42 -6 35 74 -10 84 83 -19 18 180 41 -26 74 -20 74 34 70 10 39 5 12 108 98
5588 98 -6 37 127 -16 61 33 7 -39 41 4 -9 -22 63 -21 39 -32 -38 -65 66 -32 41 -65 -53 -76 2 -39 -85 -77 -47
5617 -47 -25 -102 -59 -24 -53 -37 -52 -127 -49 -62 -124 -60 -46 -74 -61 -41 -36 -125 22 -90 -161 -22 10 -153 -150 -5 -9 -112 -29
5646 -29 -36 -29 -16 -46 -47 -99 -41 -26 -50 90 -130 -77 45 33 -25 62 27 -20 6 27 39 9 -23 -20 45 42 34 41 41 -15 51 100 40
5679 40 6 44 107 -31 -17 -22 29 -40 7 -52 -15 -14 17 0 -11 1 -7 0 84 15 63 112 47 -54 93 117 -52 53 58 87
5709 87 38 115 105 -29 57 81 -15 105 40 -46 120 23 2 39 123 -48 -15 21 23 -86 -2 17 -43 -71 -38 -24 13 -10
5737 -10 -40 -30 -12 -52 -74 91 -67 -101 10 38 -123 -57 6 -59 -26 1 59 4 28 -22 19 34 -27 -32 70 45 -77 -21
5765 -21 99 -43 -74 72 -12 -103 -29 55 23 21 11 -6 19 -5 7 9 68 -20 -28 19 26 -69 28 59 -67 -18 35 -35 -82 54
5795 54 16 -49 -57 -30 35 2 -105 -37 71 50 -89 33 7 -48 -87 124 7 -107 6 75 26 -101 41 61 -58
5820 -58 33 71 29 18 5 39 155 46 -35 72 86 3 40 76 8 21 151 58 -59 -15 -24 -29 -4 -76 32 22 -32 -87
5848 -87 -3 57 -130 -128 94 -14 -136 -9 59 -98 -84 -17 24 -10 -82 -32 -39 -6 -11 14 33 -76 -56 14 49 -27 -25 92
5876 92 -21 -75 36 89 -24 -65 58 0 -33 -16 12 71 48 -40 69 83 -110 -33 115 15 -110 26 77 -91 -17
5901 -17 82 6 -24 -22 58 9 0 -19 28 14 1 -65 67 17 -64 -37 99 8 -6 33 14 -35 -65 80 31 -59 26 12 58 -36
5931 -36 7 87 60 -80 23 116 57 -56 18 120 -23 -19 97 72 -97 50 24 21 -16 35 99 76 -11 11 31 -25 -173
5958 -173 -101 59 -27 -111 -7 9 -116 -114 67 -19 -66 -21 -9 25 -37 -47 41 11 -64 -92 46 65 -83 1 96 -49 7
5985 7 115 32 -36 55 72 37 -6 58 66 48 11 4 93 54 -51 60 86 -50 -76 128 77 -6 -22 107 11 -55 20 0 26
6014 26 -41 -47 -26 -13 -73 -36 71 -70 -99 -23 62 -97 -67 48 38 -20 -2 6 -48 -80 -5 -9 29 -93 -27 63 50 -87 -64
6043 -64 76 -41 -93 5 10 -45 -88 -2 25 -56 -12 44 -12 -1 -31 19 21 -62 28 69 -40 -20 33 82 -107 -68 54 33 -71
6072 -71 -42 25 -23 -37 -5 -6 -20 -58 26 5 -52 -48 -77 -13 12 -80 -30 7 -54 -49 -10 -50 -57 16 71 -74 10 58 39 15 35 -9
6104 -9 88 29 2 18 100 -10 -40 97 84 -21 -4 28 -13 -20 71 67 19 63 13 27 69 18 25 72 28 -38 59 58 -45 15 34
6135 34 -21 -65 -31 58 20 -3 -16 58 -42 5 12 25 69 -19 20 61 45 -35 94 36 -13 89 98 -6 -40 40 42 12 29 9
6165 9 -2 50 -22 -32 43 6 21 42 61 -95 -7 31 -78 -79 -27 -5 -89 -44 25 -93 -67 -41 -57 -13 -65 -75 -79 -38 -46 -105 5
6196 5 -16 -78 -87 -12 -80 -99 -11 -105 21 -29 -30 -8 15 -60 -53 49 -69 -52 -42 54 -17 -26 43 9 -51 5 22 -78 -44 18 43
6227 43 -28 13 -15 -30 26 33 14 62 -12 -8 44 31 13 -2 21 -16 -25 -8 18 -9 -60 -32 -75 13 -16 -29 49 23 -10 -64 59
6258 59 -126 13 61 -49 1 32 19 -82 -15 -9 -12 -3 61 -3 41 57 -18 60 33 49 56 93 -34 27 27 18 -13 -6 70 70 42 4
6290 4 7 -32 47 7 -40 44 -12 -26 2 33 81 -39 64 69 -25 0 64 16 -39 33 -33 44 25 47 -27 -13 54 17 93 -83
6320 -83 -47 31 12 -39 3 128 20 28 28 6 -33 12 41 -20 -43 14 23 -14 -10 -4 -35 27 -13 -25 25 28 -74 58 1 -34 5
6351 5 -7 11 -97 -19 6 -41 -29 0 -42 -12 -43 -39 -54 -8 -43 -32 -37 -58 -114 -6 -66 -79 -42 -10 -72 -55 -78 10 -7 -13 -9 -25
6383 -25 69 -28 20 2 -19 -8 8 101 -10 11 57 40 -26 29 16 -36 17 -16 5 31 -86 -40 31 15 14 -18 17 -24 -6 35
6413 35 27 -30 4 -19 21 -54 -32 -14 -53 7 36 22 -42 -52 -46 85 75 11 55 105 36 3 81 41 -22 68 75 30 76 9 -7
6444 -7 2 64 61 84 1 -41 52 72 8 36 66 72 -58 16 80 1 -58 46 98 -12 -24 11 -42 -15 -24 -25 26 -100 -20 -15 91
6475 91 -43 -38 32 -5 -69 -41 9 -5 -27 14 46 -60 -27 -79 -9 27 -35 -49 75 -4 -29 66 -55 -103 34 56 -51 -21
6503 -21 49 40 -38 12 48 -15 41 -42 77 32 12 62 32 10 -53 11 46 -68 -78 9 -6 -20 -11 0 11 -106 -39 40 -33 -11
6533 -11 -59 67 32 -42 -9 -33 -57 -45 54 109 -66 -20 40 -33 -17 9 64 14 5 -22 46 -17 -3 -45 44 39 -41 41 69 -7
6563 -7 -4 73 70 -63 -8 88 -64 -68 58 16 40 -30 -26 17 30 -43 -6 44 -57 -67 -6 41 -107 -106 73 15 -6 -77 32 -18
6593 -18 -57 3 62 -39 -94 -17 14 -10 -28 33 91 7 -143 -11 28 -73 3 5 15 -44 23 28 13 15 54 75 6 -77 76
6622 76 122 -11 -41 89 35 -32 62 96 33 -33 10 79 32 -59 -19 43 -38 -49 -17 59 3 -99 14 17 -18 -68 72 29
6650 29 -109 -33 46 -34 -67 33 -62 33 -55 -4 22 -8 -88 -1 95 -39 -38 34 68 -26 10 95 0 -77 34 47 -10 -40 -20
6679 -20 11 -55 -49 -38 69 -109 -59 -50 15 -95 -1 3 -11 -142 -26 -10 -66 -50 27 48 -56 -30 -12 42 -41 55 6 51 4
6708 4 -73 30 57 -46 -35 1 -16 -20 66 95 38 -64 15 -1 89 53 46 41 15 14 3 82 -4 -90 63 98 -40 4 90 35
6738 35 -38 37 50 -15 -15 62 8 18 7 63 -1 -139 -36 12 57 -25 -29 37 -30 -103 11 35 14 -33 -22 17 -48 -15 -42 35
6768 35 -52 -37 33 -16 -33 -65 93 -29 -33 29 -38 -16 -53 6 19 -30 -16 43 -61 -49 -15 42 -29 9 38 30 -34 -76 -56 -4
6798 -4 -27 -49 17 -43 -86 -27 36 -53 -46 -39 -73 -46 -60 -38 -32 -8 -12 -12 -17 19 -70 -36 -32 -61 -94 7 -44 -50 -44 41 -4 26 -22 -30 27
6833 27 -4 21 -42 8 -27 62 76 58 -28 59 27 4 -4 39 5 2 61 -37 109 37 91 20 78 21 -27 44 1 -41 9 14 53
6864 53 -69 77 46 26 -5 32 -45 12 9 33 22 52 49 35 58 -28 32 87 49 -22 19 40 -52 19 80 57 -19 38 96 28
6894 28 -19 -12 12 -12 24 -15 -39 22 -48 24 42 50 -61 -51 -39 -88 -18 18 -56 17 -62 -48 -51 -18 -79 -55 -53 -62 -162 -51 -26
6925 -26 -69 7 -16 -87 -48 -27 -9 -92 -48 -88 -87 -96 -41 -9 -16 47 -100 -4 -47 -34 -7 63 -25 -28 -6 12 10 39 44 -29 -41 -25 -27
6958 -27 -32 -33 34 -15 -6 -10 -22 70 19 -104 0 63 -15 30 46 46 -15 94 18 15 50 87 66 34 18 39 54 61 19 30 55 -18
6990 -18 0 31 -9 7 29 77 43 -15 71 139 38 98 4 55 16 -41 12 62 -16 -1 60 19 52 -8 80 18 -21 29 24 -53
7020 -53 -57 8 53 -26 -39 -12 -6 -2 -66 -11 -80 -61 -8 -76 -37 -57 -27 -39 -35 -8 -40 7 -80 -95 -90 -66 -45 -29 4 7 -40 -4 -21
7053 -21 20 30 2 29 56 -33 43 64 -74 -53 -12 -1 47 -25 54 -1 -42 -5 48 30 -76 -11 8 29 52 61 32 23 8 16 54
7084 54 -25 40 22 24 -24 -93 41 61 5 16 33 47 33 2 33 -18 8 17 29 -58 7 26 3 -62 47 34 -14 -3 97 32
7114 32 63 28 -36 26 20 -10 39 33 -53 -61 24 13 21 -41 -3 13 -50 35 -29 -15 30 -32 -65 10 -12 19 17 6 -54 -17 28 -67 -56
7147 -56 4 -13 -83 -19 42 -34 4 -67 23 20 -57 5 2 13 -83 1 4 2 -22 -12 13 -54 21 -13 20 24 35 -8 -49 7 -41 6 69
7180 69 19 -30 -6 2 2 41 -22 -66 -30 4 76 2 22 58 -2 13 -18 -53 -2 31 -36 8 2 -31 56 12 -42 -25 -11 48 -42 -60
7212 -60 42 -41 -34 -27 13 -16 -29 -38 -24 -1 -29 22 39 -26 -81 2 81 17 39 67 24 -41 -11 24 -34 -60 14 10 7 -7 -15 59 -52
7245 -52 10 4 26 -23 -74 -1 1 -69 -22 8 -39 -41 15 8 -32 -17 26 13 44 -39 25 -58 31 -37 -6 34 -30 -112 55 -35 -15 3
7277 3 13 53 -35 27 -5 -4 -9 38 2 -3 -16 19 63 -42 -12 60 35 42 60 31 59 14 38 -10 -18 67 57 9 -22 -17 23 19 -58 -16
7311 -16 3 -5 -65 -11 25 -28 -26 23 20 -74 32 -15 -16 -45 -3 46 27 -1 -18 16 -12 -40 14 -20 53 22 40 23 -77 -8 -24
7342 -24 40 40 0 59 14 -81 -42 -37 48 -11 -42 -43 60 -16 21 37 -5 -84 17 3 -46 26 31 -4 -30 10 16 -6 -41 38 -21 32
7374 32 -90 -19 42 -46 -23 -21 94 9 -25 5 49 -42 20 12 12 5 -11 10 42 -56 37 64 31 -11 30 41 63 -56 53 37
7404 37 -8 -42 -16 -28 29 6 9 20 50 -29 -7 20 27 -1 24 -24 -52 -31 32 3 -87 20 -25 -12 -41 -17 -18 -25 9 35 -43 -12
7436 -12 -5 -33 -35 -20 8 53 -2 -52 22 -22 28 -27 -20 62 24 19 55 -8 4 8 -21 -36 32 10 48 -3 -70 -36 -46 17 -35 36 22
7469 22 -21 20 40 -28 -3 16 102 -7 -5 57 38 72 16 6 24 23 -7 135 -4 26 -5 29 -13 -17 26 35 7 35 30 3 -26
7500 -26 -60 37 33 11 -56 -48 10 21 -91 13 -21 -81 70 49 -43 -61 30 -39 -94 5 23 -28 -17 -12 -20 23 13 -13 5 19 -97
7531 -97 13 -18 -1 -10 -13 45 -29 -58 -2 -99 -64 2 -23 5 0 -18 -9 1 20 -66 -27 40 -33 -9 33 -11 13 29 6 -7 -43 22
7563 22 49 12 -12 36 11 15 -23 31 22 4 3 73 15 -5 34 43 12 4 42 -4 41 90 46 73 54 -38 18 12 1 15 4 42 -15
7596 -15 -20 62 -8 20 22 37 -6 59 -31 -11 -29 81 -22 8 18 -6 -11 30 15 38 37 -19 8 3 25 -11 60 22 48 -12 43 -33
7628 -33 -11 42 -71 -70 -5 -45 81 52 22 -27 -13 28 -27 -34 -50 1 -51 -25 -6 -13 6 -32 -39 23 6 -25 -3 17 -6 13 71
7659 71 8 -33 12 -52 18 26 -2 -52 13 -6 -9 -26 92 47 39 68 -1 46 87 -9 21 31 4 -6 -35 41 66 46 32 -21 48
7690 48 -40 -28 31 -54 3 -11 51 65 -26 -44 -30 3 -78 -33 46 -30 -34 -6 -40 -54 -27 15 28 13 26 18 -20 -46 -51 -48 40 -21
7722 -21 23 44 -27 -64 -5 13 -16 -23 70 -11 -9 -58 47 -59 6 10 -13 -14 -20 -20 64 -48 2 -13 -26 -16 -40 7 -29 -16 -17 -16 -87
7755 -87 -68 -36 -10 -14 -25 18 35 13 -16 -56 32 -38 -66 2 -58 -16 18 -23 -51 -4 -19 -56 3 -29 23 32 0 16 -45 17 -23
7786 -23 -55 -19 43 -49 36 42 23 -32 23 43 -43 35 0 -21 -24 28 -2 16 -5 42 -3 70 -11 27 -15 17 -29 10 -29 25 -51
7817 -51 -13 48 23 19 -27 49 58 -36 -78 33 -75 -33 -2 18 -25 47 85 80 -17 38 31 -17 12 4 42 32 44 20 46 47 -44 86
7849 86 68 10 -6 -4 -1 -14 54 68 -69 52 16 67 28 42 53 19 -28 -32 25 41 -55 -40 -23 -30 -50 32 -36 -9 -70 -35 62
7880 62 -75 40 -53 5 -5 -30 63 -38 -20 -50 -34 -7 -19 -67 -24 -6 -80 -24 33 -65 -38 -10 -13 -18 -7 30 26 -37 -22 6
7910 6 -8 -36 5 81 5 2 -57 51 6 -107 -27 0 3 0 58 -43 -24 -62 86 -37 -55 62 36 2 -41 -14 62 -55 -43
7939 -43 38 -22 0 -10 -38 8 -62 -18 -21 19 2 11 11 17 67 19 -12 -5 37 -37 79 4 -56 44 52 -21 -28 77 66 52 -11 20
7971 20 11 -11 23 5 18 35 45 -24 -31 -25 1 -37 -57 17 16 32 -39 -12 -60 -31 -27 -43 -40 80 -32 -8 -10 -28 -54 -18 17 62 -88
8004 -88 -1 -11 -16 -1 -11 31 -4 25 -4 -3 55 67 39 0 -1 -37 6 -6 -6 -17 36 -37 57 69 43 -47 73 58 -24 20 18 16 41
8037 41 -21 -70 -2 -5 10 -57 14 -35 -23 15 38 -94 -61 29 74 -39 6 48 -29 43 5 -21 -19 22 -25 20 24 -24 8 50 -54
8068 -54 -21 -5 68 -26 -74 42 -41 8 71 8 -34 -24 43 2 -14 -3 30 -58 -16 -22 -2 51 -45 23 2 34 -17 75 8 -21
8098 -21 38 43 -12 1 8 -54 -4 -10 -50 -7 28 -78 -41 -16 16 55 -3 17 3 -7 3 36 56 60 10 -18 -73 24 -51 14 -35 -58
8130 -58 -22 -16 -4 51 -30 23 38 15 126 4 -5 -42 -18 -21 50 30 22 -17 -65 -32 32 -2 22 -25 34 -27 3 44 -15 -42 -23
8161 -23 6 -28 56 -8 60 25 -38 28 17 26 -4 21 4 -48 -99 31 61 23 23 -2 -16 14 52 48 18 30 -27 -13 41 -20
8191b0
$$ Imaginary data points
##PAGE= N=2
##DATA TABLE= (X++(I..I)), XYDATA
0 0 0 0 0 0 0 0 0 0 0 0 0 0 0 0 0 0 0 0 0 0 0 0 0 0 0 0 1 -2 5 -5 6 -6 6 -6 7 -7 8 -10 12 -13 14 -15 16 -18 20 -23 25
47 25 -28 32 -36 41 -47 55 -67 81 -102 135 -195 325 -708 3413 20582 7973 -4263 8619 20630
66 20630 14282 9477 14711 16719 13764 15740 19796 14585 6214 11824 22028 12963 -2940 3632 17167
81 17167 7670 -6697 -1046 5688 -1598 -5024 -353 -4011 -10339 -4122 3325 -3989 -13827 -6523 7503
96 7503 3240 -11497 -6826 10307 8402 -4590 -313 10089 6332 2905 9106 8079 621 5063
110 5063 13600 7143 -3963 -598 9468 6010 -7124 -8573 1003 -194 -10914 -11475 -6555 -12005
124 -12005 -15656 -8515 -10315 -22243 -19055 -5583 -9618 -23047 -19453 -5777 -5483 -15531 -15783 -5347
138 -5347 -1693 -7347 -7134 -567 -1452 -3627 3791 6185 -3189 -2783 10038 9480 -2883 -2241 8029 7353
154 7353 -797 -1722 2277 1875 -1553 -1575 -293 -4336 -7064 -813 1651 -8606 -11830 405 3728 -8011
170 -8011 -9927 1279 3707 -2462 -2044 3172 4167 3769 6127 8362 6920 6313 11619 15704 10112 6058
186 6058 14207 19114 10844 6875 14076 15207 8750 8579 11279 7345 4403 7572 7405 1386 -1459 2535
202 2535 4825 -1205 -7132 -2450 3174 -2904 -8662 -3161 419 -4506 -4926 -524 -2046 -4327 158
217 158 2693 -1241 -2236 2425 5140 2550 -143 2615 6664 4540 580 3289 5708 1795 846 4444
233 4444 1955 -3079 175 3282 -2218 -6141 -2635 -644 -4250 -7360 -6321 -3921 -4716 -7968 -7384 -4441
249 -4441 -5948 -7477 -4350 -3558 -6857 -4807 -293 -2437 -5022 -1117 1545 -641 -1043 1053 1790 1614
265 1614 1339 1654 2406 1638 484 2235 2611 -1117 -1533 2280 772 -4057 -2683 87 -2554 -4831 -3353
282 -3353 -3181 -4294 -4172 -4315 -4332 -3880 -4221 -3819 -2422 -3074 -3789 -1042 172 -2142 -1081 2225 1233 91
300 91 2721 3560 1825 2836 4358 3357 2884 3493 3523 3470 2891 1406 1921 2982 530 -1131 899 569
318 569 -2272 -1879 -864 -2608 -3167 -2026 -2935 -3673 -2525 -2616 -3273 -2221 -1841 -2276 -989 -353 -1028 380
336 380 1853 744 1476 3660 2888 2235 4369 4789 3354 4185 5147 4143 4128 4524 3517 3443 3926 2388
354 2388 1678 2690 1701 -60 672 646 -1170 -1006 -462 -1843 -1996 -1058 -2117 -2591 -1189 -1524 -2440 -1088
372 -1088 -512 -1397 -531 489 -265 449 1682 848 841 2604 2001 1030 2287 2586 1336 1743 2096 866 934
391 934 1450 -73 -557 440 -804 -2051 -1179 -1428 -2954 -2494 -2151 -3457 -3106 -2316 -3495 -3335 -1886 -2464
409 -2464 -3019 -1249 -934 -1699 -395 514 -113 787 1840 1210 1776 3148 2417 2113 3679 3257 2185 3224
427 3224 3345 1812 2176 2644 1171 831 1451 228 -681 -41 -601 -1854 -1358 -1607 -2508 -1867 -1862 -3096 -2169
446 -2169 -1023 -2437 -2485 -406 -587 -1550 95 1052 274 897 2149 1862 2133 2921 2674 3157 3783 2718
464 2718 2694 4097 3126 1644 2851 2914 788 866 1862 -117 -1286 -23 -623 -2602 -2641 -2257 -2790 -3302 -3988
483 -3988 -4204 -3087 -3461 -5061 -3861 -2466 -4049 -4199 -1804 -2171 -3739 -1772 -99 -1783 -2138 -79
499 -79 425 -289 -492 -86 802 815 -398 -262 937 -243 -1273 454 18 -2823 -1704 612 -1878 -4255
517 -4255 -2075 -648 -2870 -3908 -2646 -2015 -2404 -2965 -2511 -1400 -1857 -2414 -193 454 -2003 -1171 2836
534 2836 2066 -1331 1042 4365 2655 1024 2960 3913 2858 2826 3658 3407 2345 2327 3881 3774 613
551 613 288 4051 3571 -1256 -538 3414 1810 -1472 273 1800 -220 -370 1628 1089 -691 127 2731
568 2731 2798 -1 -345 3919 5065 840 458 5131 5015 1689 3081 5216 2855 2234 5241 4677 873
585 873 1481 4839 4203 95 -883 2632 3660 -840 -2722 827 1381 -2562 -2372 133 -2634 -4298 -572
602 -572 50 -5161 -5364 -155 211 -4474 -5363 -1250 471 -2628 -4371 -1328 4 -2420 -1900 599 -1669
619 -1669 -3913 652 2792 -3040 -4854 1240 2975 -2686 -4362 -205 1309 -1574 -3066 -1301 -643
634 -643 -2404 -1953 277 -2049 -5062 -995 2731 -2668 -6452 -440 3208 -2047 -4662 -468 1392 -952
650 -952 -1460 226 -133 -1334 363 2511 -47 -3428 388 5150 719 -4670 144 5250 654 -3215
666 -3215 566 2549 -338 -395 1667 -109 -2086 640 3192 58 -3946 -623 4656 1501 -4454 -1400
682 -1400 4383 1511 -2932 201 2375 -546 -231 2964 669 -2741 737 4697 1175 -3549 -697
697 -697 4699 2653 -3111 -1820 3449 2044 -2152 -242 1870 -1242 -1200 2766 774 -4280 -1284 4163
713 4163 1021 -4543 -2307 3025 1962 -2864 -2580 1537 1382 -1652 -405 1376 -1443 -1660 3114 2166
729 2166 -3897 -2009 4612 2733 -3439 -2034 3372 2731 -1175 -1057 1812 1631 -39 1080 2214 -528
745 -528 -1160 3652 3986 -2309 -2290 4775 4648 -1901 -1655 3610 3308 -142 238 2131 1185 403 2141 2566
763 2566 -584 -1553 2937 4187 -1699 -3476 2826 4193 -1985 -3061 1608 1696 -1675 -882 647 -1307
779 -1307 -1958 699 1087 -2370 -3425 674 2597 -1837 -4578 349 3004 -1577 -3429 592 1215 -1740
795 -1740 -624 1423 -1127 -2210 1213 2173 -1620 -3037 651 2677 -743 -3578 -509 2274 -759
810 -759 -3083 -378 477 -2312 -1588 878 -1741 -3893 -417 1492 -2312 -4250 -896 1210 -1312 -3599
826 -3599 -1599 763 -704 -2602 -777 275 -1783 -1303 1595 -246 -3224 -39 2901 -339 -2938
841 -2938 163 2483 204 -1563 -107 1283 449 -643 317 926 -671 -597 1944 1009 -2204 -490 2987
858 2987 764 -2291 76 2459 499 -821 564 1269 464 432 1206 1207 101 205 2131 1931 -753 -236
876 -236 2946 2071 -1047 216 2599 949 -536 869 1231 -137 78 985 397 -780 -516 714 752
893 752 -1145 -1541 793 927 -1713 -1392 929 17 -1495 -68 661 -869 -647 955 444 -712 -66
910 -66 943 975 54 -313 1010 1750 167 -180 1606 1370 -234 709 1597 106 -336 1295 922 -656
928 -656 -229 731 248 -485 -620 -273 192 -513 -1182 -282 50 -1177 -921 196 -605 -1593 -35 346 -1075
947 -1075 -863 382 32 -610 -84 145 123 210 1 156 715 167 -37 833 692 -388 283 1129 -101 -493
967 -493 774 381 -460 -34 239 -333 -250 -90 -408 -261 -187 -654 -395 43 -725 -625 287 -195 -898 29 267
988 267 -575 -302 404 -111 -272 422 119 -203 316 191 -196 316 130 -489 129 205 -690 -465 198 -589 -849
1009 -849 -58 -436 -1009 -446 -439 -1043 -647 -356 -912 -672 -251 -630 -599 75 -235 -487 400 334 -191 509 942
1030 942 199 591 1242 690 558 1301 932 515 1101 976 327 758 852 142 337 540 -223 -298 186 -466 -842
1051 -842 -190 -541 -1224 -707 -549 -1259 -951 -566 -1172 -969 -466 -743 -779 -129 -267 -522 289 266 -154 444 924
1072 924 330 529 1307 713 533 1281 1013 543 991 996 521 697 733 88 293 505 -299 -331 249 -448 -833
1093 -833 -122 -386 -1231 -526 -190 -940 -853 -194 -443 -664 -210 -256 -298 152 103 -29 630 445 -78 701 1053
1114 1053 91 338 1309 554 -142 777 774 -67 90 315 -145 -313 -206 -566 -531 -512 -1034 -730 -336 -1240 -1425
1135 -1425 -233 -526 -1595 -763 170 -698 -822 216 183 -240 345 677 582 608 787 1089 1521 949 561 1669
1155 1669 1904 346 633 1870 993 -60 831 978 -367 -198 540 -155 -1029 -735 -397 -554 -1281 -1637
1173 -1637 -705 -269 -1544 -1778 -218 -445 -1564 -515 458 -737 -794 948 927 -356 243 1582 1510 668
1191 668 718 1540 2135 1170 672 1766 1886 521 884 1978 481 -609 1173 1384 -960 -1178 518 243
1209 243 -1331 -1509 -599 -590 -1418 -1731 -988 -821 -1734 -1336 -60 -1026 -2333 -340 1057 -1165 -1902 708
1227 708 1323 -650 -670 860 822 45 253 826 460 -258 165 1298 45 -1662 -131 1634 -766 -2651
1245 -2651 -247 875 -1563 -2296 -546 -780 -1967 -1283 -514 -1405 -2101 -1024 259 -790 -2331 -876
1261 -876 1493 99 -2106 -65 2132 256 -769 1297 1495 -108 790 2232 822 -529 1105 2494
1277 2494 848 -1006 86 2249 1008 -1546 -551 1563 -7 -1665 64 484 -1692 -993 1194 -363
1293 -363 -2509 -542 1706 173 -1829 -517 1917 1257 -724 59 2302 1571 210 1890 2677 438
1309 438 920 3796 2672 -492 1129 4136 2418 -399 657 2765 1868 -109 116 1383 528 -739
1325 -739 296 842 -1639 -1856 1156 638 -3210 -2476 1261 204 -2930 -1978 391 -288 -1664 -953 -6
1342 -6 -712 -1048 390 848 -1176 -1611 1564 2128 -1610 -1942 2010 1890 -1565 -1178 1268 406 -1146 -201
1360 -201 309 -1208 -1485 121 279 -2043 -2826 -43 917 -2439 -3607 -145 778 -2389 -2507 134 -396
1377 -396 -1983 -456 534 -1292 -1608 914 1470 -992 -1592 1124 2460 -132 -1634 1121 2504 -39
1393 -39 -827 1527 1087 -886 573 1946 -626 -1645 1182 1793 -982 -2144 319 1564 -572 -2067
1409 -2067 -297 1186 -489 -1332 568 553 -1220 135 2141 24 -1615 1339 3011 328 -932 1608
1425 1608 2930 1200 145 1446 2374 1279 667 1896 1774 -43 727 2715 877 -1713 344 2562
1441 2562 -105 -2157 -35 1101 -664 -1617 -624 -327 -1240 -1277 -313 -581 -2031 -1425 725 -219 -2720
1458 -2720 -1211 1635 -20 -2250 -265 1418 -172 -759 687 720 -343 154 1198 628 -671 -203
1474 -203 1459 941 -1445 -971 1481 566 -1989 -871 732 -807 -1682 -268 -369 -1881 -1325 -7 -709
1491 -709 -2001 -1488 73 -32 -1723 -1651 390 449 -1377 -830 988 208 -837 807 1172 -387 -96 1679
1509 1679 1130 -458 137 1472 1234 -43 -212 967 1152 -306 -450 823 299 -944 85 806 -959
1526 -959 -1150 685 549 -1255 -821 651 424 -555 -260 490 720 258 192 1031 1042 270 942 1965 753
1545 753 91 1758 2110 335 393 1776 1461 328 628 931 603 157 74 179 -115 -741 -647 12 -689 -1714
1565 -1714 -800 -31 -1419 -1957 -496 -581 -1533 -1141 -403 -827 -987 -427 -246 -303 -340 -93 488 457 -246 312
1585 312 1325 547 -109 892 1215 212 331 1073 507 -55 435 445 -139 -150 -50 -178 -256 -723 -859 -299
1605 -299 -527 -1311 -900 -240 -1042 -1246 -368 -473 -1072 -533 19 -501 -441 147 114 47 255 235 481 724 356
1626 356 267 946 742 166 707 921 91 200 728 116 -294 219 84 -417 -237 -235 -581 -429 -420 -770 -424 -332
1648 -332 -770 -638 -48 -435 -695 117 -1 -460 137 400 -1 241 712 446 482 783 491 417 824 557 262
1669 262 684 578 -1 223 454 -285 -266 125 -348 -684 -248 -439 -893 -607 -553 -967 -719 -501 -870 -709 -298
1690 -298 -610 -561 20 -151 -303 324 416 35 526 887 441 671 1110 808 754 1139 865 664 1098 872 480
1711 480 724 876 202 335 586 -22 -162 248 -233 -558 -150 -245 -705 -462 -358 -798 -605 -329 -598 -540 -164
1732 -164 -437 -439 52 -142 -375 218 335 -178 186 594 92 152 612 324 94 416 404 65 242 235 -43 111
1754 111 132 -389 -69 109 -459 -471 7 -432 -701 -166 -121 -765 -443 15 -391 -399 -69 -106 -114 50 -59 8 353
1777 353 118 -85 507 418 -232 322 680 30 -43 552 339 -305 74 337 -75 -168 -97 -207 -142 -196 -423 -151
1799 -151 -73 -634 -445 211 -381 -849 121 329 -584 -307 529 200 -255 246 373 295 318 315 476 603 237 362
1821 362 843 479 -239 500 975 -33 -351 616 431 -510 -183 334 -313 -585 -221 -180 -509 -734 -533 -142
1841 -142 -427 -1199 -601 230 -602 -1282 -99 216 -877 -776 217 -209 -715 -94 321 -371 -450 66 439 88
1861 88 -547 -61 803 139 -830 138 809 -290 -575 694 320 -788 -48 799 -127 -706 147 698 -18
1880 -18 -526 -18 675 233 -589 1 894 -13 -467 693 723 -584 -124 1256 308 -807 233 1081 177
1899 177 -565 133 704 243 -482 -62 580 -138 -613 364 605 -903 -724 1023 430 -1333 -372 1102 99
1918 99 -899 -3 637 79 -307 207 629 41 -288 639 951 -359 -503 1335 1148 -804 -381 1547 675
1937 675 -782 144 1018 107 -332 429 539 -344 -508 494 577 -745 -1070 662 864 -1113 -1142 836 511
1956 511 -1217 -514 735 -272 -893 302 619 -647 -690 645 824 -619 -905 696 1177 -593 -913
1973 -913 857 1000 -773 -347 1129 109 -821 475 1088 -640 -847 827 972 -562 -908 510 946
1990 946 -509 -999 399 772 -727 -704 823 -1 -1213 195 1112 -773 -1424 562 995 -826 -1183
2007 -1183 276 709 -537 -956 61 438 -748 -702 481 -95 -1438 -308 1085 -740 -1879 43
2023 43 1029 -931 -1522 68 459 -715 -986 48 44 -737 -578 568 88 -1205 -253 1339 58 -1538
2041 -1538 157 1560 -155 -1186 513 1056 -352 -330 681 472 -419 -18 941 401 -933 -230 1286
2058 1286 309 -1326 -295 1372 -30 -1317 139 852 -679 -730 513 212 -887 -279 812 223 -953
2075 -953 -320 1016 522 -1001 -339 1320 459 -794 275 1312 -81 -372 1103 839 -522 143 1486
2092 1486 736 -493 89 1255 892 -399 -101 1173 671 -520 263 1202 -12 -559 907 902 -729 -423
2110 -423 1296 650 -840 -298 999 508 -626 -221 664 361 -473 -32 792 -50 -704 494 875 -702
2128 -702 -855 832 570 -933 -533 657 212 -669 -415 267 -85 -643 -252 240 -258 -946 -55 604 -584
2147 -584 -1156 408 648 -830 -686 520 242 -704 -178 421 -65 -339 86 349 -8 -467 111 755 -160
2166 -160 -799 230 803 -483 -787 448 281 -729 -384 366 -351 -751 -209 -2 -582 -904 -387 51 -430
2185 -430 -1054 -424 264 -596 -1067 -82 212 -803 -547 300 -181 -721 45 460 -181 -412 202 404 105 -266
2205 -266 112 522 116 -359 227 586 -153 -283 582 237 -531 -58 482 -203 -586 24 200 -248 -338 -163
2225 -163 32 -40 -459 -190 225 -141 -442 211 306 -473 -175 572 70 -372 289 551 43 56 291 298 227 131
2247 131 104 392 229 -45 272 520 -38 -121 497 344 -303 136 556 100 -28 414 264 53 244 329 255
2268 255 268 252 261 566 372 93 617 644 189 280 760 421 139 507 578 123 164 422 184 88 156 60 1 33
2292 33 -332 -245 10 -321 -492 -199 -256 -669 -462 -180 -613 -584 -213 -400 -489 -260 -208 -333 -163 -132 -287 -36
2314 -36 82 -251 46 264 -141 -21 375 129 -89 286 294 -63 148 274 -12 -16 91 -111 -68 52 -169 -249
2336 -249 -30 -148 -411 -92 -73 -398 -166 -6 -329 -283 -5 -177 -297 123 8 -157 101 132 4 153 268
2357 268 14 166 386 69 119 417 201 -23 331 311 -35 132 298 -81 -22 135 40 -57 70 -125 -236 77
2379 77 -121 -231 4 63 -293 -77 139 -208 -310 124 -86 -186 89 25 -187 -153 39 -195 -110 -36 -248 -104
2401 -104 -35 -277 -355 -79 -327 -586 -281 -161 -664 -487 -265 -589 -638 -332 -491 -650 -422 -510 -528 -343 -445 -524
2423 -524 -199 -210 -464 -148 211 -147 -214 298 180 -102 242 430 156 158 454 293 383 402 349 500 510 245 336
2446 336 622 290 16 527 482 -28 187 549 191 -129 329 377 -48 100 185 266 210 112 138 443 280 -73
2468 -73 295 603 10 47 682 480 5 368 747 251 118 468 563 254 215 312 477 286 3 198 472 94
2490 94 -164 350 422 -303 -94 531 -36 -496 62 328 -174 -279 80 175 -116 -182 -70 69 -180 -433 114
2511 114 247 -436 -362 399 36 -799 -195 309 -382 -621 -42 45 -465 -416 -132 -189 -360 -565 -157 41 -606
2532 -606 -708 109 0 -817 -571 340 -239 -769 -30 342 -384 -398 200 210 -305 -301 223 296 -271 -348 380 483
2554 483 -364 -297 542 236 -628 31 582 -307 -573 256 238 -591 -444 114 83 -604 -636 -28 46 -717 -770 115
2576 115 2 -937 -436 355 -376 -965 49 307 -688 -697 297 265 -571 -441 293 380 -287 -330 319 393 -435 -41
2598 -41 782 193 -641 344 884 -210 -505 617 725 -274 -247 594 506 -119 -94 579 507 -210 -48 759 381
2619 381 -506 260 1165 110 -576 597 957 -97 -256 786 668 -79 70 684 384 -102 114 827 465
2638 465 -403 86 1037 262 -647 415 1008 -90 -481 619 682 -403 -134 734 292 -405 76 719 334
2657 334 -405 -22 906 334 -633 87 973 41 -540 494 745 -341 -225 709 304 -635 -60 638 39
2676 39 -672 -190 462 58 -811 -367 440 -267 -1016 -126 307 -749 -920 170 7 -1097 -697 238 -298
2695 -298 -1049 -598 141 -273 -945 -500 178 -298 -906 -191 404 -524 -932 268 316 -868 -581 645 118
2714 118 -835 -325 457 -111 -579 -129 270 -98 -631 -92 424 -328 -806 252 579 -726 -709 545 314
2733 314 -806 -263 519 47 -523 86 414 -73 -326 115 495 -47 -384 305 779 -176 -429 685 819
2752 819 -406 -110 876 392 -370 351 768 135 -96 420 676 79 -166 409 825 119 -277 583 925 -39
2772 -39 -151 876 638 -192 250 904 230 -161 512 804 127 -154 332 603 134 -281 296 554 -96 -427
2792 -427 342 315 -579 -327 364 -264 -789 -111 201 -533 -728 -170 -130 -590 -711 -399 -51 -555 -821 -248 -105
2813 -105 -814 -695 39 -236 -860 -391 275 -479 -700 -94 126 -307 -426 -52 83 -216 -302 14 188 -342
2833 -342 -356 336 245 -540 -243 522 -33 -496 64 352 -225 -186 214 217 -83 -90 124 242 36 -104 302 447
2855 447 -66 -39 560 448 -217 314 699 228 -32 578 525 183 325 487 440 287 287 438 574 277 104 561
2877 561 543 -12 210 756 322 2 446 535 133 138 493 267 88 229 341 256 143 117 300 371 -44 -114 313
2900 313 143 -288 40 278 -214 -307 63 1 -422 -187 -151 -296 -402 -386 -411 -289 -499 -626 -371 -341 -598 -633
2922 -633 -312 -513 -773 -399 -308 -652 -516 -215 -473 -488 -274 -332 -317 -223 -300 -291 -81 -243 -330 41 -11 -357 -132
2945 -132 125 -250 -284 50 -42 -288 -132 3 -223 -94 -29 -194 -150 -40 -233 -145 118 -199 -275 139 3 -238
2967 -238 99 109 -159 -33 198 0 51 210 150 68 291 159 89 312 278 108 368 393 92 291 508 173
2989 173 116 443 329 132 341 405 184 290 380 173 169 382 126 206 381 178 139 375 253 36 248 375
3011 375 61 188 385 214 59 306 154 6 209 134 5 116 103 -112 58 119 -190 -90 142 -126 -289
3032 -289 51 -98 -284 -121 -11 -307 -256 -50 -214 -188 -114 -176 -276 14 -146 -215 122 30 -216 10 180 -139
3054 -139 -20 281 -91 -76 153 45 -137 62 39 -63 -14 -39 -127 -30 -16 -236 -153 44 -301 -318 -9 -156 -414
3077 -414 -139 -130 -381 -330 -71 -275 -301 -164 -216 -226 -141 -237 -201 -33 -58 -291 -9 85 -214 -16 234 -55 -193 114
3101 114 213 -80 83 216 75 44 61 93 173 167 -43 105 259 -77 -195 280 133 -274 37 308 -76 -78 228
3124 228 35 -73 1 151 64 15 -1 52 128 -7 -51 245 286 -245 -41 294 -36 -282 118 180 -239 -221 131
3147 131 -69 -225 -146 -131 -85 -156 -219 -48 20 -275 -322 198 -41 -416 -13 255 -162 -241 258 206 -114 16 300
3170 300 155 68 68 283 315 69 13 379 373 -233 85 581 87 -227 280 317 -214 -170 274 49 -246 -130 75
3193 75 13 -221 -226 97 91 -342 -173 193 -41 -451 102 450 -279 -270 382 330 -233 132 516 240 -28 116 418
3216 418 396 67 180 556 293 -193 213 591 21 -410 321 393 -252 -210 396 75 -418 -153 230 -88 -375
3237 -375 -218 76 -15 -442 -210 262 -191 -627 25 331 -392 -508 309 123 -481 -175 382 -132 -369 -39
3257 -39 234 -51 -366 -195 274 -92 -530 -24 328 -274 -616 130 148 -594 -421 238 -59 -556 -189 229 -159
3278 -159 -395 -56 233 -53 -416 -32 447 -38 -362 337 475 -255 -204 586 376 -346 31 652 75 -269
3298 -269 154 368 51 -267 42 267 -71 -431 24 362 -398 -506 190 179 -652 -393 360 -62 -676 -70
3318 -70 287 -223 -360 41 234 -72 -191 189 486 -20 -257 430 607 -133 -140 653 480 -301 205 696 194
3339 194 -169 335 521 40 -271 192 374 -78 -334 139 371 -338 -474 329 236 -582 -314 454 -79 -594
3359 -594 9 301 -297 -427 142 218 -186 -277 113 332 -99 -259 247 385 -315 -180 526 184 -417 38 533
3380 533 -117 -407 136 299 -277 -288 169 178 -251 -386 102 186 -344 -372 267 144 -487 -236 447 -17 -524 179
3402 179 382 -218 -242 278 301 -44 -184 216 308 -66 -114 343 270 -293 -126 476 116 -536 -50 419 -267 -482
3424 -482 191 147 -346 -321 56 13 -341 -264 5 31 -389 -354 292 41 -469 -136 398 -38 -290 270 444 -87
3446 -87 -62 378 310 -78 156 356 326 -6 69 440 342 -65 -22 511 209 -297 83 402 -183 -341 159 140 -350
3469 -350 -143 102 -83 -320 -229 -6 -4 -337 -266 94 -12 -401 -107 254 -116 -345 152 291 -173 -58 323
3490 323 174 -175 75 308 197 -31 2 164 240 -45 -85 275 99 -242 21 347 -158 -252 202 124 -301 -112
3512 -112 132 -30 -239 -128 66 -86 -153 -167 65 88 -236 -123 239 -55 -351 103 151 -241 -154 226 -29 -243
3534 -243 -89 25 -116 -68 -121 -21 -49 -248 -176 49 -134 -361 -117 140 -287 -293 97 -10 -270 -64 67 -114
3556 -114 -109 13 14 -33 35 -11 131 211 -43 130 340 112 8 185 303 18 69 396 132 -31 205 161 38
3579 38 129 134 59 35 -14 -83 71 53 -155 -56 90 -119 -172 108 5 -240 -52 50 -76 -66 125 49 97 33 91
3604 91 193 228 96 125 298 161 19 283 401 114 136 295 165 33 242 172 135 123 182 33 63 50 -30 50
3628 50 83 -101 -89 82 -107 -198 59 -67 -320 -68 -64 -192 -185 -1 -108 -134 -63 -112 -134 -13 -56 -185 -52 -82 -264
3653 -264 -49 -15 -270 -197 -12 -114 -313 -86 -200 -295 -146 -138 -165 -190 -142 -217 -170 -106 -282 -219 -8 -191 -189 29 20
3678 20 -134 -28 63 -118 -15 44 10 1 108 22 -13 99 48 -10 157 86 -89 100 124 -68 -76 179 -32 -159 135
3703 135 64 -120 -15 91 -5 -22 18 -79 -33 75 -1 41 166 77 58 300 201 -14 179 411 93 187 354 251
3727 251 247 302 294 242 376 227 239 317 266 129 233 241 8 58 214 42 -62 123 90 -45 -93 26 -92 -167 -88
3752 -88 -146 -161 -168 -183 -157 -51 -215 -220 -106 -73 -312 -47 48 -202 -172 43 -27 -209 -18 -27 -119 -86 25 -105 -21 -80
3778 -80 -204 7 -52 -282 -104 26 -166 -339 25 -10 -262 -163 -18 -122 -222 -82 -1 -91 -89 -66 -23 67 -93 -4
3802 -4 157 42 -185 149 261 -46 -33 256 183 -182 59 209 64 -55 91 154 13 -33 -10 193 57 -152
3824 -152 5 171 -38 -203 147 163 -119 -116 300 20 -156 80 138 27 0 105 223 158 -9 119 302 155
3846 155 -35 238 308 -32 -9 314 186 -172 54 322 -21 -196 74 107 -36 -100 -124 -19 -114 -322 -141 58
3868 58 -269 -392 21 -10 -404 -272 88 -261 -389 -90 15 -227 -331 -116 5 -86 -236 -78 179 -58 -211
3889 -211 149 258 -222 -71 386 138 -265 151 455 31 -144 187 271 -5 -9 179 243 -16 -111 164 269 -173
3911 -173 -156 338 187 -213 56 392 130 -202 152 342 -31 -90 186 254 13 -23 166 287 18 -69 166 268
3933 268 -252 -127 333 150 -332 45 325 -122 -236 167 165 -187 -162 107 91 -121 -202 76 142 -248 -252 215 92
3956 92 -398 -80 271 -105 -410 43 244 -248 -202 139 90 -190 -126 69 149 -173 -182 168 89 -263 -246 228 -46
3979 -46 -503 -53 236 -267 -407 77 45 -299 -231 66 -26 -225 -183 159 90 -245 -196 225 109 -292 -7 438
4001 438 -7 -298 199 318 -91 -74 368 317 -1 123 352 284 29 107 450 310 -100 47 420 152 -191
4022 -191 221 409 -76 -200 237 217 -231 -133 215 84 -195 -138 132 31 -298 -90 192 -22 -366 -94 226
4043 226 -162 -434 88 177 -310 -217 180 40 -300 -49 161 44 -228 -49 167 49 -226 -81 238 -95 -329
4064 -329 43 279 -192 -246 178 61 -295 -89 190 26 -203 -143 116 35 -183 -37 240 28 -294 6 273
4085 273 -102 -208 143 189 -185 -35 287 33 -183 23 181 33 -107 -73 112 7 -219 -68 186 -44 -267
4106 -267 78 259 -216 -224 210 54 -199 -23 155 24 -136 64 105 41 -20 83 267 119 -81 104 320 -123
4128 -123 -127 264 266 -126 39 348 121 -94 111 217 51 1 12 111 23 -156 -10 75 32 -241 -5 59 -259 -208
4152 -208 128 -17 -254 -19 88 -161 -227 19 -9 -134 -106 -59 90 1 -61 -46 197 -24 -110 217 192 -137 5
4175 5 270 97 -48 139 95 -19 50 112 82 26 -46 5 131 45 -103 -5 99 -70 -150 105 22 -239 -55 21 -117
4200 -117 -145 53 -4 -116 43 -43 10 17 -116 -79 75 -35 -175 42 58 -146 -91 106 -100 -208 -29 53 -65
4223 -65 -33 -24 3 -39 -95 -71 15 -33 -164 18 88 -117 -172 205 54 -196 11 128 -137 -30 119 89 23 -5 93
4248 93 -22 79 -13 23 117 43 -55 58 49 -148 -89 46 -56 -155 32 -29 -135 -44 -24 -59 -29 -39 -114 -24 59 -100
4274 -100 -12 110 -42 -61 100 18 -40 100 199 1 -2 181 113 86 196 194 132 157 160 62 188 101 8 177 241 6
4300 6 49 244 68 -36 107 146 -45 48 139 -69 25 3 24 -16 44 -78 -93 80 -78 -121 10 -29 -172 17 46
4325 46 -75 -92 25 -35 -86 25 -19 -128 -8 -6 -106 79 5 -98 -30 75 -93 -69 58 18 -108 7 61 -149
4349 -149 -66 45 -83 -65 18 57 -104 17 -54 -39 82 -24 -144 49 7 -152 -32 -3 -79 -138 38 -52 -97 -17
4373 -17 11 -101 -13 -11 -82 -39 -38 -83 -54 -5 -153 -141 7 -69 -199 -48 -6 -113 42 66 -74 -34 46 38 17 69 55 40
4401 40 65 11 53 158 80 0 127 274 90 38 296 163 37 205 217 66 97 136 81 66 133 -6 59 54 -47
4426 -47 33 100 25 -96 46 83 -143 -40 106 -107 -137 -18 18 -71 -69 -57 -72 28 -99 -33 -1 -32 -150 58 115
4451 115 -59 -7 156 1 -162 15 102 -40 -79 43 3 -46 -74 -57 -3 18 -132 -30 28 -112 -127 36 36 -219
4475 -219 -129 98 -69 -285 -28 11 -136 -105 -62 -11 -84 -75 -1 39 -68 -65 4 70 -187 -115 154 -1 -198 52 92
4500 92 -95 -73 118 115 -53 -14 76 58 -70 -35 91 200 -51 -34 187 117 -160 19 240 -38 -45 246 193 -45
4524 -45 42 156 97 -5 33 124 195 -18 -34 190 150 -137 -92 170 61 -227 26 150 -122 -162 106 72 -204 -108
4548 -108 120 25 -143 -88 23 40 -176 -181 73 -8 -216 -27 235 -80 -250 102 113 -145 -107 183 92 -80 -37
4571 -37 99 101 -12 14 189 200 -65 -37 288 52 -194 100 223 -86 -109 177 114 -170 -4 134 -4 -89 13
4594 13 107 68 -158 -88 68 -1 -254 -21 256 -130 -244 109 163 -240 -143 173 -14 -190 -76 119 -19 -110 -53
4617 -53 145 59 -179 -33 218 -5 -214 71 229 -157 -132 227 77 -187 -33 226 9 -97 22 92 59 -87
4639 -87 -18 160 -3 -172 -16 189 -80 -240 159 73 -195 -101 153 -43 -258 -24 49 -81 -136 -76 75 -58
4661 -58 -233 -112 139 -107 -243 56 167 -217 -244 185 -2 -273 -84 192 -31 -205 -3 54 -82 -95 -21 126
4683 126 -44 -121 85 251 -79 -208 216 167 -253 -14 307 29 -171 107 198 7 -104 28 133 9 -89
4704 -89 52 137 -77 -114 105 189 -210 -150 176 -2 -200 -24 139 -48 -135 47 83 -20 -104 52 114 -7 -112
4727 -112 16 237 -51 -100 239 231 -77 44 256 71 -110 113 228 -15 33 180 109 10 -8 131 200 -14 -88
4750 -88 131 221 -28 6 268 109 -141 14 260 -25 -159 34 96 -48 -73 53 54 -30 -121 51 40 -121 -181 58
4774 58 45 -189 -98 113 -116 -223 61 71 -190 -116 58 9 -120 -147 -47 10 -117 -184 4 64 -171 -78 89 -8
4798 -8 -184 -10 105 -156 -133 56 -47 -105 -22 2 -20 -36 -85 -7 53 -75 -106 69 -4 -198 -95 102 -65 -200
4822 -200 -17 -34 -143 -80 -1 -118 -131 -83 -32 -19 -120 -110 -37 -12 -145 -84 91 9 -132 32 103 -61 -4 131 16
4847 16 -4 56 122 56 14 102 108 209 84 -74 141 93 18 4 216 41 -82 151 118 -22 36 156 26 17 46 54
4873 54 63 45 -47 -7 114 -47 -5 110 74 -78 95 85 -57 -62 81 62 -79 76 13 22 35 29 -21 29 2 -7 76 55
4901 55 -95 44 187 -21 -52 10 43 -32 -11 64 27 -22 47 -25 62 -66 -16 -29 62 -15 -101 70 -7 -40 23 49 -46
4928 -46 -75 8 -14 -64 32 5 -33 -72 13 -39 -37 -32 -120 -5 -17 -115 -54 -22 -109 -191 -24 -9 -171 -122 39 -50 -106 -12 7
4957 7 -7 87 -1 -45 75 30 -14 120 86 -91 12 111 -32 -42 39 64 -84 94 81 14 91 31 -35 17 26 -91 6
4984 6 29 -42 -32 33 -5 -134 2 -84 -99 -107 7 -57 -74 4 -79 -65 -5 -60 -55 -24 -50 -41 39 12 -48 24 92 8 20 172
5014 172 46 -2 58 125 30 15 101 23 125 90 52 3 7 -22 40 80 32 15 93 121 -76 10 109 -72 -105 8 12 -19
5042 -19 47 2 -33 -39 -40 -33 38 -30 -67 -2 84 -65 -68 72 -82 -71 39 91 -1 -16 60 4 -16 33 15 1 56 -20 -43 72
5072 72 -14 -67 16 63 -57 8 175 25 -30 84 85 -8 24 25 51 100 79 14 31 28 -12 30 79 -58 -74 89 41 -43 44
5101 44 82 -72 -76 14 -11 -92 -29 -54 10 -80 -40 -54 -10 -99 -154 -23 -37 -159 -68 42 -52 -128 21 -21 -81 -42 39 -12
5129 -12 -112 25 -57 47 5 -14 94 110 61 57 100 22 -58 83 162 -111 3 144 35 -91 20 63 9 -6 28
5154 28 3 -59 -54 -73 75 -22 -196 -27 34 -28 -102 60 39 -107 -23 58 -17 -152 13 72 -47 -27 -26 86 11 -156
5180 -156 27 154 -5 -176 24 80 -19 -63 159 54 -98 46 112 -1 -86 -26 56 -30 0 -18 150 35 -118
5203 -118 -29 123 -68 -164 127 36 -117 -31 106 -59 -125 -41 -4 -39 -92 -7 24 -23 -164 -78 59 -84 -224 42
5227 42 73 -126 -44 139 31 -82 -7 165 13 -130 57 82 -2 -30 -25 143 -17 -40 69 123 -80 -62 169 144
5251 144 -9 47 205 68 -78 118 148 124 49 38 90 37 -26 63 217 23 -63 115 154 -34 18 159 42 -145
5275 -145 23 140 -14 -38 41 64 45 -33 -9 86 16 -102 1 117 -78 -115 116 79 -92 6 172 -54 -97 41
5299 41 113 -29 -92 73 95 24 -51 48 158 18 -19 67 108 -99 -109 92 -16 -152 41 169 -44 -137 -44 24 -132
5324 -132 -68 -30 -10 -71 -129 -81 6 -132 -191 89 -99 -194 -68 70 -132 -270 -36 0 -184 -180 -16 -14 -143 -148 -82 28
5350 28 -87 -108 8 15 -158 -132 119 -22 -156 11 87 -49 -75 156 136 -77 -41 86 -12 -25 -79 133 109 -5
5374 -5 -4 185 78 -133 80 169 17 -58 95 142 -55 -26 21 120 -71 -2 100 61 -80 -91 79 66 -108 -20 172
5399 172 34 -60 36 177 4 -21 142 103 -64 3 116 53 2 1 99 77 2 31 125 74 -74 39 147 -48 -50 101
5425 101 72 -33 49 20 43 -43 -67 64 44 -62 -107 93 21 -125 -72 80 -14 -122 -35 47 -157 -113 66 -90 -44
5450 -44 -33 7 -41 -41 2 -71 -37 -80 -49 50 -6 -99 -7 138 -102 -38 153 58 -177 -7 56 7 -63 52 43 -79 -10 11
5478 11 80 37 -37 -5 71 21 17 25 93 -15 -65 152 21 -49 5 39 -21 -65 19 -56 -30 -2 -12 59 54 -83 -47 22 40 -113
5508 -113 72 64 -57 -44 78 2 -72 54 4 -9 74 12 9 17 64 -52 95 3 -18 59 47 23 33 86 7 -18 42 54
5536 54 10 57 59 24 54 44 -42 106 37 44 -43 47 -80 -46 25 -46 -129 -53 -19 -96 -107 -72 -68 -75 -69 -68 -100 -79 -97 -82 -39 -83
5568 -83 -95 -61 -26 -73 -96 16 -100 -92 -91 -38 -55 -11 6 -121 -26 -6 -35 -22 -23 -108 35 82 30 -86 71 93 -76 -40
5596 -40 34 -101 -52 -30 4 -40 32 -41 -6 51 7 -36 32 -4 -17 58 55 -14 17 157 26 37 42 102 13 49 83 36 59 86
5626 86 102 169 104 69 79 113 94 72 88 143 58 85 151 41 31 101 104 86 69 93 96 149 109 80 136 52 -38 41 106 22 29
5657 29 117 83 46 87 74 -28 -29 115 28 35 34 -40 -31 -23 -20 -96 -3 -26 -70 -58 -60 -119 -88 -49 -54 -129 -117 -31 -86 -94 -106 -116 -105 -47
5691 -47 -102 -67 -31 -75 -85 -39 -67 -135 29 -21 -111 -9 -26 -76 -81 4 -62 -99 -24 -9 -30 -82 -71 -88 -29 -61 -106 -123 -78 -151
5721 -151 -55 -42 -87 -142 -29 14 -72 -2 3 -57 -19 2 53 -18 17 4 -40 57 16 85 46 43 38 57 33 3 11 156 96 76 128
5752 128 112 12 40 79 54 136 30 12 45 112 -12 12 172 85 45 99 94 10 -16 76 -21 -11 91 37 60 13 -17 71
5780 71 57 -5 -52 79 11 -63 44 41 -19 -45 104 32 -66 13 -9 -56 32 -59 -9 -14 -84 38 40 22 -41 11 75 -70 -22
5809 -22 102 68 -66 11 70 2 -15 -47 -27 -45 23 76 7 -19 -41 22 86 -34 -93 53 64 -47 -64 45 -73 -131 -17
5836 -17 20 -86 -78 -73 -54 -49 -53 -5 -34 -30 -59 -63 8 -70 -40 51 26 -114 -22 61 -63 -47 9 15 -38 -20 74 47 13 -39 68 87
5868 87 -15 -40 31 63 -67 33 132 91 -92 64 142 -69 -22 -8 22 -9 -42 29 53 -61 -68 4 20 -103 -97 36 -21
5895 -21 -82 -59 20 -57 -122 38 -14 -76 -60 -33 17 -73 7 -57 0 -73 -138 38 40 -93 -103 82 -35 -154 25 27 -56 -71
5923 -71 22 -33 -94 -55 21 3 -22 -50 75 25 -14 -7 70 74 -112 19 130 -55 -60 19 75 -51 -21 51 -45 -84 -28 71 -30
5952 -30 -12 -91 4 3 -124 -42 72 -12 -194 15 86 -138 -32 103 30 -51 19 63 34 8 45 111 15 -81 8 79 60
5979 60 -93 126 157 -4 -118 154 52 -4 -28 150 48 -42 39 115 62 24 6 -7 74 -41 -29 40 20 -83 39
6004 39 34 -3 -74 56 37 -54 4 48 21 -48 -7 23 22 -20 -6 39 -90 -84 41 55 12 -45 92 39 -30 32 58 12 -11 38
6034 38 15 -7 -44 1 -3 -4 -59 -23 57 -22 -49 80 50 -104 4 80 -4 -77 40 53 27 -98 18 -7 14 -37 -36 -2 -17
6063 -17 -174 26 27 -32 -100 8 34 -125 -11 1 -26 -61 -6 -43 -63 -99 -20 -30 -70 -35 -77 51 -44 -55 6 -5 0 -36
6091 -36 54 12 -41 -31 40 -1 -35 -9 -14 31 -31 -11 23 31 -14 -18 2 -32 -18 52 69 -103 -19 81 3 -10 75 22 -103 30
6121 30 0 4 -32 8 -19 29 11 -43 36 117 -38 -15 57 61 -58 42 64 -23 8 55 22 17 -23 26 85 39 -21 85 117 -3
6151 -3 -11 93 85 -17 -11 114 26 27 67 17 2 52 38 -8 -11 -10 35 34 33 2 44 70 -56 -44 10 -46 -58 9 89 -29 -21 -29 -13
6184 -13 9 11 17 -31 42 11 -14 29 -43 -64 -32 22 -53 -15 6 -47 2 20 38 10 -26 31 -16 26 4 43 17 27 -23 -26 84
6215 84 -13 -36 20 15 -52 47 54 -14 5 56 -2 43 -8 -53 26 -20 10 -17 68 -18 -21 46 38 -28 -108 22 -47 -62 15 63 -110
6246 -110 -53 21 -53 -48 45 -2 53 52 -9 -14 18 -13 -26 -36 -8 -8 -33 32 -21 10 24 38 -2 -26 -29 26 -4 -14 44 -16 -3 -83
6278 -83 48 5 -55 5 -58 -64 -118 -6 -103 -114 -55 -7 -51 -62 -52 -62 5 -43 -21 -78 8 -16 0 14 -13 -104 72 106 4
6307 4 -36 3 -24 4 22 59 4 -25 6 -35 -1 -34 -79 -17 39 -12 -72 105 39 -12 46 84 -6 19 27 -25 -6 57 28 -20 26
6338 26 -39 10 20 -28 30 41 57 48 80 73 -42 -6 57 73 -64 35 57 15 24 63 11 8 8 25 10 72 -39 66 87 11 35
6369 35 87 86 -10 7 82 -9 60 98 -19 68 26 55 12 61 81 77 90 24 -57 17 49 -48 -62 103 18 -107 8 12 -22 -33
6399 -33 2 4 -62 -53 -82 26 -14 -137 -18 55 -39 -71 26 47 -49 -45 -12 -33 -51 -7 -29 -17 14 -16 -66 -36 -23 7 -32 -67
6429 -67 -103 5 24 -62 -3 61 -63 -54 63 13 -95 -5 26 -13 3 -5 6 -33 2 -33 -2 35 -55 -28 13 51 -93 14
6457 14 37 -48 -36 -8 -20 3 -12 -29 -32 43 -25 14 -11 -23 -17 110 -2 -37 20 79 17 -35 45 57 18 -1 42 86 39 -4
6487 -4 19 62 12 45 84 70 -18 -5 70 40 -36 -11 70 -3 -51 42 33 -39 25 -18 -45 -27 -1 44 34 -23 -79 29 -32 -82 -21
6518 -21 37 -74 -97 3 71 -64 -22 15 -39 -35 13 9 63 12 -17 40 68 -58 16 142 43 21 21 38 -35 -24 67 24 29 2
6548 2 65 1 29 96 30 26 -6 4 35 50 -37 6 81 67 -49 -30 90 -60 -44 69 36 -58 7 90 -36 -56 7 -35 -19
6577 -19 -76 6 5 -10 6 13 32 -134 -51 43 4 -61 37 60 4 -65 -34 -7 41 -34 29 54 20 -36 39 -3 -2 -36 -27 73 -37
6608 -37 73 77 39 13 39 21 -17 -100 64 -28 4 -34 -62 -18 -50 -106 10 28 -67 -75 27 -6 -111 -18 -25 7 -10 -3 -7 44
6638 44 -24 77 29 -57 -52 -9 32 -34 -67 19 59 -90 -71 30 -48 -57 41 36 0 -48 -1 33 81 -50 20 21 -1 -13 41 5
6668 5 42 -90 25 58 -72 -19 73 -18 -20 43 61 -61 -29 -4 -34 -57 -14 5 18 -15 27 37 1 -114 -74 86 -27 -50
6696 -50 17 77 -42 -9 0 7 0 13 50 64 -2 31 1 113 -33 2 87 42 -75 56 98 -97 -17 70 28 -36 19 63 106
6725 106 31 43 88 65 36 -44 -43 20 -22 -42 82 7 -50 59 34 -50 26 21 -53 -50 -24 31 72 -6 -81 9 -41 -57 -36 35
6755 35 15 -33 -11 55 -79 23 84 3 25 7 2 11 23 20 -15 57 22 21 37 32 -94 26 50 47 -46 45 37 -27 23 11 -3 -32
6787 -32 -13 55 38 -36 -16 -48 -8 -1 -104 36 -30 -99 -1 3 -5 -83 -51 13 -27 22 35 -4 -28 3 -60 17 -90 -64 -16 24
6817 24 -17 -46 -8 -32 -56 34 -1 -11 -69 -20 -52 -34 17 7 -28 -46 -38 -47 36 25 -32 35 12 -46 22 60 -32 15 -12 -13 22 -44
6849 -44 27 31 -5 -37 38 8 27 -37 -11 -1 -51 5 98 85 -44 51 12 35 79 85 28 38 35 30 15 39 35 7 73 73 22 -3 18
6882 18 17 -52 57 37 -1 53 12 -17 41 40 3 5 77 17 40 -42 -29 -2 -52 -22 -24 18 -36 -43 -67 25 -75 -8 3 -18 -40 40
6914 40 -40 -38 -21 -54 -7 -64 23 -39 9 -62 -37 -27 -1 4 -41 -2 6 -19 -95 -19 -24 -43 -30 -27 -6 28 17 5 47 13 27 -6 -3
6947 -3 -51 11 46 -37 60 0 30 -74 36 92 -38 -7 14 95 45 26 -32 31 15 -69 13 64 58 6 50 42 10 -9 -47 -9
6977 -9 16 4 30 -2 43 26 -19 98 -4 -36 66 -5 -40 -33 30 40 -79 65 -65 -13 8 11 12 -7 48 -47 56 -27 -21
7006 -21 -57 -4 -31 -25 -19 -31 -22 32 -66 -127 -1 -14 -26 -26 12 -50 -10 -71 -17 -30 -69 -75 -50 6 -46 11 -53 68 -14 -17 -2 16
7038 16 -36 37 -18 48 30 79 40 30 56 37 -12 20 43 64 -33 -1 17 24 124 -11 15 2 21 -1 137 -24 3 -8 29
7067 29 71 -8 -2 -20 57 17 -8 97 9 55 35 15 3 -58 -5 26 -59 5 -18 19 -20 -27 63 -35 17 -16 12 42 -80 41
7097 41 45 10 -22 30 41 -13 -25 -23 96 -12 19 -5 -21 -75 11 -17 48 23 -25 42 -8 -99 -14 -25 -36 -86 -15 16 -135 -88
7127 -88 -29 -31 8 27 50 -54 -46 -44 -22 -33 -20 -9 105 44 -125 36 42 13 -65 -12 39 -38 -15 22 -8 -104 51 6 -15 33
7157 33 35 35 46 -3 74 140 41 -32 65 35 24 106 37 23 45 -9 52 -40 -6 -40 27 48 50 27 -24 20 -23 10 51 7 -34 53
7189 53 11 -16 -77 -48 -46 -14 23 -10 -33 -48 -23 12 26 8 -37 35 -76 2 44 7 -17 -25 77 27 -16 50 15 43 16 11 47
7220 47 -11 -58 6 -6 -48 3 -33 -1 -95 44 11 -25 -99 -44 53 -51 -79 -24 0 -36 -63 5 47 -85 -45 -49 -77 -80 -43 -16
7250 -16 -40 -86 -127 48 -36 -68 -15 -28 -113 -85 30 1 57 -48 20 27 -49 -7 42 90 -42 1 87 24 20 10 70 65 -6 47
7280 47 93 14 33 33 76 69 60 23 36 6 20 99 47 6 68 49 4 22 36 38 -41 -27 47 -2 6 29 -33 -42 10 -27 59 30 -12
7313 -12 8 91 14 23 0 62 -34 -18 -15 35 -69 72 47 -20 27 -16 24 33 -28 -29 79 5 42 11 39 -35 -18 -21 106 -13
7343 -13 -19 -20 0 2 3 -6 -5 -23 -25 -6 10 -49 -4 13 -3 -83 60 61 -54 3 -25 -54 11 -42 -10 -11 -91 11 3 -102 -34 -74 23
7376 23 -23 -116 -16 7 -46 -75 17 -40 -54 6 52 -2 2 -22 28 -43 21 -41 28 63 13 14 -25 42 0 72 30 28 -18 32 32 6
7408 6 -37 13 18 12 15 14 -13 -38 -44 12 -6 -15 22 31 -50 -26 -16 27 -24 -22 31 55 -34 10 7 51 25 -60 67 62 65 -10 37 31 41 41 6
7445 6 48 33 109 52 2 1 23 9 -9 1 -9 47 -48 -33 66 -54 8 54 48 27 -73 14 12 -10 -19 63 -75 -2 -66 32 -9
7476 -9 -66 7 -19 43 -54 29 16 -34 -50 -14 37 -41 -68 33 -20 -14 -1 18 -47 -134 -13 4 -24 11 38 60 13 11 -6 -10 -24
7507 -24 -12 26 44 4 -22 0 18 16 72 21 -86 -14 -44 11 23 6 -38 2 5 -5 -35 64 -35 4 -15 25 -21 42 47 21 30 70
7539 70 -43 -44 -48 50 -25 -18 -18 -28 48 -38 -30 7 29 -29 -59 16 65 -35 19 27 46 28 8 -9 -12 -20 36 -23 -21 -18 37 63 -6 39
7573 39 14 -22 -7 -20 12 -13 42 15 -1 -5 -34 21 -8 -32 -81 -10 -45 -54 -60 -23 -4 26 -64 -21 12 -54 -64 -35 14 12 61 0
7605 0 5 -4 -47 -25 -35 -28 7 6 -42 -65 16 -3 -40 -56 32 22 26 -27 -41 -9 68 -32 18 46 -5 46 11 5 21 22 12 -68 84
7638 84 41 -56 15 -3 52 -26 47 -18 -64 7 0 -64 105 3 26 37 66 -38 -6 64 33 20 -37 14 24 14 66 122 -85
7667 -85 81 66 -16 -11 14 -1 -3 -9 38 7 33 8 -8 13 -2 -22 0 -4 3 -30 47 -13 -75 -29 60 1 -12 -18 5 76 -16 -28 73
7700 73 -12 7 18 -25 5 92 26 21 -3 92 -30 41 -7 7 -5 26 26 6 93 -16 -19 24 -3 4 18 22 21 -5 28 30 3 56 29
7733 29 -53 13 11 8 -44 -14 -33 31 -5 27 -7 36 20 -36 35 -13 -46 -42 -23 33 -36 24 -39 -18 -68 -40 18 49 -14 -57 -15 10
7765 10 -16 -20 -38 15 15 62 31 38 62 -11 22 10 -2 30 -6 8 21 65 49 43 17 47 25 26 -11 32 0 4 28 0 28 32 6 24
7799 24 -17 -35 23 -4 11 -38 -25 -36 -14 -29 44 -38 17 -33 40 7 -31 95 0 35 -2 2 32 62 -63 14 28 -35 -44 -20
7829 -20 83 -63 -72 29 53 -39 -20 43 10 -25 3 50 -10 -10 14 6 20 -9 -9 80 -53 25 3 -51 -76 -1 5 -79 -55 -35 -12
7860 -12 -84 -91 -22 -38 -39 9 -97 65 -14 -40 -10 -55 -43 -69 -23 -62 -42 -31 -10 -6 -86 80 -18 -23 10 -10 19 -3 -38 34 36
7891 36 3 27 53 90 29 50 81 62 19 42 10 6 32 -11 -5 24 31 -8 -13 -24 -10 75 -17 14 -28 26 -7 -68 40 8 -70 -32
7923 -32 66 44 -79 -20 26 16 -21 4 28 -17 -27 -17 15 8 -31 20 15 -2 -29 -2 31 -20 58 -2 -11 20 24 6 20 -31 6 17
7955 17 1 -79 -30 40 0 -52 -30 -19 -43 -50 50 12 -59 40 -4 -24 -43 50 12 -11 -81 -25 -33 -41 -72 -81 17 -25 -122 41 -43
7986 -43 -102 -29 37 17 -9 -33 -72 13 33 -49 50 4 -52 35 16 15 7 28 18 -30 21 57 66 -25 35 47 55 24 -1 73 40 39 51
8019 51 3 2 28 72 110 21 -28 -9 28 32 61 7 61 14 8 -42 -34 75 -50 32 -51 1 18 -29 -21 2 44 44 -54 -45 91 90 -46
8052 -46 9 38 8 14 14 62 -22 81 -3 46 69 8 29 37 85 37 57 -8 25 81 45 12 -61 21 36 13 3 -4 19 27 17 8 4
8085 4 62 -21 -11 13 4 -40 36 -8 18 62 9 -40 -42 -30 -33 -32 30 18 35 -46 -16 8 -22 -2 -117 -36 -12 -58 -21 39 21 -2
8117 -2 56 -5 -3 -52 -13 13 25 33 38 -45 20 -13 8 59 -23 35 52 -27 -14 33 38 -55 9 -34 30 20 -31 53 -49 -24 -11 22
8149 22 20 17 35 -8 34 -67 -30 32 -27 -22 53 25 11 -19 19 50 12 -15 -38 -11 -49 -10 11 38 -26 -5 13 -73 -5 47 65
8180 65 33 62 21 -20 60 -4 -28 7 65 37 25
8191B5
##END NTUPLES=NMR FID
##END=
