##TITLE=1H_BAU-j-DIN02
 CDCl3, 8 sc, 
 2.7.2019
##JCAMPDX= 6.0         $$ Bruker NMR JCAMP-DX V2.0
##DATA TYPE= NMR FID
##DATA CLASS= NTUPLES
##ORIGIN= UXNMR, Bruker Analytische Messtechnik GmbH
##OWNER= root
$$ XWIN-NMR		Version 3.5
$$ Tue Jul  2 14:35:33 2019 Russian Standard Time (UT+4h)  she@DPX200
##.OBSERVE FREQUENCY= 200.13155
##.OBSERVE NUCLEUS= ^1H
##.DELAY= (6, 6)
##.ACQUISITION MODE= SIMULTANEOUS
##.ACQUISITION SCHEME= undefined
##.AVERAGES= 8
##.DIGITISER RES= 18
##SPECTROMETER/DATA SYSTEM= spect
##.PULSE SEQUENCE= zg30
##.SOLVENT NAME= CDCl3
##.SHIFT REFERENCE= (INTERNAL, CDCl3, 0, 15.7039)
##AUDIT TRAIL= $$ (NUMBER, WHEN, WHO, WHERE, WHAT)
$$ ##TITLE= Audit trail, XWIN-NMR		Version 3.5
$$ ##JCAMPDX= 5.01
$$ ##ORIGIN= Bruker BioSpin GmbH
$$ ##OWNER= she
$$ F:/spectra/data/she/nmr/H-F/1/audita.txt
$$ ##AUDIT TRAIL=  $$ (NUMBER, WHEN, WHO, WHERE, WHAT)
(   1,<2019-07-02 14:34:24.31 +0400>,<she>,<DPX200>,
      <created by zg, POWCHK disabled, PULCHK disabled
       configuration hash MD5:
       00 E9 B6 7A A2 85 ED C7 34 08 36 98 17 FE 4E 26
       data hash MD5: 16K
       07 20 70 E3 A5 27 4F CD 03 F3 EC F5 5E C6 9D BF>)
$$ ##END=
$$ 
$$ hash MD5
$$ 4C E7 D0 B5 1C AC C5 76 7C 62 F7 85 89 AF 7D 58
##$RELAX= 
##$RELAX= 
##$RELAX= 
##$RELAX= 
##$RELAX= 
##$RELAX= 
$$ Bruker specific parameters
$$ --------------------------
##$DU= <F:/spectra>
##$EXPNO= 1
##$NAME= <H-F>
##$PROCNO= 1
##$TYPE= <nmr>
##$USER= <she>
##$AMP= (0..31)
100 100 100 100 100 100 100 100 100 100 100 100 100 100 100 100 100 100 
100 100 100 100 100 100 100 100 100 100 100 100 100 100 
##$AQSEQ= 0
##$AQ_mod= 1
##$AUNM= <au_zg>
##$AUTOPOS= <>
##$BF1= 200.13
##$BF2= 200.13
##$BF3= 200.13
##$BF4= 200.13
##$BF5= 200.13
##$BF6= 200.13
##$BF7= 200.13
##$BF8= 200.13
##$BYTORDA= 1
##$CFDGTYP= 0
##$CFRGTYP= 5
##$CHEMSTR= <none>
##$CNST= (0..31)
1 1 145 1 1 1 1 1 1 1 1 1 1 1 1 1 1 1 1 1 1 1 1 1 1 1 1 1 1 1 1 1 
##$CPDPRG= <>
##$CPDPRG1= <>
##$CPDPRG2= <>
##$CPDPRG3= <>
##$CPDPRG4= <mlev>
##$CPDPRG5= <mlev>
##$CPDPRG6= <mlev>
##$CPDPRG7= <mlev>
##$CPDPRG8= <mlev>
##$CPDPRGB= <>
##$CPDPRGT= <>
##$D= (0..31)
0 1.2 0 0 0 0 0 0 0 0 0 0.03 0 0 0 0 0 0 0 0 0 0 0 0 0 0 0 0 0 0 0 0 
##$DATE= 1562063663
##$DBL= (0..7)
120 120 120 120 120 120 120 120 
##$DBP= (0..7)
150 150 150 150 150 150 150 150 
##$DBP07= 0
##$DBPNAM0= <>
##$DBPNAM1= <>
##$DBPNAM2= <>
##$DBPNAM3= <>
##$DBPNAM4= <>
##$DBPNAM5= <>
##$DBPNAM6= <>
##$DBPNAM7= <>
##$DBPOAL= (0..7)
0.5 0.5 0.5 0.5 0.5 0.5 0.5 0.5 
##$DBPOFFS= (0..7)
0 0 0 0 0 0 0 0 
##$DE= 6
##$DECBNUC= <off>
##$DECIM= 24
##$DECNUC= <off>
##$DECSTAT= 4
##$DIGMOD= 1
##$DIGTYP= 9
##$DL= (0..7)
0 120 120 120 120 120 120 120 
##$DP= (0..7)
150 150 150 150 150 150 150 150 
##$DP07= 0
##$DPNAME0= <>
##$DPNAME1= <>
##$DPNAME2= <>
##$DPNAME3= <>
##$DPNAME4= <>
##$DPNAME5= <>
##$DPNAME6= <>
##$DPNAME7= <>
##$DPOAL= (0..7)
0.5 0.5 0.5 0.5 0.5 0.5 0.5 0.5 
##$DPOFFS= (0..7)
0 0 0 0 0 0 0 0 
##$DQDMODE= 0
##$DR= 18
##$DS= 0
##$DSLIST= <SSSSSSSSSSSSSSS>
##$DSPFIRM= 0
$$ [...]
##$SUBNAM2= <"">
##$SUBNAM3= <"">
##$SUBNAM4= <"">
##$SUBNAM5= <"">
##$SUBNAM6= <"">
##$SUBNAM7= <"">
##$SUBNAM8= <"">
##$SUBNAM9= <"">
##$SW= 24.9336996594482
##$SWIBOX= (0..15)
0 0 2 0 0 0 0 0 0 0 0 0 0 0 0 0 
##$SW_h= 4990.01996007984
##$TD= 16384
##$TD0= 1
##$TE= 0
##$TE2= 300
##$TE3= 300
##$TEG= 300
##$TL= (0..7)
0 120 120 120 120 120 120 120 
##$TP= (0..7)
150 150 150 150 150 150 150 150 
##$TP07= 0
##$TPNAME0= <>
##$TPNAME1= <>
##$TPNAME2= <>
##$TPNAME3= <>
##$TPNAME4= <>
##$TPNAME5= <>
##$TPNAME6= <>
##$TPNAME7= <>
##$TPOAL= (0..7)
0.5 0.5 0.5 0.5 0.5 0.5 0.5 0.5 
##$TPOFFS= (0..7)
0 0 0 0 0 0 0 0 
##$TUNHIN= 0
##$TUNHOUT= 0
##$TUNXOUT= 0
##$USERA1= <user>
##$USERA2= <user>
##$USERA3= <user>
##$USERA4= <user>
##$USERA5= <user>
##$V9= 5
##$VALIST= <valist>
##$VCLIST= <CCCCCCCCCCCCCCC>
##$VD= 0
##$VDLIST= <DDDDDDDDDDDDDDD>
##$VPLIST= <PPPPPPPPPPPPPPP>
##$VTLIST= <TTTTTTTTTTTTTTT>
##$WBST= 1024
##$WBSW= 4
##$XGAIN= (0..3)
0 0 0 0 
##$XL= 0
##$YL= 0
##$YMAX_a= 712202
##$YMIN_a= -915291
##$ZGOPTNS= <>
##$ZL1= 120
##$ZL2= 120
##$ZL3= 120
##$ZL4= 120
##$ABSF1= 10
##$ABSF2= 0
##$ABSG= 5
##$ABSL= 3
##$ALPHA= 0
##$AQORDER= 0
##$ASSFAC= 0
##$ASSFACI= 0
##$ASSFACX= 0
##$ASSWID= 0
##$AUNMP= <proc_1d>
##$AZFE= 0.1
##$AZFW= 0.1
##$BCFW= 1
##$BC_mod= 2
##$BYTORDP= 1
##$COROFFS= 0
##$CY= 11.3945322036743
##$DATMOD= 1
##$DC= 2
##$DFILT= <>
##$DTYPP= 0
##$F1P= 18.9103706918063
##$F2P= -1.10871071338519
##$FCOR= 0.5
##$FTSIZE= 0
##$FT_mod= 4
##$GAMMA= 1
##$GB= 0.15
##$INTBC= 1
##$INTSCL= 1
##$ISEN= 128
##$LB= 0.24
##$LEV0= 0
##$LPBIN= 0
##$MAXI= 10000
##$MC2= 0
##$MEAN= 0
##$ME_mod= 0
##$MI= 1.114404
##$NCOEF= 0
##$NC_proc= 0
##$NLEV= 6
##$NOISF1= 3.799351
##$NOISF2= 2.8
##$NSP= 1
##$NTH_PI= 0
##$NZP= 0
##$OFFSET= 15.70392
##$PC= 1
##$PHC0= -8500.181
##$PHC1= 14.20097
##$PH_mod= 1
##$PKNL= yes
##$PPARMOD= 0
##$PSCAL= 0
##$PSIGN= 0
##$REVERSE= no
##$SF= 200.130013532006
##$SI= 16384
##$SIGF1= 3
##$SIGF2= 2
##$SINO= 400
##$SIOLD= 16384
##$SREGLST= <1H.CDCl3>
##$SSB= 0
##$STSI= 0
##$STSR= 0
##$SW_p= 3612.71676300578
##$SYMM= 0
##$S_DEV= 0
##$TDeff= 0
##$TDoff= 0
##$TI= <>
##$TILT= no
##$TM1= 0
##$TM2= 0
##$TOPLEV= 0
##$USERP1= <user>
##$USERP2= <user>
##$USERP3= <user>
##$USERP4= <user>
##$USERP5= <user>
##$WDW= 1
##$XDIM= 8192
##$YMAX_p= 0
##$YMIN_p= 0
$$ End of Bruker specific parameters
$$ ---------------------------------
##NTUPLES= NMR FID
##VAR_NAME=  TIME,          FID/REAL,        FID/IMAG
##SYMBOL=    X,             R,               I
##VAR_TYPE=  INDEPENDENT,   DEPENDENT,       DEPENDENT
##VAR_FORM=  AFFN,          ASDF,            ASDF
##VAR_DIM=   8192,          8192,            8192
##UNITS=     SECONDS,       ARBITRARY UNITS, ARBITRARY UNITS
##FACTOR=    0.0002004,     1,               1
##FIRST=     0,             0,               0
##LAST=      1.6414764,     0,               0
##MIN=       0,             -915291,         0
##MAX=       1.6414764,     712202,          0
$$ Real data points
##PAGE= N=1
##DATA TABLE= (X++(R..R)), XYDATA
$$ [...]
2882B56l473K094M377n02l804j286Q70k8Q34K037k67m570k172L278M254o38k833
$$ 256 -3217 -1123 3254 2752 -1052 -2338 -1468 -1496 -662 1375 1108 -3462 -5634 -2356 1898 1260 -1573
2899a573j643o19J05L230L812j383n168k167L393L747J100q22j520l318j197M469
$$ -1573 -3216 -3835 -3730 -500 3312 1929 -3239 -5406 -2013 1734 2834 2012 492 -2826 -4023 446
2915D46M822q54n037j606J734J512J204J541q38l867j907L641L305j429k918l29
$$ 446 5268 4414 -623 -2229 -495 1017 2221 3762 2924 -943 -2850 791 4096 2667 -251 -580
2931e80J120K94N89O38j460k949O03M096J339k968l060j59J389J494K382l13m264
$$ -580 540 834 1423 2061 601 -2348 -1745 2351 3690 722 -2338 -2497 -1108 386 2768 2455 -1809
2948a809m280K002N544K266k175l739k364j041L266N376J408m977n747M20M588
$$ -1809 -6089 -4087 1457 3723 1548 -2191 -4555 -5596 -2330 3046 4454 -523 -6270 -5850 -1262
2963a262L677P87j483l559l248J763N539K905k795l630p91J511J991J620J53k465
$$ -1262 2415 3202 1719 -1840 -5088 -3325 2214 5119 2324 -1306 -2097 -586 1405 3025 3178 713
2979G13k071J378L117K37k551j488O44J476J028L85j842l355o64M006L759j665
$$ 713 -1358 20 3137 3374 823 -665 -21 1455 2483 2868 1026 -2329 -2993 1013 4772 3107
2995C107m210k416M69K466L622J364l160n989j740M430N379P11l280m412k254
$$ 3107 -1103 -3519 -3050 -584 3038 4402 1242 -4747 -6487 -2057 3322 4033 753 -3659 -5913
3010e913J349N168M046k037n660l249K188M484K555k65l121l696N7M043L611p22
$$ -5913 -4564 604 4650 2613 -3047 -6296 -4108 376 2931 2666 -455 -4151 -4094 -51 3560 2838
3026B838l600j577J119K053J798J42k275k558Q74L784J955k117l201p84J719K681
$$ 2838 -762 -2339 -1220 833 2631 2773 498 -2060 -1186 2598 4553 2436 -765 -1549 170 2851
3042B851J373q73l959k842J856M778K203k613m625k196J364M012L002q86m971
$$ 2851 4224 3351 -608 -3450 -1594 3184 5387 2774 -1851 -4047 -2683 1329 4331 3445 -1526
3057a526m087R84M891L386j091l780l857m46M033M506J93m461l696K83L648L194
$$ -1526 -5613 -4629 262 3648 2557 -1223 -5080 -5526 -1493 3013 3206 -1255 -4951 -4668 -1020 2174
3073B174M36k394l672q58L237M324M33l667l065J2L275K941K93k493l362m95L483
$$ 2174 2610 216 -3456 -4314 -1077 3247 3680 13 -3052 -3040 235 3176 3469 976 -2386 -2881 602
3090F02L792j28l459l202m3L261L492O28l430l934o45L656L771J43l240l782q13
$$ 602 4394 4266 807 -2395 -2438 823 4315 4943 1513 -2421 -3066 590 4361 4504 1264 -2518 -3331
3107c331K488M262J214l624m649j464L608L981R27k913m097j766K545M274J771
$$ -3331 -843 3419 4633 1009 -3640 -5104 -1496 2485 3412 499 -3598 -5364 -2819 1455 3226
3122C226k736m500j637K882M168J589k391l947j736K445M567J603j927m182j609
$$ 3226 490 -4010 -5647 -2765 1403 2992 601 -3346 -5082 -2637 1930 3533 1606 -2576 -4185
3137d185K414M221J911j768m063k024K146M530K079k218l939j933J821M088K260
$$ -4185 -1771 2450 4361 2593 -1470 -3494 -1348 3182 5261 3043 -896 -2829 -1008 3080 5340
3152E340j712m312k653J710M591J993j903m191k537J593L785K780j408m557k820
$$ 5340 3628 -684 -3337 -1627 2964 4957 3054 -1137 -3674 -2081 1704 4484 3076 -1481 -4301
3167d301J199M049K457j069m372k834J079M192K742r72m483k780Q71M090L104
$$ -4301 -3102 947 3404 2335 -2037 -4871 -3792 400 3142 2170 -2313 -5093 -4222 -132 2972
3182B972q00l940l200P48M122L501q21l717l216Q43M094L211j78l608l456L66
$$ 2972 2172 -1768 -4968 -4220 -98 3403 2582 -1135 -4351 -3508 586 3797 3619 11 -3445 -3079
3198c079L872L855m04l918l137L31L649L717k19l642l513lL637L581j42l656l709
$$ -3079 793 4648 4244 326 -2811 -2480 1169 4886 4667 1025 -2488 -2491 1146 4727 4585 929 -2780
3215b780j33L273L781J45l923l855l14L278L539M44l503l853p64L225L827O42
$$ -2780 -2913 360 4141 4286 363 -3492 -3806 -528 3011 3455 -48 -3901 -4665 -1440 2387 3029
3231C029l192m107q31L312L816P88k951l834p51K949M014J224l016m037p47L007
$$ 3029 -163 -4270 -5101 -1789 2027 2815 -136 -3970 -4721 -1772 2242 3466 450 -3587 -4334 -1327
3247a327L794J526k846l729j371L075M158J281k417l954j248K442M104J523k380
$$ -1327 2467 3993 1147 -2582 -3953 -878 3280 4561 2144 -1810 -3058 -616 3488 5011 2631
3262B631m023j562K603L738J606k333m062j796K174L920J548k261m177j830J715
$$ 2631 -1392 -2954 -351 3387 4993 2660 -1402 -3198 -1024 2896 4444 2183 -1994 -3824 -2109
3277b109L906J899k015m187k057J861L791K160k000m158k057J752L981K269j861
$$ -2109 1797 3696 1681 -2506 -4563 -2702 1089 3249 1249 -2909 -4966 -3214 767 3036 1175
3292A175l857k230J845L800K575j780l696k101J346M335K297j186l889k446J593
$$ 1175 -2682 -4912 -3067 733 3308 1528 -2168 -4269 -2923 1412 3709 2523 -1366 -3812 -2219
3307b219L877K700j177l795k565J280L864K545r11l652k810R99L616K817q83l827
$$ -2219 1658 4358 3181 -614 -3179 -1899 1965 4510 3599 -53 -2863 -1864 1752 4569 3686 -141
3323a41k873R49L270K833r56l557k895N75L619K958j027l242l090J59L629K817
$$ -141 -3014 -2065 1205 4038 3082 -475 -3370 -2795 824 3782 2755 -487 -3577 -3418 211 3028
3339C028l20l472l253O05L277L121n67l420l086J38L459L092j84l344k987J05
$$ 3028 2708 -764 -4017 -3412 -135 2986 2419 -1001 -4087 -3949 -490 2602 2418 -926 -3913 -3808
3355c808L313L112l6k917l286R8L134L359L04k863l340k11L186L379M48l119k984
$$ -3808 -495 2617 2581 -336 -3622 -3524 -390 2969 3273 410 -2930 -3141 45 3424 3872 753 -2231
3372b231j03K895L208L07k447l529l19K612L221O65k868l417q00K632L422M19
$$ -2231 -2334 561 3769 4076 1629 -1900 -2219 393 3614 4279 1411 -2006 -2806 -174 3248 3667
3388C667k874l334o86K356L313O69k450l708j115K564L426Q01k765l263r59K342
$$ 3667 793 -2541 -3227 -871 2442 3111 661 -3047 -4162 -1598 1828 2629 -136 -3399 -4358 -2016
3404b016L343J049k495l420r00K444L753R79k474k844j377K468L285J445k094
$$ -2016 1327 2376 -119 -3539 -4439 -1995 1758 2737 263 -2581 -3958 -1490 1795 3240 1146
3419A146l334j227K368L348J339j796l126j574J716L729J661j816l467j365J893
$$ 1146 -2188 -3415 -1047 2301 3640 1844 -1282 -2856 -1140 2589 4250 2434 -1033 -2398 -505
3434e05L032J648j528l100k162J544L503J705k036l366j509J582L005J415j286
$$ -505 2527 4175 2647 -453 -2615 -1071 2432 4137 2101 -1265 -2774 -1192 1813 3228 1942
3449A942l265j981J073L477J837j922l430j478J171L255J741j206l465k213J576
$$ 1942 -1323 -3304 -2231 1246 3083 1161 -2269 -3747 -2576 679 2420 1214 -2251 -4464 -2888
3464b888L419J837j210l133j900Q94L278K669r10l145k420J293L397K291j092
$$ -2888 531 2368 1158 -1975 -3875 -2981 297 2966 2056 -1089 -3509 -2216 1181 3472 2380
3479B380k603k005L06L222K680n23l364k174J094K676K183p03k639k182M68K565
$$ 2380 -223 -2228 -1922 1300 3980 3457 93 -2081 -987 1689 3872 3169 530 -1652 -1184 1381
3495A381K389o74l347k122P66K558J830l79k915k761K30L163K373q65l274k154
$$ 1381 3770 3096 -251 -2373 -1607 951 2781 2402 -513 -3274 -3044 119 2492 1627 -1647 -3801
3511c801M09K428K250J97k730k883Q4L150K546l96k480k277j05K724K734P33k489
$$ -3801 -3392 -964 1286 1483 -1247 -4130 -4046 -896 1650 1254 -1226 -3503 -3608 -884 1850 2583 94
3528I4l301K89K983K794j63j977k404l80K265L067P45k563l159M33K351K366K37
$$ 94 -3207 -2918 65 2859 2696 719 -1685 -2065 200 3267 4012 1449 -1710 -1277 1074 3440 3677
3545C677j770k566q74J845K943N31k650k820M8J988K019K37j579l130r38K284
$$ 3677 1907 -659 -1533 312 3255 3786 1136 -1684 -1636 352 2371 2608 1029 -2101 -3039 -755
3561g55K617J17k572k296k88J720K468N42j956k912j040K860L110L78k517k474
$$ -755 1862 1979 -593 -2889 -3177 -1457 1011 1553 -403 -3315 -4355 -1495 1615 1993 -524 -2998
3577b998n90J767L089J380j713l445p80K116L351Q45j379k528j469J483K915J869
$$ -2998 -3588 -1821 1268 2648 935 -2510 -3290 -1174 2177 3022 1643 -885 -2354 -871 2044 3913
3593C913j493l140j185J606K428Q90p38k069j655Q35K685J002j588k662n98J355
$$ 3913 2420 -720 -1905 -299 2129 3019 2281 212 -1443 -608 2077 3079 1491 -1171 -1769 -414
3609d14J927R35j453k197j718J449K941J048k174k784p39J419K459J201j089k873
$$ -414 1513 2448 995 -1202 -2920 -1471 1470 2518 344 -2440 -3179 -1760 699 1900 811 -2062
3625b062k000J446L338J649j541k658j495Q97K543K045j33l199j947R95K860J580
$$ -2062 -4062 -2616 722 2371 830 -1828 -3323 -2426 117 2162 2029 -1170 -3117 -2122 738 2318
3641B318o68j866j294j11K204K287m52k614j691J110K203J342p16k103j231K25
$$ 2318 1650 -216 -1510 -1621 583 2870 2418 -196 -1887 -777 1426 2768 2052 -51 -1282 -1057
3657a057K384J750j144k433j344J140K004J371n95k198k527N71K945J982q77k869
$$ -1057 1327 3077 1933 -500 -1844 -704 1300 2671 2076 -122 -2649 -2078 867 2849 1972 -897
3673h97j831L08K267J983J09k531k659J37K629K333o43k178j730Q1J761K028N35
$$ -897 -2728 -2420 -153 1830 1939 -592 -3251 -3114 -485 1848 1205 -973 -2703 -2622 -861 1167 1702
3690A702k138k114k2K240K067k33j925j496L8J797K173N6j984j998M19K340J724
$$ 1702 -436 -2550 -2572 -332 1735 1502 -423 -1919 -1881 -84 2089 2145 161 -1837 -1418 922 2646
3707B646l93j835j657j01J944K346j78k052k290M9K112J983J57j972k224m05J529
$$ 2646 2253 418 -1239 -1340 604 2950 2772 720 -1570 -1521 591 2574 2731 759 -1465 -1870 -341
3724c41K461K18k051k000m31J498K031L17j348k233r62J725K233N09j984k017
$$ -341 2120 2338 287 -1713 -2144 -646 1385 1702 354 -1879 -2841 -1116 1117 1626 -358 -2375
3740b375l20J566K035O27j750j911m74J615K066N17j828j574m63J326K343P28
$$ -2375 -2695 -1129 906 1533 -217 -2128 -2602 -987 1079 1596 -232 -1806 -2269 -943 1400 2128
3756B128j568k088n20J605K217Q36j347k169q11J462K079J036j338k247p90J221
$$ 2128 560 -1528 -2048 -443 1774 2610 1263 -906 -1717 -255 1824 2860 1522 -725 -1515 -294
3772b94K168Q32j221k052q45O36K483P11j223k148r44J119J855P59j018k119q66
$$ -294 1874 2706 1485 -567 -1412 -776 1707 2418 1195 -953 -1897 -778 1077 1836 818 -1301 -2167
3789b167J010J921Q25j330j671j107Q69K097P82r48j963j008R36K049J032j190
$$ -2167 -1157 764 1589 259 -1412 -2519 -1650 447 1229 281 -1682 -2690 -1754 295 1327 137
3805A37j836p14R19J869J155o03k121j105R14K195J293p96j815j286J184J921
$$ 137 -1699 -2413 -1494 375 1530 927 -1194 -2299 -1385 810 2103 1307 -508 -1794 -610 1311
3821A311J101m70j859j051O60J954R41l74j711j314O34J671J247p63j865j514
$$ 1311 2412 1942 83 -968 -308 1646 2587 2213 502 -812 -178 1493 2740 1977 112 -1402
3837a402P07J841R52p51j720j453L77J688J092m20k120j142L91J670J410r06j616
$$ -1402 -695 1146 2098 1347 -373 -1826 -1449 239 1331 911 -1209 -2351 -1960 -290 1120 214 -1402
3854a402j399M65J815J313l17j608j235K26J728J506m19j476r70K06J852J278
$$ -1402 -2801 -2336 -521 792 475 -1133 -2368 -2142 -414 1092 673 -803 -1773 -1567 285 1563
3870A563l51j262j189M34J634J264o2j438j500L39J557J701m14j488j326N5J657
$$ 1563 1212 -50 -1239 -805 829 2093 2031 593 -907 -568 989 2690 2276 788 -538 -483 1174
3887A174R87J0j536j629K33J403J111j96j717j249j80J512R61p6j380j559j75
$$ 1174 2161 2171 635 -994 -761 642 1753 1557 -160 -1409 -1589 -77 884 808 -572 -2131 -2306
3904b306J333J324J63j619j301q9J498J512j48j297j312O1J205J912j1j299j338
$$ -2306 -973 351 514 -1105 -2406 -2495 -997 515 367 -930 -2242 -2181 -976 936 925 -374 -1712
3921a712J83J448J481J01j129j206L39J367J139O0r96j180k34J243J490j14r39
$$ -1712 -1529 -81 1400 1501 372 -834 -495 872 2011 2071 1075 -105 -339 904 2394 2280 1341
3938A341j350k22R94J141J26j255j429j86Q49J351J89j262j539n28J144J129L73
$$ 1341 -9 -231 763 1904 2030 775 -654 -840 9 1360 1549 287 -1252 -1780 -636 493 866
3955H66j280j374j93Q46J369K85r83j271m70J181J250L68j018j183m10J170J578
$$ 866 -414 -1788 -1981 -1135 234 519 -464 -1735 -2205 -1024 226 594 -424 -1607 -2017 -847 731
3972G31M7q67j179k35J051J370L17o90j330l39J086J421M65r64j345j76R26J396
$$ 731 778 -89 -1268 -1503 -452 918 1235 545 -785 -1124 -38 1383 1848 884 -461 -637 289 1685
3990A685K81p56j493k78P72J332M44r93j167q16J075J242L85j116j367n47Q34
$$ 1685 1966 1210 -283 -561 211 1543 1987 994 -173 -989 86 1328 1713 597 -770 -1317 -483
4007d83J299M14j015j383m97Q33J073O34r23j528m23R57J099N86q37j312l42O32
$$ -483 816 1230 215 -1168 -1665 -832 241 875 -48 -1576 -1999 -1042 57 643 -194 -1506 -1848 -1216
4025a216J377N40l48j431o59Q43J424Q51r41j247l98R01J316O54q31j119o16O22
$$ -1216 161 701 353 -1078 -1737 -894 530 1381 440 -807 -1205 -304 1012 1666 835 -284 -900 -278
4043b78J482P98q87j315n10P95J122P72o09j337p60M44J264N39n42j391p27O99
$$ -278 1204 2002 1115 -200 -710 85 1207 1979 1370 33 -727 -283 981 1520 978 -413 -1140 -441
4061d41J155N32m48j577p05M72J592L90j047r11n94J85J217J101o12j453r34R39
$$ -441 714 1246 798 -779 -1484 -1012 580 970 -77 -988 -1582 -1397 -180 921 309 -1144 -2078 -1139
4079a139J322M42l11j248o44L86J400Q47l21j666o87Q36J317P27j59j258j225
$$ -1139 183 625 314 -934 -1578 -1192 208 1055 734 -932 -1619 -783 534 1261 1102 -156 -1381
4096a381N62J652J072n59j465n59N24J007Q90p2j362j171L55J339R04o51j346
$$ -1381 -819 833 1905 1346 -119 -678 -154 853 1743 1671 309 -862 -507 832 1736 1085 -261
4113b61m74J68Q87R34J67j563j321K75J541J032q90j111p26Q8R68J107pj501j283
$$ -261 -735 -567 320 1254 1421 -142 -1463 -1188 353 1385 495 -616 -1342 -1254 -286 821 814 -687 -1970
4132a970O28J216R27n11r47q63R1J088J462j35j808r93R18J323K85O2p52r34k88
$$ -1970 -1342 -126 801 290 -657 -1520 -1429 -341 1121 986 -822 -1815 -897 426 711 773 21 -913 -1201
4151a201J347J667k29j804q19P19Q30O32J85n04j706k84J647J660o48j446q32
$$ -1201 146 1813 1584 -220 -1039 -320 510 1142 1327 823 -883 -1167 480 2140 1492 46 -786
4168g86J86P66J054L22q48j936k0J675J175m82j111n46m39N94J205O94j416j733
$$ -786 -600 166 1220 1542 694 -1242 -1262 413 1588 1106 -5 -551 -990 -396 809 1503 87 -1646
4186a646K85J576Q12o60q52o54o44Q00J403R18k079j628O62J356Q94k57l03j157
$$ -1646 -1361 215 1027 367 -485 -1139 -1783 -983 420 1338 -741 -2369 -1707 -351 543 286 -17 -1174
4204a174o82J055K065K78j781j110L47J107P65P15j16j833j060J587K037j39j376
$$ -1174 -1856 -801 1264 1542 -239 -1349 -1002 105 870 1585 1469 -364 -1424 163 2200 2061 685
4221F85p82k0L35Q60R76m01k065j048J705J383k46j373l80j68j68J015R68n46
$$ 685 -97 -117 218 1078 2054 1653 -412 -1460 245 1628 1382 9 -371 -539 -707 308 1276 730
4239G30k302m33J560J256o79n79m16j058K37J720J176j131k180O6J702N89kJ07
$$ 730 -1572 -2005 -445 811 132 -447 -863 -1921 -1684 36 1212 81 -2099 -2033 -331 258 256 363
4257C63j093j190L40K447J034j601j732L47J047P49N63J73j217j809P55K408P04
$$ 363 -730 -1920 -1580 867 1901 300 -1432 -1085 -38 711 1274 1447 230 -1579 -824 1584 2288
4274B288j370j058K0L15M84J041O32j796j899J188J921j08j043n71l73l41N76
$$ 2288 918 -140 -120 195 679 1720 2352 556 -1343 -155 1766 1658 615 44 -329 -670 -94
4291i4J458k44k214j021J566J414o62p10m81m65m73J102J853p60k485n66J790
$$ -94 1364 1120 -1094 -2115 -549 865 203 -507 -988 -1453 -1926 -824 1029 269 -2216 -2782 -992
4308i92J255O2k35m58j406m29K242K048r94k074l74J070N11P67J062p85k262l32
$$ -992 263 325 90 -368 -1774 -2203 39 2087 1093 -981 -1355 -285 226 993 2055 1270 -992 -1324
4326a324K307J456j184q46mk49j31R90R96p96k031L30K017J36j463m37K74j53
$$ -1324 983 2439 1255 409 405 156 25 1015 2011 1215 -816 -486 1531 1667 204 -233 41 -112
4344a12Q1Q75L27j856j614J218K244j10j185o66p79n92J147K527J0k692j709J092
$$ -112 -31 844 1171 -685 -2299 -1081 1163 1053 -132 -798 -1577 -2169 -1022 1505 1515 -1177 -2886 -1794
4362a794J461O78N11n09j727j245J384K590K8j670o42L56J38K15J158O60j533
$$ -1794 -333 345 856 347 -1380 -2625 -1241 1349 1377 -293 -935 -579 -441 -226 932 1592 59
4379E9j126J409J207o87j089N08O42j88q0O77m17j635K45J961P49j314j614o5
$$ 59 -1067 342 1549 862 -227 281 923 735 655 1332 915 -720 -475 1486 2235 921 -693 -758
4397g58J54Q01J241N77j902k228J86K100J050o83o67r96j336K24K693J302j770
$$ -758 -604 197 1438 2015 113 -2115 -1929 171 1221 538 -129 -1125 -2461 -2237 456 1758 -12
4414a2j989Q3R85O02K00O77n75j743Q8K115N46j066q67O66M19r7L04L79p72q31
$$ -12 -2001 -1918 -933 -331 -131 546 -29 -1772 -1684 431 977 -89 -956 -290 129 32 336 715 -57 -888
4434h88J326J440n31j527m69J016M37N33O67o72k113j86J596J630m65j536n61
$$ -888 438 1878 1347 -180 -649 367 804 1337 2004 1332 -781 -967 629 2259 1794 258 -303
4451c03m88N1J302J286q42k171p36J343J167l2m13n21q68n88J471J332o76j564
$$ -303 -791 -740 562 1848 1006 -1165 -1901 -558 609 577 164 -357 -1225 -1813 -342 990 314 -1250
4469a250k80P82O18j29J12k85r09K40J581N62j305j055N92P37L92J56Q9r21j140
$$ -1250 -1530 -748 -130 -259 -147 -432 -1341 -1101 480 1042 -263 -1318 -726 11 403 559 648 -273 -1413
4488a413P17K017L35j358r06M33M06M43R40N4j429j276J003J508J95j066n59k95
$$ -1413 -696 1321 1656 298 -608 -175 231 674 1614 1668 239 -1037 -34 1474 1669 603 44 -251
4506b51n4O03Q35j51j368r40Q60Q42L47p18n32p68M3J170R24p64j290k85O04Q25
$$ -251 -305 298 1133 982 -386 -1326 -466 376 723 5 -527 -1295 -1252 -82 842 78 -1212 -1497 -893 -68
4526f8L96r4r12o63J29J400R32p41j136n89P16J123K85Q6r62q39P6J498N46m09
$$ -68 328 234 -678 -1341 -1212 188 1120 379 -757 -1346 -630 493 778 864 -98 -937 -861 637 1183 774
4546G74j087k73K81O80Q68j92r27j111N40J230M04k49r52m23N6Q77Q52O1j423
$$ 774 -313 -586 -305 375 1243 1051 124 -987 -447 783 1187 938 -14 -437 -381 496 1348 1409 -14
4565a4j114M02J283L74l17q51n54j66R14Q72k8j352r00L26J342N36l63r15o24
$$ -14 -1128 -726 557 931 614 -237 -791 -957 -43 829 801 -551 -1451 -1125 217 753 390 -525 -1149
4584a149r4R66J031l52j086o64K57R99P92k00o39j036J4J267J100l65p99p00M
$$ -1149 -1243 -277 754 402 -684 -1348 -1091 -92 700 500 -139 -1175 -1161 106 1206 841 42 -658 -654
4603f54R62Q25J13p78j223K0J315J141l99j028r93L18P29Q93L5o95j186k22J017
$$ -654 308 1133 1246 468 -755 -735 580 1721 1322 294 -699 -381 348 1241 1276 581 -605 -827 190
4622A90J003l6j191q36o4R45R79j52o75j308Q4P82Q54M42r85j287l13J197J102
$$ 190 1193 1157 -34 -870 -934 11 990 838 163 -1145 -1061 -279 575 1017 32 -1255 -1568 -371 731
4641G31R6j159j109k8Q99R26L66p44j205j80R73J135L74q98j199j49R72J088L69
$$ 731 827 -332 -1441 -1469 -570 356 722 -22 -1227 -1407 -434 701 1075 177 -1022 -1171 -199 889 1258
4660A258p25j384J60P32J147L15p74j379L7M34J321O56r57j292l89R88Q36P08
$$ 1258 533 -851 -691 41 1188 1503 729 -650 -613 -179 1142 1798 841 -451 -840 148 984 1692
4678A692q45j009o85N92J103N90r56j281m14Q43J059K04n72j205n03N55R80P28
$$ 1692 847 -162 -847 -255 848 1438 482 -799 -1213 -370 689 893 321 -884 -1387 -832 148 876
4696H76q05j259o60O87J243M85n96j342m59P53J228Q43o37j293m10N25J164R60
$$ 876 71 -1188 -1848 -1161 82 567 -29 -1371 -1830 -1077 151 994 357 -936 -1346 -821 343 1303
4714A303m76j215p91O92J622L45k46j127m62K11J017R34j41j400q94L50J384Q84
$$ 1303 827 -388 -1179 -487 1135 1480 1234 107 -355 -144 873 1807 1666 266 -628 -278 1106 1990
4732A990p97j121q11J08R49Q96l05j361r31M23J002O38L5j364j172J25J578R02
$$ 1990 1193 72 -739 -631 318 1214 909 -452 -1383 -960 42 680 715 -649 -1821 -1696 -118 784
4750G84l67j404n74M05Q04R36J08j028j394N2J720J206o41j234l27mO37J090M53
$$ 784 417 -987 -1561 -1156 -352 584 692 -336 -1730 -1678 42 1248 607 -627 -954 -958 -321 769 1222
4769A222j028j461k7J553R84j53o19j042j28R19J189N53j426j167J46J253N82
$$ 1222 194 -1267 -1294 259 1243 1090 471 -571 -699 220 1409 1962 536 -631 -485 768 1350
4786A350K67n24j035r12Q56J714r6j442j044L35Q03L37O4j94j547r43J103J857
$$ 1350 1617 1093 58 -854 2 1716 1620 178 -866 -531 272 609 673 479 -1068 -2011 -908 949
4804I49l98j288j051P7N59J051O89o90j633o44J344J551Q4p81q01m06L51J414
$$ 949 551 -737 -1788 -1711 -1152 -101 588 -102 -1735 -2379 -1035 516 600 -181 -982 -1388 -1037 377
4822C77J374q12j749m33J240R35N0j80k82q73j93J276J319p98j828J33Q79O88
$$ 377 1751 939 -810 -1243 -3 932 982 802 520 -353 -546 730 2049 1251 -577 -444 435 1123
4840A123l27M3n84q77N8J554Q03j412j259n1R42O28N15m0j472j540Q34J930O66
$$ 1123 796 839 255 -622 -564 990 1793 381 -878 -929 13 641 1156 1116 -356 -1896 -1062 868 1534
4859A534j598r73k67j36P27J606M84k244j597O28J983N32o49l88n14r26M57K036
$$ 1534 -64 -1037 -1304 -1440 -713 893 1377 -867 -2464 -1836 147 679 30 -358 -872 -1798 -1341 695
4877F95O98j517j218O76R16M8J84L77n42p90N67J626m26j338l0J183J29m10L15
$$ 695 1393 -124 -1342 -666 250 298 482 859 317 -473 94 1720 1294 -44 -74 1109 1238 828 1143
4896A143k26j268l78J758J190j391j621mM94N8R74N88q83k332n30K298J382p62
$$ 1143 917 -351 -729 1029 2219 828 -793 -797 -303 -245 729 1317 434 -1898 -2428 -130 1252 490
4914D90j235k04n78l7J507J745j177k093l25J392O42k07M59j18j329m03J633J135
$$ 490 -745 -949 -1527 -1564 -57 1688 511 -1582 -1907 -515 127 -80 379 261 -1068 -1471 162 1297
4932A297j338r33O66N50k59l2P88l48r77J70J855P3j685l73J001M42m80M11O13
$$ 1297 -41 -974 -308 242 -17 -49 739 391 -586 -416 1439 1512 -173 -546 455 897 417 828 1441
4951A441j408j186J172K029k60j696n06K27j06N74J219k15j931j097J384J091
$$ 1441 33 -1153 19 2048 1788 92 -414 -187 -293 281 1500 1285 -646 -1743 -359 732
4967G32m78k87J7q65o60Q00J902m83j970l42J072L66l93L86Q08j582p63J486J408
$$ 732 254 -33 -16 -881 -1541 -741 1161 678 -1292 -1634 -562 -196 -589 -203 605 -977 -1740 -254 1154
4986A154n63j390k6R34j23qR59J15j595l96J595R24j100m28K22K99q34M98J105
$$ 1154 591 -799 -825 109 -14 -22 937 1052 -543 -939 656 1580 480 52 274 573 -261 237 1342
5005A342o72j371L30J452r6j071JO75n57m68J117O64j445j296J067J208m15q52
$$ 1342 670 -701 -371 1081 985 -86 -85 590 33 -435 682 1346 -99 -1395 -328 880 465 -387
5023c87M20j50j260N81J670K53j731r11P61P59l50M45L92j072j324Q32J783j70
$$ -387 33 -117 -1377 -796 874 1127 -604 -1515 -754 5 -345 100 492 -580 -1904 -1072 711 541
5041E41j276K26J50k93M5J108P09j454j028J186R13n54m02P19J55r20k90J568
$$ 541 -735 -509 -359 -652 -607 501 1210 -244 -1272 -86 827 273 -129 590 745 -175 -465 1103
5059A103Q5j235m8J139J1j232j5P46k2q36P08O91n25j460N27J156l13o17L60j89
$$ 1103 1188 -47 -95 1044 1055 -177 -192 554 532 -304 404 1095 570 -890 -363 793 480 -137 223 34
5079C4q85j61J289N02j116p78N79L46l83J23J049n21j445J1J478L16q74M12K74
$$ 34 -851 -1012 277 779 -337 -1115 -536 -190 -573 -450 599 78 -1367 -1356 122 438 -436 -24 250
5098B50o99q42J230J070n84j214L39J092n17m81P22M40r32l43R19N11q65k92R04
$$ 250 -449 -1291 -61 1009 425 -789 -450 642 125 -356 366 806 -126 -469 450 961 96 -196 708
5117G08J75p22k21Q70j78q82K57R05m08q24J55P15l79m64M97N34r03q34R49O10
$$ 708 883 161 -60 810 632 -250 7 912 504 -320 -165 550 171 -293 204 738 -165 -999 -50 560
5137E60o15n78L08N52j109N6J019M7q97k23O15L64o84K19M46k47p04L64J022l12
$$ 560 -55 -633 -325 227 -882 -826 193 240 -657 -880 -265 99 -585 -366 80 -167 -871 -507 515 203
5157B03p83K85O72m00l29O51L10k71n83M50Q70p36n23R71N0q77j2O67M12q73m01
$$ 203 -580 -295 377 -23 -352 299 609 338 -245 205 1075 339 -184 787 837 -40 -52 615 1027 154 -247
5178b47O84J14m19k9M30N8r64J41Q55m26k52j30L98k11n21K83P38q64k68L08M08
$$ -247 437 551 132 103 533 591 -373 -232 623 197 -55 -185 213 2 -519 -236 502 -362 -630 -322 86
5199H6l33l80L05L15n44l62J185jr86k1N97K4k54n5M42j93p23M93O70K05p05J
$$ 86 -247 -627 -322 -7 -551 -913 272 271 -715 -736 -139 -115 -369 -424 18 -175 -898 -405 265 470 -235 -234
5221b34K13R1Q0J46J95k92l13M08P38k69l33j21L52m00J00O53k14p71q8M66J43
$$ -234 -21 70 150 296 491 199 -114 294 1032 763 430 309 661 261 361 1014 800 29 -59 407 550
5242E50j91k11J17m41j63L67L20j79p93rL86J22k04L8P2m12j37M48M22m37l75
$$ 550 359 148 265 -176 -339 28 348 169 -624 -633 -247 -125 -329 -291 -219 -631 -768 -320 102 -335 -710
5263g10K8J24K28L41l6l86r5J3O73K49m07k62K6L23O7J93M47o20p20O41N57K8
$$ -710 -682 -558 -330 11 -25 -411 -506 -493 180 429 22 -240 -214 109 176 369 816 196 -524 117 674 702
5285G02j17M2m97l8J43O26L2n02n32J37L68L37j46m45k70k78K18N06M5n17m94
$$ 702 585 627 130 92 235 861 893 391 -141 -4 364 701 555 110 -160 -438 -220 286 331 -186 -680
5306f80q6J33M74J04j58o37k07N21L43J62o47j09M9N5K87N26j63o31j50L67P26
$$ -680 -766 -633 -159 -55 -213 -850 -1057 -536 -193 -31 -678 -787 -738 -683 -396 130 -33 -664 -814 -447 279
5327B79j0l44j56OR1M97N44k68o25r1L07O79J40k07n72l7L5N10J51j15o39l13
$$ 279 269 -75 -231 -225 -134 363 907 639 14 -77 230 909 1049 842 270 233 268 778 929 814 175 -138
5349a38K15M51Q5j00m85p24K20O47L69l80n11k74j48N69L04k12m20m48L1N92O79
$$ -138 77 528 613 513 28 -696 -476 171 540 160 -351 -625 -773 -204 100 -112 -532 -980 -949 -357 322
5370C22n53o45p5K32N63L09n6m95l97J64P24K62J7k79n30K98O13L58M4o08l84
$$ 322 -231 -876 -951 -719 -156 153 97 -398 -795 -631 93 355 372 93 -437 -139 474 832 876 268 -116
5391a16K18L51M88k05l41k14k66L74N53n5n92n16J41M56K52J63n91n09k68O36
$$ -116 102 453 941 736 395 181 -85 289 842 787 195 -321 -180 276 528 691 100 -409 -677 -41
5411d1N82m9o26m95J09J74L78L55m03n70j78M57M92M1n44k00k18K15M61J52k76
$$ -41 541 492 -134 -629 -520 -346 32 387 -16 -586 -764 -307 185 226 -318 -518 -736 -521 -60 92 -184
5432a84n57K18L41K48k6j58k37k55J60Q05L75o92n52J08Q12J68j1q9l00n03M47
$$ -184 -741 -523 -182 66 40 -118 -355 -610 -450 355 730 38 -514 -406 406 574 563 474 174 -329 118
5453A18N93L32m68n56J52Q0K30L00n9p90o32O05M58J31o80n4k1k52R2N89J07q10
$$ 118 711 1043 575 19 171 251 481 781 722 -68 -700 -95 363 494 -186 -240 -261 -513 -421 168 275 -535
5475e35o14N74N52Mm80J68J09m43L43O80N9j141jP45K60M1l30L10n27l35R02O79
$$ -535 -1149 -575 -23 -19 -499 -331 -222 -665 -322 358 417 -724 -725 20 280 321 -9 301 -226 -561 341 1020
5497A020n82q85k7O53lJ77N14l93q59k49J128N91r61m23O25rm16L33O65k01j148
$$ 1020 438 -447 -474 179 176 353 867 474 -385 -634 494 1085 124 -299 326 317 -99 234 899 698 -450
5518d50Q4J074M4r22l31P72k60k39M59N10p09j173Q54O77j99q10R4J14l21K90
$$ -450 -366 708 752 -170 -501 271 11 -228 231 741 32 -1141 -287 390 191 -619 -525 -411 -732 -442
5538d42Q61J30j291o90J059M55k51M0K99m40j008N97J362k37r02KO40r1l79O16
$$ -442 419 549 -742 -1432 -373 82 -169 -129 170 -270 -1278 -681 681 444 -458 -456 184 93 -286 330
5558C30N89o46q91P86P81n85n75M33Q34r55j36O50p7r16J93J194K4j160m12L78
$$ 330 919 273 -618 168 949 364 -211 222 1056 101 -35 615 538 -378 -185 1009 1033 -127 -539 -161
5578a61J46k81Q06M32r65j430N11J531l9o70J53J72j027l10J377P75r25r71L98
$$ -161 -15 -296 510 942 -23 -1453 -942 589 550 -120 33 205 -822 -1132 245 1020 95 -876 -478
5597d78M51n21l2J066R7j218m33J196J59p32Q3R63q9j034M8R02m49l79R05M16
$$ -478 -27 -548 -580 486 583 -635 -1068 128 287 -445 -362 601 512 -522 -474 428 -21 -400 505 921
5617I21p96j117P88Q83k15m19P93l58j054k75J653Q26j275r28P17J61o33L72J331
$$ 921 125 -992 -204 679 464 45 838 480 -574 -849 804 1630 355 -573 144 305 -328 44 1375
5636A375n82j577K06J153l8j003O13M64q35r44Q07R07q45o18O09Q44j037n98P89
$$ 1375 793 -784 -578 575 537 -466 147 611 -224 -1168 -361 546 -299 -917 -308 536 -501 -1099 -310
5655c10O27p51j88Q76q7j360J28J449M58j053l34Q22l72p06P91J471o11j620J08
$$ -310 317 -434 -622 254 167 -1193 -1065 384 842 -211 -545 277 -95 -801 -10 1461 850 -770 -662
5674f62J241J8o11N68N51j183q66J043J411j005q80O79K25n45k45J078Kj401j4
$$ -662 579 597 -14 554 1105 -78 -944 99 1510 505 -375 304 529 -16 -261 817 819 -582 -596
5693e96J245J47j386K41J009n10p10M48O95o76r90P81J298q66r91L47O05o64k69
$$ -596 649 796 -590 -349 660 150 -560 -112 583 -93 -1083 -302 996 130 -861 -514 91 -573 -842
5712h42J212K91j380p96J292Q51q22k26O36m65j036N23J799k35j585M7J162J1
$$ -842 370 661 -719 -1515 -223 628 -194 -420 216 -249 -1285 -762 1037 802 -783 -736 426 437
5730D37o91O80O90j069q16R28J536j082j062N91N14o84k33J035K20j514m92J627
$$ 437 -254 426 1116 47 -769 159 1695 613 -449 142 656 -28 -261 774 994 -520 -1012 615
5748F15N64j304n67O83K5o21M09Q97n29j567L50J495J4r66J25L24m77m19J239
$$ 615 1179 -125 -692 -9 16 -605 -196 701 172 -1395 -1045 450 464 -502 -377 -53 -530 -949 290
5767B90Q41j654r94Q56J288m46m02O00j81j109J43J534L97j404o94J155J74n68
$$ 290 1131 -523 -1517 -661 627 181 -221 379 198 -911 -768 766 1163 -241 -935 220 394 -174
5785a74K38Q14p72j310Q02J637k41j423K45N36p6l02R38K8j222n11R44J135p19
$$ -174 64 878 106 -1204 -402 1235 994 -429 -184 352 276 -26 912 940 -282 -793 151 1286 567
5804E67o61L40j2o88M77J088l46j683k58J421K56p82o8R5l77p10J309P83o75j472
$$ 567 -94 246 234 -454 23 1111 765 -918 -1176 245 501 -281 -349 -254 -631 -1341 -32 751 76 -1396
5824a396J46J522j59n28N65j75q86j1J287Q54j329q49M50P56l46O16M24n40j410
$$ -1396 -1250 272 113 -415 150 -25 -911 -922 365 1219 -110 -959 -509 247 -99 517 941 401 -1009
5843a009M70J790O0j237k36K37L5m5Q64M69j370j328J104J295j40p74l45r3j86
$$ -1009 -539 1251 1311 74 -162 75 110 65 929 1398 28 -1300 -196 1099 959 185 -160 -253 -439
5862d39O7J204L36j798m89Q00R32j21q32N87o57o62O13J316k12j659j81P01N55
$$ -439 -372 832 1168 -630 -1119 -319 613 492 -340 247 -410 -1072 -459 857 645 -1014 -1195 -494 61
5881F1jK59l43p88m52J203J122n21j324J80M75K84J06P19m97j442%J511Q49q85
$$ 61 60 319 -24 -812 -1264 -61 1061 540 -784 -604 -129 155 261 980 483 -959 -959 552 1401 516
5901E16n21q8J7J53N87P29q36j441K94J090O35o89l72k29m26J51J165N47j239
$$ 516 -5 -93 -76 77 664 1393 557 -884 -590 500 1135 446 74 -155 -581 -430 735 1282 43
5920D3j006R3Q84K65Ok97n21n78M55J467j88j028p70L37O33K41M93l88q71n72
$$ 43 -963 -870 14 279 285 -12 -533 -1111 -656 811 623 -405 -1175 -838 -205 36 529 141 -730 -1302
5940a302Q83J053K15j072o61J19N84N47N12k81j136l34P20J118k7o37l72l42K50
$$ -1302 -419 634 849 -223 -884 -765 -181 366 878 597 -539 -873 -153 965 938 301 -71 -413 -163
5959a63P78P71n80j365k88Q16J027L7n31n49n28n4J128O53n52j292k31N77Q04
$$ -163 615 1386 806 -559 -847 -31 996 1033 502 -47 -575 -629 499 1152 600 -692 -923 -346 458
5978D58K9j01p59n18j6J033R26o80j042l45L11Q80N66k85p76p15K58J011M64l13
$$ 458 487 386 -373 -891 -907 126 1052 372 -670 -1015 -704 176 742 457 -319 -1034 -776 235 699 386
5998C86p92n07L22P96N95Mj107p57M88R71N67m55o57n50L00P22O13J44j136o82
$$ 386 -406 -913 -591 205 800 804 -303 -1060 -572 399 966 511 -146 -696 -396 326 939 1083 -53 -735
6018g35L8J131P37k92p40o43O7P27O86J6q62j011K86O67N49J45p73p95j81Q61
$$ -735 -697 434 1171 879 139 -504 -437 290 976 992 130 -881 -595 72 621 766 -7 -802 -983 -122
6038a22Q87k49q96o19K4N63Q02M9m14j010k08Q90Q09J0q25n41k21O58R32M6m26
$$ -122 765 516 -380 -999 -975 -412 390 439 25 -985 -1193 -303 506 516 -309 -850 -1071 -413 519 565 139
6059A39p82j92Q22P95P7n54r05r2N28R65L37o18q80n6M84N95M76m63p07o01N91
$$ 139 -643 -835 -13 782 859 305 -600 -692 -164 801 1138 520 -360 -416 68 663 1139 676 -31 -632 -41
6080d1P10N38q51p20j14K94O66J88l13o35p02N08Q45M31p07n14m96K03Q56L07
$$ -41 669 1207 356 -364 -478 -184 482 670 357 -278 -980 -472 373 804 97 -417 -913 -710 146 453
6100D53j41q42o63M54Q45M48m79o85k69R4O91Q66l10r80k93K94R42K15j03m94
$$ 453 312 -530 -1193 -739 106 554 75 -610 -879 -785 -94 772 462 -518 -811 -517 425 640 537 43
6120D3n54j31P54J061m89j010m22O67P03R6K11o05q20L6P87Q20l16q56n63M41
$$ 43 -511 -642 112 1173 684 -326 -748 -81 622 718 929 324 -496 -460 327 1147 831 -25 -588 -147
6140a47L68L27K29p21q53L3J148M31n19n61j69j90K96O03J94p28r46J04J065L27
$$ -147 221 548 777 56 -797 -764 384 815 296 -265 -434 -624 -328 275 469 -259 -1205 -1101 -36 291
6160B91l65m37j8k87K40R05M31p84j107L41J035K50k89k20j85m29L64J223J3r29
$$ 291 -74 -511 -529 -816 -576 329 760 -24 -1131 -790 245 495 206 -14 -199 -628 -264 959 972 43
6180D3n39M78L07oN56j27q75n34N54J316k42j026l69M24p2J14P78j94j156m65
$$ 43 -496 -18 289 283 839 712 -163 -697 -143 1173 931 -95 -464 -40 -112 2 780 586 -570 -1035
6200a035J074P07k78p04j22K00l36J22J062l29j093k07Q62L47j77l70J27n15k24
$$ -1035 39 746 468 -236 -358 -158 -494 -372 690 361 -732 -939 -77 270 93 -277 -150 -665 -889
6219h89P52P74n22j213K72R45J45m58L95n4p08k59J387N59r59q90Q84J17k08O5
$$ -889 -137 637 115 -1098 -826 119 264 -194 201 147 -561 -820 567 1126 167 -723 161 278 70 135
6239A35O30l98r21K06J361J55j025n70N60J15l82L24Q72r32j266P12J133l62p08
$$ 135 765 367 -554 -348 1013 1168 143 -427 133 248 -134 190 1062 130 -1136 -424 709 347 -361
6258c61J53K41q36j03J205N32j280p23J042M93n57m86O88M1r67J76J486j86j413
$$ -361 -208 33 -803 -906 299 831 -449 -1172 -130 363 -194 -680 8 49 -918 -742 744 558 -855
6277h55R4J124J12q74J64N83n25p13J060R55p51j194M24Q83l74m63J024J28j375
$$ -855 -761 363 475 -399 -235 348 -177 -890 170 1125 374 -820 -396 487 113 -350 674 802 -573
6296e73l87J437Q87j222o74R68O8r80M36J281n23j451K57J204j76j013M57P22
$$ -573 -960 477 1364 142 -532 436 504 -476 -40 1241 718 -733 -476 728 552 -461 -4 718
6314G18p77q69P11J145j023r83Q51Q35p09r48P84Q81j202m09J349J56j345l07
$$ 718 -59 -928 -217 928 -95 -1078 -227 608 -101 -1049 -265 616 -586 -995 354 510 -835 -1142
6332a142J548K32j229J79Q10M5j480O56J689m96j494L19J139l48r74O28J064r23
$$ -1142 406 638 -591 -412 398 443 -1037 -381 1308 812 -682 -363 776 428 -546 82 1146 223
6350B23j264J202Q74q15p38P79P40j213m02J258J81j183n6J194J98j616j93J207
$$ 223 -1041 161 1035 220 -518 261 1001 -212 -614 644 825 -358 -414 780 978 -638 -831 376
6368C76L82j229J15J209p89j102O70J393q87j105O03O86m27q35J012Q62j260q86
$$ 376 758 -471 -356 853 64 -1038 -368 1025 138 -967 -364 322 -105 -940 72 934 -326 -1212
6386a212J115Q43j250k61R28K20j103j56J475O5j440K2J340J13j272J18J194k55
$$ -1212 -97 746 -504 -765 163 383 -720 -876 599 664 -776 -754 586 699 -573 -455 739 484
6404D84j081P42R94o80j346Q42J185o12p99L39O60r56k26J107O31j518o44J099
$$ 484 -597 145 1139 459 -887 -45 1140 528 -271 68 728 -228 -454 653 1284 -234 -878 221
6422B21L95q78j42J194k94j576K63J531P3j362j58J007j53j065P30R58o76j097
$$ 221 616 -262 -404 790 496 -1080 -817 714 787 -575 -733 274 121 -944 -214 744 68 -1029
6440a029O34J131q16r96P58Q03q02m56Q11M29j130l48J176O65j002n29P84K24
$$ -1029 -395 736 -80 -1076 -318 485 -317 -773 38 467 -663 -1011 165 830 -172 -701 83 307
6458C07p70L96J174n96j253O6J476K06j055L44M54n41q53J112R36j144r05L27
$$ 307 -463 -67 1107 511 -742 -676 800 1006 -49 295 749 208 -645 467 1403 259 -646 -319
6476c19J067k82p08O05J58j157k80J412N41j063q21N54M22m61J90M70k41j366
$$ -319 748 466 -242 363 521 -636 -916 496 1037 -26 -847 -293 129 -332 -142 328 87 -1279
6494a279M84J257j58j032O4P63m27l71J037J63p60o86P46J004n69p88L57L27m22
$$ -1279 -795 462 304 -728 -664 99 -328 -699 338 501 -259 -945 -199 805 236 -552 -195 132 -290
6513b90J0J057j13j235l08J358N12m87m40K01k66m86R92Q08n02j286j59J058K01
$$ -290 -280 777 664 -571 -879 479 991 504 64 265 -1 -487 505 1313 811 -475 -634 424 625
6532F25l35L22L1j133m83J191Q39o41r47L18J87j13J71M03r8j218j09J047M65
$$ 625 290 612 643 -490 -973 218 1057 416 -531 -213 -26 -139 32 435 337 -881 -990 57 522
6551E22q06m28J91J30j73M00L29m15p02J59J150J11p57j67J67K0K63R38M2j218
$$ 522 -284 -712 -521 -391 -564 -164 165 -250 -952 -793 357 468 -289 -456 -289 -269 -6 932 974 -244
6571b44n96P17R16p4m11j7l35n32O54J201jj302n82N21N36j37N68k26p20q39O14
$$ -244 -840 -123 793 719 308 291 -44 -576 78 1279 1278 -24 -606 -85 451 314 882 656 -64 -903 -289
6592b89J284l49q22m69K30K3M66L23k53p44m83P91O65j78n26m08j8K01N72N15
$$ -289 995 646 -176 -645 -415 -392 74 397 144 -600 -1083 -292 373 195 -331 -739 -757 -556 16 531
6612E31o80o18o7Q05O12k25n31j66k82M53O59M17n08r78kQ37N38k07k74j99n43
$$ 531 -149 -767 -834 -29 583 358 -173 -339 -621 -168 491 908 400 -578 -580 257 795 588 314 115 -428
6633d28J59J220L22p62p64j39M22N01K34j74p21n36L84Q60J00k91o63k17J27N65
$$ -428 -269 951 1273 511 -253 -392 30 531 765 591 -130 -666 -282 578 678 387 -276 -493 -366 199
6653A99M92l72o64q55N56R11J47m78n43j95K32L17O33p6r72l55M23Q73J00r2q00
$$ 199 691 319 -345 -1200 -644 267 414 -64 -607 -802 -570 -253 380 304 -668 -1023 -600 273 373 281 -519
6674e19l49L89P50N91k97p36l25K73N21O00P8r68n87K73P93P94p16p29l33J75
$$ -519 -868 -479 271 862 565 -171 -496 -223 298 898 976 8 -579 -306 487 1281 565 -164 -497 -322
6694c22Q79K28J55p33q81J53Q66L27k51q05l83J98M18N18J70p45o37O7P07P64
$$ -322 557 785 940 207 -674 -521 345 672 421 -384 -767 -569 -151 367 537 -208 -845 -778 -71 693
6714F93l30o41m74J25N45O58K4p54p77J09N98Q61n1o96n82k48P32R25j55m39r38
$$ 693 363 -278 -752 -627 -82 576 600 -154 -931 -822 -224 637 586 -110 -692 -940 -208 717 562 123 -815
6735h15K21O53P39j05m91n05l46O05J090K0o89o15j76P05M85J18n09p82l01Q59
$$ -815 -594 59 798 693 202 -303 -649 -44 1046 1066 377 -238 -414 291 776 894 385 -397 -698 161
6755A61N32R3o12q16p9M91Q22k2n95r42j63P80P37J43o02o11j83J09J143R6k60
$$ 161 693 786 174 -642 -721 -230 592 570 -25 -967 -1130 -350 387 530 -72 -683 -866 -757 386 482 222
6776B22r25k47P74P08L05o30p87l8N2J004N14o51q90j57N85P25L41l87q90m19
$$ 222 -703 -950 -176 532 837 207 -580 -618 -566 438 952 301 -589 -746 -161 564 905 518 -372 -791
6796g91N50Q25K59l85o83m47L34P55L85j64q14p66P02P47K90l02p09m08K05P35
$$ -791 -241 584 843 458 -225 -672 -338 417 802 638 -176 -942 -240 507 797 495 -214 -622 -417 318
6816C18N93k74r41m42L77P04L49k61p66n33L70N68O06j81j029k78K24P68J65J46
$$ 318 911 637 -304 -746 -369 335 684 423 -343 -876 -506 62 668 487 -542 -820 -596 172 337 483
6836D83o70q24L14P80P38m62n78m42L1Q23N31N7p58p15P8Q99O44k09p87o41L53
$$ 483 -187 -1011 -697 83 821 359 -219 -661 -630 193 724 781 23 -692 -614 285 929 720 -67 -708 -355
6857c55O88L71K91r16q68N4J013N33l42n04m96k17O56P20J86p42q23J78P91N01
$$ -355 333 704 995 79 -789 -735 278 811 469 -35 -531 -748 -92 628 814 72 -751 -573 218 719
6877G19o4m49p63k09L91J133K59j199n50k3O65M56J1k63p73m39N83J028J80q43
$$ 719 655 206 -557 -766 -375 758 1017 -182 -732 -755 -90 366 377 114 -659 -1098 -515 513 693 -150
6897a50o94J35L57O78K61r1j221n9O27R36n4l52n41l73K16Q63O91p85r73j95R53
$$ -150 -844 -709 -352 326 587 496 -725 -784 -157 779 725 373 -168 -541 -325 538 1229 444 -529 -724 229
6918B29O82J1m04p06o37M66J042L84p03q16k26M93Q76M8l90q30m48K46J013M50
$$ 229 911 922 518 -188 -825 -359 683 1067 364 -452 -678 -185 691 739 349 -481 -929 -683 330 780
6938G80m17q55j81J16O77N17k51m21r16N22P93K86o25n13j57K38L80O06m6r18
$$ 780 363 -492 -673 -557 120 637 386 -35 -951 -429 364 650 25 -488 -645 -407 -27 579 533 -385
6958c85m92N42Q18L00o42m78k25m9P21Q24j18j098m61N05P98K27q8m85n95j91
$$ -385 -877 -335 483 783 141 -337 -562 -611 110 934 816 -282 -743 -238 560 787 699 214 -381 -572
6978e72Q02P99j12r67n20L55M28M74M9m51q68k01R42O39k60r85k22L47J79M24
$$ -572 230 1029 917 -50 -570 -215 213 687 736 285 -583 -784 158 797 537 -448 -670 -323 -144 280
6998B80K95p19r69N6J032Q09l32p91n92LP06O32M26p46j063J20Q94O51j94l70
$$ 280 575 -144 -1113 -1057 -25 784 452 -339 -931 -928 -222 410 836 90 -973 -853 41 692 498 128
7018A28m22n68N90J022L15p15j119K14O67M92J72k40n87n88M79J216J12r71q10
$$ 128 -294 -862 -272 750 1065 350 -769 -555 112 604 776 536 -51 -639 -160 1056 1168 197 -613
7037f13J93O30K13L64k59j091k55M65J154r4j011k26j15L90L14O20l12j138n06
$$ -613 -420 210 423 787 528 -563 -818 -353 801 707 -304 -530 -645 -255 59 679 367 -771 -1277
7056a277P76R87Mo89k69j99rO77P31l72r15p43J107N73J16k9l97o55k8P62R71
$$ -1277 -501 486 490 -199 -468 -667 -676 1 732 360 -555 -1298 -191 382 498 469 72 -583 -611 151 1122
7077A122m56j180RL80M88J35J88l64o12j38J012M23o16o65N1K29L35L92j26o62
$$ 1122 666 -514 -505 -125 363 498 686 322 -290 -428 584 1007 391 -274 -223 6 341 733 607 -55
7097e5p92M22J074m2m75l19l46k9J64Q77oj040p59O19Q72K70k56l49l69n17M84
$$ -55 -847 -425 649 607 132 -187 -533 -562 -398 479 473 -567 -1326 -707 165 435 179 -170 -539 -1056 -572
7118e72J126K90r59p17J47Q04K93o6o1n34m65N11Q61K46p24n10L17N68p6K33l43
$$ -572 554 844 -115 -832 -685 119 412 346 285 -249 -714 -203 658 904 180 -330 -13 555 479 712 369
7139C69o69j91O32P61k74o59m50K79J86N16L61n24r12k12R65O61k44o36l90j19
$$ 369 -300 -491 141 902 628 -31 -481 -202 -16 500 861 337 -575 -787 178 839 595 -41 -431 -550
7159e50l1P24M09k01j222j95Q36N39j33j30m20m14J03N77P75m19q53k95O55K55
$$ -550 -581 143 552 351 -871 -1066 -230 309 176 46 -374 -788 -685 -108 667 248 -605 -900 -245 10
7179A0K27M9m19n12K39P33M55n91m72J4J71L08M70j4n90p97L20J179K4m78l74
$$ 10 237 286 -133 -645 -406 327 782 191 -281 -267 -96 212 682 668 78 -719 -399 780 804 326 -48
7200d8k06J60N42K48O1p71p34J81Q44M54m79m04j60k15K76O10J51n86n19K10L98
$$ -48 -254 -94 448 696 757 -14 -748 -567 277 731 252 -152 -312 -527 -251 359 510 -76 -595 -385 13
7221A3K17j33o2n98p3L27Q77k55n89k32RM37J66R8j99m12l54O76P08mp03k22J32
$$ 13 230 97 35 -563 -636 -309 568 313 -276 -508 -499 -62 104 202 3 -409 -763 -87 621 617 -86 -308 -176
7244a76L37L9K78k04m94j81O05M69r9k44m94lJ46L44M18n16n30j21M29N52l32
$$ -176 161 200 478 274 -220 -401 204 673 574 330 -164 -167 -21 323 741 225 -305 -426 3 555 223
7265B23J9l50m30J33N52L11k26o30j38K50L40J09r7l96k39J58J78O27k20l64l11
$$ 223 242 -108 -538 -405 147 458 232 -398 -536 -286 54 163 66 -330 -569 -411 -233 394 174 -190 -501
7286e01J67K54K79R9m36m26L56L90L66m75k17P9k9j21O66J06n77l70K00M43J11
$$ -501 -334 -80 199 298 -138 -564 -208 182 548 73 -144 -65 -94 -215 451 557 -20 -390 -190 253 364
7307C64j95j28l91K74K9J97P3k9p36K71L93K55q7k70l82m8M52M54o9j80m78j75
$$ 364 169 41 -350 -76 -47 150 223 194 -542 -271 122 377 290 20 -362 -410 42 496 427 247 -231 -406
7329d06L39K27K25m56k13j27K44L28K06n10l46L5P7K29M87j96l37l34J61N73L0
$$ -406 -67 160 385 -71 -284 -411 -167 161 367 -143 -489 -454 -377 -148 339 143 -194 -528 -367 206 236
7350B36l11l6r1J43Q5L23j55n8m52K68M14Lk03j3k84J96L76j13J10l92k58K05
$$ 236 -75 -111 -202 -59 26 349 194 136 -316 -48 366 369 166 153 -131 65 441 328 438 46 -212 -7
7372gMK08m8k67j37mL35K44k30j89o9j06J25M85r2o1o14J02K60K80Pl26j96k01
$$ -7 -3 205 157 -110 -247 -251 84 328 98 -91 -160 -266 -141 344 252 191 -423 -321 -61 219 226 -100 -296 -497
7396d97M29k3L00k34j48l30J69L02J45m9k85l5N3K13J58o6k69l9k6O42j2J67m79
$$ -497 -68 -91 209 -25 -173 -503 -334 -32 113 64 -221 -256 -203 10 168 102 -167 -206 -232 410 398 565 86
7419H6L2p3J60L24k01j87k11j22M69R8o3k00j88K4L8L80k34j72l75L28J38J90
$$ 86 118 45 205 529 328 141 -70 -192 277 375 312 112 -76 -52 -14 366 132 -40 -415 -87 51 241
7441B41j72l15j57j26K50K80K79l52k99L2K4K49K17l59j39l2K03K65J77k10l25
$$ 241 69 -246 -403 -529 -279 1 280 -72 -371 -339 -315 -66 151 -208 -347 -379 -176 89 266 56 -269
7462b69j42MO12J40k22j92k37L85J99n6n6k46K0j33N25N2r1l41j84K45L37P2j15
$$ -269 -411 -407 205 345 123 -69 -306 79 278 222 166 -80 -60 -193 332 384 293 -48 -232 13 350 422 307
7485C07k08k72Q3L07K31k10k75l38K09J82K79l47lk40m9K07J57m0j35k43Q6K42
$$ 307 99 -173 -90 217 448 238 -37 -375 -166 16 295 -52 -55 -295 -344 -137 20 -20 -155 -398 -312 -70
7507g0J98j62J7l93L8L56KK04k57j25k81O24K25p3l31m9oN7L48K01l28l49q8L26
$$ -70 128 -34 -17 -410 -372 -16 -14 190 -67 -192 -473 151 376 303 -28 -77 -83 -26 322 523 195 -154 -242 84
7531H4K15M6k28j58j05r7P24k7l07j56k83J98L18K60j85l15k27K9M28PJ49o14
$$ 84 299 345 117 -41 -146 -243 481 454 147 -9 -292 -94 224 484 299 -16 -243 -214 214 221 370 -244
7553b44j06L6M92M5o9r1m57J53K01L27l41j3k50K5L06L77j19k86m18P7M22K84
$$ -244 -350 -314 178 223 154 63 -394 -241 -40 287 -54 -67 -317 -292 14 391 272 -14 -432 -355 67 351
7575C51k15k75q9J09K19K73j09j46m49j3N87K68j38k45r0j57P7N51r6m18k52J
$$ 351 136 -139 -228 -119 100 373 264 118 -331 -344 243 511 373 128 38 -119 -42 509 413 -5 -257 -256
7597b56L08L42J06m64l28m4M04J87Nk55l75RL36K56j76N0n28k00K78N26J65m60
$$ -256 52 394 500 36 -292 -336 68 255 260 5 -370 -361 -25 231 55 105 -423 -623 -345 181 346 -114
7619a14l83P5K52J75M05j86o49k09L66N92q0j16O1o02K57L84J90k10k87k29J79
$$ -114 -497 -422 -170 5 410 224 -425 -634 -268 324 244 128 189 -413 -156 228 418 208 -79 -308 -129
7640a29N13Q2p1l39k29n7N08M78k78p06j02M09K48P0j35p9l36j20M16N47l66m71
$$ -129 384 466 395 56 -173 -230 278 756 478 -228 -330 79 327 397 262 183 -153 -273 143 690 324 -147
7662a47l12J37L46J49J06l89m26J18L10L66q0m68k10J19j6M87J60l92l61l3N43
$$ -147 -459 -322 24 173 279 -110 -536 -418 -108 258 178 -290 -500 -381 -397 90 250 -142 -503 -536 7
7683GK27j74k69k0j11Q8N13K77m97j65j39N03K49j82n2l69l7J33L65J89l00n65
$$ 7 234 60 -209 -229 -340 -252 261 538 41 -124 -263 240 489 307 255 -114 -151 -18 347 536 236 -329
7705c29Q4K42L43j59J32k92m43K70N46J02m11m27J28J11J76K91j51m22m92N21
$$ -329 -245 -3 340 181 313 21 -422 -152 394 496 85 -342 -214 -103 73 364 213 -209 -701 -180
7725a80K58L45m79j68j02n9L88J66Q8o22q4N8O16j8l60k12Q1k90N30O20k84q41
$$ -180 78 423 -56 -224 -326 -385 3 169 257 -365 -449 -391 225 207 -153 -365 -284 -574 -44 576 292 -549
7747e49P0L26K29O9m8N7n15K74L77L60j7o76j10K08L94j06o2%m64k59O43K32k55
$$ -549 -479 -153 76 145 97 154 -361 -87 290 650 633 -43 -153 55 449 343 281 281 -183 -442 201 433 178
7770A78l14o6J12N8K30O8j28n68j44M97R6p6j45l3Q4p0J57J82q1n07j03O48K47
$$ 178 -136 -202 -90 -32 198 266 138 -430 -574 -77 19 -57 -202 -235 -151 -221 -64 118 37 -470 -573 75 322
7793C22l69m5j09j56J60N44K01m79l76K55Q4K99j00J0m04j75M49L76K24o67m52
$$ 322 -47 -92 -201 -357 -197 347 548 69 -307 -52 32 331 231 241 -163 -338 111 487 711 44 -408
7814d08L69J14j23L45P2k33p10M48O22j38j86j30kj21P1J62J04k76j83J29K87
$$ -408 -39 75 -48 297 369 136 -574 -126 496 358 172 42 40 -81 -10 152 256 -20 -203 -74 213
7835B13j80n4j20K4l52M84J21J22n50j73L99K03l01KR3k64J4K64L00j86m53Q3
$$ 213 33 -21 -141 -117 -469 15 136 258 -292 -465 -66 137 -164 -162 -69 -333 -319 -55 245 59 -394 -311
7857c11K99L74m4l11J01m02K4N07M24l76l86k61N37L6J67J7j94m08o0K79J94J14
$$ -311 -12 362 318 7 108 -294 -270 237 661 285 -101 -362 175 211 378 395 201 -207 -267 12 206 320
7879C20j98j66j64j02K08O37k49m24J01Q9j30k04M80k11j28p4K40P7j57l38N4
$$ 320 122 -44 -208 -310 -102 535 286 -138 -37 52 -78 -282 198 -13 -141 -215 25 102 -55 -393 -339
7900c39L96j06l01K03J39k06M7L20J08n86o4J45N32k3j80q3k23q1L23K92N7n06
$$ -339 57 -49 -350 -147 -8 -214 -167 153 261 -325 -389 -244 288 265 85 2 -221 -302 21 313 370 -136
7922a36qJ65j19K39M46n7m71n25O60J89k8j42o0J89n67J88J48J33k13j36m1K36
$$ -136 -144 21 -98 141 587 530 59 -466 194 383 355 213 153 342 -225 -37 111 244 31 -105 -146 90
7944I0o2q1K22r1n1l74L74k14n2Q4K32j07j35q7J04oq9L03K4j65j27q3J58M36
$$ 90 28 -53 169 78 27 -347 27 -187 -239 -155 77 -30 -165 -252 -148 -154 -243 60 84 -81 -208 -291 -133 303
7968C03m29K27p7k07L15kj3k05k6K33k9r7L9J37Q3j10k43K78M5j42J1M1K0p8J5
$$ 303 -126 101 24 -183 132 130 117 -88 -114 119 90 -7 32 169 252 142 -101 177 222 80 91 132 152 74 89
7993H9J78k5k38n7K11k55PJ03K0m2j52lN7j7M4J09j18j12k5J39r4j3l19M82n0
$$ 89 267 242 4 -53 158 -97 -90 13 33 -9 -161 -164 -107 -124 -80 29 -89 -201 -226 -87 -181 -194 -513 -31 -81
8018h1m2r4L74m7l78P8J73L2J23j88o8K79k16K08n7l1P1J02k9j88K19k89m5R8
$$ -81 -123 -217 157 110 -268 -190 -17 15 138 -50 -118 161 -55 153 96 65 136 238 209 21 240 -49 -94 4
8042Dj2L48m4l06J46r7J42k90K34j00J35l71M5M89j86j56j71j14J37M7J36O9j49
$$ 4 -8 340 296 -10 136 39 181 -109 125 25 160 -211 -166 323 137 -19 -190 -304 -167 -120 16 85 -64
8065f4j36j75L57l9rk51p7J99L8J06N8l3j88J17Q0K06n3n8m22K53J43K22qm56
$$ -64 -200 -375 -18 -57 -66 -317 -394 -195 -157 -51 7 -26 -214 -97 -17 189 136 78 -344 -91 52 274 266 -190
8089a90J28K23j5K3O9q7j89k08L49m1K60k64j77N9J70p6L12m55j6K43n7J87k96
$$ -190 -62 161 146 169 238 151 -38 -246 103 62 322 58 -119 -60 110 34 346 -109 -125 118 61 248 -48
8112d8k17Q2q9K3L48L3k33j49k02K26K59K3k53J11l39K9N44l8k04j84o7L37K84
$$ -48 -265 -183 -272 -249 99 132 -101 -250 -452 -226 33 56 -197 -86 -425 -396 148 110 -94 -278 -345 -8 276
8135B76k05l0j05j08p8L85K13Q0o33l7K51K67J7L1l65l9l1M42nk26o3l54J59K05
$$ 276 71 41 -64 -172 -250 135 348 428 -205 -242 9 276 293 324 -41 -80 -111 331 326 100 37 -317 -158 47
8159D7K51j48j78j85J57O7M64l45j46l34J61J42J65J5r2m57L00L4L14p0l61j80
$$ 47 298 150 -28 -213 -56 11 475 130 -16 -350 -189 -47 118 133 41 -416 -116 -82 232 162 -199 -379
8181c79J88N5J24N1j35k06l6L31Q0J76
$$ -379 -191 -136 -12 39 -96 -302 -338 -7 73 249
8191B49
$$ Imaginary data points
##PAGE= N=2
##DATA TABLE= (X++(I..I)), XYDATA
0@%%%Qj6QqK4l2M0m8N6q0R6j07J36j66J94k29K71l21L73m28M96n74O55p42Q43
$$ 0 0 0 0 8 -8 0 -8 16 -16 24 -24 32 -48 48 -59 77 -89 105 -124 147 -174 199 -229 267 -307 348 -394 449
28D49r59J086j221J370j539J724j922K137k381K650k935L251l605L991m416M889
$$ 449 -510 576 -645 725 -814 910 -1012 1125 -1256 1394 -1541 1710 -1895 2096 -2320 2569
44B569n419O016o683P435q311R332j0526J1963j3728J5953j8862K2831k8614L7862
$$ 2569 -2850 3166 -3517 3918 -4393 4939 -5587 6376 -7352 8601 -10261 12570 -16044 21818
58B1818n4963R6902l79081n99967Q06565M82297k94846j78657K87135k70577n76973
$$ 21818 -33145 63757 -315324 -915291 -108726 373571 78725 -99932 187203 -83374 -660347
69f60347K92256R20952L8537p04353j42134M00120j04272k71307M30087N12663
$$ -660347 -368091 552861 591398 -112955 -255089 145031 40759 -230548 199539 712202
79G12202m20354o02866K64917M62686k90286l10385M35925L29828n06091m08642
$$ 712202 291848 -311018 -46101 416585 126299 -184086 251839 581667 75576 -333066
89c33066L54213K22120m06274o3088N83366P6828p38988l15789N04299K62569
$$ -333066 21147 243267 -163007 -226095 357271 434099 -304889 -620678 -116379 146190
99A46190k65739P5795L40883l43082o81259K07088Q12454J13985m98013p4328
$$ 146190 -119549 -43754 297129 -45953 -727212 -520124 292330 406315 -91698 -166026
109a66026J94824k63209k07476N64646N28939m33623o13503K03782M18620j52444
$$ -166026 28798 -234411 -441887 122759 651698 218075 -395428 -191646 226974 74530
119G4530j40313L66207R8517n40539k06625N26683K43433m50611j91624L90691
$$ 74530 -65783 300424 398941 -141598 -348223 178460 421893 -28718 -220342 170349
129A70349P5092m16423k0835M02307p8329m52170J21822M99108j20705n25955
$$ 170349 245441 -170982 -191817 210490 132161 -320009 -198187 300921 180216 -345739
139c45739N1353M27032n9855k85376J98464K51094l46114l33866L83986M37900
$$ -345739 -294386 132646 72791 -212585 -14121 236973 -109141 -443007 -59021 378879
149C78879k62915l78676J71030K04241k13558m5180L87666N4539n08034j78706
$$ 378879 115964 -262712 -91682 112559 -100999 -146179 241487 296026 -212008 -390714
159c90714M54119K38004k95526j26837K07818p8637l02313J75258M54005j00574
$$ -390714 63405 301409 5883 -120954 86864 8227 -294086 -118828 335177 234603
169B34603m84185j2522L60464Q972k09976J36735J94769k56065k61327K86343
$$ 234603 -249582 -262104 98360 107332 -102644 34091 228860 -27205 -288532 -2189
179b189L30545k18451k99015J72029K18186j70169j22406K24546N9615l15333
$$ -2189 328356 109905 -189110 -17081 201105 30936 -91470 133076 192691 -122642
189a22642p5976L61427J29028l34599j71556K13218P6956j63013O5332K22542
$$ -122642 -198618 162809 291837 -42762 -214318 -1100 75856 -87157 -21825 200717
199B00717j49303l51982P9729L72255K0032k57551q304J32621j16826j16940K39625
$$ 200717 51414 -300568 -220839 151416 171448 -86103 -94407 38214 -78612 -195552 44073
210D4073K08185k38591k66446J69558K43019j03360j40595J21347N5731j91370
$$ 44073 252258 13667 -252779 -83221 159798 56438 -84157 37190 92921 -98449
220i8449k5045K72404P1972k85056j32787K11794J24683j16715k1148J02382r8461
$$ -98449 -123494 148910 220882 -64174 -196961 14833 139516 22801 1653 104035 5574
231E574j94712J10572K75945k8777k49717l7020J32761j4748o0848J23520Q7711
$$ 5574 -189138 -78566 197379 168602 -81115 -118135 14626 -122 -60970 62550 150261
242A50261j84942j61594J54494J84655r4079j42520O3837P0753q4811j6050J39930
$$ 150261 -34681 -196275 -41781 142874 48795 -93725 -29888 40865 -43946 -59996 79934
253G9934O369j91940m7426J94294R8692j25225q3742M9587q618n4060R7576J42980
$$ 79934 86303 -105637 -153063 41231 139923 14698 -69044 -19457 -28075 -82135 15441 158421
265A58421q4115k05770m672J59854N2549n2262R073N069j06192n2153J40138J23068
$$ 158421 74306 -131464 -136136 23718 76267 24005 33078 38147 -68045 -120198 19940 143008
277A43008q8256j26850L1319P2695k0520r186N9362j5863j09454k403J32638M0715
$$ 143008 54752 -72098 -40779 31916 11396 2210 61572 45709 -63745 -66148 66490 107205
289A07205j15204p0582N3704L7652j7434K6822L6139p6541j05870M2199J31040
$$ 107205 -7999 -78581 -24877 12775 -4659 22163 58302 -18239 -124109 -81910 49130
300D9130K2367q3257m4070P720p418J6065P6391K9377q5142p3550M7526P9714
$$ 49130 71497 -11760 -55830 -48110 -55528 -39463 36928 66305 -18837 -92387 -44861 34853
312C4853L320k9785m737j4791k5279L6128P5845m619q8296l8877N6678N5993k76
$$ 34853 38173 8388 3651 -11140 -36419 -291 75554 70935 -17361 -56238 440 56433 56157
325E6157j4272j7674m5193k4547N5890P6060j0753p7823m0665K1135L0723K0947
$$ 56157 41885 24211 -20982 -45529 10361 86421 75668 -2155 -42820 -21685 9038 29985
337B9985J4611j8578n3595k4756M0205M4441j2499m0933j6293Q137J3713J7013
$$ 29985 44596 26018 -27577 -52333 -12128 32313 19814 -21119 -37412 -29275 -15562 1451
349A451N502k9808l8976P468N1608L1544k0955m0233k1740P182L5835M6694J2914
$$ 1451 6953 -22855 -61831 -54363 -2755 28789 7834 -32399 -54139 -46957 -11122 35572 48486
362D8486m2264n1666k47M7814M3322O713k3280l2377j9146J4880M0013K2696j9609
$$ 48486 6222 -45444 -45691 2123 45445 52158 28878 -3499 -22645 -7765 32248 54944 35335
375C5335l5765j1256J8105K1576K159j6714j9784l742J5790J8666j953k4371k5147
$$ 35335 -430 -11686 6419 27995 30154 13440 -6344 -10086 5704 24370 22417 -1954 -27101
388b7101j209K4282K6800J163k9364l4442n900K7769L2779O622k3675l0677j1029
$$ -27101 -28310 -4028 22772 23935 -5429 -39871 -45771 -18002 14777 21399 -2276 -32953 -43982
401d3982J6763K8548J5095j1221k5718j3577J2959K6277J1935j2461k0262l265
$$ -43982 -27219 1329 16424 5203 -20515 -34092 -21133 5144 17079 4618 -15644 -18909
413a8909J6467J9254M199j3304j7582m262J5771K3458Q069j7435k6005q857J7167
$$ -18909 -2442 16812 21011 7707 -9875 -14137 1634 25092 33161 15726 -10279 -19136 -1969
426a969K5136Q976j5088k3508j1227Q974J8401J1341n820j7789j2930N719J6704
$$ -1969 23167 32143 17055 -6453 -17680 -8706 9695 21036 15216 -2573 -15503 -9784 6920
439F920P529j0266j4096j009J0700R234N22r289j3952n012J3671K0512L097j9395
$$ 6920 14449 4183 -9913 -10922 -222 9012 9534 245 -13707 -18719 -5048 15464 18561 -834
453h34k0277k146J3997J8005R437q815k2698j3025J1285K1512Q159p221j0756
$$ -834 -21111 -23257 -9260 8745 18182 9367 -13331 -26356 -15071 6441 14600 7379 -3377
466c377p948j398J1040J4152k329j6262m869J3666R651p273q365K22N6J249J2204
$$ -3377 -11325 -12723 -1683 12469 10140 -6122 -10991 2675 12326 5053 -3312 -3090 -3034 -1785 10419
481A0419R840j3556k3555K06K3014J2993n367q487p294j0477J513K0661J4569
$$ 10419 20259 6703 -16852 -16646 6368 19361 13994 5507 -1787 -12264 -10751 9910 24479
494B4479j3535k0494P81J0703K027M62M709n360j4360K977J9871J344k1204q518
$$ 24479 10944 -9550 -8769 1934 3961 4423 9132 3772 -10588 -7611 12260 13604 -7600 -16118
508a6118J4945R084n077K76K105j5511j4354J8063K8303m985k7804q080J0346
$$ -16118 -1173 7911 2834 3110 5215 -10296 -24650 -6587 21716 16731 -11073 -19153 -8807
521h807K307K289J4623K208k6278j7044J9826K2348q149j4157L825K267r220N276
$$ -8807 -6500 -4211 10412 12620 -13658 -30702 -10876 11472 3323 -10834 -7009 -4742 -13962 -8686
535h686J9299k966k4523p70K6070Q301j6390m890R566l616n481J8128J6913j9793
$$ -8686 10613 7647 -16876 -17646 8424 16725 335 -4555 5011 1395 -4086 14042 30955 11162
549A1162k6429J1696K6505j279j4910K627P37j6821j085K7639Q829l1147k1751
$$ 11162 -15267 -3571 22934 21655 6745 9372 10109 -6712 -7797 19842 28671 -2476 -24227
562b4227J7573J8054p280n842M639j2636k0442J3815L4570j318l2992j2055J4804
$$ -24227 -6654 11400 4120 -1722 2917 -9719 -30161 -16346 18224 16906 -16086 -28141 -13337
575a3337O296J120J5958N316k9094k2204K4427L1513p512j8822M005L764j3661
$$ -13337 -7041 -5921 10037 15353 -13741 -35945 -11518 19995 12483 -6339 -2334 1430 -12231
588a2231K650K6850K928l0163q992K7088J0696k1279q055J4100n10j0265J3253
$$ -12231 -9581 17269 20197 -9966 -18958 8130 18826 -2453 -10508 3592 3082 -7183 6070
601F070J7127k0609l0630J3513L4627K638j8644k979j858j6078N050L8360J4568
$$ 6070 23197 2588 -28042 -14529 20098 22736 4092 1113 -745 -16823 -11773 26587 41155
614D1155l6489l0201J4692K1548kM224R000k0843l2939J1256M2037N366l1551
$$ 41155 4666 -25535 -10843 10705 10703 14927 23927 3084 -29855 -18599 23438 28804 -2747
627b747j2806R688l173l685K1170J1814l1355k6940K2307L0261r956j9759N846
$$ -2747 -15553 -5865 -9038 -12723 8447 20261 -11094 -38034 -15727 14534 4578 -15181 -9335
640i335M010j3750N490K9531p16l5333p640L2427J4248j7556m925R485j0169j1267
$$ -9335 -5325 -19075 -13585 15946 15230 -20103 -27743 4684 18932 1376 -3549 5936 -4233 -15500
654a5500K5541K6678k4359l7643J0930L2873L38j1922P076n040l0768o68M6259
$$ -15500 10041 36719 12360 -25283 -14353 18520 18858 6936 14012 8972 -21796 -22464 23795
667B3795K0976l8157l1786J4119J4782m125J2348J9348k4624m3906J0463M8244
$$ 23795 44771 6614 -25172 -11053 3729 -396 11952 31300 6676 -37230 -26767 21477
679B1477P092l0651p297R477j4112p583L3313J9934l8157l4220K6342L2067j6004
$$ 21477 28569 -2082 -9379 98 -14014 -21597 11716 31650 -6507 -40727 -14385 17682 1678
692A678j8577J3715J123k6511O676M2034p33m8899j1308M0342J5531k1235M08
$$ 1678 -16899 -3184 -2061 -28572 -21896 20138 19405 -29494 -40802 -460 15071 -6164 -5756
705e756J5240k1258k4876L5284M5830k2341m8993P434L3926k621q701K3928L230
$$ -5756 9484 -11774 -36650 -1366 44464 22123 -26870 -19436 14490 11869 3168 27096 30326
718C0326m6184j6748N2382L3672l5876l1407J7491Q208j9299J2952L7688j8313
$$ 30326 -15858 -32606 19776 53448 17572 -13835 3656 11864 -7435 5517 43205 24892
730B4892n7104K687N3950P302l7831l179K0076j9546k2327L7103L4859m0925m8718
$$ 24892 -32212 -29525 24425 31727 -6104 -9283 10793 -8753 -31080 6023 40882 -43 -48761
743d8761K8227M4529j6957k7018J9182P009l7581k213N6457J4479n8864k7387
$$ -48761 -20534 23995 7038 -19980 -798 6211 -31370 -33583 22874 37353 -21511 -48898
755d8898M3343K3252k5200J308K7985k3510m6952K6946O5862r056n8791j155L7095
$$ -48898 -5555 17697 -7503 -6195 21790 -1720 -48672 -21726 44136 35080 -23711 -24866 12229
768A2229p719j8087L4489K4244n0778m0022M7320M9473l1518l7322K3287J5723
$$ 12229 4510 -13577 20912 45156 -5622 -45644 1676 51149 19631 -17691 5596 21319
780B1319l3252j117N0804R70o4657j3760N9586J8540m5397j2290L0415j1710l5889
$$ 21319 -11933 -13050 37754 38724 -25933 -39693 19893 38433 -6964 -19254 11161 -549 -36438
793c6438K8457N1117l1026o5006J4317N6500n310l3269J5401J5671m1200j9877
$$ -36438 -7981 43136 12110 -52896 -38579 17921 12611 -20658 -5257 10414 -30786 -50663
805e0663N8767L9439n1243m6204L3406L2161k3524l882L9425p799o0190K047P0641
$$ -50663 8104 47543 -3700 -49904 -16498 15663 -7861 -11743 27682 19883 -40307 -38260 32381
818C2381J4672n6222j4820L8956j082l0748K4116M1893l3726n5863K8672N9037
$$ 32381 47053 -9169 -23989 14967 13885 -16863 7253 49146 15420 -40443 -11771 47266
830D7266j6807m6784J4145K7198k7458j6830M6679J9898n9236l4042N1683L7237
$$ 47266 30459 -16325 -2180 25018 -2440 -19270 27409 47307 -11929 -45971 5712 42949
842D2949l6440k4754K6750j499m0038J3908N9833p827o9498j0470N3250J1447
$$ 42949 6509 -18245 8505 7006 -33032 -19124 40709 32882 -36616 -47086 6164 17611
854A7611l1041Q384K3584l4103l9034M1314N6374k7521n3833J3829L4864j5805
$$ 17611 -13430 -5046 18538 -15565 -54599 -13285 43089 15568 -38265 -24436 10428 -5377
866e377j4515L5571J2634n0903k1381N3812L1952m0732k7218K9896J2454k7118
$$ -5377 -19892 15679 28313 -22590 -43971 9841 41793 1061 -26157 3739 16193 -10925
878a0925O881L9113j4031n2663P628N6647M733m3223n028K4591j3215j8838L4249
$$ -10925 -4044 35069 21038 -31625 -23997 32650 37383 -5840 -10868 13723 508 -18330 15919
891A5919L1607m1463m8340K6829M6028j2285k6962J3410N000l4381m330N0457
$$ 15919 47526 6063 -42277 -15448 30580 18295 -8667 4743 9743 -24638 -28968 21489
903B1489J7452n0219k9924L2412K1665j9413j709K2347j5596l8253J5556N0210
$$ 21489 38941 -11278 -41202 -8790 12875 -6538 -8247 14100 -1496 -39749 -24193 26017
915B6017l538m5112m523K9768r40j5008J9665J6932l3005k7662L4020L9225k0443
$$ 26017 22479 -22633 -27156 2612 1672 -13336 6329 23261 -9744 -37406 -3386 35839 15396
928A5396l2948J0560J6344j3468K3L0632j45m3959j2407M1429K2319k5225j6343
$$ 15396 -17552 -6992 9352 -4116 -4093 26539 26394 -17565 -29972 11457 33776 8551 -7792
941g792J1775l839j6090J8715L2165j6860m3569R31L5523P045j7093N77M971k0044
$$ -7792 3983 144 -15946 2769 34934 18074 -25495 -24564 10959 18004 911 1488 6459 -13585
955a3585j0132L0912K3823k5729l1092J1472K1310l609m365J0638o689k6909K879
$$ -13585 -23717 7195 31018 5289 -25803 -14331 6979 3370 -995 9643 2954 -23955 -21076
968b1076L5856J0274l0651j7803J4735R529m806Q141J1049j9323k6575J3637L5189
$$ -21076 14780 25054 -5597 -23400 -8665 864 -3942 4199 15248 -4075 -30650 -17013 18176
981A8176J800k4624q469P243r92L010J9736N997k6235j9226J8652K4500l186j2231
$$ 18176 19976 -4648 -13117 -5874 -6866 -3856 15880 21877 -4358 -23584 -4932 19568 16382 4151
995D151q98l143q166J0212K2398l402k8143r871J8963J3160n555n273k085j2074
$$ 4151 3253 110 -8056 2156 24554 21152 -6991 -16862 2101 15261 9706 4433 2348 -9726
1009i726p049J7580K0140j1091k5996m976J4637R111J215J691p624j7135k177
$$ -9726 -16775 805 20945 9854 -16142 -21118 -6481 2630 3845 5536 -2088 -19223 -21400
1022b1400K2057J6833j0484j8865l234P310P216Q771M723j1942j7904K298K0516
$$ -21400 657 17490 7006 -11859 -15093 -7783 -567 8204 12927 985 -16919 -14621 5895
1035E895J0996q727j2412n411P09P761J3684L372j6168j6602M948J7679Q009n297
$$ 5895 16891 8164 -4248 -9659 -8950 -1189 12495 15867 -301 -16903 -11955 5724 13733 8436
1049H436q808p738k749R068J5854K423j5583j4104M473J4277Q316k445r124r709
$$ 8436 -372 -8110 -10859 -1791 14063 16486 903 -13201 -8728 5549 13865 11420 2296 -7413
1063g413k165J1053J3636n24j4357j1821J498J1347J0139N84j1017j4527k330
$$ -7413 -9578 1475 15111 14587 230 -11591 -10093 1254 11393 11977 960 -13567 -15897
1076a5897J2897J3658p79j2629j1746j128R143J1825M020r487j4032l139J1691
$$ -15897 -3000 10658 9879 -2750 -14496 -15624 -6481 5344 9364 -123 -14155 -17294 -5603
1089e603J3415J891r786j0287j733R518J1995L549q484j2107k543J0451J2576
$$ -5603 7812 9703 -83 -10370 -12103 -2585 9410 12959 4475 -7632 -10175 276 12852
1102A2852K721r833j2191k922R765J2100K772r516j2807m248Q411J2577M464r048
$$ 12852 15573 5740 -6451 -9373 392 12492 15264 5748 -7059 -11307 -2896 9681 14145 5097
1116E097j3660m967Q647J3201M197q525j1949m210P547J1532N261o066j2341n680
$$ 5097 -8563 -13530 -4883 8318 12515 3990 -7959 -12169 -4622 6910 12171 6105 -6236 -11916
1130a1916P011J3097N549p917j2852m793P089J1459M729o579j2340o314N462J1942
$$ -11916 -4905 8192 13741 5824 -7028 -11821 -4732 6727 11456 4877 -7463 -13777 -8315 3627
1144C627N915o011j2133o770M846J2638P249n896j2717n418P060J1269N032l799
$$ 3627 9542 3531 -8602 -15372 -10526 2112 9361 3465 -9252 -14670 -7610 3659 8691 4892
1158D892r330o556L536J3091R597n411j3662n984P671J1079N476l243r560q833
$$ 4892 -4438 -10994 -7458 5633 15230 9819 -3843 -9827 -2156 8923 14399 11156 1596 -7237
1172g237J732J3073R659n645j3633o362L880Q214O644l98j0600j1944J706J2891
$$ -7237 -5505 7568 17227 11582 -2051 -8413 -4533 3681 10325 9927 -673 -12617 -10911 1980
1186A980P578o447j0101l981R37N787R171K005j2252j2172N346J5159N243o595
$$ 1980 9558 3111 -6990 -10971 -10034 -4247 4924 6929 -5323 -17495 -12149 3010 8253 1658
1200A658o372l499j583O335J4158K909j5577j2939P205J3757L733l653l306p138
$$ 1658 -4714 -8213 -9796 -3461 10697 13606 -1971 -14910 -7705 6052 9785 6132 2826 -4312
1214d312o937P952J6607J114j6167r172O651P512J857L239n04j2298q023J2774
$$ -4312 -11249 -3297 13310 14424 -1743 -10915 -4264 3248 5105 8344 7840 -4458 -12481 293
1228B93J6481m783j4816j720O068L69J945R436j995j8396o725J7613J2744j0398
$$ 293 16774 11991 -2825 -4545 1523 1892 3837 13273 11278 -7118 -13843 3770 16514 6116
1242F116j2430J470J487m303O234J2024p789k1490j127J9402P271j0504m433K101
$$ 6116 -6314 -4844 -3357 -7660 -1426 10598 2809 -18681 -19808 -406 6865 -3639 -8072 -5971
1256e971o735l082J6752J3818j4208j9671O495J7187J088m304N912j309j5707
$$ -5971 -12706 -15788 964 14782 574 -19097 -12602 4585 5673 1369 7281 5972 -9735
1269i735l45K3642J0672j8986j3163J0790P505p375K493J1946q240k1102M875
$$ -9735 -10080 13562 24234 5248 -7915 2875 10380 3005 5498 17444 9204 -11898 -7023
1282g023K3695p42k1340l449J2103k362q709J0048R233j7968j7251J6424K0806
$$ -7023 16672 15930 -5410 -8859 3244 882 -7827 2221 11454 -6514 -23765 -7341 13465
1295A3465r695j6765N690O456r863J319K1533K028k7190r273K4385J2745j4107
$$ 13465 3770 -12995 -7305 -849 -10712 -9393 12140 14168 -13022 -22295 2090 14835 728
1308G28m341J1120o760j7581J2267K7278p725k9679L77K2001j103j3852R175J0906
$$ 728 -3613 7507 747 -16834 -4567 22711 14986 -14693 -14316 7685 6582 -7270 1905 12811
1322A2811j8866j6374K1456K1215j7060k0482J2729J3489j2604m795J9361K730
$$ 12811 -6055 -22429 -973 20242 3182 -17300 -4571 8918 -3686 -8481 10880 13610
1334A3610k5579l759K8597Q309k4544o953J9600Q56j7478P710K1111j3410k7904
$$ 13610 -11969 -15728 12869 21178 -3366 -10319 9281 10137 -7341 369 21480 8070 -19834
1347a9834J0886K9406o797k4988N034J4940j3518j1911K2874J5669k7529k3056
$$ -19834 -8948 20458 13661 -11327 -6293 8647 -4871 -16782 6092 21761 -5768 -28824
1359b8824K1762K1767j4984j1866J6408J583k4956K98L3575N859l1372q361K4529
$$ -28824 -7062 14705 -279 -12145 4263 5846 -19110 -18812 14763 20622 -10750 -19111 5418
1372E418L412j9209P645K2081j3269k7689J3763K9905j1357k6343J1504K1202
$$ 5418 8830 -10379 -2734 19347 6078 -21611 -7848 22057 10700 -15643 -4139 17063
1384A7063j5916j6995K0950J5853k6220j6337K8012J7317k6806j6666K3900J0920
$$ 17063 1147 -15848 5102 20955 -5265 -21602 6410 23727 -3079 -19745 4155 15075
1396A5075k2664k928K7057j910l3485N22L5252L611k9356j512K1525q419k0547
$$ 15075 -7589 -10517 16540 14630 -18855 -18333 16919 20530 -8826 -10338 11187 2768 -17779
1409a7779J8201K7028k0247l2611J4210K7846j1480j7693J6228J0971k7871j3783
$$ -17779 422 27450 7203 -25408 -11198 16648 5168 -12525 3703 14674 -13197 -26980
1421b6980L2205J8537k8614j8045K3057J0212k3919j559K9405l75l2882m83L3173
$$ -26980 5225 23762 -4852 -22897 160 10372 -13547 -15106 14299 13924 -18958 -19441 13732
1434A3732M26k9063L867K8074p362k6275J1590K5583j5066k4237J9297K5388k0035
$$ 13732 14158 -14905 -11038 17036 9674 -16601 -5011 20572 5506 -18731 566 25954 5919
1447E919k5070J8118K0259j8466j2777K4001Q635l1965j1591L3088J4376k7448
$$ 5919 -19151 -1033 19226 760 -12017 11984 20619 -11346 -22937 10151 24527 -2921
1459b921j0518K2219k92k6064P766L3640o895l6757J589L0508l076k3250J0991
$$ -2921 -13439 8780 8488 -17576 -9810 23830 16935 -19822 -18233 12275 9199 -14051 -3060
1472c060K1394j9394k5584K0369K7619j8031k4233J6880J7813k0234j4054K4952
$$ -3060 18334 -1060 -26644 -6275 21344 3313 -20920 -4040 13773 -6461 -20515 4437
1484D437J2568k6755j0822K7693R361k7368o405K7571M290k5463O21K5857n392
$$ 4437 17005 -9750 -20572 7121 16482 -10886 -17291 10280 14570 -10893 -10272 15585 10193
1497A0193k7271Q821L0209q063k8793O921K4355j0690j8915J6591J8967k2360
$$ 10193 -17078 -8257 21952 13889 -14904 -7983 16372 5682 -13233 3358 22325 -35
1509c5k2202K1271K2586j8359j7589J7630R872k1858p020K7468P456k8241q926
$$ -35 -22237 -966 21620 3261 -14328 3302 13174 -8684 -15704 11764 19220 -9021 -17947
1522a7947K5696N948k2571j49K2680n249k4442P453K6287q633k5668Q519K2891
$$ -17947 7749 13697 -8874 -9023 13657 8408 -16034 -8581 17706 9073 -16595 -8076 14815
1535A4815j0775j9857J3254J6746j7978j6646K0646J6778k1250j7336J9351J3280
$$ 14815 4040 -15817 -2563 14183 -3795 -20441 205 16983 -4267 -21603 -2252 11028
1547A1028j8450p744K0956M067k4170l361K6497N517k3386k668K0677m45j8131
$$ 11028 -7422 -15166 5790 9857 -14313 -17674 8823 14340 -9046 -11714 8963 8518 -9613
1560i613O972K0874q096k1850R606K2065q780j8391R577J4952j2820j2492J5724
$$ -9613 -2641 18233 10137 -11713 -2107 19958 11178 -7213 2364 17316 4496 -7996 7728
1573G728J1403j9603j3332J8193J2206j8031j0346J4606M049j7673k106K0797
$$ 7728 19131 -472 -13804 4389 16595 -1436 -11782 2824 6873 -10800 -12906 7891
1585G891L66k2975l251K0042K749j5896J902J3878o827j5673J0218J9231q039
$$ 7891 8257 -14718 -17969 2073 4822 -11074 -9172 4706 -2121 -17794 -7576 11655 3616
1598C616j7912P190J4452p059q909J1610P946j4659q725J6660J0456j4374q669
$$ 3616 -14296 -7106 7346 287 -8622 2988 10934 -3725 -12450 4210 14666 292 -8377
1611h377J2758N362j2491r79J4789q60j7123Q88J7875M56j5648k43J2354k654
$$ -8377 4381 9743 -2748 -3727 11062 10202 -6921 -6033 11842 12298 -3350 -3593 8761 6107
1625F107j0401O822J0979r817j3712Q123J4209o296j1582M253N305q213l589J2093
$$ 6107 -4294 2528 13507 3690 -10022 -1899 12310 6014 -5568 -1315 3990 -4223 -7812 4281
1639D281M078j4706q728J1048P266p551k968O485k703j0678M376J4510p81j4004
$$ 4281 8359 -6347 -15075 -4027 3239 -4312 -7280 -795 -3498 -14176 -9800 4710 3929 -10075
1653a0075j262J0628J054n321M558P034p117q215Q431J1979m772r344L167O599
$$ -10075 -11337 -709 345 -4976 -418 6616 -501 -8716 -285 11694 6922 -2422 745 7344
1667G344l059k378O708J691r960l881R814N799p886n623L324O00l816K407O222
$$ 7344 4285 1907 8615 10306 346 -3535 6279 12078 4192 -1431 1893 2493 -1323 1084 7306
1682G306m743j0936R44R972J346o117j533J890l486j849P957N778p519q839L593
$$ 7306 2563 -8373 -7429 2543 3889 -2228 -3761 -1871 -5357 -7206 751 6529 -990 -9829 -6236
1697f236P988K2k250J324j287n823Q03R283L390p635o244K959L839K93J114J249
$$ -6236 1752 1774 -476 848 -439 -6262 -5459 3824 7214 -421 -6665 -3706 133 426 1540 2789
1713B789m391n721L183Q091P32n781k918J733J137J267M511N4o433l778N467O824
$$ 2789 -1602 -7323 -4140 3951 4683 -1098 -4016 -2283 -1146 121 4632 4686 -1747 -5525 -58 6766
1729F766l85m574j546j1j14L285N056j319p869l201M648N337j67l229k964k802
$$ 6766 6381 1807 261 250 136 3421 8477 7158 -711 -3912 736 6073 5906 2677 -287 -3089
1745c089l87M344M410k563o946k905K769M055J825j121m085m174O45N896M024
$$ -3089 -3476 868 5278 2715 -4231 -7136 -4367 -312 1513 392 -3693 -7867 -7222 -1326 2698
1760B698k413n008j999J866L845L312O46m333m454J013O226M193j828m703k490
$$ 2698 285 -4723 -6722 -4856 -1011 2301 2947 -1386 -5840 -4827 1399 5592 3764 -939 -3429
1775c429J247L616M045K04m317m781N20N225M112r79m518l652J85M110M245j3
$$ -3429 -2182 1434 5479 5683 1366 -3415 -2895 2330 6442 5463 945 -2707 -2522 1588 5833 5820
1791E820m408m403p4M318M369K02m104m677r33M458M888k4m695m492n38L420M236
$$ 5820 1412 -2991 -3065 1253 5622 5824 1720 -2957 -3890 568 5456 5432 737 -3755 -4293 -873 3363
1808C363N83l925n063j745L454N107J176m462n051j055L574M577J189k888m834
$$ 3363 3946 21 -5042 -6787 -3333 1774 2950 -1512 -6563 -7618 -4044 533 1722 -1166 -6000
1823f000j286L157N335K206k981m751j364L930N428K027k772m758j178L338N212
$$ -6000 -7286 -4129 1206 3412 431 -4320 -5684 -1754 3674 5701 2929 -1829 -3007 331 5543
1838E543K277k305m877k646K267N688K556l184n573k636K279M556J971k454m876
$$ 5543 7820 5515 638 -2008 259 5947 8503 5319 -254 -2890 -611 3945 5916 3462 -1414
1853a414l388R77N070K880k419n461l020J734M765K933j581m765l435J791N043
$$ -1414 -4802 -3825 1245 4125 1706 -3755 -6775 -5041 -276 2657 1076 -3689 -7124 -5333 -290
1868b90L648j285m572l162J114M743M470o27n100l979J456N236L000r14l536l945
$$ -290 3358 2073 -2499 -5661 -4547 196 4666 4039 -1061 -5040 -3584 1652 4652 3738 202 -3743
1884c743m09L697N153J38n670m680J331M505L067l40k784m020j071M097N444P7
$$ -3743 -4152 -455 4698 4836 -834 -5514 -4183 322 3389 3049 265 -3755 -4826 -729 4715 4792
1900D792m402l773O91L637L873J252l084m903j097M704N126m43m128l489n09J726
$$ 4792 390 -3383 -2692 945 4818 6070 2986 -1917 -3014 1690 6816 6373 2245 -1244 -1753 -27
1916b7M007K402l343o897j884M896M548q75l356l357k057N60M919L994l259o997
$$ -27 3980 6382 3039 -3858 -5742 -846 3702 2827 -529 -3886 -5943 -5383 -464 3530 271 -6726
1932f726j464M364L754Q83j019k598l784Q65O097M186l299m760m43K619K413K433
$$ -6726 -8190 -3826 -72 811 -208 -2806 -6590 -5725 372 4558 1259 -3501 -3944 -1325 1088 3521
1948C521R62l608m713J884O873K194m142l053J6N86J386L946J188n727n791L111
$$ 3521 4483 875 -3838 -1954 4919 7113 2971 -82 -66 520 1906 5852 7040 1313 -4478 -1367
1964a367O674J146l794k371j466j532K235N904R35p370n056L036M504Q29n26j329
$$ -1367 5307 6453 2659 288 -1178 -2710 -475 5429 6364 -1006 -6062 -3026 1478 2307 1781 452
1980D52m144l613M029O891p90p033k643K832J206N49K630R5o265l576O110O656
$$ 452 -3692 -7305 -3276 3615 2825 -4208 -6851 -4019 -2813 -2264 366 461 -5804 -9380 -3270 3386
1996C386j834n491Q5J745k53K308N134p76p569j858P140N056k348k572L66j573
$$ 3386 1552 -3939 -3854 -2109 -2362 -54 5080 4304 -3265 -5123 2017 7073 4725 2153 2519 946
2012I46j535M685N785l366p984l01N667J014j665N04n63n422j829O770M143n827
$$ 946 -589 4096 9881 6515 -1469 -1770 3897 4911 3246 3750 3187 -2235 -4064 2706 6849 1022
2028A022o193K112L214j551J10L192k665p346R73Q556K178o894l515L003O25q73
$$ 1022 -5171 -3059 155 -1396 -1286 1906 -759 -8105 -7132 1424 3602 -3292 -6807 -3804 -3179 -4052
2044d052M191L715o081p349L853Q870Q49m750n16M12l143J006Q680L367q429n896
$$ -4052 139 3854 -2227 -9576 -5723 3147 3996 -754 -1270 -858 -4001 -2995 5685 9052 623 -5273
2060e273M872N195j202m9K951l117p171K412R683O19q425j986M813l21l681L403
$$ -5273 -401 4794 3592 3543 6494 3377 -3794 -1382 8301 8920 495 -1491 3322 3001 -680 2723
2076B723L993o032o375N141O804m092o948K008L746k951j510N558L0r142k646
$$ 2723 6716 684 -5691 -550 6254 2162 -4786 -2778 968 -1983 -3493 2065 2095 -7047 -9693
2091i693R248M871o323l960K701o10l485N044Q431m117j1542M99R512J977l747
$$ -9693 -445 4426 -1897 -5857 -3156 -3766 -7251 -2207 6224 2107 -9435 -8936 576 2553 -1194
2106a194J988J987p065m326R481R230o248q795K998N019k702m08O795L09r908
$$ -1194 794 2781 -4284 -8610 871 10101 3853 -4942 -1944 3075 373 -35 6760 7069 -2839
2121b839k396R936M322p057l621N214j76n062L032P009m190r714K666R711j326
$$ -2839 -5235 4701 9023 1966 -1655 3559 3383 -1679 1353 8362 4172 -5542 -2876 6835 5509
2136E509p702Q95L999m640l575Q042M729r431q344O798P596m214l959M213o24
$$ 5509 -2193 -1298 2701 -1939 -5514 2528 7257 -2174 -10518 -3720 3876 -338 -4297 -84 -708
2151g08p940R38J1649K059j0804l997P393K710m474K679N935n219r011N594J1394
$$ -708 -8648 -7710 3939 5998 -4806 -8803 -1410 1300 -3174 -495 5440 221 -8790 -3196 8198
2166H198k125r125J179N746l175k738P529L952j0319o484R307P658o144n372M497
$$ 8198 6073 -3052 -1873 3873 698 -2040 5489 9441 -878 -7362 1945 9603 3459 -1913 2584
2181B584M96o860J631J0622o89j2677k538R964K862o600J46N046n179p636O266
$$ 2584 3080 -3780 -2149 8473 7784 -4893 -7431 2533 5395 -1205 -1059 3987 -1192 -8828 -2562
2196b562J0685m780j0977J763P459k391m154N714K713q931m883R571P064p802
$$ -2562 8123 3343 -7634 -5871 1588 -803 -4957 757 3470 -5461 -10344 -773 6291 -1511
2210a511o275N662L302n198N60Q033j527j0825N29J1941K495q679j565N632j598
$$ -1511 -7786 -2124 1178 -4020 -3460 4573 3046 -7779 -7250 4691 7186 -1493 -3058 2574 976
2225I76m611O293Q039o977j0650M290J0449j657n730K808J846p458k538J0463
$$ 976 -3635 2658 10697 3720 -6930 -2640 7809 6152 422 3230 5076 -2382 -4920 5543
2239E543N397r807p804N726M696m312q23N792k213j0012J057J1047J126r665j941
$$ 5543 10940 1133 -6671 -945 3751 -561 -1384 4408 2195 -7817 -6760 4287 5413 -4252 -6193
2254f193O398n26m732M257N778o230q247N911R550l248p451K206M477m042j536
$$ -6193 205 -321 -5053 -796 4982 -1248 -9495 -3584 5966 2718 -4733 -2527 1950 -2092 -3628
2269c628P614K726r542n677Q489O680n055l689L375r08n321K674R567q83j0503
$$ -3628 3986 6712 -2830 -8507 -18 6662 1607 -2082 1293 385 -4936 -2262 7305 6422 -4081
2284d081k299P766K422l830J507L035n571n496O451Q762l937q378J258M984j845
$$ -4081 -6380 1386 3808 -22 1485 4520 -1051 -6547 -96 8666 4729 -3649 -2391 2593 748
2299G48j834N415J019q345l774Q343N577n982m782L070J189l676J602O219k286
$$ 748 -1086 4329 5348 -2997 -6771 1572 7149 1167 -3615 -545 644 -3032 -1430 4789 2503
2314B503q913q3Q424J902n477j219K628k318k513N741N234n416p261K640O555
$$ 2503 -6410 -6493 1931 3833 -1644 -2863 -235 -2553 -5066 675 5909 493 -6768 -4128 2427
2329B427m96k708J638J16n348j49P884L398o919m948L711L361j362M46K932k815
$$ 2427 1931 -777 861 977 -4371 -4520 3364 6762 -157 -5105 -1394 1967 605 1051 3983 1168
2345A168o119J741Q150J159o048k421K810p6q07L384K672m944n491L216O353p13
$$ 1168 -4951 -3210 4940 6099 51 -2370 440 364 -443 2941 5613 669 -4822 -1606 4747 4034
2361D034l861l35P09k166N70M855O33o435l354M238L804j811k060P93j650k878
$$ 4034 173 -162 547 -1619 -1049 3806 4439 -1996 -5350 -1112 2692 881 -1179 -386 -2036 -4914
2377d914K413N484r23o147j714L654K213q64N82K32l326k291M481N397j934m668
$$ -4914 -2501 2983 2060 -4087 -5801 -2147 66 -798 -216 16 -3310 -5601 -1120 4277 2343 -2325
2393b325q43K769J075J242J764r51m541j036M738L930j908l139m42j11J15K635
$$ -2325 -3168 -399 676 1918 3682 2731 -1810 -2846 1892 5822 3914 775 333 222 337 2972
2409B972K424k388m833l91M174J690j474j529q04j707l6L210K320l146m267lL477
$$ 2972 5396 3008 -1825 -2216 1958 3648 2174 645 -159 -1866 -1902 1308 3628 482 -3785 -3788 -311
2426c11J152p03n85j401j894M35L782J499k805k952Q1K138J601P22n23k137k053
$$ -311 841 138 -447 -1848 -3742 -3307 475 1974 -831 -3783 -3702 -1564 37 759 236 -1901 -3954
2443c954J603L686J075k094k233j6Q71J746J833pk710k262J741L341J066j773
$$ -3954 -2351 1335 2410 316 -1917 -1933 -1062 684 2517 2510 -200 -2462 -721 2620 3686 1913
2459A913j548r12L68J607K061m2l018k160J294K647Q22q97j948j370O2J663K173
$$ 1913 365 -547 -179 1428 3489 3447 429 -1731 -437 2210 3032 2135 187 -1183 -1121 542 2715
2476B715r80k282j866N36J796J401n04j923j955J44J997J789n60k117j518M32
$$ 2715 1735 -547 -2413 -1877 -81 1320 816 -1107 -3062 -2918 -921 868 308 -1809 -3327 -2895
2492b895J509J726J56j324k222j22K469J821r4j843r52J75J525J552O96j225j769
$$ -2895 -1386 340 496 -828 -3050 -3172 -703 1118 1024 -819 -1771 -1596 -71 1481 2177 952 -817
2509h17k23J595K203J96j421j597j95J686J534K01j366j659m10J282J398N32j012
$$ -817 -1040 555 2758 2954 1533 -64 -259 1427 2961 3162 1796 137 -273 1009 2407 2939 1927
2526A927j954q72P96J864M67j613j517n77P92J186L28n80j758q50N12J452J126
$$ 1927 -27 -899 -103 1761 2228 615 -902 -1479 -687 499 827 247 -1511 -2361 -1849 -397 729
2543G29j385j883m86J211J077N27l57j410q13M89J342J102l78j247q53O47J291
$$ 729 -656 -2539 -3025 -1814 -737 -210 -567 -1977 -2790 -2301 -959 143 -235 -1482 -2335 -1688 -397
2560c97J405l75j353n50P06J496O74j99n65o77R3J110J522j67j563p04J012R16
$$ -397 1008 633 -720 -1270 -564 932 1606 1407 842 165 258 1368 2890 2723 1160 456 1468 2384
2578B384k7p9n52r54m02P39J020j90j606r30J39O51K14p4q77j199k90O54J102
$$ 2384 2357 2278 1726 772 370 1109 2129 1939 333 -597 -458 193 407 333 -544 -1743 -2033 -1379 -277
2597b77n66r10l75k78J7R63R68o03j263m85J767O78l43K32K91o65l25J049J577
$$ -277 -843 -1753 -2128 -2406 -2389 -1426 -458 -1061 -2324 -2809 -1042 -364 -707 -475 -184 -849 -1174 -125 1452
2616A452m14j391K80J222O1m21M69M85p07m90Q78R15j106p58P21L02l89j8L24
$$ 1452 1038 -353 -73 1149 1210 789 1258 1743 1036 546 1424 2339 1233 475 1196 1498 1109 1091 1415
2635A415l43j310L74J427n2j510m39R62m53o59P96J238j350k138N50J729j76j117
$$ 1415 1072 -238 136 1563 1511 1 -438 524 71 -588 208 1446 96 -2042 -1492 237 61 -1056
2653a056M54M49j655r30J706J489j128j205M24O17j100K99J543M47j722o92J457
$$ -1056 -602 -153 -1808 -2738 -1032 457 -671 -1876 -1452 -835 -1935 -1636 -93 354 -1368 -2060 -603
2670f03P75q74K39J494p00j140M87K020m55j623J006J339n88j365J235J340j334
$$ -603 172 -702 -463 1031 331 -809 -322 1698 1243 -380 626 1965 1377 12 1247 2587 1253
2687A253j179J596J364j849j905J580J549j420r25J308m6k401o79K845N93k170
$$ 1253 74 1670 3034 1185 -720 860 2409 989 64 1372 1326 -1075 -1754 1091 1684 -486
2703d86j316R95K47j415P91K078j269k738J68K475J24j185M91Q56j779j427K856
$$ -486 -1802 -807 -560 -1975 -1184 894 -375 -3113 -2945 -470 -346 -1531 -1040 -184 -1963 -3390 -534
2720e34K210j971k118J490J820j086n51J810O15k762o00L486J066k657j355J969
$$ -534 1676 -295 -2413 -923 897 -189 -740 1070 1685 -1077 -1677 1809 2875 218 -1137 832
2736H32R51j324J38J800r06k825R13L337j01k699m21J267l15o32J878J488l023
$$ 832 1783 459 597 2397 1491 -1334 -421 2916 2815 116 -305 962 647 15 1893 3381 358
2753C58k679J914L002q64j937O05R4k190n1L473P42l702k329K394J620j331m59
$$ 358 -2321 -407 2595 1731 -206 399 493 -1697 -1748 1725 2467 -1235 -3564 -1170 450 -881 -1340
2770a340J158j067k719J039M018l22l789p09K368N58q02R61J207k336j990K938
$$ -1340 -182 -1249 -3968 -2929 1089 767 -3022 -3731 -1363 -805 -1607 -646 561 -1775 -3765 -827
2786h27L655j369l109P58J419l09O29K473j94m014r37M102K596k299j931R62n17
$$ -827 2828 1459 -1650 -892 527 218 847 3320 3126 -888 -1825 2277 4873 2574 643 1605 1088
2803A088j401J655L212j465m799o62L633J304k043o15M04j966j455L033K700k147
$$ 1088 -313 1342 4554 3089 -1710 -2372 1261 2565 522 -93 311 -1655 -3110 -77 2623 476
2819D76m422P32K963K74r15Q85o09k965K12M334J777l215k900J418K085l14O46
$$ 476 -3946 -3214 -251 23 -892 -7 -616 -3581 -3369 965 2742 -473 -3373 -1955 130 -184 462
2836D62J574k217l254J091M749R65l228j981J086N16K1K361J358l349l942K349
$$ 462 2036 -181 -3435 -2344 2405 3370 142 -1839 -753 -237 -216 2145 3503 154 -3788 -1439
2852a439M696M80l009q78L2r70J121L810O42m171l404K481L323L0j033m77j892
$$ -1439 3257 3737 728 -150 -118 -1088 33 3843 4485 314 -3090 -609 2714 2744 1711 1234 -658
2869f58k015J911M026l06m602j989K265J286l11L64K1k658k251L135L852j494
$$ -658 -2673 -762 3264 2958 -1644 -3633 -1368 -82 -393 -29 -8 -2666 -4917 -1782 2070 576
2885E76m105o30K192J204L86R83n67l598o24M510L686k162l617n60J241J672K407
$$ 576 -3529 -4159 -1967 -763 -377 606 39 -3559 -4183 327 4013 1851 -1766 -2326 -1085 587 2994
2902B994J832l027m851o6M776L524j139k394j937j794Q00M173L047k873n655o98
$$ 2994 4826 1799 -3052 -3118 1658 5182 4043 1649 -288 -2082 -1282 2891 5938 3065 -2590 -3288
2918c288L443K019J82m07j481l156q8L672K615k471l381K22K101K76j03m7j167
$$ -3288 155 2174 2356 1949 468 -2688 -2776 896 3511 1040 -2341 -2119 -18 258 155 108 -1059
2935a059j925J267L462O48l937k569J461K578J167N93j534m027j819L912N393
$$ -1059 -2984 -1717 1745 2393 -1544 -4113 -2652 -74 1093 1686 152 -3875 -5694 -1782 3611
2950C611M04m374l556l28K154L534L605j005n789m166L282N818K315j964l014
$$ 3611 4015 -359 -3915 -4243 -2089 1445 5050 4045 -1744 -5910 -2628 3190 5505 3541 527
2965E27k772p62L388M901O98m471m023J011K970J413J63j097k436j667K026K721
$$ 527 -2245 -3007 381 5282 5980 1509 -2514 -1503 1467 2880 3043 1946 -490 -2157 -131 2590
2981B590o28l261j015J745J565m6o74k091j613O48M134J880k827m559r41K806
$$ 2590 1962 -1299 -2314 -569 996 950 276 -1815 -3428 -2780 1354 3234 407 -4152 -5093 -2287
2997b287L307J699p34m170m238J379N978M165j914n202k940M70L960M426J342
$$ -2287 1020 2719 1985 -2185 -6423 -5044 934 5099 3185 -2017 -4957 -4487 -527 3899 5241
3012E241l680n665o44M516M628M92k589l817j539J881M246K461k854l868o77K237
$$ 5241 1561 -4104 -4748 -232 4396 4888 2299 -1518 -3057 -1176 3070 5531 2677 -1191 -1868 369
3028C69K281N77j026k653j683J824L492K68l394k982P79K720J729k28k436l284
$$ 369 2650 3227 2201 -452 -2135 -311 3181 3449 55 -2927 -2148 572 2301 2073 -363 -3647
3044c647p53L208M204P8m384l779j29L564L793J204l228m662j759L642N302J376
$$ -3647 -4400 -1192 3012 3090 -1294 -5073 -5202 -1638 2155 3359 131 -4531 -6290 -2648 2654 4030
3060D030k989m170j805K438M625K585j763m816k669K926M310J951j633l482k562
$$ 4030 1041 -3129 -4934 -2496 2129 4714 2951 -1865 -4534 -1608 2702 4653 3020 -462 -3024
3075c024J284M045K596j580m146k233K154L627J468j645l180k167J031M091K108
$$ -3024 -1740 2305 4901 3321 -825 -3058 -904 2723 4191 2546 -634 -2801 -1770 2321 4429
3090D429k019m114j982J962L808J814j486m180k621J378M474K488j800m401k614
$$ 4429 2410 -1704 -3686 -1724 2084 3898 2412 -1768 -4389 -3011 1463 3951 2151 -2250 -4864
3105d864J247M137K793j121m533l244J317M336L057j197l965k858O96L982L521
$$ -4864 -3617 520 3313 2192 -2341 -5585 -4268 68 3125 1928 -2037 -4895 -4199 -217 3304
3120C304k74l875l419R55M102L379m33l937k955M63L730L526j09l847l144L93
$$ 3304 3030 -845 -4264 -3309 793 4172 3739 -198 -3153 -2690 1040 4566 4457 610 -2534 -2141
3136b141L236L612k33l575l429j84L812L590k59l757l591l44L495L626n2l452
$$ -2141 1095 4707 4474 899 -2530 -2714 1098 4688 4429 672 -2919 -3263 232 3858 3806 354
3152C54l912q30L394M173K45l840l988k52L163M038L54l317l982p55L388M041
$$ 354 -3558 -4388 -994 3179 3424 -416 -4404 -4656 -1493 2545 2899 -418 -4400 -5155 -1767 2274
3168B274Q69l211l934q87L199M031J264l028l934q80L136M062J145k546m153j135
$$ 2274 3143 -68 -4002 -4889 -1690 2341 3605 577 -3357 -4237 -1101 2961 4106 1560 -2593 -3728
3184c728K897M459J463l058m015j268K541M234J533k419m202j695K255M305J821
$$ -3728 -831 3628 5091 2033 -1982 -3250 -709 3525 5058 2639 -1563 -3258 -1003 3302 5123
3199E123k522m577j587K454M009J702k478m026k304K123M033J758k051m230k349
$$ 5123 2601 -1976 -3563 -1109 2900 4602 2124 -1902 -4206 -2083 1950 3708 1657 -2573 -4922
3214d922J858M222K156j817m520k155J862M039K471j925l780k514J675M212K708
$$ -4922 -3064 1158 3314 1497 -3023 -5178 -3316 723 3194 1269 -2511 -5025 -3350 862 3570
3229C570j478m185k443J363M148L058j475l893k595J324M092K967j131l781k992
$$ 3570 2092 -2093 -4536 -3173 975 4033 2558 -1335 -3930 -2606 1486 4453 3322 -459 -3451
3244c451J064M346K893j044l957k856R80L882L136r30l946k769L53L734L089o82
$$ -3451 -2387 1959 4852 3808 -149 -3005 -2025 1857 4993 4063 117 -2652 -2299 1435 4524 3842
3260C842l947l208L73L845K982o86l798l313M67L267L077l37l473l600J19L571
$$ 3842 -105 -3313 -2940 905 3887 3201 -597 -3910 -3443 -176 2901 2564 -909 -4509 -4390 -819
3276h19L294k48l570l200rL430L557R8l425l379j55L473L560N08l318l287l95
$$ -819 2475 2227 -1343 -4543 -4552 -1122 2435 2533 -892 -4271 -4426 -953 2607 3115 -203 -3490 -3885
3293c885L630L586O06l136l518l43L540L453P29k910l789l67K680M005O22l178
$$ -3885 -255 3331 3937 801 -2717 -3060 480 3933 4662 1752 -2037 -2404 276 4281 4903 1725
3309A725l555p66K626L853N42k807l846p55K256L613R78k798m092j206K644L783
$$ 1725 -1830 -2596 30 3883 4425 1618 -2228 -2983 -727 2886 3864 1066 -3026 -4232 -1588 2195
3325B195Q47k791l708j294K446L506J398k449l472j584K470L722J499k308l632
$$ 2195 3042 251 -3457 -4751 -2305 1201 2599 150 -3322 -4906 -2436 1286 2785 477 -3155
3340c155j446K334L895J446k002l691j473K326L855J801j840l864j593K159L824
$$ -3155 -4601 -2267 1628 3074 1072 -2619 -4092 -1766 2089 3890 2050 -1814 -3407 -1248 2576
3355B576J963j990l433j796J790L644K103j825l564j922J747L335J858j688l522
$$ 2576 4539 2549 -884 -2680 -890 2754 4857 3032 -532 -2454 -707 2628 4486 2798 -724
3370g24k081J285L414K190j525m123k175J255L405K148j505l409k337R31L486
$$ -724 -2805 -1520 1894 4084 2559 -1564 -3739 -2484 921 3069 1564 -1845 -4182 -3251 235
3385B35K478j237l893k039R52L451K389q94l249k512R68L460K868o22l824k142
$$ 235 2713 1476 -2417 -4456 -3504 -53 2336 1442 -1807 -4319 -3351 109 2977 2355 -1469 -3611
3401c611J173L293K680o33l189k581J033L348K529n30l280k644P57L213K669m99
$$ -3611 -2438 855 3535 2902 -287 -2868 -1835 1513 4042 3512 232 -2412 -1655 1558 4227 3728
3417C728l323k725M27L366K526q34k839k753j6K891K776q1l292l351RL414K558
$$ 3728 405 -2320 -1893 1473 3999 3165 326 -2427 -2443 448 3224 3143 -149 -3500 -3491 -77 2481
3434B481l28k933k710k01K667L224j41k978k901J98K736K761j30k312k859j78
$$ 2481 2153 -780 -3490 -3691 -1024 2200 2059 -919 -3820 -3622 -886 1875 1745 -567 -3426 -3604
3450c604K593L173K36k857k791J22K545L071M87k531l121m76K942L607J03k547
$$ -3604 -1011 2162 2398 -459 -3250 -3128 -583 2488 2975 444 -2677 -3153 -211 3396 3499 952
3466I52l058k95K847K807Q59k339l237j047K810L186O13k608k913p74J835K835
$$ 952 -2106 -2401 446 3253 4112 1773 -1464 -2511 299 3485 4098 1490 -1423 -2197 -362 2473
3482B473J107k057l148j213K125K728Q15k207k732j098J785K842R58k015l244
$$ 2473 3580 1523 -1625 -2838 -713 2015 2830 623 -2109 -3207 -1422 1420 2378 363 -2881
3497b881o89K357K404Q15j665k949j111J856L264J302k297l118p21K087K672J309
$$ -2881 -3570 -1213 1191 2006 341 -2608 -3719 -1863 1401 2703 406 -2712 -3433 -1346 1326 2635
3513B635j390l233j359J581L648J559k138k966r41J617K641J911j072l444j788
$$ 2635 1245 -1988 -3347 -1766 1882 3441 1303 -1663 -2604 -987 1654 3565 2493 -951 -2739
3528b739J498L444J334j455l060j399J208K671J865r47l295j909J218L221J230
$$ -2739 -1241 2203 3537 2082 -978 -2377 -1169 1502 3367 2420 -875 -2784 -1566 1655 2885
3543B885j451k168j664N14K425K230j015l074j920J297K722J062o38k442k011
$$ 2885 1434 -734 -2398 -1884 541 2771 1756 -1318 -3238 -1941 781 1843 1205 -1237 -3248
3558c248N83K778K317j358k872j622J491K398J579p80k353k160Q09L216K162j117
$$ -3248 -2665 113 2430 1072 -1800 -3422 -1931 467 2046 1266 -1087 -3247 -2438 778 2940 1823
3574A823l282j474J161K524K171j27k673k708L97L262K522n24k886j757P6K133
$$ 1823 -1459 -2933 -1772 752 2923 2796 123 -2585 -2188 1074 3596 3072 186 -1571 -1495 638
3590F38K688L94k692k801Q8K655K070m55j976j976n11J753K298L47k576k491L85
$$ 638 3326 3720 1028 -1773 -1685 970 3040 2585 609 -1367 -1878 -125 2173 2520 -56 -2547 -2162
3607b162K430J454q85j561k031j87K200K309k85k756k306P86K489J960J23k239
$$ -2162 268 1722 837 -724 -2755 -2942 -742 1567 1282 -1474 -3780 -2994 -505 1455 1578 -661
3623f61k549m61K986L399n0l018k421m5K463K477J043j927k979p78K501K885P48
$$ -661 -3210 -3671 -685 2714 2664 -354 -2775 -2820 -357 2120 3163 1236 -1743 -2521 -20 2865 3613
3640C613k079k195n40J006K444J240j419k792q35K132J888R7j610j659q28J380
$$ 3613 1534 -661 -1201 -195 2249 3489 2070 -722 -1557 575 2463 2560 950 -709 -1537 -157
3656a57J981O66j922k758l73K164J952oj766k213r00J411L052R17k288k900m87
$$ -157 1824 2490 568 -2190 -2563 -399 1553 1547 -219 -2432 -3332 -1921 1131 2048 -240 -3140 -3627
3673c627J776K618R92j461k623j348J681K930J298j348k706q90J451K258J366
$$ -3627 -1851 767 1759 298 -2325 -3673 -1992 938 2236 888 -1818 -2708 -1257 1001 2367
3688B367p91k016j502J235K533J177j389j876p59R88K059J065q96k301j356J600
$$ 2367 1576 -440 -1942 -707 1826 3003 1614 -262 -1021 -33 2026 3091 2195 -106 -1462 138
3704A38K124P91j510k045j098R73K103J260j268k930j340J439K324J111j287k164
$$ 138 2262 3053 1543 -502 -1600 -627 1476 2736 1468 -1462 -2802 -1363 961 2072 785 -1379
3720a379j675P87K453J348q66k493j564J107K308J094m01k205j429O25K121J763
$$ -1379 -3054 -2267 186 1534 668 -1825 -3389 -2282 26 1120 719 -1486 -2915 -2290 -169 1594
3736A594o57k091j228O79K085J657m02j871j513P56K148J641p86j971j190O06
$$ 1594 937 -1154 -2382 -1703 382 2039 1637 -234 -1747 -991 1157 2798 2012 41 -1149 -543
3752e43K105J476k94k301j895O85K330J458o33k325j452L13J937J679n75k272
$$ -543 1562 3038 2744 443 -1452 -767 1563 3021 2388 63 -1389 -1076 861 2540 1965 -307
3768c07j811L50J895J586m01j975j785NJ840J743p0k134j667K48J770J482kj610
$$ -307 -2118 -1768 127 1713 1312 -663 -2448 -2443 -603 1140 1070 -1064 -2731 -2483 -713 769 767 -843
3786h43j784K42J694J778j07j668j352L22J764J639L7j619j815M23J878J718Q3
$$ -843 -2627 -2385 -691 1087 980 -688 -2040 -1718 46 1685 1722 103 -1712 -1289 589 2307 2390
3803B390j810j687N0J871J622J57j601j816j47J465K021p3j714j806l37J508J816
$$ 2390 580 -1107 -1057 814 2436 2593 992 -824 -971 494 2515 2442 728 -1078 -1415 93 1909
3820A909K0j567j896m22J723J586J86j620j824k60J281J741K36j422j825n82J620
$$ 1909 1929 362 -1534 -1956 -233 1353 1539 -81 -1905 -2165 -884 857 1093 -329 -2154 -2736 -1116
3837a116J736J99j309j358m16J282J817O27j268j694k73J255J902L21j128j343
$$ -1116 620 819 -490 -1848 -2264 -982 835 1462 194 -1500 -1773 -518 1384 1705 577 -766
3853g66o24J427J492O74r59j804o72J034K206M31j218j764n36J126J472O68j072
$$ -766 -1390 37 1529 2203 1244 -560 -1232 -198 2008 2439 1221 -543 -1079 47 1519 2187 1115
3870A115j763o62J079J531N09j080j579p58P56J866O26j106j834m72R27J593P48
$$ 1115 -648 -1310 -231 1300 1809 729 -850 -1608 -852 1014 1640 534 -1300 -1772 -845 748 1496
3887A496j147j447r09R69J552R57j033j803o46O98J973M94q63j782o54Q63J859
$$ 1496 349 -1098 -2007 -1038 514 1471 438 -1365 -2011 -1313 660 1154 291 -1491 -2145 -1282 577
3904E77P48q95j571o58P72J660R15p49j638o00O90J761P59n86j675o30O25J525
$$ 577 1325 430 -1141 -1799 -1027 633 1548 799 -839 -1439 -749 1012 1771 1185 -490 -1120 -495 1030
3922A030R40n61j649q79R23J553O08o52j422p92N56J369R85p06j707r90N83J501
$$ 1030 1970 1409 -240 -1119 -196 1357 1965 1313 -109 -901 -345 1024 2009 1303 -404 -1394 -811 690
3940F90J019r41j532p68L61J463Q57o14j348j190O76J380Q16m88j313j041N30
$$ 690 1709 768 -764 -1532 -1171 292 1149 535 -813 -2003 -1327 53 869 381 -932 -1973 -1443
3957a443J163J270n62j447p98N36J424R36n18j119r60M56J569J034o10j119r32
$$ -1443 -280 990 428 -1019 -1817 -1281 143 1079 561 -558 -1518 -1062 507 1541 931 -188 -1120
3974a120M91J410J032n33r52j159N32J330J098l41j309j004J38J472Q33k33j424
$$ -1120 -629 781 1813 1280 328 -831 -299 1031 2129 1788 479 -525 -387 1085 1918 1685 261
3991B61j006K41R09Q27K9j281j352K56J169R88l50j367j233K39J173J064m54j166
$$ 261 -745 -504 405 1232 1261 -20 -1372 -1116 53 1041 691 -676 -1909 -1670 -497 567 113 -1053
4009a053j006j18J717Q18J05j371j077L74J208J237j74j098r13K31J446R69j65
$$ -1053 -2059 -2177 -460 358 463 -908 -1985 -1611 -403 834 660 -438 -1351 -1120 326 1295 1130
4026A130j076q71J93J133J364j06j183j295K54J336J079j92j098j241R4J036J332
$$ 1130 54 -817 -624 509 1873 1767 584 -711 -457 879 1958 1766 668 -573 -479 557 1889
4043A889l5j586j108K74J135Q98k87j038j315k37J326R06o5j054j154n5R95J099
$$ 1889 1854 268 -840 -566 569 1467 1180 142 -1173 -1410 -84 822 757 -297 -1451 -1506 -511 588
4061E88j06r68j388j98J170J536k94j156r34J70R21J132K11j062j002k12J425
$$ 588 482 -486 -1874 -2072 -902 634 340 -816 -1750 -1580 -659 473 684 -378 -1380 -1592 -167
4078a67J406l40j004q29J98Q19J250N48j263j202k33J351J286Rr58j028k92P14
$$ -167 1239 899 -105 -934 -736 83 1333 1881 618 -584 -817 534 1820 1829 871 -157 -449 265
4096B65J660K30j262j476j16J269Q32J13p70j398o43J037J357L36j708j125L9
$$ 265 1925 2155 893 -583 -699 570 1402 1515 745 -653 -1296 -259 1098 1434 -274 -1399 -1360
4113a360P17J025N6o05j252q81R71J534J66j132j154N7P04R26O98n30j544k91
$$ -1360 -643 382 438 -167 -1419 -2300 -1329 205 371 -761 -1915 -1858 -1154 -228 470 -60 -1604 -1895
4131a895J199J557L68j147q19j11L54J531P90o00j698l44J619J078mr08m95q26
$$ -1895 -696 861 1229 82 -737 -848 -494 1037 1827 1227 -471 -815 804 1882 1878 970 475 -351
4149c51M94J325J113j017j969o40J560P50O9n17j164j063M91J642P48j189j823
$$ -351 143 1468 2581 1564 -405 -1045 515 1265 1334 817 -347 -1410 -919 723 1471 282 -1541
4166a541l57Q47J083M91k09j315j206N45J843P08j243j201nL02P40R38J26j434
$$ -1541 -1898 -1051 32 523 314 -1001 -2207 -1662 181 889 -354 -1555 -1560 -1258 -518 420 546 -888
4184h88j368J038K077L52j135o51q4L19P35J262m5j945j038J380J709J74o10j092
$$ -888 -2256 -1218 859 1211 76 -575 -659 -340 395 1657 1612 -333 -1371 9 1718 1892 1282 190
4202A90m42j26J260J622m67k315r23J300J441J71o11p66j282m90J767J397p75
$$ 190 -252 -378 882 2504 2037 -278 -1201 99 1540 1711 1100 334 -948 -1438 329 1726 951
4219I51k163n20Q07Q35J10N90j071j665k84K012J581j158j687R0N91L35R23O06
$$ 951 -1212 -1732 -925 -90 20 610 -461 -2126 -2410 -398 1183 25 -1662 -1572 -981 -646 277 883
4237H83r60j923J02K280J263j182r16j38J05M29J381N46j601j845R55J845L42
$$ 883 -77 -2000 -1898 382 1645 463 -453 -591 -486 -57 1324 1870 269 -1576 -621 1224 1566
4254A566n94n53n87o15P08K122j0k177j437J024J459J08j97l81j125r32J042K484
$$ 1566 972 419 -168 -783 -75 2047 2037 -140 -1577 -553 906 1014 817 436 -689 -1621 -579 1905
4272A905L5k310j347J037P74L09M12k1j846r09J445K025q92j477n11M08K85L47
$$ 1905 1940 -370 -1717 -680 94 403 815 794 -1052 -1961 -516 1509 617 -860 -1371 -963 -678 -331
4290c31J156o35j740n47J975J239r28j291K14M52j47J199J233j347k228J22K434
$$ -331 825 190 -1550 -2097 -122 1117 189 -1102 -888 -436 -583 616 1849 502 -1726 -1604 830
4307H30J017r33o85m23p41M59K264J079j744k472M13J574R09r2l79q45j550J56
$$ 830 1847 914 229 -194 -935 -476 1788 2867 1123 -1349 -936 638 1547 1455 1076 231 -1319 -1163
4325a163K221R26j375j698M45N23q6O74M15j098j407N86J859r4j712q9P34J22
$$ -1163 1058 1984 609 -1089 -644 -121 -207 467 882 -216 -1623 -1037 822 728 -984 -1073 -339 -217
4343b17j21P86j24j904q23K063K031o95j908p99M57M43J156J610q66k574r64K187
$$ -217 -338 448 324 -1580 -2403 -340 1691 996 -912 -1711 -1254 -811 345 1955 1089 -1485 -2449 -262
$$ [...]
8191H0
##END NTUPLES=NMR FID
##END=
