##TITLE=1H_BAU-j-CCl4
 CCl4, 8 sc, 
 4.2.2019
##JCAMPDX= 6.0         $$ Bruker NMR JCAMP-DX V2.0
##DATA TYPE= NMR FID
##DATA CLASS= NTUPLES
##ORIGIN= UXNMR, Bruker Analytische Messtechnik GmbH
##OWNER= root
$$ XWIN-NMR		Version 3.5
$$ Mon Feb  4 14:25:36 2019 Russian Standard Time (UT+4h)  she@DPX200
##.OBSERVE FREQUENCY= 200.1313
##.OBSERVE NUCLEUS= ^1H
##.DELAY= (6, 6)
##.ACQUISITION MODE= SIMULTANEOUS
##.ACQUISITION SCHEME= undefined
##.AVERAGES= 8
##.DIGITISER RES= 18
##SPECTROMETER/DATA SYSTEM= spect
##.PULSE SEQUENCE= zg30
##.SOLVENT NAME= CDCl3
##.SHIFT REFERENCE= (INTERNAL, CDCl3, 0, 15.7039)
##AUDIT TRAIL= $$ (NUMBER, WHEN, WHO, WHERE, WHAT)
$$ ##TITLE= Audit trail, XWIN-NMR		Version 3.5
$$ ##JCAMPDX= 5.01
$$ ##ORIGIN= Bruker BioSpin GmbH
$$ ##OWNER= she
$$ F:/spectra/data/she/nmr/H-F/1/audita.txt
$$ ##AUDIT TRAIL=  $$ (NUMBER, WHEN, WHO, WHERE, WHAT)
(   1,<2019-02-04 14:24:12.98 +0400>,<she>,<DPX200>,
      <created by zg, POWCHK disabled, PULCHK disabled
       configuration hash MD5:
       00 E9 B6 7A A2 85 ED C7 34 08 36 98 17 FE 4E 26
       data hash MD5: 16K
       6D 2F 56 23 A3 17 F3 CD 21 20 3F 49 99 62 24 CD>)
$$ ##END=
$$ 
$$ hash MD5
$$ B8 FD 18 EC B2 7C B7 5F 64 D6 80 B4 37 43 8C 43
##$RELAX= 
##$RELAX= 
##$RELAX= 
##$RELAX= 
##$RELAX= 
##$RELAX= 
$$ Bruker specific parameters
$$ --------------------------
##$DU= <F:/spectra>
##$EXPNO= 1
##$NAME= <H-F>
##$PROCNO= 1
##$TYPE= <nmr>
##$USER= <she>
##$AMP= (0..31)
100 100 100 100 100 100 100 100 100 100 100 100 100 100 100 100 100 100 
100 100 100 100 100 100 100 100 100 100 100 100 100 100 
##$AQSEQ= 0
##$AQ_mod= 1
##$AUNM= <au_zg>
##$AUTOPOS= <>
##$BF1= 200.13
##$BF2= 200.13
##$BF3= 200.13
##$BF4= 200.13
##$BF5= 200.13
##$BF6= 200.13
##$BF7= 200.13
##$BF8= 200.13
##$BYTORDA= 1
##$CFDGTYP= 0
##$CFRGTYP= 5
##$CHEMSTR= <none>
##$CNST= (0..31)
1 1 145 1 1 1 1 1 1 1 1 1 1 1 1 1 1 1 1 1 1 1 1 1 1 1 1 1 1 1 1 1 
##$CPDPRG= <>
##$CPDPRG1= <>
##$CPDPRG2= <>
##$CPDPRG3= <>
##$CPDPRG4= <mlev>
##$CPDPRG5= <mlev>
##$CPDPRG6= <mlev>
##$CPDPRG7= <mlev>
##$CPDPRG8= <mlev>
##$CPDPRGB= <>
##$CPDPRGT= <>
##$D= (0..31)
0 1.2 0 0 0 0 0 0 0 0 0 0.03 0 0 0 0 0 0 0 0 0 0 0 0 0 0 0 0 0 0 0 0 
##$DATE= 1549275852
##$DBL= (0..7)
120 120 120 120 120 120 120 120 
##$DBP= (0..7)
150 150 150 150 150 150 150 150 
##$DBP07= 0
##$DBPNAM0= <>
##$DBPNAM1= <>
##$DBPNAM2= <>
##$DBPNAM3= <>
##$DBPNAM4= <>
##$DBPNAM5= <>
##$DBPNAM6= <>
##$DBPNAM7= <>
##$DBPOAL= (0..7)
0.5 0.5 0.5 0.5 0.5 0.5 0.5 0.5 
##$DBPOFFS= (0..7)
0 0 0 0 0 0 0 0 
##$DE= 6
##$DECBNUC= <off>
##$DECIM= 32
##$DECNUC= <off>
##$DECSTAT= 4
##$DIGMOD= 1
##$DIGTYP= 9
##$DL= (0..7)
0 120 120 120 120 120 120 120 
##$DP= (0..7)
150 150 150 150 150 150 150 150 
##$DP07= 0
##$DPNAME0= <>
##$DPNAME1= <>
##$DPNAME2= <>
##$DPNAME3= <>
##$DPNAME4= <>
##$DPNAME5= <>
##$DPNAME6= <>
##$DPNAME7= <>
##$DPOAL= (0..7)
0.5 0.5 0.5 0.5 0.5 0.5 0.5 0.5 
##$DPOFFS= (0..7)
0 0 0 0 0 0 0 0 
##$DQDMODE= 0
##$DR= 18
##$DS= 0
##$DSLIST= <SSSSSSSSSSSSSSS>
##$DSPFIRM= 0
$$ [...]
##$SUBNAM2= <"">
##$SUBNAM3= <"">
##$SUBNAM4= <"">
##$SUBNAM5= <"">
##$SUBNAM6= <"">
##$SUBNAM7= <"">
##$SUBNAM8= <"">
##$SUBNAM9= <"">
##$SW= 20.0189088683792
##$SWIBOX= (0..15)
0 0 2 0 0 0 0 0 0 0 0 0 0 0 0 0 
##$SW_h= 4006.41025641026
##$TD= 16384
##$TD0= 1
##$TE= 0
##$TE2= 300
##$TE3= 300
##$TEG= 300
##$TL= (0..7)
0 120 120 120 120 120 120 120 
##$TP= (0..7)
150 150 150 150 150 150 150 150 
##$TP07= 0
##$TPNAME0= <>
##$TPNAME1= <>
##$TPNAME2= <>
##$TPNAME3= <>
##$TPNAME4= <>
##$TPNAME5= <>
##$TPNAME6= <>
##$TPNAME7= <>
##$TPOAL= (0..7)
0.5 0.5 0.5 0.5 0.5 0.5 0.5 0.5 
##$TPOFFS= (0..7)
0 0 0 0 0 0 0 0 
##$TUNHIN= 0
##$TUNHOUT= 0
##$TUNXOUT= 0
##$USERA1= <user>
##$USERA2= <user>
##$USERA3= <user>
##$USERA4= <user>
##$USERA5= <user>
##$V9= 5
##$VALIST= <valist>
##$VCLIST= <CCCCCCCCCCCCCCC>
##$VD= 0
##$VDLIST= <DDDDDDDDDDDDDDD>
##$VPLIST= <PPPPPPPPPPPPPPP>
##$VTLIST= <TTTTTTTTTTTTTTT>
##$WBST= 1024
##$WBSW= 4
##$XGAIN= (0..3)
0 0 0 0 
##$XL= 0
##$YL= 0
##$YMAX_a= 15058
##$YMIN_a= -16769
##$ZGOPTNS= <>
##$ZL1= 120
##$ZL2= 120
##$ZL3= 120
##$ZL4= 120
##$ABSF1= 10
##$ABSF2= 0
##$ABSG= 5
##$ABSL= 3
##$ALPHA= 0
##$AQORDER= 0
##$ASSFAC= 0
##$ASSFACI= 0
##$ASSFACX= 0
##$ASSWID= 0
##$AUNMP= <proc_1d>
##$AZFE= 0.1
##$AZFW= 0.1
##$BCFW= 1
##$BC_mod= 2
##$BYTORDP= 1
##$COROFFS= 0
##$CY= 11.3945322036743
##$DATMOD= 1
##$DC= 2
##$DFILT= <>
##$DTYPP= 0
##$F1P= 18.9103706918063
##$F2P= -1.10871071338519
##$FCOR= 0.5
##$FTSIZE= 0
##$FT_mod= 4
##$GAMMA= 1
##$GB= 0.15
##$INTBC= 1
##$INTSCL= 1
##$ISEN= 128
##$LB= 0.24
##$LEV0= 0
##$LPBIN= 0
##$MAXI= 10000
##$MC2= 0
##$MEAN= 0
##$ME_mod= 0
##$MI= 1.114404
##$NCOEF= 0
##$NC_proc= 0
##$NLEV= 6
##$NOISF1= 3.799351
##$NOISF2= 2.8
##$NSP= 1
##$NTH_PI= 0
##$NZP= 0
##$OFFSET= 15.70392
##$PC= 1
##$PHC0= -9054.57
##$PHC1= 50.60004
##$PH_mod= 1
##$PKNL= yes
##$PPARMOD= 0
##$PSCAL= 0
##$PSIGN= 0
##$REVERSE= no
##$SF= 200.130013532006
##$SI= 16384
##$SIGF1= 3
##$SIGF2= 2
##$SINO= 400
##$SIOLD= 16384
##$SREGLST= <1H.CDCl3>
##$SSB= 0
##$STSI= 0
##$STSR= 0
##$SW_p= 3612.71676300578
##$SYMM= 0
##$S_DEV= 0
##$TDeff= 0
##$TDoff= 0
##$TI= <>
##$TILT= no
##$TM1= 0
##$TM2= 0
##$TOPLEV= 0
##$USERP1= <user>
##$USERP2= <user>
##$USERP3= <user>
##$USERP4= <user>
##$USERP5= <user>
##$WDW= 1
##$XDIM= 8192
##$YMAX_p= 0
##$YMIN_p= 0
$$ End of Bruker specific parameters
$$ ---------------------------------
##NTUPLES= NMR FID
##VAR_NAME=  TIME,          FID/REAL,        FID/IMAG
##SYMBOL=    X,             R,               I
##VAR_TYPE=  INDEPENDENT,   DEPENDENT,       DEPENDENT
##VAR_FORM=  AFFN,          ASDF,            ASDF
##VAR_DIM=   8192,          8192,            8192
##UNITS=     SECONDS,       ARBITRARY UNITS, ARBITRARY UNITS
##FACTOR=    0.0002496,     1,               1
##FIRST=     0,             0,               0
##LAST=      2.0444736,     0,               0
##MIN=       0,             -16769,          0
##MAX=       2.0444736,     15058,           0
$$ Real data points
##PAGE= N=1
##DATA TABLE= (X++(R..R)), XYDATA
0@%%%%%%%%%%%%%%%%%%%%%%pJ5j6J6j6J6j6K2l0L2l2L8m6M9n6O4p1P9q7R7j07
43e6J19j33J47j62J78j95K15k38K62k89L19l51L88m33M82n35O01o78P71q88J034
64E58j233J512j933K671m335J7818j1652j7981J2079R237K449j2416q558Q314
78c470J4341n019j1803l191R848R216l869j4629k95J2820N858r186j0120J995
92g504J3913L577j1454q218P106J1354o76j1194o846Q717J0511m255j1838k438
106i245J0370R168o342j2403R16J2745N098r675j0178L662J2776J889j2340o972
120a0531Q087J0613r92j1378m972R873R312m843j2143j654J0854P824q373j1587
134i910L194J2541L099r577q171N117J1736L4j2115n504P810R844k459j1708l202
$$ y = [0, 0, 0, 0, 0, 0, 0, 0, 0, 0, 0, 0, 0, 0, 0, 0, 0, 0, 0, 0, 0, 0, 0, -7, 8, -8, 8, -8, 8, -8, 14, -16, 16, -16, 22, -24, 25, -31, 33, -38, 41, -46, 51, -56, 63, -70, 77, -85, 93, -102, 113, -125, 137, -152, 167, -184, 204, -229, 253, -282, 319, -359, 412, -476, 558, -675, 837, -1096, 1575, -2760, 15058, 3406, -14575, -2496, 6741, 9190, -3226, -11784, -3470, 10871, 5852, -5951, -9142, 706, 9922, 6053, -8576, -8871, 3949, 9807, 621, -9499, -7504, 6409, 9986, -1468, -9686, -2580, 8774, 8098, -3096, -9942, -1225, 9286, 5031, -6807, -9245, 1125, 10293, 3951, -8452, -7536, 5209, 10307, 632, -9546, -5884, 6892, 8781, -3559, -10531, -2444, 8169, 7177, -4201, -9173, 700, 10012, 5169, -6974, -8628, 2226, 10050, 1677, -9910, -6716, 5825, 8924, -653, -8824, -3707, 8029, 8063, -4052, -9556, -1746, 8098, 5639, -6069, -9271]
149i271J0209Q827o070j0901K82J1738N443r596r905M068J1187J799j0400p095
163i685O833J0787j272j0556m533Q428R076m038j1971j675J0834O824p297j0230
177h475J918J1947L621r433q078N526R886P80j0686n942O812R598k414j0376l510
192h826R403Q588n341j0604j21J0763M999q156r311L154J0703J993r385o508O220
207b429R657m31r925m942P825Q881l900j0843k274R917P227o955j0009K124J0754
222D677L511q355p704M267J0159N32r712n696O050R369j538j0472l271Q932P699
237H448m552r947m01R736N221p543r263L125J0189J812q225o601M981R624K10
252F814r509m936P121Q102l024r868k730R514O509n849r189J168R843M215p583
$$ y = [-9271, 938, 9765, 3695, -7206, -6924, 4814, 10257, 661, -9244, -5176, 6011, 7810, -2590, -9685, -2852, 7935, 6663, -3893, -8426, 2, 9078, 5040, -6931, -8606, 2228, 9052, 1755, -8475, -6557, 5390, 9011, -422, -8500, -2974, 6912, 7692, -2994, -8936, -2124, 7474, 5060, -5316, -8826, 577, 9165, 3824, -6780, -6901, 3862, 8861, 705, -8606, -5452, 5251, 7244, -2141, -8649, -2429, 7228, 6797, -3128, -8070, -245, 8636, 4736, -6107, -8381, 1536, 8763, 1808, -8201, -6077, 4677, 8188, -167, -7871, -3604, 6555, 7087, -2625, -8321, -2271, 7098, 5560, -4912, -8183, 749, 8448, 3896, -6051, -6452, 3284, 8505, 962, -8301, -5176, 5013, 6825, -1400, -8001, -3020, 6604, 6814, -2695, -7631, -510, 7592, 4568, -5300, -8030, 1484, 7993, 2144, -7045, -5877, 3966, 8181, 598]
267E98p692L485R385O22q584n760N098R162r24r671l409P971P645m074r907n88
283f643R286M860o663q332K329R052K932p549o689M732Q953J90q715m760N937
298a080Q176k443r709k555Q614O589n300r053J083R438L783o954p298K810Q513
313D614J472p963n950N092Q727p74q597l502P108P520l372r556p40Q322M598n718
329A281p797J255R144K555p040o193L708Q444N33p767n472N517Q106j617r463
344d806k244P779O142m210q247N69Q548L733o279p369K732P884J996p755n839
359g366M810Q230l4q744l567O489P077l048q908r61P554N160n425p498J414Q003
375C186L102o118o196L027Q323R56q013n211N386P771k012q410k609P361O282
$$ y = [598, -7094, -3609, 5776, 6398, -2186, -7946, -2848, 6314, 5390, -4281, -7690, 281, 7926, 3852, -6055, -6643, 2643, 7503, 840, -7492, -5163, 3889, 6821, -728, -7417, -2685, 6268, 6458, -2257, -7017, -1080, 7096, 4653, -5056, -7611, 1003, 7592, 2292, -6761, -5678, 3760, 7543, 589, -6709, -3899, 4614, 6086, -1877, -7827, -2735, 5992, 5218, -3379, -6881, 227, 7747, 4375, -5181, -5921, 2401, 6999, 1281, -6516, -5261, 3883, 6438, -602, -6795, -3087, 5357, 5890, -1877, -7349, -1832, 6274, 4657, -4806, -7050, 729, 6871, 2661, -5586, -5017, 3531, 7264, 985, -6384, -3652, 4232, 6228, -1527, -7366, -2556, 5674, 5640, -3104, -6671, -182, 6895, 3847, -5061, -6022, 1532, 6692, 1267, -6231, -4817, 3186, 6288, 170, -6026, -2999, 5324, 6280, -1733, -6944, -1558, 6213, 4201, -4209, -6818, 543, 6825]
390F825l925q058K61P617L854n558p073K115P519K142o668n861M224P811L70p814
406b219m179O096O923k403q464j664P563M746m926p236P08Q147K980n725o254
421e907K467Q155J143p395n100M715P391j296p686l169O984O207l774p604J38
436d731P227L828n127o955J604P740K125o238n696L378Q017L87p784l933N703
451d55O524k129p677k110O505M999m079p143Q41P386L167n137o256K528P182J545
467E691p059m772M273P258j091p463l144O456N942k840p337p55O734M199m638
482A454o896J113O792L026n966n927L273Q002M50p035m219N275O296j877p571
497c810j805O293M939l456o839M01O577L835n324n966J893P101J579o626m862
$$ y = [6825, 2900, -5158, -4897, 2720, 6574, 1016, -6057, -3942, 3577, 5719, -949, -6810, -2586, 5225, 5595, -2219, -6398, -302, 6621, 4218, -4246, -5910, 1653, 6399, 1473, -5763, -5055, 3092, 6072, 347, -5907, -3440, 4715, 5858, -1537, -6637, -1922, 5469, 4173, -3513, -6682, 302, 6509, 2735, -4869, -4731, 2496, 6324, 1197, -5758, -4154, 3586, 5711, -527, -6223, -2845, 5172, 5559, -2225, -6158, -455, 6069, 3940, -3737, -5847, 658, 5657, 1578, -5565, -4724, 2662, 5829, 692, -5564, -3036, 4146, 5691, -1368, -6140, -1867, 5391, 4300, -3163, -6307, 149, 6091, 3251, -4086, -4841, 1893, 6092, 1454, -5442, -4329, 2463, 5489, -477, -6404, -3131, 4871, 5321, -1714, -5933, -658, 5638, 3761, -3810, -5615, 678, 5617, 2161, -4678, -4277, 2300, 6135, 811, -5155, -3262, 3839, 5418, -1208, -6070]
512f070L760P037n90o936k857N654N723k515p102j048O550L897l621o660N36O698
528B456K753n322n800L163P125Q06o704m206M572O512j556p258k167O112M614
543E100l102o433M3O497L727m760o212J766O731K114o144n265L662O707j31o884
559b584k890N335N477k148o767j236O196M084l527o887M85O619L250n177n518
574e288K352P098J404o657m384M416N990j307o756k307N399N272k918o360k70
589d316O342L772m579n903R22O750K091n942n124L427O633J70o324l368N433N312
605E296k011o430j537N583M317l314o256j92O768L164m876n464J980O849J315
620E192o036m390L775O001j174o311k154M692N247k128o240p10O167L492l851
$$ y = [-6070, -2310, 4727, 4137, -2799, -5656, -2, 5721, 3206, -3896, -4944, 1606, 5503, 1882, -4778, -4242, 2456, 5209, -113, -5913, -2750, 4375, 5181, -1523, -5729, -1157, 5355, 3799, -3459, -5626, 486, 5100, 1998, -4435, -4392, 2105, 5832, 1072, -5140, -3374, 3357, 5471, -673, -5938, -2276, 4431, 4300, -2584, -5474, -139, 5338, 3190, -3577, -4813, 1383, 5467, 1940, -4947, -4462, 2157, 5407, 230, -5288, -2936, 4162, 5566, -1091, -5475, -1059, 4931, 3624, -3132, -5439, -40, 5232, 2314, -4046, -4316, 2026, 5798, 1219, -4684, -3762, 2988, 5079, -863, -5987, -2560, 4073, 4243, -2081, -5449, -16, 5296, 3285, -3145, -4682, 901, 5218, 1904, -4352, -4544, 2224, 5388, 512, -4952, -2972, 3877, 5192, -844, -5234, -1459, 4542, 3368, -2943, -5097, -405, 4842, 2714, -3526, -4236, 1931, 5423, 1572]
635A572n912M37O873J952n338n322L136O715K89o136l333M422N252j226o052k273
651d944N259M539l018o310k42O164L568m340n353J566O409J971n964m747L685
666a757N745m34o077k525M776M965j940n855j229N444M215l538n996L51O229K360
682D734m938n197K524O392Q36n848l277L763N433q93o149k090M786M410k371n789
698c674m35N646L771m098n430J263O565J287n509m099K510N970j20o049k825M628
714e99N044j406n995j232N161M036l168n536l00O028L003n007m692K118O322N84
730D361n425l423L473N364j061n539k296M352M699k451n923p09N945L629l688
745A308n772J395N859J808n072m128K607N405J67n561k863M027N263j503n522
$$ y = [1572, -4340, -3903, 2970, 4922, -416, -5738, -2602, 4113, 4402, -1734, -5067, -645, 4607, 3381, -2671, -4944, 315, 4854, 1836, -4474, -4716, 1448, 5016, 676, -4677, -3111, 3298, 5269, -695, -5442, -1757, 3988, 3554, -2523, -5048, -272, 4693, 2753, -3102, -4331, 1113, 5328, 1790, -4206, -3855, 2374, 4734, -204, -5401, -2877, 3515, 4351, -1497, -4774, -1011, 4422, 3529, -2620, -4710, 76, 4486, 2115, -3674, -4109, 1537, 5308, 1210, -4220, -2957, 3608, 4895, -614, -4713, -2203, 3767, 3647, -2402, -5227, -599, 4445, 3039, -2956, -4188, 973, 5009, 1841, -3695, -3995, 2033, 5036, 29, -4663, -2545, 3777, 4361, -1064, -4487, -1014, 4350, 3289, -2250, -4546, -194, 4505, 2054, -3869, -4578, 1367, 4996, 1308, -4464, -3069, 2790, 4598, -474, -4602, -1995, 3410, 3577, -1984, -4847, -820, 4443, 2940, -2582]
760b582j620N010L877k748n815k4N726K677m303n267K538N717J018m871l823L221
776a269N423o05n482k590L882M802j767n598j300N752L880l537n657R94N763K019
792D710n156m233K613N123N93n436k900L753N206j070n465j889M772M057k669
807B009n785p4N169L132l896m805J535N607J471m949l491K618N125j57n459k564
823d514L770M947j633n545j343N333L814l358m981K48N506K197m517m257K114
838b219N328M70n183k890L475N027q59n099k326M188M454k230n884j26N153K968
854D247l755m435R03N713J785m904l466K455M959k8m996k958L760M843j463n486
870b826j112M725L916l070n163L86N339J773l691m582J665N363J041m754l217
$$ y = [-2582, -4202, 808, 4685, 1937, -3878, -3902, 1824, 4501, 198, -5069, -2531, 3186, 4204, -667, -4490, -1269, 4154, 3549, -1933, -4523, -641, 4161, 2394, -3204, -4504, 1248, 5128, 1591, -4066, -3072, 2691, 4710, -446, -4679, -2066, 3057, 3650, -1786, -4686, -933, 4273, 3203, -2262, -4151, 621, 4678, 2009, -3776, -3850, 1319, 4451, 555, -4250, -2715, 2892, 4363, -586, -4077, -1459, 3666, 3509, -1950, -4514, -744, 4203, 2570, -2975, -4318, 1015, 4829, 1471, -3510, -3262, 2244, 4441, -76, -4333, -2219, 3109, 3579, -1604, -4494, -1019, 4008, 3149, -1950, -4276, -88, 4366, 2136, -3748, -3874, 1279, 4247, 492, -3943, -3040, 2673, 4458, -446, -3912, -1457, 3502, 3474, -1522, -4480, -720, 4123, 2660, -2826, -3938, 787, 4703, 1633, -3530, -3144, 2195, 3968, 277, -4305, -2640, 2723, 3764, -990, -4207]
885d207K800N143l35n487j952L907M709k704n147p27N236K917l070m734J133N056
901B538J757m485l792K015M831O22m885l253L456M673p08n372j666M872L588k429
917A762n149K61M848K193l742m422J719N235J034m166l619K751M909l55m838k620
933d199L776M293j664n256r07M530L647l506m235P26N087J655l760m037J663M911
949B724O60m487k936L084M521n57m981k024M393L938k407n000P4M140K765l672
965B35m271J327N024J325m165l236K218M818K59m886k655L367M271j322n075j002
981c768M352L483k617m943O48N045J697l532m098J565M701Q71m370k997K556M797
997C390l32n127j693L959L754k173m806m37M789K253k738m411Q95M888J671l902
$$ y = [-4207, -1407, 3736, 3401, -2086, -4038, -131, 4578, 1874, -3273, -4000, 1236, 4153, 1083, -3651, -2518, 2538, 4295, -190, -3982, -1967, 2864, 3486, -1399, -4652, -1196, 3477, 2769, -2603, -4269, 603, 4191, 1762, -3387, -3126, 1722, 3915, 173, -4249, -2530, 2705, 3739, -427, -4046, -1295, 3614, 3259, -1579, -4199, -423, 3870, 2206, -3050, -3957, 573, 4220, 714, -3521, -2795, 2292, 3947, 187, -3850, -2187, 2724, 3384, -1103, -4039, -955, 3566, 3009, -1972, -3996, 397, 4335, 1928, -3072, -2998, 1142, 3907, 235, -4036, -2709, 2315, 3640, -525, -3761, -1543, 3275, 3534, -1352, -4007, -640, 3631, 2309, -2766, -3768, 584, 4067, 1450, -3493, -2845, 2200, 3897, 365, -3733, -2168, 2533, 3404, -966, -3963, -1407, 3390, 3058, -2069, -3762, 197, 3951, 1778, -3028, -3465, 1324, 3577, 839, -3572, -2677, 2211, 3882, -20]
1013b0l757K235M709O3m521k914L185M623j345m913j121M393L019k323m190P3
1029b804M364K223l401l854J218M150J499l883l418K795M381J4m799j928L507
1044F4L916j765n220k84M229K502l033l894P33M469J884l342l661J473M866L77
1060C314m365k948K979M459j063m751j152M063L539k345m309K4M086K268l224
1075E75m165J041M211J470l789k973K197M433J14m733k154L685L696j685m350
1090b427r41L973K650k322m061N32M559J823l424l781J686M420O29m222k851K664
1106a093L955o08m376j317L620L394j808m117n00L908K464k912l675P03M194J281
1122C113l469l416K347M423J62m310k206K981L835j319m614q76L645K923k032
$$ y = [-20, -3777, -1542, 3167, 3230, -1291, -4205, -1020, 3603, 2258, -2655, -3776, 617, 3636, 1313, -2877, -2804, 1560, 3783, 382, -3472, -2254, 1896, 3395, -488, -3906, -1111, 3270, 3284, -1515, -3443, 64, 3980, 2215, -3005, -3289, 940, 3442, 409, -3485, -2752, 1717, 3601, 259, -3402, -1929, 2937, 3314, -1051, -3999, -1020, 3439, 2376, -2375, -3527, 536, 4075, 1730, -2579, -2555, 1531, 3799, 575, -3590, -2549, 1662, 3132, -657, -3630, -1433, 3000, 3114, -1619, -3773, -88, 3608, 1923, -2427, -3368, 605, 3255, 933, -3128, -2596, 1963, 3786, 362, -3419, -1733, 2687, 3316, -906, -3757, -1093, 2862, 2254, -2122, -3439, 181, 3575, 1767, -2350, -2850, 1058, 3522, 610, -3065, -2362, 1832, 3113, -356, -3772, -1425, 2998, 3160, -1150, -3356, -375, 3460, 2141, -2473, -3349, 296, 3219, 1187]
1137A187l940p8M262K026k983l629J197M484O13m111k706K485M244n45m517j294
1153c305L561L243j462m144m39L383K594k665l784N04L983J533l315k974J721
1168a566M366K43m407j816K390M091j252m243j070L599K820k107l577k04L893
1183A160K470l034l937J507M138Q31l833k921K444L699o4m320j354L196L261j240
1199B003m326p04L462K856k438l842K72M416J423l015l264J416M582M71m054k385
1215c127K223L581n73m264q94L086K978j642l830k04L460K575k763l527Q99L917
1231A895J421l778l032K277L751j44l605j854K975L296j090l432j479L419K298
1246B918j693l888N9M017J749k665l085P85M386L72m006k032K337L289o96l688
$$ y = [1187, -2753, -2831, 1431, 3457, 474, -3155, -1958, 2526, 3139, -972, -3678, -1193, 3051, 2506, -2011, -3305, 256, 3499, 2037, -2107, -2546, 837, 3431, 766, -3018, -2514, 1469, 3002, -313, -3287, -1566, 2800, 3043, -1364, -3180, -790, 3301, 2049, -2194, -3264, 335, 3155, 1048, -2529, -2733, 1160, 3630, 596, -3341, -1834, 2304, 3135, -698, -3619, -1175, 2524, 2460, -1860, -3214, -18, 3243, 2003, -2323, -3027, 435, 3291, 853, -2989, -2717, 1699, 3122, 107, -3157, -1741, 2841, 3312, -742, -3127, -904, 2677, 2104, -2160, -3054, 32, 3010, 1368, -2462, -2666, 794, 3369, 606, -2921, -2022, 1895, 3316, -462, -3494, -1217, 2534, 2390, -1215, -3069, -94, 3202, 2112, -1320, -2799, 620, 2918, 1225, -2663, -2604, 1413, 3162, 497, -2588, -1803, 2583, 2955, -1051, -3083, -746, 2543, 1847, -1841]
1262a841j236K705L462j234m051l82L456K544k350l589J21L827J840l721k841
1277c290J720L906L03l455k483K833L301q45l647j205L177K542j672l742o7L772
1293A148J986k669l488J586L708P03l376k878K280L577n58l634j345K637L412
1308C089j281l722q34L535K356k175l625L36L740J218k556l405J873L664J23l118
1324g82k136K575L098p49l500j475L281K387j441l735k50L754K012k602l235Q86
1340a912L900P96l165k855K066L486k27l236j725K495L322q20l525j061L021K748
1356C308k130l873M81L427J918l102l175J354L752N91l254k098K334L048o21l187
1372a227j791L013K862j250l950j65L515J968k164l126M51L776R98l169k788J629
$$ y = [-1841, -3077, -372, 3090, 1856, -2195, -2577, 879, 3423, 1073, -2516, -2395, 1432, 3272, -449, -3290, -1570, 2336, 2639, -816, -3299, -466, 2835, 1990, -1657, -2862, 315, 2857, 1185, -2557, -2624, 1148, 3134, 465, -3023, -1437, 2271, 2974, -402, -3280, -1000, 2577, 2019, -1615, -2960, -323, 3089, 1808, -1914, -2748, 787, 3143, 968, -2657, -2321, 1419, 2637, 81, -3324, -1451, 2213, 2336, -782, -2918, -343, 2755, 2006, -1494, -2969, 312, 2699, 1258, -2477, -2727, 1027, 3039, 437, -2798, -1912, 1988, 2784, -381, -3236, -1170, 2316, 2089, -1147, -2872, -377, 2945, 2125, -1400, -2461, 560, 3308, 1178, -2695, -2214, 1213, 3131, 29, -3146, -1792, 1960, 2551, -703, -2801, -467, 2581, 1960, -1227, -3018, -5, 2857, 1607, -2343, -2508, 1007, 2975, 811, -2315, -1864, 1912, 2910, -259, -3047, -1418]
1388a418L130M88l076j809K095L478p66l758j009L103K380j705l399k35L604J596
1404B699k490k873J110L794L96l124k176J781L335m77l130j645K445K732j146
1419A231l281o33L442K236j985l406K27L639J072k822k491J246L324L55k952j951
1435b749K213L063m61l445j046K670K555j771l271OL241J419k394k393Q53L345
1451A835M13k476k441J419L416J61l313j971K246L124r81l126q92L310K139j799
1467A064l019r0L334J287k629k682J297L247M47k867k083J999K958r4l439j432
1483b702K721K498j169l433m74L178K002k041k791P47L164R46k706k418J642K623
1499A787L81l103j882K321K715p17l287m90K678K538k014k941N4L061J104k078
$$ y = [-1418, 1712, 2200, -876, -2685, -590, 2888, 2122, -1636, -2645, 458, 2838, 1133, -2266, -2501, 1103, 2699, 209, -2664, -1554, 2240, 2636, -488, -2664, -883, 2452, 1975, -1155, -2800, -355, 2377, 1231, -2050, -2683, 759, 2995, 1010, -2396, -2169, 1470, 2542, -280, -2771, -1525, 1799, 2154, -798, -2749, -536, 2527, 2066, -1379, -2425, 245, 2800, 1029, -2242, -2236, 1005, 2424, 30, -2363, -1510, 1835, 2248, -228, -2669, -1250, 2166, 2327, -986, -2957, -711, 2413, 1432, -1694, -2586, 724, 2863, 1064, -1955, -2045, 1289, 2576, -53, -2735, -1438, 1809, 2256, -611, -2694, -695, 2263, 2169, -1270, -2702, 19, 2517, 1348, -2085, -2559, 619, 2621, 580, -2211, -1464, 1700, 2646, -60, -2478, -836, 1787, 2168, -935, -2817, -496, 2219, 1502, -1785, -2275, 403, 2941, 927, -2014, -1960, 1101, 2205, 127]
1515A27k606J008K755J037k633j956J547K966m35k780j526K286K819j241l231
1530a863k49K862J582j617k906M79K956J397k512k442Q95L233J07l027j637J692
1546a050L056q4l284j223K907K274j456l244Q3K974J338k075k413O40K792J155
1562B390k370k533J518L091m9l129j374K193K567q93l250m52K684K195j724k905
1578b041K17K948J287k050k669J114K547O34k643j790J322L328k46l250r50K318
1594G6K422j308l115k83K904J408j701k462M74L018R03k195k484J249K922K03
1610B031k806j744K267K504q64k949q57K753J887j218k807J08K705J168j829k681
1626b332J123K677N86k582k121J818K630R4l027q70J827K741j399k831k31K423
$$ y = [127, -2479, -1471, 1284, 2321, -312, -2268, -721, 2245, 1810, -970, -2496, -210, 2609, 1368, -1863, -2112, 750, 2332, 715, -2191, -1712, 1244, 2641, 129, -2313, -1418, 1815, 1922, -1105, -2742, -1050, 2006, 1922, -1362, -2585, 322, 2596, 1140, -2104, -2021, 953, 2291, 216, -2197, -1557, 1235, 2390, 20, -2513, -995, 2096, 2047, -1082, -2456, -263, 2304, 1411, -1839, -2291, 393, 2588, 864, -2041, -1824, 1124, 2411, 361, -2308, -1194, 1353, 1987, -656, -2446, -1124, 2204, 1958, -1292, -2242, 76, 2498, 1190, -1925, -2208, 696, 2104, 403, -2059, -1585, 1433, 2336, 141, -2343, -1094, 1828, 2031, -775, -2519, -252, 2252, 1388, -1561, -2418, 335, 2222, 1004, -1803, -1695, 1010, 2178, 349, -2332, -1209, 1468, 2054, -528, -2649, -831, 1799, 1893, -1134, -2004, -177, 2564, 1165, -1666, -1897, 526]
1642E26J748j687k654N41K882J228k391k400J271K680J77k554j836J963K547o56
1658A385l049o73K690J921j080k813J59K499J471k199k277M62K530P99k375j641
1674b191J322K842R8k699j585K098K324q86k922l25K427J525j336k512K00K812
1690A192J177k138k305P94K981L31k426k258J890K755n59k767r02K433K067j143
1706A122k719O5K116J802j968k711O79K395J296k281k116J000L061L9k353j858
1722b431K264K434r66k562q75K467J904j749k246P2K509J528j955k556Q63K707
1738A408M63k498j471J306K691m72k690n73J793K145j083k271n28K594J398j593
1754F19k782M47K722J019k122k035J263K747J11k562j625J904K395o91k860o61
$$ y = [526, 2274, 587, -2067, -1526, 1356, 2584, 193, -2207, -936, 1744, 1921, -633, -2469, -506, 2041, 1385, -1664, -2337, 353, 2274, 1194, -1619, -1460, 1039, 2510, 311, -1966, -1504, 1026, 1825, -550, -2191, -869, 1973, 2071, -628, -2213, -115, 2209, 1323, -1599, -1924, 503, 2028, 692, -1820, -1620, 1192, 2369, 231, -2074, -1280, 1701, 2032, -394, -2652, -762, 1993, 1434, -1333, -2235, 198, 2265, 1122, -1597, -1532, 584, 2386, 418, -2293, -1614, 781, 2077, -204, -2320, -1320, 1741, 1780, -573, -2431, -167, 2267, 1301, -1261, -2136, 331, 2235, 486, -1760, -1688, 821, 2349, 394, -2162, -1299, 1408, 1871, -627, -2098, -792, 1899, 1427, -1263, -1836, -43, 2102, 1019, -1252, -1780, 814, 2212, 619, -2163, -1716, 1006, 2025, -97, -2132, -869, 1878, 1989, -573, -2198, -294, 2101, 1410, -1450, -2111]
1770b111K120K022j238k379j57K545J412j769k245L83L001M36k406j730J316K398
1786A598Kk641r30J950K178j246k041n35K024J666j472k232p3K476J402k180j907
1803a961Q84K570L54k178k035K056K186p09k342p24J991J697o83k559l48K643
1819H42J559j925k135L44K508N82k212j764J235K542Q8k478j349J732K324o08
1835A285k534l83J982J666j338k632K88K651R46j961j810N47K612M34k200j702
1851b149J612K164m35k448p29J865J753p37k188l90K170J628j331k496K77K301
1867H67Q32k098j829J501K064N62k553j186J740K170p03k668l95J679K075j383
1883F75k299j8K174J408j689k129O89K400O40k116j566J327K075l15k032j117
$$ y = [-2111, 9, 2031, 793, -1586, -1743, 802, 2214, 445, -1800, -1417, 1584, 2020, -386, -2116, -800, 1598, 1600, -1041, -1971, -21, 2157, 911, -1130, -1665, 359, 2025, 553, -1679, -1752, 724, 2126, -54, -1961, -1077, 1493, 1847, -331, -2366, -310, 1876, 1167, -1175, -1899, 92, 1789, 1106, -1453, -1801, 842, 2401, 476, -1659, -1315, 1193, 1775, -437, -2201, -966, 1576, 1664, -814, -2163, -431, 1893, 1285, -1249, -1632, 350, 2016, 678, -1954, -1666, 985, 1931, -30, -1840, -1293, 1319, 1753, -447, -2149, -537, 1627, 1192, -1256, -1985, -120, 1633, 896, -1292, -1682, 488, 2116, 785, -1711, -1434, 867, 1699, -399, -2228, -727, 1337, 1899, -654, -1840, -100, 2070, 1367, -1301, -1696, -17, 2058, 675, -1624, -1642, 532, 1940, 251, -1878, -1189, 1211, 1851, -265, -1831, -504, 1571, 1256, -776, -1893]
1899a893J780J996q64k240k98J816J824j494k324P6K631Q71k144j865J158K401
1915A431L6j562j713J350K462n12k654q44K266J306l77k708j57K235J302j246
1931F15k293O48K226O55k010j829R84K331J08k173j281J395K446o22k171p72J975
1948B32J485r27k556L35K110J429k034k223J103K397L03k093j418J255K181k72
1964A307k354p38J425K001p35k241o27K696J274j590j737jK050R17j827j478Q68
1981g90K107R0j993j282J549K324m52k390r42J884J785j147k335K07J671J250
1997A536j599j776Q10K309L08j662j514R04J784R4k060j153J756K026p96k424
2013a457k45K321J374j225k158K31K148O00j436k074Q44K100L64j871j266J545
$$ y = [-1893, -113, 1883, 1019, -1221, -1519, 297, 2121, 627, -1697, -1621, 1010, 1881, -263, -2128, -970, 1431, 1467, -95, -1808, -458, 2004, 1492, -1162, -2006, 260, 1566, 1189, -1519, -1676, 559, 1861, 615, -1678, -1030, 1196, 1851, -159, -1988, -1004, 1327, 1435, -738, -2019, -624, 1822, 1200, -971, -1743, 232, 1717, 790, -1766, -1431, 679, 2108, 74, -2149, -1046, 1351, 1654, -439, -1857, -602, 1579, 1307, -1047, -1785, -360, 1641, 906, -1335, -1962, 734, 2008, 418, -1319, -1320, 730, 1647, -180, -1658, -790, 1317, 1407, -586, -1868, -319, 2005, 1553, -837, -1779, 105, 1890, 743, -1592, -1385, 286, 1536, -63, -1839, -1029, 1280, 1588, -74, -1588, -684, 1100, 1194, -866, -2019, -263, 1763, 967, -1457, -1702, 619, 1993, 768, -1390, -1159, 989, 1589, 153, -1921, -1077, 1023, 1387, -484, -1750, -205]
2029b05J685l04j995r86J910J746r80k283o4K101P43r98k075M21K335O42j765
2046g2j738J004J937K55j859j254J116K219n66k468k59J764J590r45k104O6K093
2063G79Q88j757j607O50K200M57j772j411J159J809J59k123j163J711J672r70
2079F81k038l23K039J321j484j304l9K053O72j647j503P49K218J26k150j342J734
2096b37K079q14k123n99K055J569j124j860kJ785P15j044j941L49J940O61j806
2113c97j104Q65J967ok205o82J320J717l15k253n93K126J620j603j958M54J897
2130H50J115j718j581O74J459L27j602j169J225J717k10k058n93J397J942q65
2146I10k128j70J847J148j138j975N36J754O47j395j590R11J905K38k094j196
$$ y = [-205, 1480, 1176, -819, -1805, 105, 1851, 871, -1412, -1476, 625, 1368, 370, -1705, -1284, 1051, 1693, -72, -1810, -806, 1131, 1386, -473, -1727, -611, 1608, 1042, -1426, -1685, 79, 1669, 724, -1380, -1314, 779, 1667, -90, -1697, -1047, 1153, 1610, -162, -1573, -414, 1395, 1554, -569, -1732, -21, 1651, 681, -1357, -1680, 359, 1680, 196, -1108, -1147, 906, 1578, -69, -1572, -823, 1395, 1521, -629, -1971, -237, 1842, 1028, -1095, -1694, 361, 1930, 806, -1054, -1056, 729, 1444, 400, -1541, -1192, 748, 1409, -397, -1501, -636, 1331, 1325, -880, -1562, -242, 1475, 1160, -1093, -1686, 440, 2060, 457, -1501, -1047, 850, 1965, 247, -1334, -660, 799, 1126, -476, -1645, -420, 1297, 1087, -971, -1564, -167, 1775, 910, -1218, -1388, 459, 1607, 469, -1506, -970, 784, 1431, 36, -1554, -643, 1262, 1500, -594, -1790]
2162a790J296J959n91k018m58K033J239j254j476j13J879R69j708j338O07J780
2178A016K34j653j099P45K264l66j944k83Q86J743o47k069k15J786J042r64j853
2195a377K72J996P68j565j575Q36J677K31j716j080J207J718n00j833m90J549
2211A18J373q71j587k98J789J149j365j867L42K014J32j246j097Q09J630Q1j872
2228g66o82J480J416l93k476J8J701J079j102j282k0J563N45p23j618M44J897
2245A081K29j785j173J260J748j95k188l45J324J748j102j615r3J380J083q78
2261D79j964O00J708O22j463j692J144J845N6j888p38J089J599o56j499m72J281
2278E1J289p86j835K28J771P83j252j489N18J909m4j491r82O92J811k39j591o19
$$ y = [-1790, -494, 1465, 874, -1144, -1602, 431, 1670, 416, -1060, -1173, 706, 1675, -33, -1371, -764, 1016, 1250, -403, -1502, -757, 1507, 1141, -803, -1086, -200, 1543, 896, -1173, -1388, 398, 1440, 476, -1377, -1105, 891, 1659, 94, -1481, -645, 1032, 1263, -453, -1533, -326, 1392, 892, -941, -1431, 118, 1491, 620, -967, -1265, 524, 1673, 308, -1559, -1217, 797, 929, -317, -1414, -605, 1025, 1106, -766, -1448, 32, 1448, 1055, -1421, -1403, 298, 1377, 275, -1007, -1027, 536, 1081, 358, -1260, -816, 1081, 1310, -475, -1648, -388, 1360, 1165, -1023, -1368, -44, 1704, 602, -1013, -1106, 274, 1357, 479, -1485, -885, 823, 1445, -18, -1710, -566, 1279, 1335, -553, -1291, -202, 1397, 741, -758, -1230, 51, 1340, 554, -1281, -1053, 718, 1501, 249, -1240, -722, 1187, 1143, -348, -1330, -638, 1173, 934, -657, -1276]
2296a276J382J458r77j481k53J425J256j077j683m1K130O14j368j480J114J449
2312A192%j732o84J216J256j15j883p66J646R43p29j501K03J407R17q42j791M59
2330h04J497P30j727j247J093J713j73j690p63J266J242k71j673m21J026J951
2346A749j058j797p6J820N06j328j307Q47J544K91j764p04Q84J474N6j828q86
2363a577J765J019l17j751k33J579P39p42k072R47J468M51j321j667J094J789
2379A171J16j862o95J093J401m85j430m90J496R79q34j508K4J380J043j394j258
2396a253O10J450N72j639p58M56J532l16j137r61J357J592m86k037r6J588J003
2413A477r87j884P36J193O08j335j260R19J495N9j340j137J342J297l42j409q17
$$ y = [-1276, 106, 1564, 587, -894, -1147, 278, 1534, 457, -1226, -1267, 863, 1477, 109, -1371, -257, 1192, 1192, -540, -1224, -8, 1248, 1133, -750, -1516, 130, 1073, 344, -1157, -954, 453, 1370, 528, -1263, -804, 693, 1423, -304, -1551, -458, 1255, 1082, -608, -1371, -105, 1137, 866, -807, -1228, -202, 1749, 691, -1106, -1182, 638, 1144, -184, -1491, -644, 900, 1191, -573, -1277, -393, 1081, 1137, -691, -1577, 188, 1207, 890, -861, -1094, 485, 1224, 482, -1590, -643, 825, 1276, -45, -1712, -618, 1171, 1287, -575, -1270, -177, 1224, 739, -691, -1181, 315, 1294, 460, -1048, -1024, 356, 1399, 5, -1253, -643, 807, 1379, -260, -1018, -562, 970, 654, -483, -1444, -87, 1505, 1019, -1018, -1114, 474, 1477, 490, -1394, -658, 535, 1143, -192, -1452, -533, 962, 1021, -319, -1456, -114, 1183, 841, -568, -1385]
2430a385J541Q40l81j737LJ525Q48j215j419O89J735M67j638j145O94J554r4j661
2448g79n04R69J394k14j730m23J796Q15r33j424j35J394Q98j158j146L67J526
2465G13O02j326j336Q90J457J2j570o41J028J432p84j317m34J896O12r59j431
2482a156J65J847L41j005j341L81J830Jj272q29N08J640k20j482l61Q75J553q21
2500F54j438n26J899Q62j512j168M74J422L75j279j187P64J869j37j432q72J009
2517b23J278n68j678J73J161J270r22j665M27J527N41j413r86O08J241K21j284
2534b92j158J167J303k32j335n82J418R49o59j511n54J771R52j021j352J29J531
2551E24N21j188r16P31J395lj307r87J102J367m61j726k87J606R06o71j789J28
$$ y = [-1385, 156, 996, 615, -1122, -1119, 406, 1254, 39, -1380, -691, 1044, 1511, -127, -1272, -578, 976, 882, -779, -1283, -314, 1080, 866, -864, -1287, 509, 1324, 391, -1033, -1168, 226, 1124, -34, -1180, -813, 713, 1315, -11, -1347, -457, 1000, 1012, -558, -1199, -171, 1261, 477, -840, -1274, 622, 1234, 275, -1156, -991, 856, 1197, 192, -1149, -768, 1062, 1063, -209, -1038, -530, 1110, 890, -592, -953, -78, 1475, 654, -784, -1310, 589, 1451, -61, -1229, -755, 667, 1042, -237, -1424, -660, 1209, 1072, -360, -1232, -223, 1055, 487, -1191, -1018, 143, 1413, 491, -1174, -747, 780, 1321, -92, -1078, -470, 771, 992, -292, -1450, -283, 1020, 788, -547, -1129, 289, 1238, 579, -932, -1486, 285, 1237, 216, -1136, -1007, 524, 1045, -143, -1059, -328, 1067, 1064, -243, -1230, -128, 1239, 778, -948, -1235, 371, 1277, 606, -1183, -1055]
2569a055J931L04q95j445M98J391L75j524q72Q04J426J10j527o29J533Q04o23
2586F06j527qJ109Q43r97j166M10J064P72q83j323N25J666l54r56r62R57J434
2604A210n45j501r6J151R77n52j414q2J359O39j148j033K30J477K72j186r63O13
2622e92J436R4j729m71J165J040j82j440m22J589P16r85j352L48J238M63o70j101
2640h55K63J269M07j525p60Q39J308K6j500n09J095J112o52j199j50J232O58q09
2658B50j499O99J072L91p89j284Q03J154K75j509n99Q19J327l66j665q5R21R65
2676H80o86j158J26J297Q36j292p57L04R43M39j164p29M19J649l14j367n55J068
2694f1J475p49j195m96J256Q08o36j553J94J436O35j046j497J181J106Qj094r81
$$ y = [-1055, 876, 1180, 285, -1160, -662, 729, 1104, -420, -1292, -488, 938, 1048, -479, -1108, 425, 1229, 606, -921, -929, 180, 1023, 26, -1140, -730, 334, 1106, 223, -1100, -575, 1091, 737, -219, -1181, -224, 1210, 665, -836, -932, 219, 1196, 644, -770, -852, 507, 1146, -2, -1035, -805, 672, 944, -242, -1205, -592, 844, 938, -791, -1262, -97, 943, 761, -679, -1101, 488, 1204, 219, -1133, -785, 453, 916, 246, -855, -592, 677, 1084, -441, -1201, -362, 946, 972, -528, -1037, 58, 1170, 518, -681, -831, 401, 1059, 250, -1249, -550, 522, 913, 124, -1160, -357, 797, 1072, -437, -1036, -217, 1110, 744, -921, -1006, -85, 880, 194, -964, -838, 459, 1295, 3, -754, -450, 493, 932, -232, -961, -542, 1107, 793, -574, -1129, -61, 1414, 665, -530, -1026, 230, 1038, 402, -1151, -957, 479, 1114, 68, -1429, -248, 858, 866, -228, -1209]
2712a209R54J338p12j027l44J184P21m22j446M8J521M99r86j229L00J419K57j199
2730c33p36N55J474o6j367o55R81J629q50j298m44J536O93p72j448L01J034O50
2748H84q95r88L74J460J77j343r14J066J169m54j278m43J231R47o67j039M0Q15
2766A42J146j248j171N11J263L58j233o88M42J192K59j123q42R24R70j89j352
2783f39l60Q54J158l93j626J32R86J036r56j088K03J383L51j355q97J067Q62o7
2801F51j116m08Q73R44m35r82n49J252J132p95j568J22J338L44r86j034N72J366
2819G21J37j247n20Q12R90l93j104j42Q61R48o43j310J12J137P58r87j150K80
2837g40J631K3q82j131P52J390l29q78q35J123P46l94r50l76J037P90o09j258
$$ y = [-1209, -255, 1083, 371, -656, -1000, 184, 905, 483, -963, -915, 606, 1105, 119, -1110, -810, 609, 866, -333, -1069, -514, 960, 894, -473, -1128, -147, 1482, 632, -666, -1110, 426, 1119, 347, -1101, -800, 234, 884, -11, -999, -625, 835, 1012, -331, -1245, -179, 990, 536, -742, -1185, 46, 993, 326, -713, -673, 142, 1288, 40, -1131, -620, 643, 1001, -232, -920, -478, 714, 973, -150, -992, -68, 902, 713, -639, -999, -145, 1013, 620, -1006, -874, 112, 1148, 192, -896, -693, 690, 1041, -314, -1211, -144, 718, 651, -465, -873, 0, 944, 509, -473, -1022, 230, 1362, 567, -1001, -879, 459, 803, -183, -1217, -645, 721, 858, -389, -909, -97, 893, 500, -604, -746, 115, 1063, 420, -890, -778, 359, 1117, 130, -1020, -740, 891, 914, 32, -1099, -347, 1043, 714, -164, -999, 124, 870, 476, -474, -850, 187, 977, 368, -890]
2855h90J34J013N90r46j097K88J902l35o28j117P21J323m52r34m88R38Q67l73
2873E16j350MR70Q47p13j100K34J198N17j304j134J067J166j63j235k50M06J207
2891H83k64r16p43J311Q12p01j376K79J393L76j121p79J32J357K42r55q79P47
2909b02Q40K00j340j28N43P51K56j493k60R67J020r89j011K37J267K19q87q07
2927h17J06J363M2j015q46J073R55l9j415k76J028O34n09j140J56R92P81j206
2945a33q31K74J393K17j088r09Q99R79j3j200m69O52J136j23j267k46R80R90n13
2964G28j280m5R64O64q15j119J49J133L30r97n73L84J072J66r58n80R41R21m75
2983F10j352l37J447N98p91r73R4J542N1j088o88P61Q50p4j096q75R78Q88j29
$$ y = [-890, -756, 257, 847, -99, -1196, -908, 994, 659, 31, -1086, -365, 958, 506, -428, -916, 22, 889, 516, -834, -830, 140, 987, 274, -826, -592, 606, 1123, -181, -1315, -248, 918, 755, -480, -730, -324, 883, 619, -297, -1040, 271, 1083, 382, -994, -715, 678, 1054, -67, -846, -714, 643, 885, -70, -949, -202, 638, 838, -502, -630, -87, 664, 920, -573, -833, 134, 1154, 165, -846, -609, 658, 877, -10, -817, -711, 652, 694, -321, -1167, -94, 861, 822, -593, -869, 159, 793, 284, -856, -700, 292, 1073, -133, -964, -690, 703, 920, -168, -1077, -178, 801, 788, -412, -881, -229, 907, 784, -483, -729, 251, 1241, 728, -552, -597, 367, 1031, 216, -903, -754, 379, 709, -288, -861, -477, 595, 761, -197, -777, 164, 1085, 610, -742, -1079, 368, 966, 175, -798, -704, 838, 889, -199, -887, -126, 724, 650, -446, -1321, -343, 545, 416]
3002D16r52m21J126Q04n07j068k61R92P29p65j141M71J086L14j277m61P36R71
3020G92k24r02m36P41Q85l19j426n7J215P94r32q59P3Q87P70j042j013Q35P27
3039E09J11r84o29J000J005n49j177o5R44P82o94p37k22J214K01n08j191J95J360
3058E65L84j138p64N51Q28N17j260o54P44J092o1j430l41J164O34o12p61qR56
3077D06P06r54j223O38P99N13j235l44J57J249jj355n31J272Q60n96q64n82J344
3096B59O98p60r24j05J203O19j075q10N71J041R7j069o37Q54R93l57j192l73J020
3115E3O85l05j182K20J016N39q18q02Q6R36J44o02p18N46Q10K94j223n71J041
3134A49O63l16j386J32R81N58o94r09J94R78Q40j124n99j12J450k5r83q26O59
$$ y = [416, -536, -957, 169, 973, 466, -602, -863, 129, 858, 93, -1048, -577, 509, 823, -454, -915, -179, 792, 568, -334, -770, -29, 856, 537, -889, -946, 269, 1063, 131, -728, -655, 232, 1002, -40, -1053, -218, 509, 620, -364, -993, 7, 1012, 463, -714, -779, 165, 947, 253, -484, -706, 508, 709, 201, -990, -795, 565, 949, -189, -953, -402, 426, 943, -317, -971, -227, 865, 804, -626, -967, 197, 831, 219, -542, -550, 406, 1112, 158, -1065, -427, 372, 885, -350, -694, -537, 712, 711, -644, -1175, 97, 957, 361, -503, -1085, 259, 957, 197, -727, -832, 371, 990, -85, -895, -324, 717, 814, -255, -892, -38, 955, 598, -594, -967, 53, 738, 433, -749, -529, 487, 1026, 208, -594, -508, 428, 572, -30, -748, -202, 608, 902, -321, -892, 149, 812, 496, -890, -758, 223, 781, 87, -822, -628, 350, 1190, 66, -533, -645, 805, 780, -203, -1029, -370]
3153c70J022j54j054k05Q26Q92n90j105N4R79P44q46j026L07J026J70o37r25L34
3172e58J112K43j155m24P48Q34k34j014k23P28P98o57q80r0J082O14p66o62J15
3191c89Q32J62p93o96O82J059k15r95o26P60J190m55j013k70R76P62r13q07L11
3210d38R40J36r32o61Q02R93o3j056q48J041P76j41j020l44Q31O13l65r34q4J089
3230C35O24r45o61j71J172N94j131p58P88J030k89q16n55P86Q48k32j030k56P65
3249I8O36n22j118R1J333K2p14m28J80Q10j16l98o86N30J098l35j249R4K21J475
3269A022n91j059O6O99R82p50q71Q8J152Qp45j093R64Q99j06r21n34P71Q66k41
3289F06j041k90P49O83n04p49j36Q81M98o40r03M88R44P1n54n04K47P02J18j138
$$ y = [-370, 652, 498, -556, -761, 65, 957, 367, -738, -684, 295, 1039, 193, -833, -526, 500, 670, 33, -892, -558, 554, 797, -358, -782, -34, 800, 566, -448, -671, 57, 855, 198, -682, -772, 310, 924, 158, -504, -389, 443, 605, -188, -884, -202, 857, 642, -353, -979, -219, 971, 516, -497, -767, 209, 971, 58, -749, -438, 502, 638, -294, -955, -153, 840, 777, -279, -1127, -86, 690, 549, -471, -815, 16, 629, 264, -670, -754, 335, 959, 14, -647, -818, 354, 948, -183, -941, -153, 877, 588, -228, -783, 3, 851, 619, -411, -667, 98, 734, 212, -906, -815, 518, 540, -174, -602, -422, 388, 272, -126, -812, -282, 816, 481, -768, -674, -453, 1022, 431, -628, -562, 137, 1119, 369, -502, -414, 738, 746, 1, -1092, -128, 771, 665, -256, -790, -19, 847, 606, -435, -725, 24, 707, 203, -546, -682, 199, 697, 57, -846, -358, 586, 657, 103, -401, -154, 548, 666, -472]
3309d72n64J170O20k94j232K02Q60N10l84j363O50R40j3p41q78O23J157k28p87
3328b24o68R67O89l85j067j98R41Q68q81p80l06J389L82n40q83J49J121J60p74
3347d0r66P33R46N0j254k82M30R86j80j031K6P03P52m75j025j99J285L40j015
3366b16n98M34J105J12j309o51P84P47K92j132k38N75O88k24r43k33Q32J050j002
3385G3o46J5R63O73j388n54O84R78o3j059o05Q07P06L1q48j23L89P10k88j148
3405f93K83R40L54p67r45L28R99L69j224l62M92P98j3q90l96P38P34k79j025N
3425e54R65M57o60o97p4Q69M93o64r60O69P97k1j160k95Q05M49l9p66l8M47Q73
3446H96o42p34J6R98J51o59q38O94N00L90o81p97L71Q18J1p57o69P96N55k98o89
$$ y = [-472, -1036, 134, 754, 460, -772, -570, 290, 800, 416, -947, -297, 643, 630, -111, -989, -366, 791, 563, -224, -892, 75, 764, 379, -688, -886, 55, 923, 42, -738, -1044, 345, 727, 187, -696, -547, 574, 734, -40, -1006, -273, 673, 723, -531, -813, -383, 603, 423, -608, -582, 121, 873, 398, -627, -826, 459, 799, -216, -814, -380, 725, 837, -472, -1123, -339, 408, 700, -432, -670, -95, 593, 369, -574, -807, 25, 1075, 73, -573, -558, 405, 1078, -310, -864, -180, 798, 735, -324, -929, -122, 584, 615, -233, -356, 33, 743, 455, -693, -410, 530, 884, 117, -828, -500, 499, 868, -356, -718, -226, 572, 559, -331, -727, 11, 745, 466, -559, -554, 411, 868, 208, -489, -563, 306, 799, 135, -825, -156, 641, 620, -540, -835, -30, 419, 380, -386, -424, 23, 896, 254, -480, -464, 534, 685, 26, -812, -118, 382, 772, 91, -706, -335, 483, 494, -263, -932, -136, 419, 121, -568]
3467e68j26R23N01n52n62k95Q14O86r86p56O37P29J61p25n59M40Q58l60n17k90
3487e47P88P12o60r43J9J218K24p58q06N06R30l35n73m88M68R46k42q71l18N66
3507a64O92mj014l66J048M78m76q42J12R50L04p21q83O30O57J10n51m36M80O46
3527F50P6r59p17R42J065n77j186J10P96J92j37q86L10N46M60o77r50K12J167
3546D37N1q56n88L52J258j2j163l61J015R30q84r23Q6R18M00m26o97N6J002m7
3566E48p46o23M64R70j5p23m29N88O66n88m92k37Q89L00n82l93p5R29K08m31p04
3587d76L83O56k47p94k48L15Q38L7r80k88R63O00n67n47n8Q09L46p98n01J55P84
3608C82L51p69q23P83O21j79l99q10N35J086l24r69m03J076P36q97l68q4P09M77
$$ y = [-568, -694, 229, 730, 178, -384, -679, 135, 821, -165, -921, -284, 445, 606, -119, -678, -238, 620, 260, -257, -547, 241, 953, 293, -650, -631, 587, 811, 53, -753, -247, 683, 348, -225, -713, -245, 701, 459, -412, -730, -164, 528, 524, -490, -856, 192, 670, 194, -648, -536, 414, 718, -3, -886, -256, 401, 511, -40, -476, 4, 650, 726, -233, -950, -8, 1057, 480, -706, -596, 200, 392, 255, -631, -321, 225, 685, 8, -942, -730, 437, 488, -368, -956, -604, 654, 642, -521, -882, 133, 1063, 179, -744, -658, 260, 660, 234, -463, -407, 595, 548, -198, -821, -357, 613, 598, -125, -554, 34, 700, 112, -380, -617, 272, 572, -10, -403, -478, 451, 659, 228, -476, -93, 563, 316, -478, -726, -411, 427, 464, -516, -804, 159, 759, 192, -355, -413, 396, 742, -56, -557, -402, 382, 733, -36, -859, -76, 545, 366, -33, -843, -308, 778, 454, -515, -918, 158, 894, -3, -371, -455, 254, 731]
3628G31n40q14K62R22j06j009k02L56P02L57j002k06P77L29j8r39J11M91M52n68
3648H6p68K56O91L40p13k93K39Q41k47o34l49L49Q17r8r53k87Q60N46l92j160
3668h69L01Q64M41q42n88J05R52J30n94n02K57J010r3q83l25M11J036o11o97j0
3688e07O11N76n81p45j7J134J57m79j051N56Q64K72o20r20O52O44k8r71j36L98
3708a91P93l81o07k66R60K05n41o50K01R80M9n40p58L96P97K01r00l89R03J62
3728D24k30o96J22N02N80m62p45k64R58N49p40p13L94P61K94j006k73L03O60k10
3748B08p18l02O62R06m44p45j35Q12M98n74p35J07P50L69o75o52L64J011k43p34
3768b70l79O94L96J46j080q1N47N24k18j190L74P68M61k84p13j83J039l4n73m66
$$ y = [731, 191, -623, -361, 561, 455, -554, -756, -400, 302, 659, -343, -549, 228, 557, 539, -400, -289, 202, 654, 86, -682, -426, 265, 605, -108, -401, -162, 679, 432, -202, -551, -202, 615, 517, -436, -723, 137, 683, 291, -869, -568, 296, 737, -105, -693, -588, 364, 494, -100, -602, -345, 665, 572, -311, -636, -225, 811, 200, -497, -507, 104, 680, 99, -646, -663, 471, 628, 149, -902, -346, 518, 790, 170, -750, -98, 546, 518, -453, -589, -191, 602, 221, -386, -652, 308, 513, -28, -678, -477, 503, 552, 12, -746, -350, 447, 648, -252, -641, 262, 424, 194, -502, -380, 122, 702, 240, -505, -769, 189, 738, -2, -715, -321, 440, 734, -272, -545, -242, 418, 208, -510, -812, -150, 756, 312, -433, -568, 244, 742, 168, -567, -460, 290, 659, -16, -668, -304, 707, 464, -270, -649, 45, 441, 587, -493, -574, -27, 497, 279, -911, -537, 231, 692, 408, -305, -488, 551, 517, -56, -522]
3788e22L79P18L8p55n00L60N85P9r28K0O66P76r71m97L6P71L90q14j73J81K51
3809I0Q31j141n08N90N42Q3q69m08Q22N24k09q14J9N20P48o28p30p7Q90K10o06
3830a21l80L68N25Q3o55n36P73N47K4r62p6P16K59k48j102J79Q07O55o30r93K12
3851e55J151L3o83o83P22O21m36l91m43P22M20l39p45j77J019M87n03q59P8R78
3871D17K34o62o62N07N41K73q07n61M68Q14n1p82k95R80K74m12q12j58R63K15
3891D84l84p02K01J215k43p57m92L42J085k95p78m42O27L59L39q98l53N70O96
3910E74l44n58j10O08K97k71q66K00Q93Q2j027j18O35N81P9q22k14M75M87j96
3930C85q90L0P04L52o10l76L48M16K09p92l00J08R95j98o05o11O08Q06l03j011
$$ y = [-522, -143, 575, 613, -142, -642, -282, 303, 382, -546, -526, 140, 916, -55, -552, -516, 255, 645, -169, -342, -161, 90, 921, -220, -728, -138, 404, 487, -382, -790, 32, 556, 347, -467, -448, 72, 820, 192, -538, -615, 275, 485, -121, -501, -133, 392, 475, -180, -716, 57, 604, 628, -334, -410, 306, 565, 317, -785, -606, 201, 856, 226, -767, -555, 596, 629, -54, -737, -15, 606, 170, -221, -664, 58, 478, 139, -606, -783, 236, 723, 220, -639, -561, 417, 651, -11, -673, -166, 375, 648, -159, -720, -252, 562, 511, -271, -566, 414, 688, 276, -536, -694, 269, 484, 100, -602, -401, 814, 571, -186, -678, -336, 749, 454, -324, -766, -139, 220, 559, -339, -692, -122, 574, 230, -328, -438, 170, 467, 196, -670, -470, 423, 505, -522, -640, -5, 576, 655, -167, -381, 94, 581, 385, -505, -475, 229, 581, -29, -405, -57, 359, 568, -224, -524, -416, 579, 381, -224, -835, -227, 579, 276, -735]
3950g35K38O57O27m42q00j87J220k01k51n99J89O90l3o40m22N04P18o3j113K05
3970d38M38M12j70n33j97P16K48n08m82j10J154J39r74k67L89Q43l9r14l88N71
3990a10M13j11m75k52M75O69j57q55K4N63N51q20m99P8R57l5p58J09K44O28n0
4011E89r31r8L78O23k11n65l69Q20L31m40m07J18K82M61n71m58R9Q70j14o86k40
4032e19K72M84L75p94l61N29O89m62p46N6O95L60n54o74L96N96K36o79l59N40
4052H0M53j41o61m95M76Q07k89n91j96R01J36m18p54j50J043N66o58m41K08M09
4072B85N54q32m64L23M99q9m27k56K81P28m23l93j52P14J39o35n11L22P84K74
4092G21r00%k3N45j25l40p15N09P06l69j59l02M27O93k54q07j36Q70K15o86n41
$$ y = [-735, -497, 160, 787, 345, -455, -642, 578, 377, 126, -473, -284, 406, 373, -267, -689, -185, 533, 470, -643, -438, 0, 412, 242, -291, -488, 228, 476, -32, -514, -624, 530, 669, -305, -572, -183, 660, 621, -293, -681, -110, 303, 192, -283, -535, -60, 609, 452, -403, -379, 184, 735, -85, -584, -506, 451, 416, -342, -233, 11, 639, 589, -342, -440, -62, 561, 350, -215, -584, 236, 567, 127, -280, -162, 120, 581, 10, -448, -349, 521, 407, -279, -519, -247, 237, 612, -182, -543, -14, 675, 213, -533, -477, 218, 578, 24, -650, -254, 342, 578, -101, -460, 80, 533, 392, -269, -764, -288, 519, 230, -361, -557, 344, 480, 62, -692, -842, 201, 767, 109, -332, -124, 285, 839, 7, -457, -134, 365, 276, -151, -407, -126, 602, 179, -214, -366, 348, 487, -148, -659, -337, 447, 721, -179, -179, -202, 343, 218, -122, -837, -328, 378, 9, -150, -452, -25, 668, 414, -393, -529, 341, 556, -130, -671]
4113f71J76J073K41p58o36K33O27j6n48k09P03K39o9p73j83M83J021o65p31L54
4133a09M52J65o24l49L65N66N8r00k26L74K05K48n43m69J003M47k96p71R6N15
4153B07L92m47q30M26N72J88n46m06K23P54j51n02l96L88O20k02p53J28K64M83
4173D12k53q27L61N52M24l80n74N4O69l9p00m36O13P42l46j16p07P90L83k48p14
4194c40r6N62M75n35m17J82L02%on02J34N62Q2p12m34P81L69j26q42K75K36M34
4216C84l3q49j43P97J97l89l54m5M94L87n53l19M09M75j97n40k60O46N73n34m02
4237b56N8L67K9L19q77k17R54L97p31l77L20K61K28q86J6K07O79l98m87j17N42
4258C1M05l26o29M7R34J63o05n15K92N09L90r43k32L87M36J44p30j44M56L84k81
$$ y = [-671, -495, 578, 819, 61, -575, -342, 285, 269, -279, -488, 215, 454, 385, -388, -571, -88, 933, 268, -463, -109, 343, 508, -116, -465, -100, 466, 524, -376, -602, -228, -23, 225, -318, -787, 216, 663, 367, -404, -308, 207, 599, 152, -678, -252, 320, 508, -38, -444, -221, 533, 382, -120, -516, -128, 492, 290, -463, -335, -71, 412, 159, -668, -307, 245, 669, 289, -285, -231, 438, 399, -301, -737, -124, 618, 272, 156, -551, 239, 622, 374, -340, -436, 126, 601, 66, -351, -169, 133, 133, 127, -375, -241, 321, 403, -309, -743, 38, 407, 281, -561, -286, -50, 384, 351, -498, -641, 156, 353, -36, -390, -435, 59, 446, -107, -426, -17, 458, 261, -279, -539, 107, 680, 146, -256, -198, 169, 198, 517, -360, -577, 377, 774, 43, -334, -14, 247, 475, -411, -395, -188, 491, 93, -394, -511, 31, 436, 110, -519, -472, 462, 625, 20, -495, -203, 306, 696, -247, -479, -92, 344, 488, -242, -386, 70, 454, 173]
4279A73p90J26P31J02l55l30j23O33J91j89q68L50N60K69n20m85K34P14j93n52
4299c22k80Q25L42l12o03m1Q85m7l14n45J67K33N17m39p41N97N14jn74m48O82
4320I5M4J52q24k8Q89K52n71l40Q9O16M34n23o52K17M96K39n81l22j6Q65l60l87
4342b16k56M83L66r4m55q4K97O24o78k83j87P00L71p64j71O5P46j29n47n56M90
4363b78R48m82n35k95O65K38o2o59m5O32L98l03o69J1P61J78m38m35K47O61j47
4384C91n59k88N50K58j14p90K20K05P99n53o47K52M32K35m76l47O0Q24R4m49m93
4405c96M55J33J10n61l51P20J28J5p50K1O06K67k28q10K86M04M50m69o19N02M86
4426C99j28m07j51M15J91K7o05k34P28M90p35l46r8O75L37n54n90L55O95m8n17
$$ y = [173, -617, -491, 240, 342, -13, -343, -466, 167, 358, 169, -699, -349, 211, 480, -40, -525, -291, 423, 230, -322, -602, 223, 565, 253, -350, -391, 494, 447, 133, -412, -245, -12, 505, 66, -675, -78, 436, 435, -139, -587, 95, 139, 291, -533, -561, 328, 580, 9, -331, -242, 374, 808, 285, -367, -150, 346, 585, 4, -318, -334, 531, 171, -216, -472, 11, 377, 283, -172, -256, 41, 665, -13, -296, -483, 217, 588, -176, -347, -282, 464, 335, -212, -768, -278, 670, 188, -347, -642, 23, 261, 199, -460, -505, 127, 525, 222, -447, -436, 325, 503, 65, -370, -123, 538, 391, -168, -456, 94, 352, 238, -552, -332, -127, 672, 119, -528, -276, 156, 391, -85, -432, -372, 452, 546, 97, -396, 59, 192, 302, -259, -610, 110, 238, 253, -497, -476, 130, 397, 169, -641, -355, 49, 499, 30, -589, -87, 399, 271, -136, -287, 128, 319, 346, -259, -493, 235, 725, -10, -356, -454, 221, 558, 4, -586, -231, 464, 416, -101]
4447a01l64K31P98k89o42K10L3M87l88n08K27O97m2j64n75J40L45L27k90n26l6
4468d30O12J66n68l95O52J12J52o47j56O82J92j87m65j25N75J24j99k16j17P24
4488D86k94k42m47M88J87P9m00l57M42N49qo34j69M64J84l00k73r9L05N18j72
4509C07o88n0Q76l7l98l25J59O11k27k92n07O35M00k13n37n0L23L59p9n25J0P42
4531D94N6o00m32N4Q46j94l30k30L07M44Kn33m32Q17O0r7n58K24R1M26l26n49
4553d60L26L91K20n49k79J71M71J20m67o03P27K67j03p16j94P38K58m5n01m6O92
4574D18Q2m65m38K15N03m50k51k9J19O38k4m77j04L53M21k46k70l83O29K67m48
4595F0l80k09P12L16p92n0L10L01M78q59n05O47L43k27l96j21N55J68k63o65N06
$$ y = [-101, -465, -234, 564, 275, -367, -157, -124, 363, -25, -533, -306, 391, 349, 185, -390, -250, 95, 422, 132, -394, -430, 182, 348, -220, -615, 37, 149, 301, -346, -502, 180, 372, 185, -280, -405, 170, 294, 95, -121, -238, 486, 192, -50, -497, -9, 178, 257, -143, -500, -58, 491, 483, -151, -320, 144, 328, 28, -245, -344, -39, 479, 307, -381, -431, 445, 408, 10, -315, -156, 455, 228, -64, -571, 64, 464, 251, -286, -336, -13, 346, 267, -258, -248, 494, 550, -50, -482, -428, 418, 224, -106, -336, -29, 415, 417, -116, -548, 269, 329, 232, -326, -102, -11, 415, 89, -460, -134, 257, 477, -72, -351, -180, 291, 411, -56, -659, 68, 335, 232, -484, -678, 60, 318, 273, -228, -274, 418, 500, 35, -403, -188, 315, -135, -386, -415, -296, 342, 318, -159, -263, 90, 511, 265, -5, -388, 241, 508, 60, -320, -529, 183, 499, -293, -343, -33, 268, 746, -113, -618, 29, 372, 145, -251, -372, 183, 351, 88, -577, -71]
4616g1L01L30l68n59J50O37k73k69m37O08N81o78k54k38M62J48K13p68j12P83
4636A86Q0l03m65M47K54K58n50m65L36L18K72o79J1K26N06j63Q1l90O6L46k11
4657A61m97L0O36P2k04o38J94M72k8l19k47M02L41k05m09q0L45N24k61m13l54
4678d78M39L76l17q62M68O77O0k53l76m0R03k44m51k65J41P15p3p59o5M82K87
4699C65j61m60j58P29J26n23k67L62J46L55m13m95K52O26j60m55k08J35L89M4
4719B29m16r1M26K50k61m67n0P77J48n94k88J49N16K16n16m84J42P61m32l34l
4740c22N67J90l99l60Q3N04L63p76n3n0K28L23l17l42J86M54J80m71m13N09K74
4761C58K9m61l88M53P9l69j40L43N00K24p71l70O22K83O3k91o76O20L50l93m0
$$ y = [-71, 230, 560, 192, -367, -217, 420, 147, -122, -559, 49, 630, -48, -302, -540, -78, 70, 283, -485, -597, 186, 266, -37, -502, -55, 199, 457, -93, -558, -222, 96, 368, -311, -300, -74, 432, 269, 350, -40, 26, 372, 161, -336, -306, 330, 402, 198, -440, -246, 226, 198, -121, -368, 34, 375, 170, -239, -319, 26, 550, 289, -124, -478, -39, 337, 20, -842, -374, 303, 363, 110, -266, -306, 597, 353, -98, -363, -222, 493, 420, -339, -404, 78, 365, 204, -256, -414, 315, 441, -82, -349, 13, 159, 514, 101, -394, -142, 484, 324, -131, -339, -204, 185, 229, -187, -278, 148, 398, 137, -330, -380, 397, 545, -49, -337, -188, 328, 544, 28, -456, -314, 447, 15, -319, -322, 245, 435, 36, -324, -241, 263, 626, -150, -203, -253, -25, 298, -19, -361, -175, 279, 459, -12, -425, 84, 358, 387, -74, -462, -9, 70, -299, -439, -96, 404, 628, -143, -513, 109, 392, 455, 164, -512, 108, 458, 65, 25]
4782B5j92nR10l07p77j71O41L64l83l47oK94N18o43m62L90O20O1r24m2M30M83
4804D77kp93pL53M52m23n32N63J34J09k07n34J44N66J36o39l8L6O84q0q51R9O7
4827b86N77k34m31k50N95N78o18l52K80L51K4o2n23N6N05J38k53p61O31L21J30
4848D16p51j29N10L70j97l37n3L21K29m33m50K64L44K11k97n30L46L41K17n13
4868a21j56K40L08n0l18rJ61L10m68j33L8K67J98n05J10j97M95J9l34m12N65L72
4890C80k88j59Q1J07K08l58l45K25J78K15j37n29J72K38M77m37o82L19O91n00
4910a44m7k42M76n8J44j72k95L41K43P8o63j50Q20p8n01l32M05L98j29k63l91
4931e60M26L90L5o76o0M46L31j25n96q8N45N04n52m40K44L13M41m59m83M1M04
$$ y = [25, -167, -172, 738, 431, -346, -517, 124, 488, 105, -242, -248, 46, 564, -79, -541, -151, 469, 530, -394, -436, -6, 477, 475, -318, -325, 28, 480, 57, -475, 88, 222, 331, 124, -410, -266, 300, 436, -203, -241, -205, 479, 399, -452, -353, -286, 291, 57, -374, -624, -29, 549, -69, -421, -141, 210, 234, 172, -351, -295, 210, 348, 95, -666, -35, 286, 416, -335, -464, 46, 416, 219, -118, -171, 150, 379, -54, -504, -240, 104, 315, 18, -512, -166, 175, 392, -121, -277, -37, 271, 221, -97, -106, 55, 365, -103, -236, -198, 69, 267, -238, -128, -325, 170, 189, -145, -557, 8, 380, 92, -67, 14, 121, 329, -29, -374, -149, 29, 244, 107, -422, -250, -12, 465, 28, -654, -335, 356, -144, -191, -433, 43, -15, 129, -43, -338, 3, 246, 324, -339, -489, 331, 253, -248, -580, -175, 223, 94, -169, -560, -134, 256, 291, -385, -445, 1, 332, 207, -389, -477, 68, 572, 20, -420, -176, 137, 578, 119, -364, -323, 81]
4952H1K49m13k00O68Q9Q3n95l22N76n4q7k14j66L92M08n28k61L74J55R9m10k01
4974b77L51p8K79l77p2L90N3j44l57j2J88L63j17k36j39K63R5k64j07K83r3N87
4996E79m13n62M04K50j22m97m5M53L16j3n37P6K85J05l38m3j78M40K70n39k53
5017c62J13N42j48k80O3j09J35J69l91J53K14R5j69n18K08M37O8k02k17m5L36
5038I2J32n68Q4k7M50J38o66J18L85J15j1m43O4J83L08m42R1k72K64P39p26m54
5060d46K11M54j62j56j18J28L03J66p34J16J52M43K6p32J33K08N07j07q75K83
5080b00M91rl20l78M63L55J06o65j76M82R7j17j59k69J53M83l80k08P5M47K8m82
5102a83k01M65q1L40n16o6K3M21j09j18n9J13P0j0l1l8RL23j17o18M61K58j52
$$ y = [81, 330, -83, -283, 385, 474, 557, -38, -360, 216, 162, 75, -139, -305, 87, 495, -33, -294, 80, 235, 334, -76, -277, 74, -4, 275, -102, -174, 216, 269, 125, -232, -244, -56, 307, 190, -46, -185, 78, 173, -91, -198, 85, -8, 579, 166, -396, 8, 258, 136, -361, -406, 47, 363, 350, -187, -111, 174, 279, -59, -102, -280, 160, 430, -109, -362, -249, 293, 145, -135, -72, -181, -46, 123, -268, -115, 99, 194, 25, -493, -285, 152, 220, 18, -199, -244, 92, 224, -344, -260, -287, 163, 301, -365, -247, 138, 253, 242, -201, -137, 46, 354, -88, 3, -269, -5, 734, 8, -446, -235, 219, 57, -99, -217, -89, 214, 380, -354, -238, -86, 357, 383, -349, -216, -8, 499, 392, -483, -200, 291, 282, -38, -416, 47, 402, 508, -157, -333, 149, 246, 129, -30, -299, -146, 337, -43, -251, -176, 271, 299, -183, -384, 81, 0, 340, -176, -242, -219, 202, 93, -25, -84, 29, 99, 89, 58, 20, 29, 352, 235, -383, 78, 336, 184]
5125A84l68J48k26M51N2m53J23L8M68m59k44j5K13L45k44k74j95M59K46n76K98
5146b9o5L31r9k58k5P9L35K01o87P2K41J87j04o49K18K81K74l88k05J44O06j58
5168C02l70k26O96k60j5l91Q7p4N19l4n75J92L63L10l46k37j83L61K33k05m46
5189b99O0M96j4m23n8l2L67J14l72k23J83O39j99p47K99O09L2m49j05m1L66j41
5211F2o2k31J60K4N5R0k63P4J86R5m02Q7J90R3k06j10J65Q2J75l46k69N6N59j99
5235F5k33k27M10L25J4m25l0p1L67J64n43p2J44M55o85L21N6Q7J73k75K1l64N05
5258A82K9k72k73M38K18k43j94l65M25K63j59J6m51L64L80k17m33J45K74j5j97
5279h5m11M04K37J80l13p59Q33J72j50l94J41L54K2j55j18k92L04O19l72o17P5
$$ y = [184, -184, -36, -262, 189, 241, -212, -89, -51, 417, -42, -286, -301, -88, 257, 13, -261, -456, 3, 249, -327, -29, -94, 237, 138, -120, -145, -66, 269, 470, -217, -145, 96, 283, 179, -470, -252, 29, 303, -85, -290, -146, 460, 302, -68, -294, 402, 142, 127, -264, -177, -251, 268, 234, -341, -149, 214, 524, 178, -59, -242, 119, 352, 147, -299, -239, 257, 243, -180, -238, -270, 97, 211, -161, -384, -201, 438, 239, -508, -209, 400, 432, -17, -122, -163, 203, 62, 0, -231, -71, -47, 8, 98, -165, -91, 95, 190, -212, -125, 65, 158, -48, -158, 7, 89, 264, -82, -351, -295, 264, 65, -168, -395, 15, 340, 354, -71, -101, -172, 195, 359, -184, -256, -112, 343, -342, -21, 35, 122, 295, 20, 41, -323, 182, 211, -61, -334, 104, 322, 79, -115, -480, -55, 208, 49, 65, -386, -22, 358, 141, -292, -147, 127, 112, -85, -496, -92, 145, 325, 12, -747, 86, 258, 108, -286, -145, 209, 231, 76, -42, -334, -30, 589, 217, -400, -325]
5300c25M08J30l29l8J24J07Q7k25J64k13M07j1n52J73L19k98K09k15L6r9K13Q2
5322A54k43M1L8L44n48J74j2K79P7o81%N21J91p4p10Q3M91J03k44n82M62N39k82
5345A21j71l98L37L57j54l15K40P6K2l5j63j60J56J72K9j6k65K35P9qo69L99L22
5368A91K04o95J76K47l5l9k79P0K15K99m91J56k41K53M69l92k13o2L04O9o4k80
5390a38K26K82k97J8l50J94L79L1o88LN28O1k94j11J85J02l1J27m45J23M04J0
5412C19l13l10L17K08N9l92j81K45M89k12l71Q5K30K63l96k80K75J9P6p4k26J5
5434a55M47l0j75j92J4M91p0l03m07M99L6k00k43J59J85j22J28j88k7K45j24M4
5456A2l92L51L40k21l00O1L6L19km07J4L39R2M7l79J7M83k40Q2m25K68j76J49
$$ y = [-325, 83, 213, -116, -154, -30, 77, 164, -61, 103, -110, 297, 286, -266, -93, 226, -72, 137, -78, -42, -141, 72, 154, -89, -48, -10, 334, -214, -40, -52, 227, 304, -377, -377, 144, 335, 261, -449, -366, 125, 228, -16, -598, -136, 403, 121, -50, -448, -111, 246, 92, -223, 17, 93, 115, 80, -83, -243, -87, 85, 114, 98, -167, 68, 147, 139, -530, -131, 191, 395, -300, -124, 123, 88, 49, -230, -160, 55, 354, -137, 19, -222, 31, 500, 108, -105, -167, 137, 206, 142, -138, 88, 370, 73, 91, -259, -65, 314, 345, -343, -340, 188, 249, -45, -156, 29, 131, 100, 227, -218, -95, 309, 319, 6, -304, 13, 221, 280, -112, -293, -48, 441, 229, -142, -57, 173, 436, 40, -240, 35, 54, 130, 56, -170, -155, 292, 262, 87, -105, -91, 400, 330, 27, -380, 119, 155, -45, -288, -129, 56, -66, 62, -126, -153, 92, -32, 12, -380, -29, 311, 90, -210, -149, -113, 206, 204, -203, -189, 150, 242, 289, -90, -73, 410, 170, 252, -173, 95, -81, 68]
5479F8J53l16P7Q8J64l07o4P6J69j4m62M93j32K19k93JK29r3J51j81M4j15K40
5502A95q6j82n9J61M32j46l45k16L96L7l5l80j70M27J88j07k73p1L78n6j7P5o8
5525G8o3J77m38k33M44J77M1o75J38L95K24m4o55M69j07L40k03m34J22M23j43
5546C3n3k06J83L95m69k34J56K00J35K8k03k91M23l7l43r1J81L73J16l88Mk02
5568b90N67j26k27j42PK10K52k51k63N55j72j95J71l01J88K53n8o41L47M52k17
5589A19pk93Q8L09j26k36j94K36M60m82n8K69j9J56q7l66Q4J58L52j81m60J62
5611a16J07J58m05J70k9L90k94o7r0L04j21J59l30j63R8L68j15j90K00K85o9j57
5633I3k48J93J02J6l9k59lK40l55K54m2K46J70l73l36J63L97k29J52l88n1l5M73
$$ y = [68, 221, -95, -18, 70, 234, -73, -137, -61, 108, 94, -368, 125, -7, 212, -81, -80, 149, 56, 207, 26, 70, -45, 195, 109, -73, -132, 29, 461, 315, -30, -246, 150, 187, 152, -228, -398, 29, 217, 110, -163, -234, 144, 88, 71, 146, 78, 15, 192, -246, -479, -35, 142, 183, -492, -354, 41, 265, 221, -434, 35, -72, 268, 65, -369, -247, 176, 33, -20, -226, -43, 352, -117, -351, -195, 5, 140, 168, -35, -326, 97, 60, -283, -374, -193, 180, 296, -92, -88, -290, 277, 151, -76, -218, -211, -1, 251, 0, -263, 292, 120, -75, 96, -205, -17, 236, 178, -463, -116, 336, 119, 112, -181, -93, 216, 90, -146, -340, -104, 356, -126, -184, 85, 66, 222, 135, -231, -147, 11, 363, 182, -278, -116, -9, 149, -256, -86, -115, 275, -19, -86, -176, 128, 7, 166, -164, -327, -229, 139, 24, -166, 34, 319, 250, 93, -155, 38, 140, 156, 117, -142, -145, 95, -260, -6, -48, 198, 368, -5, -341, -178, 219, -10, 142, -246, -297, -332, 141]
5656A41m1J33l89K83K03l76k54J73J15k31J8R0m1L19j53j29n9M02k31j24J55j55
5678a51L81k16j98r5L77L7L7l55O5L21K5j36j8k28J71O3j23k15l67J060l94j77
5700a36J1J6M2J17L2k90J91M13k54m14K41l8L92k87K7j26J50J66k16l77M82J86
5722C28M7n98J58J27J7j39J47k72J7K30r7k99K31J04J44r6r1P4k32L30j07l10
5744b87L63q0j33rp9L92J26L8o64L88K1L8J07k08k90N48l6o7k02M4L1K7jj77N
5769a05J94J27l27l1N6J49l2L5l55N5K16J90m25K03qj36K86n12K05J64J42J06
5791A97o28L56J48l7j79m11M12J21K21m93K64J80J12q1k64l36M20J1J66k69r2
5812a82N21n29M2k14K85J91j58kp1K32J3J47k25k57L80J98m14j88N5K39N0k85
$$ y = [141, 100, 233, -156, 127, 330, -46, -300, -127, -12, -243, -225, -135, -176, 143, -10, -139, -198, 204, -27, -151, 4, -151, 230, 14, -184, -279, 98, 135, 172, -183, -118, 203, 228, 92, 74, -154, 17, 80, -43, -258, -625, 435, 41, -136, -125, -109, -67, 50, 82, -208, -17, 396, 142, -272, -31, -69, 323, 36, 63, -63, 87, 253, 37, -340, 142, 328, 375, -223, -65, 62, 79, -60, 87, -185, -168, 62, -35, -334, -103, 1, 145, 49, -42, 32, -200, 130, 23, -287, 76, -4, -137, -146, -225, 167, 293, 331, -333, 55, 76, 114, 221, 13, -277, 271, 235, 168, -34, 10, 41, 68, 67, -110, -105, 89, 216, -111, -142, -86, 63, 31, 66, -289, -234, -18, 172, -253, -50, -58, -194, 92, -420, -215, -51, 91, 197, -431, -75, 73, 36, -143, -554, -142, -21, 200, -293, -29, 151, 263, 182, -82, -418, 2, 13, 179, -90, -182, 339, -190, -148, -362, -77, 114, -44, -46, -117, 115, 128, 275, 50, -207, 173, 371, -43, -231, -176, 63, 113, -172]
5834a72K13r1Oj25J20K6L29o17M85k22j28J89L65l37k42K08j42K73j00j02N5J14
5856A05mk04j56N36P0l12j41j65L09J68K6l86K24q1L98o12L74k02J43r5r7J14
5878A2m2J98M1l78J5K36K24k12O8j58J94j28O0l70R5M85k84Q5k88J72J68K41l78
5901E6r1o5K35n4m31K65o8L17l07J18J75q7J95m15lJ47OK56l45n2r1N29L2n61
5925b39J79L93k70L29m36j19K32K70k60j58J25m3o2O1m80N18Q7p7j19j20M6J90
5947D7M4l14J63k5J21N3j59o6L28j17l17r6J13K68J69j31j63j31nL23j36j45J23
5970e3k0L21j91k54K22O5k31p2K43j61J34J50l43K02J00N2k40q0K64KP0l08l5
5993a63K41N0O4k24j98L46J69m81o0R1M78k89J3k52J49p2L45l18j1P8M01k33j59
$$ y = [-172, 41, -50, -44, -169, -49, -23, 306, -311, 174, -48, -176, 13, 378, 41, -201, 7, -135, 138, 38, -64, -9, 105, 101, -103, -259, 277, 347, 35, -106, -271, 38, 206, 232, -154, 70, -11, 387, -225, 149, -53, 90, -5, -102, 12, -30, 168, 209, -169, -154, 82, 306, 94, 162, 4, 198, 70, 130, -240, -145, 340, 56, 141, -147, 25, 193, 434, 56, -35, -100, 135, 81, -350, -85, -153, 164, -143, -25, 150, 63, 258, -157, -160, -13, -7, 249, -96, -148, -239, 290, 322, -239, -60, 333, 63, 392, -44, -163, 69, 339, 79, -79, 46, 3, -59, 2, -478, 40, 127, 50, -69, -189, -143, 47, 91, -223, -60, -85, 36, 89, -70, -136, 192, 75, -242, -338, -225, 43, 212, 81, -82, -213, -218, 105, -31, -176, -53, -73, 248, 57, -197, 25, 90, -141, -213, 30, -131, 3, 153, -190, 12, 112, 164, -76, -156, 108, 110, 180, -128, -163, 78, 128, 192, -32, -230, 116, 285, -196, -256, -165, 313, 24, 37, -215, -66, -138, 207, -111, -122, -44, 357, 124, -35]
6016c5k44M66j01m09L68N1P3jO2n51R9J01K94j55j11j61O53l16j75m3M27k16k89
6039b13r6L65j02K25P9m22K31n1Q5rm16L29N1L78m41p5N6K15j29k90n9J57K98
6062A66K85n04j88M16Jk24Q9j11K23k73J16%j89K80j99K27n5j01J24k1n7j4J71
6085A62m1j25k64K60j77K83J20k06o2R9M5j16P4p9J80M3K00n78J56J85l02oJ30
6108a9k0L18l79l0J61J59J15l79q1J79K91m13q1J11m7M34ol47k16K98J28l21P3
6131g2j25M26k20K89n41K01o4L98k00m67L27O6pj62%R4L47j37j42l58K96j60L29
6154A18j8k64J87O1o3j33K26k14K50l56J3L56j00p0j13k0J43k0j15J3L00o7l6
6177G8o4l61J70K31k2M2j24J06j06K44l40q9K64J11n7k07J0j54K99j16k83L71
$$ y = [-35, -279, 187, 86, -323, 45, 96, 169, 168, 230, -321, -222, -121, 173, 18, -93, -254, 399, 83, -92, -135, 292, 76, -213, -309, 56, -46, 179, 258, -164, 67, 16, 101, 92, -324, 5, 56, 434, -7, -82, -26, 189, 60, -230, -289, -132, 166, 451, -53, -241, 175, 176, -48, 41, -70, 153, -120, -4, -4, -193, 87, -112, 115, 60, -41, 83, 62, 5, -9, 162, 121, -4, -268, -8, -185, 98, 218, 12, -50, 49, 94, -22, 52, -27, 153, 196, 396, -182, -26, 159, -143, -149, -19, -39, 279, -100, -130, 31, 190, 305, -74, -155, 24, 315, -98, -179, -68, -115, 319, 313, -34, -250, 48, 176, -145, -72, -197, 229, 9, 298, -243, -42, -106, 292, 92, -375, -48, 18, 11, -151, -151, -57, 290, 153, 11, -347, -51, -211, 118, 100, -164, 23, 84, 21, -112, 114, -100, 150, -206, -193, 163, 63, -7, -120, -140, 3, -17, -132, -119, 181, 114, 78, 14, -347, -177, 54, 32, 74, -50, 56, -50, 194, -146, -235, 29, 140, 83, -124, -114, -268, 31, -85, -368, 3]
6199CJ27j28J00k97L8J77J21k89N1L37k72m6j7j83L47M6j73k03J43J63j2N4j38
6222e1m2K06m5l70j4K66j12J2J83j92J88K97k68j90j08K35K39k64j54J7R6M68
6244C97k16l29j18J65J56l1l21J32L74L6j63m04O6K10j28K68l7J45J59n28K06
6265C9j58O2O3J40j03j62R2M2J07j83Q3K08k94M3K7N5K3j48j70N3K24n3K39l69
6289a40k81N30J20l39j88P1O25j77k12k1N5P3j59k28N03k19J99j13k21L30Pj57
6311E8k98PK0L24O6l1l07K44j98M7k6r6j9K68J37n32L66k53L02J38m74J55P1K06
6335A75k92j02K73N2mJ5P5k34Qo5M07p17N12Q3N3m22K98n7K7l49J4J90J50k36
6359a46J97j20R2K5k48L67k07j36K04J16j05j34P0j46J05N4k08J52P4o4J27J51
$$ y = [3, 130, 2, 102, -195, -157, 20, 141, -148, -97, 240, -32, -78, -95, -278, 69, 115, -58, -261, -118, 45, 33, 87, -51, -93, 113, 68, -302, -316, -50, -162, -150, 33, -159, 29, 326, 58, -132, -240, -5, 234, -30, -184, -167, -71, 397, 181, -148, -266, -101, 55, 24, -297, -165, 209, 245, 82, -322, -256, -46, -174, 94, 57, 202, 361, -167, 39, -119, -57, 6, 146, 43, -119, -27, 15, 122, -61, 22, 230, -64, -21, 6, 61, 84, -64, -234, -181, 43, -10, 229, -140, -421, 109, 229, -110, -298, -227, 398, 221, 9, -12, 43, 116, -43, -271, 232, 13, 212, 99, -122, 208, 215, 58, -240, -233, -213, 111, 177, 146, -161, 83, -115, -68, -94, -190, -209, 59, 196, -336, 30, -223, 79, 217, -257, -102, -31, 175, -117, -219, 54, 106, 102, 117, 192, -42, -34, -99, 308, -409, 103, 186, 239, -183, 115, 58, 85, -264, -250, -60, 90, -146, 51, -69, 23, 48, -200, 167, -40, -176, 28, 144, 39, -95, -25, -171, -66, -12, -220, -68, 6, -58, 69, 220]
6381B20k94K11j97r5M1J03J30k99p8J44K16j72k2r6L68L2k27J56l36L85k95L17
6403B12j27O2l25L2K97l47j1K21J32k94n5J1K42k6o0j47P5K92m3l04J33q1K56
6426A45j09o1r3R6J33m17jL70p5j97j63M3M54j61J24k68J84N3j05K61l27K89j00
6449G5j42pk2K35Q9j11l83M24k51L24k54Or0p1N67j59l91J67k6J98k47j02l01
6472d72M61P5rk63K22n7K14r5k56J76J44n5j41J74q7J5J07k82q4M76r6q6k41r5
6496b55K47m5J34P5m86N23l35l65N57r2j15nJ77J25J2m3k27j43L18P0L8k71R5
6519a1k8J87j33j47J03J8M5l3r5k87J81M85l94k49M73k39J81P8j4k02O2j32N5
6542i6j14J38J31R7r4j75J26l8L6k57K45J25j07J66k00k25K78p9J0j5M3J58J20
$$ y = [220, -74, 137, -60, -155, -114, -11, 119, -180, -258, -114, 102, -70, -92, -188, 180, 212, -15, 141, -195, 190, -105, 212, 85, 147, -178, -146, 151, -196, -207, 14, 146, -148, -203, -192, 50, 24, -36, -183, -108, 184, 141, -163, -30, -111, 145, 36, -25, -118, -22, 111, -306, -307, 63, -12, -209, -372, -329, 125, -36, 88, -180, 4, 57, -48, 213, -114, 175, 75, -67, -74, -96, 139, 228, 117, -266, 158, -93, 231, -23, -17, -107, -178, 389, 230, -161, 6, -20, 178, -69, -171, -472, -11, 64, 55, -208, 14, -43, 171, 76, -180, -4, 140, 85, -56, 118, 31, 46, 153, -129, -213, 263, 167, 81, -160, -255, -8, -53, 81, 156, -330, 193, -142, -507, 50, -42, -157, -162, 15, 140, 152, 109, -118, -261, 57, 127, 165, -106, -11, -39, 148, 15, -132, -29, -11, 34, 1, -94, -381, -200, 285, -109, -358, 115, -124, 57, 135, 121, -81, -19, -151, -96, -210, -72, 59, 156, 62, -113, 13, -25, 11, -246, -1, 124, 17, 183, -17, -242, 36, -43, -33, -48, -5, 153, 273]
6565B73m49L40l55j05L22Q8o4J46l5k60KoJ2K41k07j45K09J8J12K17n59J74J0
6588b1L11j29oN3k9k82mJ66r5J64J0l72K72k00L23l25J6N7J9J16l72M21J11k40
6612c6l3J10o0J43l7O7k81j08M26q0m0q4j11L23j57J83p0K4k07J29o7k03K15J98
6636B44r9k14P2Q7r9K75k01K8J64l07R0j82R8l9k09J00R8kK70k59J41r9j77K62
6660D2o6j35K83r5J52j50j28J58n0p7j25O1jK23J23k78L81m70K81J61l75q7K75
6683A03K30k13j13j24Q3K12j41k14j29L94K1j70j03P0K50L0j20l88J63J56J7Q7
6705A01k69%K46l2o9J9m19N14k18M4J84k04J95r0Q6m7J43k28K5J3K05K7m03n1
6729b28R2J91p1M1J75j79nM4j28K84r9l03K85j78J67N6j16j5j60K77pN3k28q8
$$ y = [273, -176, 164, -191, -296, 26, 114, 50, 196, 161, -99, -97, -103, -91, 150, -57, -202, 7, 25, 137, 354, -205, -31, -21, 290, 161, 155, 208, 179, -103, -107, 59, -36, 128, 138, -234, 38, -162, 161, -164, -148, -91, -72, 44, -328, 93, 204, -36, -69, 41, -19, 124, 87, 154, -127, -235, 191, 111, 71, -13, -124, 199, 42, 225, 155, 179, -28, 101, 34, -169, 46, 244, 145, -69, 3, 90, -9, 266, 65, 93, 257, -50, 40, -142, -44, -83, -292, -192, -94, -96, 174, -85, 56, -43, -220, 42, -24, -159, 124, 29, 181, 31, -97, 61, 11, -66, -191, -130, -131, 92, 215, -63, 318, -152, 129, 290, -85, -172, 103, 333, 120, 7, -117, -34, 178, 37, -177, -306, 88, 109, -61, -164, -94, 156, 186, 66, -322, -159, -3, 14, 101, -168, -168, 78, 46, -23, -4, -423, 91, -127, -83, 101, -103, 92, 2, 88, 41, 184, -44, -19, -6, 199, 226, -177, -228, -136, 55, -16, 25, 200, 21, 16, 60, -68, 216, 117, -186, 99, -79, 88, 144, 28, 13, -147, 130, 123, 176, -52, -140]
6753a40p1J70j12J75j3K20l71O6J44J00j16L48k54l58O5LJ7K05j15K13j35j3P0
6776I8K1l59J85K55m1k72k41L05K54j31k13K6K9k2k30M63kK06k95j29p1M51l47
6799f0L9J45k09K59J08l17j12j00M67r5l63M38k43J62r4K42j02m6m5k09J13r6
6821a18K7K89l27J52l63K87J56P2N3k22j99J88m2j11J52R9k81n4j20K42K14J6
6843A10k88R8N8m5O3k18J38j07J62l6K21r3j48o6J45k73L14J50j62l8Nl2J59l94
6867b77Q7K30j29J16j41N2o2K33Mo4n4No4l8J11l21L17o0J75l46J68K01j03r0
6891e0m9K4%p1J6O3K49M8p7l05Q4n2K64Rj98K1P3K52k39K1m23M61mR7l22n4R2
6918g0Q7J62k91QJ73Q4o5k38o9J70K30k28J17j68P9j0Q8m9j15PM7K25m07K00K58
$$ y = [-140, -211, -41, -153, 22, 9, 229, -142, -76, 68, 168, 52, 400, 146, -212, -147, -144, -127, 78, -37, 176, 41, 28, 98, 119, -240, -55, 200, 159, -113, -354, -49, 205, 74, -139, -113, -84, -106, -336, 127, 125, 331, 36, -93, -164, 287, -60, -21, 124, -85, 174, 282, -35, -147, -247, 220, 125, -238, 200, -43, 119, 25, 267, 165, 119, 74, -135, -22, -118, -91, 198, -129, 23, -340, -53, 103, 175, 228, 6, -193, -5, -47, -158, -6, 93, -188, -242, -362, -120, 94, 110, -178, -80, -22, -67, -4, -222, -84, -191, -29, -65, 156, 63, -85, -151, -6, -279, 35, 185, 23, -15, -10, -42, 117, -277, -190, 40, -89, 27, -114, -62, -124, 109, 113, 49, -5, 0, -64, -102, 9, -312, 5, -55, 120, -226, -58, 143, 40, -50, -99, -75, -75, -146, -130, -67, 182, 230, 153, -152, -68, -120, 144, 153, -45, -24, 49, 301, 62, 83, -340, 121, 117, 214, -108, -162, -70, 17, 179, -112, -104, 69, 153, 88, -150, -219, -49, 181, -47, 70, -98, -19, -29, 59, 10, -105, -98, -51, 174, -233, -33, 225]
6943B25q4l06J72N1Q9l14K18l1P4r9j19J94N6Kq9m57N03j09J59nr9r6j05M14q3
6968A61l32j27L73j06M3j57K66J89j6k31j83J09J47j53n1k32N59j75k52L81l10
6989i7R7R1j13J23l36M54n7j75j9j21J52K94k14l68K94p3J73J3r0j22K58j68k6
7012c0n7p1J35j06J8L68j77K51k57k23j1N57l78R4k12k46N63k35k5J68j78J74
7034A22L0l16j17K68N8J51m84K37M0L2j96O0K66M6l92J00r3K16M2k35K47k93K22
7057A1j30J61j15k09L26L0j68M7J63J36J8l52J11M02l27J22l30j00O7J12R8r7
7079b4j29J50J63j46k21J96M24m15k03J61J68k5j62N5l6J5J04k64L7J27m4M23
7101C54m34J13J10j24q1K1l0QJ50q2M0k65L54J7q4O9k11J76k5M6p6j76P6K31M2
$$ y = [225, 141, -165, 7, 58, 147, -167, 51, 20, 94, -5, -124, 70, 126, 128, 39, -418, 85, -24, 135, 130, 31, -65, -170, 244, 161, -171, -298, 75, -31, 12, -145, 121, 310, 294, 63, -120, -11, 136, -17, -68, -300, 259, 84, -168, 213, -97, 0, 91, -22, 101, -235, 219, 162, -13, -32, -153, -1, 293, 79, -289, 5, -68, 105, 118, 28, -94, 164, -4, -30, -87, -158, -23, -129, -111, 257, 80, 331, 74, -149, -160, 397, 19, 113, -99, -345, 218, -17, -42, 126, -52, 122, 152, -164, -281, -13, 45, 196, -288, -51, -11, 21, -175, -115, 151, 197, -195, -95, -188, 28, 70, -165, 82, -211, 11, -119, 42, -73, -282, 44, 74, -94, -47, 116, 252, 270, -82, 29, 431, 104, 226, -104, -204, -137, -25, 73, -24, -153, -3, 160, 14, -207, -11, 413, -2, -205, -44, 124, 99, -63, -8, -44, -29, 75, -189, -152, -25, -69, 354, -80, 33, 143, 19, -62, -41, -71, -63, 87, 5, 45, -220, 134, 151, 67, 136, -75, 101, 76, 122, 46, -130, -54, 177, 219]
7126B19k15J43k08O3j2m6J90j65J77r9j59J13K9j29M3N8k6J3j28K16k89M32j39
7149H1k27k5J76j29N24n18K09Q2l1j12j17k3L38k47J12j27N1j06J38j04j58J72
7171d1L0m3J82j0q4j56L92l07r0K5K32q9q8pR4j0J84k61j97N58l33LJ11j88J12
7196A9L8L6j33M7L10l48k05N0L11m7p0K2n5r9J96l9j46j70K29L6o9L4k20M65j69
7221B3J0j92K19k05J74qp4J20p7O8k40J25J03Qm15R1l2O9j40L9J13m4L82k40K5
7246i8J19L2r7M7%j46J33J44l40P0J86J58k53J67m04K99L22k12j86j03L31r7j57
7269h5P8j2j71J58O1k26K34L5l14K29M3M1K12j48k37L13k89n3P8J8J9j49J92j22
7293i5P5J34k15M7L3j18O8K23R4l27J82J10j94P8j93j72L81j49q1J9M6Q9j27J24
$$ y = [219, 4, 147, -61, 2, -10, -56, 134, -31, 146, 47, -112, 1, 30, -99, -56, 2, -24, -11, -139, 77, -212, 220, 81, -146, -171, 5, -124, 400, -118, 91, 173, 142, 30, -87, -110, 228, -19, 93, -34, 17, -89, 49, -55, -213, -41, -11, -54, 128, 118, 34, -122, 270, -37, -127, -102, 130, 41, -47, -54, 40, 30, 214, -47, -244, 314, -19, -16, 95, -93, 19, 57, 93, -40, 7, 317, -31, -236, -186, 125, 78, 8, 30, -25, -124, 72, 33, -113, -283, -54, -18, -87, -53, -273, 192, 23, 33, -159, 60, -145, 29, 21, -53, 67, -10, 58, -182, -57, 46, 54, -361, -270, -302, -233, -373, -334, -221, -265, 117, -123, -98, 21, 53, -44, 3, 3, -143, -10, 134, -206, -136, 50, 208, -45, 122, -282, 17, 339, 127, -59, -162, 169, 72, -85, -7, -19, -190, -32, 29, -197, 37, 72, -242, -13, 30, 71, 283, 135, -102, 211, -78, -131, -53, -35, -16, -165, 27, -95, -20, 114, -101, -54, -21, -139, -71, 152, 246, -81, 101, 211, 17, 95, -98, -270, 111, -38, -119, -100, -54, 35, -92, 32]
7317C2n6N7lJ78k36q7J59k76K04J81k16J46J86kj66Mj73J20j1j79JPJ41p0K43
7342A84k11j20p1Q0L32l96L73m3j20r8J3K48k48J97k1L8J54m03J09m5o1J60O0
7365A11k7l81K79J57j96o4o0J24N1J95m53J9J92J23k38O0K8K21L9n40J11%K53
7388Dj24N5N4j4m8M5n5J74k29J4L03m07L90k40M10l24o8j73L47j15j10q2M00j47
7412F0r5Q8l76O32m16J31oK87m35K21k8l88M24J67k85J80l02J80k4k5j89J88r2
7435a03J65k01J28j00K2k5J20j30J7L45j60j34l42N10NJ73m52J43K84j64R4m37
7457b42J62K97nk26j50O6K98Pj92J00K6J68l91l4p1L04j61j53k7l2N36l53L9K25
7481A91m50J96J07j15J9j62K89Q4k27k54M38Nnj04q5L2L7p1M8Q9j90L33k53k18
$$ y = [32, -24, 33, 30, 208, -28, -115, 44, -232, -28, 153, -63, 83, 269, 267, 101, 105, -68, 52, 41, -138, -137, -130, 11, -59, 184, -27, -147, -218, -138, 194, -202, 171, 128, 8, -90, -77, 171, -77, 120, 99, 137, 291, -112, -3, -48, -109, 51, 111, 84, -297, -18, 139, -57, -121, -181, -57, -6, 189, -264, -245, -53, 70, -168, -108, -80, 141, 180, -360, -249, -249, 4, -120, -65, -11, -25, -73, -28, -83, 91, -138, -124, 179, -228, 162, -78, 332, 8, -60, -233, 114, -1, -111, -193, 207, 60, -35, 53, -323, 309, -107, 24, 18, 305, -130, 91, 63, -325, 99, 266, -19, 161, -141, 39, 15, -10, -199, -11, -103, 62, -139, -11, -111, -89, -114, 6, -124, -107, 238, 78, -56, -398, 112, 117, 290, -162, -19, 265, 101, 195, -242, -80, 217, 212, -14, -164, -98, 200, 207, 15, 115, 141, 309, -82, -116, -187, 117, -44, -197, -224, -256, 280, -73, -34, 191, -259, -63, 44, -71, -52, -214, 75, 159, -68, -322, 116, 121, 116, 12, -73, -41, -4, -75, -27, 62, -128, 205, -48, -266]
7505b66Q4J94k7J15J13j38J95k77QnJ06k5j64J08l50N27M5k41N9j60k1J48J97
7528B25j97k72L24m8j16M9K5o1K53j91J04L10j78j02qjk93L93j18K2j51J66k54
7551a19J77m27L60l1J40k99J28Q1J68n8k14Q3oJ72l19m0K64k1R2j59k74L33j49
7574a18J88k60L75l78J13L34m89j5L44J26m34J48J29o6L2o8J7j32J96J15k28j26
7596a97L10N4J05k29j61R4J79j10k25j05K15M1R4l4k42M13L6j89j03K51j65J41
7618A73n00K26L6N4J66j99L5K40k19J18k66j13K95p2O4k82K10j16M39k79j00J8
7640g2q0K90lk39L4R7J37k36K21O1j92o3J35k66J15K24mo8l1N5j54K5N7M0Q3j59
7666Go8k38N11M6l51K26k25K19O3j69k03J62P5j5j03k95L94J59k42L0O5j21l2
$$ y = [-266, -182, 12, -15, 100, 213, 75, 270, -7, 1, -4, 102, 77, -87, 21, -329, 198, 243, 2, 61, -99, -120, 28, 225, 28, -244, 80, 32, -84, -35, -10, -71, 182, -9, 95, 405, 227, 125, 117, 116, -177, 216, 98, 120, -31, 135, -119, 58, -369, -9, -40, 100, -199, -71, 10, 178, 120, -94, -11, -17, 155, -164, -204, 60, 39, 131, -28, -302, 31, -118, 70, -190, 185, -193, -80, 254, -235, -250, 94, 220, -214, -66, 63, -3, 29, -39, -22, -154, 42, 157, -71, -197, 113, 167, 272, 43, -118, -24, 155, 45, -180, -285, -70, -29, 65, 31, -211, 202, 238, 49, -54, 197, 32, 173, -327, -101, -65, -11, 155, -44, -9, 231, 12, 130, -136, -249, 46, -26, 38, -244, -34, -150, 289, 10, -90, -72, -152, 138, 135, -104, -70, 27, 164, -72, 149, 210, 18, -45, 90, -176, -61, 163, 159, 91, 60, 115, -39, -14, 43, 83, 166, 7, -61, -299, 212, 258, -93, 133, -92, 127, 190, 21, -182, -20, 55, 40, -63, -358, 36, 195, -47, -17, 48, -73, -105]
7689a05J79R0k86Q3L19J0k43L93l27J82k83j32K15N9m4j10l1J44j86L04k26j95
7711a90K27k0J79k86J45j04L0j8j71lN24m27J27PJ20k17M7J43k47k1K78J07l52
7734a22o2L87K24j92l16k39M26j42j33j29K48J81j18m1j97j7M17Q3k08K1l47J85
7756i1K77j83j15M15l00Ml20K01K40k11J01J42q3J1J73j37P7m53K94j52k48L68
7778A0m3K22k63n2P2J75l0M9k15R4J21L1j60k50N2L78J18n7j41j41k62M56k20
7801e6rK3K7m1K9k71K41K30j42j40M4L66l20J37k08K84j47j03J18m7m3J44j81
7824f5Q1m8N0j78J78q7J82j72j11o5J17K55q3m7N2j03Q8r1J18l2k0P4J9m8jj66
7850a03M0J81k3j83J45m6qJ16j50k85K18K86k76j20L87pj41O9k00l4J28L38k88
$$ y = [-105, 74, 164, -122, -39, 280, 290, 47, 440, 113, 295, 12, -120, 95, 154, 110, 0, -31, 113, -73, 231, 5, -190, 37, 17, 196, -90, 55, -49, -19, -37, -208, -211, 313, -114, 13, 20, 140, -77, -30, 113, -134, -155, 123, 230, -122, -184, 203, 427, 235, -81, -320, 106, -36, -169, -298, -50, 131, 13, -28, -225, -242, 175, 258, 50, 71, -276, -91, 186, 3, -112, 303, 3, 7, -313, -112, 128, -83, 18, 160, 77, 88, 261, 124, 201, -252, 42, -110, -358, 10, -33, 189, -74, -126, -54, 121, 91, 140, -75, 19, 140, 171, 11, -239, -187, 191, 309, 252, 111, -30, -292, 164, -56, -65, -42, -15, -56, -27, -298, -57, 173, 31, -109, -65, 301, -19, 118, -90, 194, 47, -56, 62, 15, -28, 116, -65, 16, -32, 18, -160, 18, -69, 113, -59, -170, -235, -118, 137, 54, 7, 59, -44, 44, -47, 71, 39, 19, 93, 112, 64, 63, -103, -63, 118, 95, -88, 57, 11, 3, 119, -31, -316, -98, 188, -88, -208, 179, 172, 31, 100, -100, -134, -6, 332, 44]
7873D4j29L19j29j9l42N09k47p4l38K17L56k60N4J4O0K7o3M7k97K43M6j48R8m21
7897d33M56K8P6k43r2j5L20L05n12N0o6J48K32l30J3m8J78J67n6k03M4j1J79l82
7921a95M2K93mj36J0o2J46J79n10N37k54j61K56j21j53J86q6O0k08L45L9k33k8
7944e8l45K96J80P1j2k71J78n7j14m5k7L07K03l96M3k11N25j56m7k63J09J41O9
7967A20R0l31O9K5j7NL0o0R2Q4N2j33q4kM2j69J30R3K23j96l02L22K42r9l46N
7993a15K6K9J96n57L26J24K51k98j89J1k9M65l22J02P4K3j93j2j05J60K74m83
8015b42K01r9L3K47j72P7j91K18l7k10KJ12j61M17j12k90l6K85J45j63j27K59
8037A56J04l11m9O5K19j76j05J7l61P03j63O8l24J8k20P92l87k00O9O4K36j34
$$ y = [44, -85, 234, 105, 86, -256, 253, 6, -68, -406, -189, 167, -93, -39, -25, 35, 62, -1, 46, -251, -8, 38, -110, -12, -433, 23, 51, 127, -116, -208, -223, 97, 402, -110, -60, -126, 22, 254, -76, -63, -111, 67, 234, 178, -25, 19, 8, 187, -195, -153, 140, 136, 0, 10, -52, 94, 273, -237, 300, 46, -115, 141, 20, -133, 53, -33, 27, -181, 164, 203, -30, -58, -403, -107, 73, 144, 132, -139, 39, -18, -132, -177, -204, 103, 306, -90, -47, -258, 267, 111, 64, -199, -90, 51, 120, 210, -121, -52, -27, -44, -39, -9, -69, 23, 107, 159, 26, -58, -60, -18, -187, -57, 36, 259, 63, -239, 83, 325, 226, -120, -115, -89, -60, 136, -421, -95, 29, 280, -18, -207, -196, -225, 240, -82, 20, 94, 117, -76, -88, -193, -33, 241, -242, -41, -140, -107, 140, -32, 45, -146, 72, 35, -175, -173, -61, -222, 195, 83, -207, -243, 42, 187, 24, -103, 156, 260, -51, -100, -35, 184, 8, -97, -80, -441, 262, 99, 167, -157, -139, -359, 433, 46, -154, -85, -21, 215, 81]
8059H1k25p5L42l30K12l42K03L12K8m89L62j65J6J62l23J43J70J06j62j16%J45
8081E5J04q7j4J27m7j83j5Q5j03J47j50k7J20O3J01j15j56K09L9j50R5j93N3J84
8105A42k2p1l4j90M97k15k22j57M9L11N8l59r1L89j00l1J80o4O2k16J55k09m1
8128a79K37j32ON6k06K79J54j72j56K37K7k96Q6R4k68N48mo25K71L31l01m7K50
8151A90o6k42J49l08O4K36oj66Rn9K14L5Rl3j23K16J61l29r0K39P9k68j11K42
8175D2N7m6P1j29J6j3m5K63n15M29q1m0j70k22N28m08
$$ y = [81, -144, -219, 123, -207, 5, -337, -134, 178, 206, -283, 79, -86, -70, 92, -231, -88, 82, 188, 26, -90, -90, 55, 159, 72, 58, 185, 138, -45, -60, 25, -78, 69, -81, -108, 12, 75, 176, 61, -95, 114, 153, 3, 98, -95, -42, 142, 120, 49, 15, -175, 322, 107, -115, -272, -223, 88, 146, -213, -304, 85, -15, -46, 134, 70, 132, -84, 71, -138, -179, 58, -74, -68, -12, -218, 61, 215, 43, -113, 124, 151, -145, -59, 35, -233, 315, 311, -314, -43, 288, -13, -60, 190, 124, -118, 31, -277, -213, 23, 17, -149, -140, -199, 15, 50, 59, 26, -97, 119, 280, -49, -139, 100, 179, -89, -200, 42, 99, 53, 124, -5, 11, -2, -47, 216, -299, 130, 49, 9, -161, -383, 145, -263]
8191b63
$$ Imaginary data points
##PAGE= N=2
##DATA TABLE= (X++(I..I)), XYDATA
0@%%%%%%%%%%%%%%%%%%%%%%%%%%%jKlQj3J5j6J6j7J8j9K0k2K7l1L4l7M1m7N1n6
48c0O3o9P6q3R0j00J11j22J35j52J72j94K21k53K91l43M17n23O91j007J775n949
70d783j1986J5427J0792l342j1887n093J0246J2161o608j3303R62J0825N969o468
84B912j2754K088J4085L005j0904q105N713J2192J357j2994o531R692R870m399
98E227j1655l208J0381R160o808j1737R77J1614O223q209j1340L449J3042K152
112I268j1691q017P002J1780j220j2244m705J0594R074m597j0994k590J0817P999
126A0476q220j1589K118J1927M366r654r675N718J2744K63j1932n634P815R865
140H588k670j2320k798J0154Q033n251j1276J14J1541O201q539j0521L441J1299
$$ y = [0, 0, 0, 0, 0, 0, 0, 0, 0, 0, 0, 0, 0, 0, 0, 0, 0, 0, 0, 0, 0, 0, 0, 0, 0, 0, 0, 0, -1, 1, -2, 6, -7, 8, -8, 8, -9, 9, -10, 10, -12, 15, -16, 18, -19, 22, -25, 26, -30, 33, -36, 40, -43, 47, -53, 58, -64, 71, -81, 91, -103, 118, -135, 156, -187, 230, -293, 398, -609, 1166, -4783, -16769, -1342, 9450, 6108, -5779, -10872, -626, 11535, 4927, -8376, -7414, 3411, 9380, 2912, -9842, -7754, 6331, 9336, -1568, -9673, -3960, 8232, 9589, -3405, -9936, -244, 9626, 5227, -6428, -9636, 745, 9905, 3097, -8640, -7663, 3951, 10174, 1965, -9375, -5926, 7116, 9268, -2423, -10440, -3438, 8342, 7122, -5122, -9827, 767, 9841, 5244, -5750, -8340, 2477, 10476, 2256, -9333, -7215, 4712, 9078, -576, -10251, -4533, 8211, 8474, -3458, -9092, -1277, 8588, 5918, -6402, -9200, 954, 8987, 3736, -7540, -7426, 4115, 10316, 1777, -8744, -5303, 5996]
154E996K533j0827p960O929J1067j254j1008m329Q977R075l818j1215j900R599
168A865P075o552j0715J017J1676M670q837r092M617J1822Q80j1215o181P405
182a565R300k449j0820l288R084Q038m757j0140n21J0161O266p268j0144K350
196e753J1286K523r788p511O088J0427p43j0149m426Q127Q271l096j0479k337
210g560R115O955o042j0218J067J0133M955q244q771M568J0859R43j0049o221
224h510O614R278j995j0285l022Q162P737l778j0046r43R892N796p110r586K279
239e517J0089K994q984p346N277R660J79r495m490O938Q492k659r926k785Q660
254A087O219m601r359J20J0099M852p737p865L613R663J358r319n966N717Q444
$$ y = [5996, 8529, -2298, -10258, -3329, 7738, 6484, -4524, -8853, 124, 9199, 5381, -5834, -7734, 1865, 8940, 2388, -8327, -7310, 4366, 9036, 199, -8893, -4276, 7546, 8426, -2789, -8970, -1565, 7735, 5286, -5534, -8822, 262, 8300, 3543, -6597, -7118, 3043, 9309, 2041, -8103, -5753, 5533, 8056, -1732, -9243, -3155, 7272, 6529, -3620, -8046, 81, 8352, 5256, -5223, -7560, 1555, 8510, 2468, -7750, -6683, 3450, 8405, 161, -8610, -4042, 6817, 7760, -2289, -8510, -1896, 7382, 5387, -4898, -7920, 242, 7979, 4201, -5845, -6788, 3104, 8900, 1790, -7796, -5517, 4572, 7566, -1418, -8764, -3487, 6173, 6352, -3143, -7633, -695, 7797, 5138, -4788, -7573, 1087, 7306, 2705, -6654, -6534, 3565, 8417, 680, -7185, -3572, 6091, 7449, -1870, -7836, -2119, 6325]
269F325j074r531l613P530P426k852r798j109R153N503o164r167J867R483L201
284G180q242o796M705R454m4q579m734O540P955k634r171k924P700O955m887r219
300f741L44R639M455o749p852L149R007J543q109o104N170Q108r80q409l735P088
316a76P376k853q736j745Q098N813n586q857J111R132L029p413o290L633Q800
331E336M80p865m580N404P784j988q418l325P107P102l857q901m9Q664M399o030
347A263p509K457Q641J779p941n918M545P719k56q071l781O653P134k736q154
362d175k008P791N585n285q372J078Q365L531o930o302L794P716J380p601m914
377f347M909P319j041q364l506O972O083l023q238n99Q319M686n585p768K290
$$ y = [6325, 5251, -4280, -7893, -363, 7063, 4211, -5587, -6696, 2457, 7960, 1796, -7371, -5504, 3979, 7180, -1062, -7858, -3153, 6301, 6257, -2322, -7056, -516, 7439, 4805, -4366, -7290, 410, 7365, 2478, -6741, -6397, 3242, 7697, 948, -6904, -3755, 5252, 6795, -1314, -7418, -2248, 5860, 4880, -3529, -7264, -176, 7200, 4347, -4389, -6134, 1964, 7777, 2191, -6666, -5555, 3577, 6606, -807, -7097, -3464, 5336, 5816, -2049, -6629, -1225, 6559, 4571, -3847, -7172, -65, 7037, 3180, -5721, -5770, 2894, 7293, 1263, -6246, -3789, 4852, 6631, -1310, -7228, -2683, 5036, 4780, -3291, -7072, -419, 6715, 3979, -4175, -6183, 1608, 7193, 1908, -6464, -5386, 2979, 6510, -420, -6722, -2928, 4788, 6168, -1433, -6347, -1438, 5881, 4840, -3524, -7030, -58, 6025, 3002, -5236, -5835, 2484, 7170, 1585, -6183, -3893]
392c893P995J960o998n963M107P424J29p108l990N496P170j554q644k225P548
407A454N242m902p884R52P843L324o085o147K740Q343O76o907m643M091P267q49
423D515p742l365O314O424k750q003q59P880M511n316p129J602P464K182o429
438g01n598L060P931M39p448l789N002P209j844p931k147O726N198m267p267l3
454e460P830L725n836n780K352P653J291o366n018L493P197o53p483k931N510
469d76O378k693p695r40P382M430m717p334J546P078K645o228n517L205O863O42
485D569o017m596M935P005j510p535k720O349N352l563p544L09P308L482n318
500E06o148K365P082K010o553n179L674O671k91o852l616N439O496j936p389j091
$$ y = [-3893, 4102, 6062, -936, -6899, -2792, 4632, 4761, -2347, -6337, -841, 6329, 4775, -3869, -6094, 1454, 6696, 1794, -6090, -5138, 2705, 6029, -56, -6203, -3463, 4880, 5556, -1351, -5994, -1903, 5364, 4515, -3227, -6592, -278, 6146, 3396, -4607, -5466, 2414, 6925, 1609, -5520, -3918, 3546, 5728, -701, -6299, -3239, 4692, 5131, -2317, -6106, -1104, 6105, 4261, -3670, -5817, 909, 6107, 1840, -5427, -5460, 2370, 6095, 259, -5521, -3169, 4484, 5775, -591, -5609, -2116, 5081, 4428, -3055, -5986, -476, 5902, 3209, -4486, -5426, 1956, 6386, 1669, -5665, -4119, 2959, 5604, -624, -6141, -2936, 3927, 4569, -1448, -6044, -1109, 5896, 4386, -3149, -5869, 480, 5832, 2269, -5275, -4966, 2342, 5824, 506, -5642, -3277, 3805, 5815, -738, -5917, -2243, 4428, 4137, -2715, -6331, -892, 5604, 3668, -3721, -4812]
516d812O854M065m260o809N80P066K838n675n626K777O777J045o093m308M342
531a239O654j245p558k321O135N260l477o856k30O946L602m676n797J636O790
546C624K032o132m955K998O410L36o664l485N268N679j755o855j512O220M670
561E879l941o684M12O708K642m883n575K184O886J532n800m851M173O406o00p344
577b856k595N219N599k911o980k30O235M049m300n846J132O714J955n357n325
592e497K886O517M83o471l756M973O108j647o565j980N986M455l500o455K00O376
608B113K495m312n279J590O675J593n493m549L410O299m92o817k633M994M993
623D587k197o206q52O179M059m091n815R90O000K452n131n446K688O386R01o254
$$ y = [-4812, 2042, 6107, 1847, -4962, -4382, 2684, 5522, -153, -5779, -3002, 3775, 4820, -1273, -5581, -1239, 5415, 4170, -3388, -5709, 426, 5686, 2209, -4647, -4877, 2069, 5671, 995, -4802, -3166, 3624, 5656, -476, -5431, -2433, 3977, 4313, -2351, -5836, -568, 5111, 3356, -3499, -5011, 1209, 5879, 1938, -4746, -4334, 2374, 5016, 133, -5442, -3258, 3628, 5160, -640, -5491, -1318, 5088, 4488, -2856, -5451, -232, 5367, 2456, -4524, -4754, 1481, 5530, 1230, -4616, -3484, 3230, 5185, -172, -5497, -2611, 3906, 4389, -2082, -5838, -865, 5243, 3596, -2969, -4949, 1037, 5492, 1992, -4463, -4263, 2113, 4608, 296, -4983, -3393, 3282, 4875, -618, -5167, -1757, 4542, 4050, -2767, -5400, -406, 4587, 2390, -3816, -4668, 1511, 5570, 1479, -4336, -3346, 2654, 5106, -25, -5471, -2783, 3603, 4504, -1750]
639a750m052M522O241j347o688j621N307M497l226o257qN958L455m619n153J362
655c379O620J764n365m606L117O121j94o078l120M655N079j872o208r62N644M028
671E244l640n701O68N760K567m583n274J726O498J016n616l621L732O133j067
686C842o234k150N195M318k646n953o91N646L267l830n050J178N665K204m753
701Hm766K825N776M35o540l346M759N094j499o001j050N402L993l095n800J91
717c614N302K831m117n432J965O191J388n544m005L772N870p87o427j965M591
732A9M394k315n874n03N145L815l583n320J042N849K356m911m660K434N837L1
748C756n629l273M084N347j360n636j584M722M321k628n854j44N560K955l952
$$ y = [-1750, -5802, -1280, 4961, 3614, -3074, -4695, 612, 5109, 1883, -4374, -4382, 1576, 5031, 412, -4741, -3379, 3241, 5005, -360, -4966, -1849, 4272, 4078, -2000, -5120, -465, 4614, 2742, -3466, -4428, 1216, 5244, 1604, -4097, -3429, 2331, 4898, 315, -4959, -3233, 3265, 4281, -1335, -4956, -1224, 4909, 3842, -2392, -4542, 653, 4971, 2325, -3628, -4319, 1327, 4594, 764, -4286, -3108, 2557, 4761, 8, -4758, -1933, 3843, 4278, -2262, -5608, -849, 4245, 2746, -3255, -4305, 1097, 5090, 1995, -3805, -3614, 1688, 4519, 402, -5030, -3065, 3126, 4514, -1030, -5035, -1263, 4607, 3820, -2607, -4572, 19, 4413, 2098, -3776, -4279, 866, 4681, 1098, -4222, -3180, 2669, 5025, 114, -4546, -2112, 3725, 3756, -1873, -5146, -1062, 4285, 2925, -2711, -4295, 427, 4748, 2120, -3734, -3878, 1682, 4637, 685]
763F85n300J301O247J280n088l718L216N610l23n653k881M220M678j847n855o52
779d080M834L770l209n223N27N846K488m805m694K261N449P56n321l368L730N175
795D136r18n839j195M291M229k474n318o02N171L092l999n026J052N900J656n049
811h93l666L109N504l54n622k706M194M621j547n478j692M989M041k635n738O96
827c177N479K617m694m590J766N797O79n177l394L511N165j012m951k234M038
842a77M668k009n662o96M654L550l325n133O84O146J621m662l626K460N054M25
858C972n695k634L655M460q97n418j525M411M019k408n363K86N122K456m044m879
874d482J668N426J122m747l774L472M990m07n084k084M056M250j741n113j195
$$ y = [685, -4615, -3314, 2933, 4213, -875, -4593, -1377, 4233, 3910, -1743, -4624, -404, 4274, 2427, -3428, -4080, 754, 4524, 1315, -3908, -3381, 2465, 4953, 148, -4546, -2285, 3164, 3920, -1401, -4769, -1039, 4136, 3218, -2621, -3816, 475, 4704, 2230, -3088, -3690, 1481, 4573, 574, -4452, -3400, 2500, 4156, -893, -4559, -1450, 4054, 3700, -1922, -4628, -434, 4187, 2640, -2838, -4530, 459, 4500, 1865, -3873, -3177, 2302, 4919, 225, -4365, -2599, 3198, 3877, -1300, -4694, -1183, 3982, 2970, -1981, -4215, -177, 4491, 2482, -3180, -3876, 778, 4328, 1003, -4130, -3446, 2700, 4321, -341, -3967, -1507, 3547, 3972, -1723, -4357, -702, 3758, 2861, -2557, -4082, 329, 4348, 1940, -3423, -3137, 1985, 4441, 397, -4482, -2814, 2612, 3734, -1013, -4787, -1315, 3675, 3268, -1816, -3900, 156, 4406, 2665, -2448, -3643]
889c643M750L123k805n131N16N252K216m171m014K196M929M39m932l029L238M405
905C339p75n169j574M343M080j943n241j69M947K496l932m424J634M964J111m637
921i50l300K916M709k67m481k547L707M419j698n322j205M404L541k973m750M58
937c339N185K228l872m023J598N415J92m296l226K915M763q06m688j942L908M188
953D200j973m865n98N025K256l130m593N22N131J555m192l309K435M480N19m658
969a195k669L265M225j042m961j412L955L936k834m557J78M892K346l531m206
984c610J641M760O95m382l344K893M266j51m650j772L393M455j793n254o08M565
1000A104L073l248m820J084M902J523l885l411K125M774K45m665k586L159M330
$$ y = [-3643, 1107, 4230, 1425, -3706, -3190, 2062, 4278, 107, -3907, -1711, 3218, 3657, -1275, -4304, -1066, 3339, 2564, -2605, -4179, 164, 4244, 2301, -2940, -3109, 1838, 4334, 402, -4022, -2388, 2576, 3687, -950, -4250, -1334, 3375, 3108, -1373, -3920, -213, 4206, 2508, -2814, -4019, 385, 3926, 953, -3797, -3339, 1846, 4074, 202, -3821, -2223, 3192, 3384, -912, -4138, -1223, 3540, 2734, -1954, -3896, 12, 4200, 2227, -2638, -3236, 1789, 4045, 915, -3678, -3156, 1975, 3530, -662, -3971, -1536, 2944, 3463, -1195, -3864, -599, 3626, 2584, -2377, -3789, 166, 4102, 1268, -3289, -3111, 1781, 4127, 596, -3610, -1969, 2791, 3486, -896, -4240, -1347, 2919, 2768, -1882, -3654, -261, 4194, 2401, -2853, -3461, 1104, 4177, 929, -3891, -2807, 2095, 3618, -267, -3678, -1553, 3221, 3466, -1199, -3785, -626, 3704]
1015C704j470m614j506L870L636k083m822K17M739K477l553m021J461M219J148
1030C402m308k959K353M213P8m321k266L403M328j429n242p33M358K852k496m834
1046c601R45M132K036l659l334J876M215P01l911k858K378M412q33m661j558L447
1062b73L955j926m854K54M519K202l469l696P66M597J137l726l239K033M313K40
1078B833m374k213L691L760j108m806j394M285K941k524m211K08M705J584l328
1093D9l299J481M255R50m125k961K727L651l25m477j911L536L955j719m538l03
1109c054M295K690k930l944P62M010J502l820l157K025M004P64m186k397L035
1124d01L941j148m528j053L369L215k369m089J0M358J997k930l582J197M263J005
$$ y = [3704, 2234, -2380, -3886, -16, 3620, 1537, -3285, -3068, 1671, 4148, 595, -3426, -1965, 2254, 3402, -906, -3865, -1512, 2701, 2779, -1542, -3808, -405, 3923, 2494, -2748, -3481, 877, 3729, 1233, -3601, -2656, 1476, 3512, -147, -3481, -1605, 2610, 3311, -600, -3458, -1080, 3332, 2499, -2162, -3720, -273, 3682, 1756, -3098, -2844, 1675, 3877, 408, -3288, -2522, 2075, 3212, -514, -3753, -1720, 2593, 2833, -1541, -3754, -63, 3697, 2589, -2217, -3611, 674, 3615, 1091, -3120, -2912, 1793, 3377, 49, -3250, -1769, 2486, 3436, -689, -3650, -923, 2728, 2403, -2074, -3985, -449, 3506, 1787, -2751, -3054, 1241, 3931, 1001, -2943, -2181, 1829, 3331, -489, -3646, -1621, 2383, 3147, -1039, -3436, -401, 3540, 2392, -2136, -3189, 180, 3395, 1026, -3063, -3053, 1305, 3302, 372, -3210, -2013, 2250, 3255]
1140C255l663k896J952M479n51m293k056L576L596j352m259n18L721K475k652
1155H14l747M47L898J678l178l277J107M648P00l962k620K616M095q97m098j495
1171c271L187L560k474l635J64L741K384k662l551Q15L591J271l683k839J854
1186a548M212m5m307j555K691L882j293m082r63L737K799k185l980Q1L936J482
1202B862k712l367J247M200R81l630k951K486L958o92m382j413L413L066j598
1217A468m060j51L773K086k122l527P34L849J107l303l284J969L896L95m088k413
1233c671L180L558r35m001r58L676K547k507l495J5L711J828k900l000R72M060
1249B080Q80l646k615J980M012l09l932j558L113K914j562l778j69L183K659k373
$$ y = [3255, -408, -3304, -1352, 3127, 2576, -1717, -3773, -197, 3399, 2047, -2212, -2730, 991, 3466, 814, -2933, -2486, 1412, 3090, -88, -3365, -2258, 2390, 3090, -872, -3492, -876, 3219, 2322, -1776, -3271, -84, 3476, 1002, -2633, -2469, 1272, 3656, 994, -2557, -1742, 1849, 3120, -563, -3402, -1548, 2664, 2619, -1688, -3243, -552, 3330, 2037, -2045, -3008, 729, 3528, 1343, -2637, -2556, 1380, 2862, 150, -3217, -1970, 2230, 3211, -419, -3370, -884, 3074, 2382, -2000, -3413, 0, 3066, 1468, -2592, -2743, 1030, 3116, 994, -2533, -1799, 2050, 3157, -146, -3430, -1461, 2435, 2830, -1258, -3671, -491, 3067, 2132, -1869, -2827, 849, 3396, 889, -2606, -2591, 1120, 2948, 48, -2952, -1980, 2080, 2960, -686, -3301, -1321, 2691, 2382, -1550, -3108, 5, 2919, 1357, -2421, -2590, 593, 3252, 879]
1265H79l384L53L888J333k959l577J803L874M36l668k146K602L569q41l821j006
1281b665K979K685j895l476k10L593J941k530l206P66M150Q69l222k787K201L478
1297B671k79m106j366K416L637j524l684k69L274K440j861l647K24L426J596k776
1313A72l585J594L717O80l413j824K028L305n96l321j435K688K857j542l681n50
1329b906L666J961j991l324N94L810J416l187l135J890L570P9l768j739K869K846
1345B651q20l478p55K858K585j691l637J29L221K014k793l485J410L471R08l309
1361g21k404K560L122l78l579j529K932K623j279l232q61L342K251j867l546O13
1377a953L633J444l084k905J636L233N75l578k235K539L175o62l438j159K760
$$ y = [879, -2505, -2152, 1736, 3069, 110, -3467, -1664, 2210, 2646, -1022, -3168, -566, 3003, 2162, -1659, -2665, 314, 2999, 1104, -2372, -2582, 1011, 2952, 422, -2784, -2018, 2132, 3001, -221, -3008, -807, 2671, 2392, -1714, -3080, -664, 2973, 1449, -2235, -2504, 770, 3210, 1349, -2298, -2074, 1352, 2948, 172, -3413, -1819, 1898, 2578, -835, -2659, -631, 2674, 2078, -1243, -2678, 10, 2867, 1325, -2356, -2906, 760, 2721, 730, -2594, -2000, 1810, 3226, 39, -3096, -1206, 2364, 2443, -1325, -3064, -195, 2651, 1831, -1647, -2402, 456, 3041, 1350, -2287, -2158, 1063, 3077, 284, -3201, -1791, 1680, 2588, -721, -3125, -565, 2557, 2179, -1400, -2929, 3, 2626, 1347, -1885, -2746, 596, 2847, 980, -2566, -1953, 1680, 3124, 40, -2865, -1229, 2004, 2579, -999, -3234, -695, 2480, 1818, -1620, -2779, -19]
1392a9K838j186l823j78L645J684k503l161O92L720Q53l137j999J814L369k53
1408B356l737j218K278K920j196l255o07K487K817j699l712N29L480J369k652
1423A60k721Q83L525N89l316k070K213L168k69l381j225K805K546j539l290n49
1439b471L167J880k008l350M78M201O29k827k550K018L239k81k957j917K202K878
1455B331r93l401l65K650K595j673l303J59L125J792k500l146J043L053Q16l122
1471i39j844K010K895k16l156j162K564K417j139l300o14L245J850j967k942L74
1487a924L539R51k610k483J495L426pl127j867J995K754p37l177o42K614K370
1503B570j215l278j82L176J469k302k648O50L484M39k678j852J697L058l35k788
$$ y = [-19, 2819, 1633, -2190, -2368, 1277, 2961, 458, -2703, -2011, 1709, 2562, -575, -2574, -760, 2609, 2356, -1381, -2599, -321, 2599, 1403, -1852, -2459, 28, 2845, 1146, -2566, -2037, 1443, 2812, 160, -2561, -1678, 1847, 2436, -880, -2950, -737, 2431, 2162, -1219, -2444, 361, 2907, 1368, -1922, -2471, 696, 2576, 568, -2782, -2304, 1897, 2526, -301, -2851, -833, 2406, 2125, -832, -2749, -547, 2331, 1338, -2063, -2428, 222, 2817, 1144, -2159, -2000, 1125, 2917, 417, -2729, -1686, 1367, 2183, -939, -2783, -773, 2122, 1906, -1250, -2412, 152, 2569, 1430, -1870, -2484, 761, 2611, 644, -2298, -1924, 1615, 2566, -44, -2527, -1032, 2394, 2387, -740, -2607, -612, 2142, 1405, -1772, -2414, 200, 2570, 1355, -1923, -2105, 1071, 2540, 238, -2410, -1760, 1724, 2163, -515, -2367, -670, 2388, 2053, -735]
1519g35j674K262K883j160l595j004L245K014j378l368N84L303J276k461k666
1534b474J403K915K00k879j988J923K730Q4l293j086K471K446q68l371l30L003
1550H86J807k384k776O47L501N55k780j782J587K816M0l025j480K179K431n17
1566A705l288r95K764K246j778l237N66L212J362k507k473R81L589J64l169j806
1582b664J756K933m52k632j614K588K622j326k943k15K664J656j997k671N46L093
1598A344R28k570k053J229L082K37k661j920J950K563m61l074j013K251K529j757
1614F04k630o6L355J179k097k281O12K758M65k022k493J534K880K40l186r88K225
1631H9K218p47l223n13K834J718j801k748L35L151J021k359k281J265L032L82
$$ y = [-735, -2409, -147, 2736, 1576, -2019, -3023, 222, 2236, 858, -2510, -1926, 1377, 2653, 192, -2474, -1071, 1844, 2044, -835, -2823, -900, 1830, 1914, -1379, -2465, 6, 2452, 1584, -1787, -2117, 886, 2693, 309, -2467, -1820, 1681, 2236, -544, -2326, -739, 2077, 2117, -908, -2388, -209, 2222, 1705, -1583, -2578, 186, 2432, 654, -2583, -2017, 1195, 2557, 50, -2423, -1442, 2147, 2311, -858, -2664, -908, 2025, 1573, -1059, -2673, -85, 2537, 1211, -1732, -1947, 717, 2373, 376, -2295, -1749, 1344, 2272, -298, -2351, -1122, 1960, 2197, -464, -2384, -434, 2129, 1668, -1406, -2419, -168, 2361, 604, -2026, -2092, 1263, 2442, 345, -1936, -1324, 1434, 1899, -123, -2616, -1082, 1798, 2038, -1148, -2136, 89, 2307, 1560, -1663, -2176, 658, 2376, 575, -2173, -1838, 1313, 2334, -25, -2306, -1041, 1991, 2373]
1647B373k822j831J546K848q75k677j067K621K115j452k551r7K474J699j975k473
1663b144R18K559N99k228j713P44K967j41k262j670K176K621j209k645n58K645
1679F59J640j534k912N08K452J395j854k478N51K922Q97k595j852J758K300j80
1695A677k732j315K350K170r25k883j12K444J747j989k392K71K896O13j906k294
1711b380J286K916N8k612j235J680K623q55k703p49K361J671j616k374K93K541
1727I05J277k090k034O28K790N78k366j915J395K716l19k602j005J749K314o38
1743A383k942k11K779J546j804k555K37K634J003k015k106P87K525M62k088j525
1759a890J642K354p04k554j147K217K170j168k627J02K412J545j918k192N32K744
$$ y = [2373, -449, -2280, -734, 2114, 1239, -1438, -2505, 116, 2231, 779, -1772, -1869, 605, 2304, 329, -2144, -1226, 1333, 1932, -296, -2009, -1265, 1702, 1561, -701, -2371, -195, 2426, 1217, -1428, -1986, 659, 2299, 765, -2147, -1639, 813, 2208, 354, -2124, -1573, 1349, 2246, -349, -2201, -443, 1857, 1677, -1055, -2370, -20, 2150, 1225, -1658, -1770, 674, 2421, 432, -1960, -1689, 1207, 1820, -86, -2380, -1094, 1822, 1880, -732, -1967, -287, 2336, 1481, -1222, -1971, 390, 2061, 445, -1929, -1636, 905, 2182, 92, -1942, -1314, 1476, 2054, -312, -2227, -832, 1884, 1565, -1037, -2042, -293, 2021, 1383, -1559, -1770, 1009, 2555, 751, -1804, -1567, 1067, 2070, 55, -2051, -1264, 1261, 1723, -365, -1890, -248, 2106, 1402, -1152, -2299, -82, 2088, 920, -1707, -1605, 807, 2352, 434, -1758, -1226, 1518]
1775A518O39k389j966J508K206K51k671j448K283K218j047k569n08K438J763j746
1791D80k376M48K369J022j954j929P28K742L63k124j965J663K537n96k639p57
1807a988J920K057j252k151l96K475J460j668k033J95K343J018k044j915J022
1822i57K574p5k102j460J415K893q21k827q2J641J774j069k411j96K416R76j399
1839B90k273P11K614N92k066j914J627K395m44k605q18J394K520q99k818j69K507
1856F44J539j595k551N57K385J167k198j936Q70K444N38k617j273J731K401r55
1872A151k137n32J683J618r92k238j52K276J511k049j745N43K441L21j856j784
1888a941J193K243j91k273r72J967J595m81k405n46K159J523j100k236J36K190
$$ y = [1518, 2157, -232, -2198, -690, 1516, 1767, -904, -2352, -69, 2149, 1102, -1467, -1975, 463, 2226, 480, -1896, -1448, 921, 1943, -11, -1940, -1212, 1530, 1893, -231, -2196, -533, 2004, 1408, -1231, -1988, -68, 1989, 737, -1414, -1810, 665, 2125, 457, -1576, -1381, 962, 1980, -64, -1979, -957, 1617, 1542, -560, -2020, -605, 2288, 1467, -1360, -1442, 199, 1973, 904, -1507, -1703, 713, 1689, 290, -1983, -1272, 1342, 1934, -132, -2046, -419, 1976, 1532, -1073, -1891, -497, 2023, 1124, -1694, -1863, 644, 2183, 588, -1963, -1406, 979, 2146, -52, -1988, -1118, 1326, 1864, -753, -2026, -295, 2106, 1151, -986, -1518, 165, 1783, 791, -1447, -1599, 677, 2188, 139, -1606, -1063, 1378, 1699, -157, -1941, -748, 1495, 1304, -969, -1941, 26, 1621, 1140, -1265, -1811, 348, 1871, 771, -1465, -1329, 861]
1904H61J192k058j945P19K574M5k026j163J203K396m15k271q04J893J517r07j980
1921a169n29K196J215j650j724L63K233J006j967j882J047K289K73k649r16J657
1937b07J870m90k401n54J910J983j511j790l03K361Q06j470j899N53K101O97j933
1954b77j772J656K053j99k271j027J950J531m43k243o91K022J670j277k218P9
1970a457K466P88j874j620O92K388K0k335r58J697J939p87j792r02J999J750j165
1987H49k261M7J888J250j407k231M90K365P25j948j512J215K317l25k093j191
2003a822J581J709m01k289l84J852J919j594k266L70K182J149j946j723P44J992
2019A073M07k083j194J116J904k0k116o49J614J657q66k220Q9J740J445j570k256
$$ y = [861, 2053, -5, -1950, -1231, 1343, 1388, -638, -1801, -598, 1798, 1383, -888, -1692, 201, 1718, 811, -1169, -1698, 498, 1713, 63, -1661, -1298, 935, 1941, -26, -1908, -861, 1428, 1701, -948, -1864, -207, 1663, 1173, -1228, -1782, 128, 2111, 600, -1190, -1493, 868, 1674, 204, -1695, -1142, 959, 1656, -277, -2049, -393, 1660, 1461, -810, -1837, 113, 1644, 1201, -1042, -1733, 289, 1959, 682, -1536, -1457, 1009, 1797, -77, -1697, -1005, 1383, 1403, -932, -1890, -193, 1746, 959, -833, -1735, 264, 2014, 849, -1412, -1365, 523, 1773, 366, -1865, -1375, 990, 1715, -233, -1745, -530, 1787, 1462, -631, -1822, -241, 1468, 1067, -1222, -1606, 246, 2165, 571, -1695, -1325, 857, 2006, 60, -1663, -919, 1073, 1480, -603, -1797, -681, 1223, 1203, -913, -1562, 52, 1709, 843, -1377, -1288, 452, 1897, 327, -1929]
2036a929N79K262N22j491j629J200J902k48j731j139J469J803r28j612q25J835
2052D0J620q68k096L31J742J063j637j885M94K214P31k054j525J244K086l70j620
2069d90j237J675J800o53k348m66K261J204j321k160M85K201N95j789j332P86
2085g89J963K80k054j171J336J952l54k190m66J698J526q31k092k78K257J079
2101A866j379j810J05K165N25j792j424J319J711P5j833j089J329J730n75k098
2117a175o78J893J664r08k340K96K180P15j459j629O76K187n7j313j409Q55J725
2134A223J17k100q51J520J673o97k039k23K091R77j301j857K23K031O97j575j651
2151a742J133K051j24j972o41P34J908l27k062o66J502J622q23j919L27J768Q32
$$ y = [-1929, -1350, 912, 1434, -57, -1686, -486, 1416, 1168, -563, -1702, -233, 1570, 642, -970, -1795, 40, 1660, 792, -1304, -973, 769, 1832, 195, -1690, -1196, 1018, 1749, -305, -1830, -586, 1500, 1130, -490, -1727, -52, 1748, 1095, -1253, -1719, 542, 1746, 425, -1735, -1250, 951, 1546, -243, -1575, -789, 1174, 1454, -600, -1771, -435, 1517, 1163, -1027, -1493, 205, 1731, 900, -1192, -1470, 787, 1866, 487, -1323, -1218, 947, 1472, -320, -1744, -425, 1286, 1361, -472, -1561, -232, 1498, 923, -1175, -1853, 40, 1704, 796, -1544, -1248, 932, 1647, 188, -1441, -765, 1422, 1365, 52, -1357, -502, 1223, 1340, -760, -1611, -91, 1582, 885, -1154, -1377, 714, 1691, 390, -1467, -1244, 787, 1484, -91, -1742, -609, 1442, 1318, -654, -1295, -561, 1347, 1020, -1042, -1708, -206, 1416, 593, -1326, -999, 769, 1601]
2168A601j323j650M63J740P57k145j021Q01J976j05j891q28J435J838o16k094
2184a062l02J771J362j294j872K42J968P05j800q52M78J895K25j846j406J399
2200c89J675l30j899q59J725J900j313j773J38J712J448j604j666L69J697N18
2216A349j709j242P18K053J70j818q17R53J768l13j907o97J921J247j064j876
2232a264J57J814P69j012j873M18J786N10j683j292J289J786l16j733r84J385
2248b43J639p32j718k80J991Q73j246j671L24J743P50j566j263P53J890J71j912
2265d97r40J414J158k30j660n63J461J048o52j564l85J857J000j253j303O23J654
2282A168K65j698j037O48J510M4j733p99J477J656o98j653j76J682O66p78j850
$$ y = [1601, 278, -1372, -909, 831, 1588, -557, -1578, -777, 1199, 1094, -797, -1625, -190, 1648, 1032, -1062, -1364, 407, 1769, 475, -1397, -1155, 813, 1518, -282, -1134, -656, 1239, 1464, -382, -1788, -389, 1286, 956, -943, -1802, -77, 1823, 510, -1263, -1125, 587, 2035, 431, -1235, -866, 831, 1349, -360, -1602, -884, 1169, 1339, -479, -1296, -343, 1425, 1112, -795, -1492, 429, 1676, 612, -1264, -1107, 707, 1476, 464, -1409, -991, 795, 1305, -378, -1670, -381, 1405, 1089, -644, -1628, -243, 1396, 664, -1054, -1334, 657, 1530, 284, -1387, -1063, 680, 1430, -136, -1399, -646, 1244, 1415, -497, -1437, -23, 1135, 905, -755, -1318, 143, 1191, 539, -1025, -1410, 447, 1447, 194, -1109, -486, 1168, 1433, -265, -1302, -654, 856, 900, -833, -1632, -155, 1501, 803, -850, -1026, 656, 1322, 544, -1306]
2299a306M54J353R38j564j243L10J818O19j881r40J082J406J87k078m99J501J125
2316A282n45j834l5J580J032j302j107O8J824O82j827j065O93J527K3j694p19
2333a417J173J579o29j509l63J417J373j192j197l21J516N91p99j397L67J732
2349I24N03j476j473J242J910l55k328k81J486J240n73j929m36J740J193r36j589
2366a138K36J365Q26j208j651R23J779j40j469r15R57J879l14j819m35J434J190
2383A500q98j789K42J518O52p76j584J83J490P85j556j268J240J413l19j391p64
2400a322J343J225n20j745m06J452J526j181j278j65J756Q27j430j476P95J585
2416I86K52j748q77J246J384m85j245p63J383J278r91j460J03J354N83q24j237
$$ y = [-1306, -852, 501, 1439, -125, -1368, -1058, 760, 1379, -502, -1442, -360, 1046, 1233, -845, -1344, 157, 1282, 737, -1097, -1132, 448, 1480, 178, -929, -861, 963, 1645, -182, -1247, -554, 973, 996, -698, -1417, -244, 1335, 706, -803, -1166, 251, 1624, 432, -765, -1086, 430, 1021, 222, -1175, -808, 924, 1427, -49, -1522, -280, 1630, 1275, -1053, -1334, 152, 1392, 819, -1110, -1546, 194, 1387, 451, -1138, -902, 463, 1289, 81, -1570, -647, 1132, 992, -477, -1392, -435, 1444, 1130, -689, -1124, 310, 1500, 602, -1187, -945, 573, 1225, 449, -1135, -952, 538, 1323, -233, -1501, -261, 1152, 833, -558, -1322, 21, 1246, 726, -1019, -1425, 27, 1553, 372, -906, -1071, 685, 1512, 82, -1394, -599, 986, 1238, -510, -1387, -141, 1243, 758, -487, -1250, 133, 1411, 420, -1040, -937, 417, 1000, 176, -1061]
$$ [...]
8191A55
##END NTUPLES=NMR FID
##END=
