##TITLE=1H_BAU-j-BBU
 CDCl3, 8 sc, 
 13.3.2019
##JCAMPDX= 6.0         $$ Bruker NMR JCAMP-DX V2.0
##DATA TYPE= NMR FID
##DATA CLASS= NTUPLES
##ORIGIN= UXNMR, Bruker Analytische Messtechnik GmbH
##OWNER= root
$$ XWIN-NMR		Version 3.5
$$ Wed Mar 13 14:36:49 2019 Russian Standard Time (UT+4h)  she@DPX200
##.OBSERVE FREQUENCY= 200.1314
##.OBSERVE NUCLEUS= ^1H
##.DELAY= (6, 6)
##.ACQUISITION MODE= SIMULTANEOUS
##.ACQUISITION SCHEME= undefined
##.AVERAGES= 8
##.DIGITISER RES= 18
##SPECTROMETER/DATA SYSTEM= spect
##.PULSE SEQUENCE= zg30
##.SOLVENT NAME= CDCl3
##.SHIFT REFERENCE= (INTERNAL, CDCl3, 0, 15.7039)
##AUDIT TRAIL= $$ (NUMBER, WHEN, WHO, WHERE, WHAT)
$$ ##TITLE= Audit trail, XWIN-NMR		Version 3.5
$$ ##JCAMPDX= 5.01
$$ ##ORIGIN= Bruker BioSpin GmbH
$$ ##OWNER= she
$$ F:/spectra/data/she/nmr/H-F/1/audita.txt
$$ ##AUDIT TRAIL=  $$ (NUMBER, WHEN, WHO, WHERE, WHAT)
(   1,<2019-03-13 14:35:24.37 +0400>,<she>,<DPX200>,
      <created by zg, POWCHK disabled, PULCHK disabled
       configuration hash MD5:
       00 E9 B6 7A A2 85 ED C7 34 08 36 98 17 FE 4E 26
       data hash MD5: 16K
       AD EA DA 2C A0 C8 39 FE E6 1E 55 82 CD 08 D3 E8>)
$$ ##END=
$$ 
$$ hash MD5
$$ 21 71 73 1D 65 68 01 F6 8C 89 50 7B A8 67 BB D9
##$RELAX= 
##$RELAX= 
##$RELAX= 
##$RELAX= 
##$RELAX= 
##$RELAX= 
$$ Bruker specific parameters
$$ --------------------------
##$DU= <F:/spectra>
##$EXPNO= 1
##$NAME= <H-F>
##$PROCNO= 1
##$TYPE= <nmr>
##$USER= <she>
##$AMP= (0..31)
100 100 100 100 100 100 100 100 100 100 100 100 100 100 100 100 100 100 
100 100 100 100 100 100 100 100 100 100 100 100 100 100 
##$AQSEQ= 0
##$AQ_mod= 1
##$AUNM= <au_zg>
##$AUTOPOS= <>
##$BF1= 200.13
##$BF2= 200.13
##$BF3= 200.13
##$BF4= 200.13
##$BF5= 200.13
##$BF6= 200.13
##$BF7= 200.13
##$BF8= 200.13
##$BYTORDA= 1
##$CFDGTYP= 0
##$CFRGTYP= 5
##$CHEMSTR= <none>
##$CNST= (0..31)
1 1 145 1 1 1 1 1 1 1 1 1 1 1 1 1 1 1 1 1 1 1 1 1 1 1 1 1 1 1 1 1 
##$CPDPRG= <>
##$CPDPRG1= <>
##$CPDPRG2= <>
##$CPDPRG3= <>
##$CPDPRG4= <mlev>
##$CPDPRG5= <mlev>
##$CPDPRG6= <mlev>
##$CPDPRG7= <mlev>
##$CPDPRG8= <mlev>
##$CPDPRGB= <>
##$CPDPRGT= <>
##$D= (0..31)
0 1.2 0 0 0 0 0 0 0 0 0 0.03 0 0 0 0 0 0 0 0 0 0 0 0 0 0 0 0 0 0 0 0 
##$DATE= 1552473323
##$DBL= (0..7)
120 120 120 120 120 120 120 120 
##$DBP= (0..7)
150 150 150 150 150 150 150 150 
##$DBP07= 0
##$DBPNAM0= <>
##$DBPNAM1= <>
##$DBPNAM2= <>
##$DBPNAM3= <>
##$DBPNAM4= <>
##$DBPNAM5= <>
##$DBPNAM6= <>
##$DBPNAM7= <>
##$DBPOAL= (0..7)
0.5 0.5 0.5 0.5 0.5 0.5 0.5 0.5 
##$DBPOFFS= (0..7)
0 0 0 0 0 0 0 0 
##$DE= 6
##$DECBNUC= <off>
##$DECIM= 24
##$DECNUC= <off>
##$DECSTAT= 4
##$DIGMOD= 1
##$DIGTYP= 9
##$DL= (0..7)
0 120 120 120 120 120 120 120 
##$DP= (0..7)
150 150 150 150 150 150 150 150 
##$DP07= 0
##$DPNAME0= <>
##$DPNAME1= <>
##$DPNAME2= <>
##$DPNAME3= <>
##$DPNAME4= <>
##$DPNAME5= <>
##$DPNAME6= <>
##$DPNAME7= <>
##$DPOAL= (0..7)
0.5 0.5 0.5 0.5 0.5 0.5 0.5 0.5 
##$DPOFFS= (0..7)
0 0 0 0 0 0 0 0 
##$DQDMODE= 0
##$DR= 18
##$DS= 0
##$DSLIST= <SSSSSSSSSSSSSSS>
##$DSPFIRM= 0
$$ [...]
##$SUBNAM2= <"">
##$SUBNAM3= <"">
##$SUBNAM4= <"">
##$SUBNAM5= <"">
##$SUBNAM6= <"">
##$SUBNAM7= <"">
##$SUBNAM8= <"">
##$SUBNAM9= <"">
##$SW= 26.0245685251456
##$SWIBOX= (0..15)
0 0 2 0 0 0 0 0 0 0 0 0 0 0 0 0 
##$SW_h= 5208.33333333333
##$TD= 16384
##$TD0= 1
##$TE= 0
##$TE2= 300
##$TE3= 300
##$TEG= 300
##$TL= (0..7)
0 120 120 120 120 120 120 120 
##$TP= (0..7)
150 150 150 150 150 150 150 150 
##$TP07= 0
##$TPNAME0= <>
##$TPNAME1= <>
##$TPNAME2= <>
##$TPNAME3= <>
##$TPNAME4= <>
##$TPNAME5= <>
##$TPNAME6= <>
##$TPNAME7= <>
##$TPOAL= (0..7)
0.5 0.5 0.5 0.5 0.5 0.5 0.5 0.5 
##$TPOFFS= (0..7)
0 0 0 0 0 0 0 0 
##$TUNHIN= 0
##$TUNHOUT= 0
##$TUNXOUT= 0
##$USERA1= <user>
##$USERA2= <user>
##$USERA3= <user>
##$USERA4= <user>
##$USERA5= <user>
##$V9= 5
##$VALIST= <valist>
##$VCLIST= <CCCCCCCCCCCCCCC>
##$VD= 0
##$VDLIST= <DDDDDDDDDDDDDDD>
##$VPLIST= <PPPPPPPPPPPPPPP>
##$VTLIST= <TTTTTTTTTTTTTTT>
##$WBST= 1024
##$WBSW= 4
##$XGAIN= (0..3)
0 0 0 0 
##$XL= 0
##$YL= 0
##$YMAX_a= 185458
##$YMIN_a= -233591
##$ZGOPTNS= <>
##$ZL1= 120
##$ZL2= 120
##$ZL3= 120
##$ZL4= 120
##$ABSF1= 10
##$ABSF2= 0
##$ABSG= 5
##$ABSL= 3
##$ALPHA= 0
##$AQORDER= 0
##$ASSFAC= 0
##$ASSFACI= 0
##$ASSFACX= 0
##$ASSWID= 0
##$AUNMP= <proc_1d>
##$AZFE= 0.1
##$AZFW= 0.1
##$BCFW= 1
##$BC_mod= 2
##$BYTORDP= 1
##$COROFFS= 0
##$CY= 11.3945322036743
##$DATMOD= 1
##$DC= 2
##$DFILT= <>
##$DTYPP= 0
##$F1P= 18.9103706918063
##$F2P= -1.10871071338519
##$FCOR= 0.5
##$FTSIZE= 0
##$FT_mod= 4
##$GAMMA= 1
##$GB= 0.15
##$INTBC= 1
##$INTSCL= 1
##$ISEN= 128
##$LB= 0.24
##$LEV0= 0
##$LPBIN= 0
##$MAXI= 10000
##$MC2= 0
##$MEAN= 0
##$ME_mod= 0
##$MI= 1.114404
##$NCOEF= 0
##$NC_proc= 0
##$NLEV= 6
##$NOISF1= 3.799351
##$NOISF2= 2.8
##$NSP= 1
##$NTH_PI= 0
##$NZP= 0
##$OFFSET= 15.70392
##$PC= 1
##$PHC0= -9020.186
##$PHC1= 18.80026
##$PH_mod= 1
##$PKNL= yes
##$PPARMOD= 0
##$PSCAL= 0
##$PSIGN= 0
##$REVERSE= no
##$SF= 200.130013532006
##$SI= 16384
##$SIGF1= 3
##$SIGF2= 2
##$SINO= 400
##$SIOLD= 16384
##$SREGLST= <1H.CDCl3>
##$SSB= 0
##$STSI= 0
##$STSR= 0
##$SW_p= 3612.71676300578
##$SYMM= 0
##$S_DEV= 0
##$TDeff= 0
##$TDoff= 0
##$TI= <>
##$TILT= no
##$TM1= 0
##$TM2= 0
##$TOPLEV= 0
##$USERP1= <user>
##$USERP2= <user>
##$USERP3= <user>
##$USERP4= <user>
##$USERP5= <user>
##$WDW= 1
##$XDIM= 8192
##$YMAX_p= 0
##$YMIN_p= 0
$$ End of Bruker specific parameters
$$ ---------------------------------
##NTUPLES= NMR FID
##VAR_NAME=  TIME,          FID/REAL,        FID/IMAG
##SYMBOL=    X,             R,               I
##VAR_TYPE=  INDEPENDENT,   DEPENDENT,       DEPENDENT
##VAR_FORM=  AFFN,          ASDF,            ASDF
##VAR_DIM=   8192,          8192,            8192
##UNITS=     SECONDS,       ARBITRARY UNITS, ARBITRARY UNITS
##FACTOR=    0.000192,      1,               1
##FIRST=     0,             0,               0
##LAST=      1.572672,      0,               0
##MIN=       0,             -233591,         0
##MAX=       1.572672,      185458,          0
$$ Real data points
##PAGE= N=1
##DATA TABLE= (X++(R..R)), XYDATA
$$ [...]
1241b02m38o19k53k55l01o41o50K81J147Q75ok6Q69K57j021p68K93Jo68J3J211
1262i01P42k02M02O19k59j186n39L99J40m99j60Q68J137O82j93m37m5M22l5o97
1282B58k48M74O50O69Q83K68n28j17Q64j0j507q41Q65P26o66j68J093N48q88p09
1302A616M81m4j282j078L61P88Q1k45J80L66J07l03n61k47n70q02j37R93N20j021
1322g97n15J389R65j618k067M08J065q54j497O84J660N7r18M16J188j91j328k98
1340b251Q64K81l40L01J381R20r9m88N64N90q79j466N75J496k04j270L94J883
1358B252J15j674l92J123l83k005k24J743O98j133%J750P11j254q89N72P12o45
1376A077n01R74J354k54r22N64J539j07k004q76J385P15j586r41J452J139j021
$$ plain form
1241 -202 -640 -1259 -1512 -1767 -2068 -2709 -3359 -3078 -1931 -1056 -1062 -1088 -219 38 -983 -1751 -1458 -1457 -2125 -2112 -901
1262 -901 -159 -361 41 660 401 -785 -1324 -925 -785 -1284 -1444 -576 561 1243 1050 613 568 990 955 258
1282 258 10 484 1134 1803 2686 2954 2426 2309 3173 3163 1656 815 1680 2406 1740 1572 2665 3213 2325 1616
1302 1616 2097 2053 771 -307 54 842 923 678 858 1224 1331 1028 467 220 -350 -1152 -1289 -296 224 -797
1322 -797 -1312 77 1042 -576 -2643 -2235 -1170 -2024 -3521 -2837 -1177 -1120 -2038 -1622 -434 -625 -1953 -2251
1340 -2251 -1387 -1106 -1446 -1145 236 1156 1057 569 1133 1723 844 -622 -47 1449 1245 -25 369 2252
1358 2252 2367 693 301 1424 1041 -964 -1188 555 1253 120 120 1870 2581 1327 438 1010 1722 1077
1376 1077 576 1550 2904 2650 1728 2292 3831 3724 1720 844 2229 2944 1358 417 1869 3008 1987
1393A987r78P31K37j710j125J245Q53j224j233J073J372o90j424J54Q70k94j213
1410a369l48P55K28p80m04J126N62j221j229O74R43p15j104N48R66m57p30R65
1428a590Q72p99n97J008J188j106j131J030J690j55j065O33J449j0j235oJ278
1445A454O46r79p26Q74P92p11p84Q63J337p90j329N02R99j051j684R01K144l71
1463B087j992Q3J708j09j840j49J514K36j556k81J288M10j104n78J362Q60j236
1480G03j556L07J128m03j064N58J540n08j853K08J735n10k585j5K548N31k634
1497a870r77K225J328k053j610J434J304j563j478J225J748p82j813N51K026p9
1513c84k198m38K085R95j756j053J769J633j279j335J584J730j296j986J305K284
$$ plain form
1393 1987 1009 1740 1977 267 -858 387 1240 16 -1217 -144 1228 538 -886 -732 138 -156 -1369
1410 -1369 -1717 -962 -734 -1514 -1918 -792 -230 -1451 -2680 -2006 -1063 -1778 -2882 -2334 -1368 -1825 -2555 -1590
1428 -1590 -718 -1517 -2114 -1106 82 -1024 -2155 -1125 565 410 -655 -22 1427 1417 182 176 1454
1445 1454 2100 1121 395 1269 2061 1350 566 1429 2766 1976 647 1149 2148 1097 -587 314 2458 2087
1463 2087 95 178 1886 1777 -63 -212 1302 1538 -18 -299 989 1399 295 -283 1079 1939 703
1480 703 -853 -546 582 179 -885 -327 1213 705 -1148 -940 795 285 -2300 -2315 233 764 -1870
1497 -1870 -2847 -622 706 -1347 -2957 -1523 -219 -1782 -3260 -2035 -287 -1069 -2882 -2331 -305 -384
1513 -384 -2582 -3020 -935 60 -1696 -2749 -980 653 -626 -1961 -377 1353 57 -1929 -624 1660
1529A660n08j646Q09K194m10j930N9J781L19j256mJ560L07j532p25J218J041j030
1547A907j191J000J250j257j769O80J909l16k274J08J873k09k400m91K075O77
1563A572j654o97J341J75j735p49J390R84j192j003J033J276q33j585J32J553
1579HJ70j361l43J195M41j147n24J214Q26j448r87J096J061j050j093P48J151
1596d3m16p68L80N37n47m10M96M25o84m30Q93Q89l06q70K47O71K8p59n4J040N49
1617H68p62m33J063N82j000n58J272J066q58j104R17J078q29j102J234J479o41
1634B272j455L14J303l96j500J47J423L20j314p75Q27O05r81r77O03J119p24j584
1652g73q2J173r1j208m3J212n9j303k00O80k85j149K31J406R5j360k26J242K81
$$ plain form
1529 1660 1152 -494 315 2509 2099 169 228 2009 2328 1072 1068 2628 2935 1403 678 1896 2937 1907
1547 1907 716 1716 2966 1709 -60 620 2529 2213 -61 47 1920 1711 -689 -1180 895 1572
1563 1572 -82 -779 562 737 -998 -1747 -357 627 -565 -1568 -535 741 -92 -1677 -1545 8
1579 8 178 -1183 -1526 -331 110 -1037 -1561 -347 479 -969 -1956 -860 201 -849 -1942 -1194 -43
1596 -43 -459 -1227 -847 -310 -857 -1267 -771 -346 -1030 -1460 -567 322 16 -854 -607 64 92 -667 -721 319 868
1617 868 106 -327 736 1318 318 -240 1032 2098 1240 136 1053 2131 1302 200 1434 2913 2272
1634 2272 817 1131 2434 2038 538 685 2108 2428 1114 339 1166 1771 790 -187 416 1535 811 -773
1652 -773 -855 318 227 -981 -1024 188 129 -1174 -1374 -694 -979 -2128 -1897 -491 -396 -1756 -1982 -740 -459
1671d59j176n66Q72O02p05n93O53Q88l84q27N39J324l48j476o0J500M47j413l05
1690a487J761Q88j202p96J485P20j576j143J387J538p90j314Q59J780k18j722
1706A70n27J231O87r28q38Q20R10l65r14M33R92k63j006J2Q57k97r76K72J227
1725A497J14q14J85P79m12j220j26Q53Q7p11r8O68K61p05n96K75K83m39p48m9
1745i16N61j54o78k5P87L08q12l32M70j11q45j56R34K90p96K7J130L80j110o60
1765a708O60O69m97o83K57P73J50l61J5M31Q8k95l39M81L00m87l90P15J027k24
1785E82m69L77O68k20p25J53M82j30l06P06O12j27m93J59L67k79m32j41K09L9
1805A032Kl4M9J13l5j17L6j74m82m55K16L69j40l98M47P07m60q12L5M53m87p86
$$ plain form
1671 -459 -1635 -2201 -1329 -727 -1432 -2025 -1372 -484 -868 -1695 -1156 168 -180 -1656 -1716 -216 231 -1182 -1487
1690 -1487 274 1162 -40 -836 649 1369 -207 -1350 37 1575 785 -529 330 2110 1892 170
1706 170 -357 874 1561 633 -205 615 1525 1160 246 679 1671 1408 402 414 1271 974 -2 270 1497
1725 1497 1611 797 982 1761 1349 129 3 856 943 232 134 802 1063 358 -238 37 320 -119 -867 -916
1745 -916 -355 -509 -1187 -1212 -425 -117 -929 -1261 -791 -902 -1747 -1903 -969 -679 -1475 -1448 -318 62 -1048 -1708
1765 -1708 -1048 -379 -876 -1559 -1302 -529 -379 -740 -725 -294 -206 -501 -840 -359 -59 -546 -936 -221 806 582
1785 582 113 490 1158 938 213 366 848 718 412 1118 1730 1603 1110 1269 1636 1357 925 784 993 1032
1805 1032 1034 1000 1049 1162 1127 1010 1046 872 390 -65 151 520 380 -18 429 1136 676 -136 -101 352 -135 -921
1827i21J0Q38N6o31m7O92J4p38m77K99P2m76m16K72O88J60n31m8M48K01n20n42
1849a597K83L81j77q0P31M57l21j59O77K78p63n03N01N09j27j65L92M98q1j85
1869E49J00j8l52k39pK93J34j51n5M87N78k52m79r6O4k47k40M70M30j28j05N67
1891A303M57n98o95K64M94m56o03J40N45Q6l33R6L31j21o02m49P6R4k83k97L09
1912b42N85P0o00j04M03p4q57k27N07J12n02l3O13K28l57j96R2k18o82q6K83O3
1934a222j34J37M09K16j82l19LJ78r8k41K7N16L52n3J64P55L45o38l45M28M08
1955G06l87l34O23O46P1j83K28R9l40j72J62j10l83j53L59L81jj38l3J9j5m10
1977F35m55j53K01J8m4K62K92k29m01N5K61m23o01O4L46j31j58K18L47o6j76l
$$ plain form
1827 -921 -911 -73 -17 -648 -695 -3 11 -727 -1204 -905 -833 -1309 -1725 -1453 -765 -605 -1136 -1184 -736 -535 -1055 -1597
1849 -1597 -1314 -933 -1110 -1190 -459 -2 -323 -482 195 473 -290 -793 -292 217 90 -75 317 815 734 549
1869 549 649 631 279 40 33 326 460 309 254 741 1319 1067 588 492 556 309 69 539 969 841 736 1303
1891 1303 1760 1162 467 731 1225 769 166 306 851 937 604 700 1031 910 308 -141 -65 29 -254 -551 -242
1912 -242 343 413 -187 -291 112 38 -819 -1046 -539 -427 -929 -962 -349 -121 -478 -674 -582 -800 -1482 -1568 -1285 -1222
1934 -1222 -1356 -1219 -810 -594 -776 -1095 -1092 -914 -1012 -1253 -1226 -710 -358 -411 -247 508 853 215 -130 298 706
1955 706 319 -15 608 1254 1325 1142 1370 1469 1129 957 1119 1009 626 473 832 1213 1212 1074 1041 1060 1045 635
1977 635 180 27 228 246 202 464 756 527 126 181 442 19 -582 -518 -172 -303 -461 -243 104 38 -138 -141
1999a41j11n53k30K15J96J0K8J31K72J3k57j60j01l5j46j31R4K62L1N5L12K72
2021B6m20m46J14J86m59m93N73P50m8m64K72N19j60n47K3K12m3j93L22O00K59
2042E83j86Q7M45O1m11n17K62N47K6l38M28O51m6o32R7N41m10r97n1J028J31r40
2064C59j81R98N42q39p44K02K37m62n17J81N29j71k90J3M04r8q14l86M52J77p17
2085a125l69N48O72l38m58L36N52n08o65M32M59l27l42N31P01m7m29Q3M30n0n44
2106d58n7K52P8k09j94M34L28k32m96J35L49l36o07Q8O69%m99K98P82J27o07n
2128a60M82R8m31kM74J60p9R4M47J08k89j31M5Q5k26m31L7L34M64k10k01J61J35
2151I64j96l94j1m0j35J43K74J48k02J18J3l20k95Q0k5o04l90M34M67l45o90K07
$$ plain form
1999 -141 -252 -805 -1035 -820 -624 -614 -586 -455 -183 -170 -427 -587 -688 -723 -869 -1000 -906 -644 -613 -558 -246 26
2021 26 -394 -840 -726 -540 -999 -1492 -919 -169 -217 -681 -409 110 -50 -597 -574 -362 -405 -598 -276 324 583
2042 583 397 484 929 990 579 62 324 871 897 559 987 1638 1592 960 1057 1598 1188 191 140 1168 1299 359
2064 359 178 1176 1718 879 135 337 574 112 -405 -224 305 134 -156 -143 261 163 -651 -1037 -585 -408 -1125
2085 -1125 -1494 -946 -274 -612 -1070 -734 -182 -690 -1355 -923 -464 -791 -1133 -602 99 52 -377 -294 136 86 -458
2106 -458 -515 -263 -185 -394 -588 -154 174 -58 -554 -419 -70 -406 -1013 -925 -256 -256 -755 -457 325 452 -155 -160
2128 -160 322 420 -11 -13 461 621 542 636 1083 1191 902 771 816 901 675 244 281 615 1079 869 668 829 964
2151 964 768 374 363 323 188 331 605 753 551 669 682 362 67 147 122 -482 -872 -438 29 -316 -1006 -799
2173g99N47l49p80l76M26L09l52k70N19O28j15m46J65N13j76p03K03R53J41n85
2193e47p8J129L69r42m82P45M23p73n75O08Q06m40n46M09N68r0p06r0N11M0n91
2214b52l0O53M07l50k33N48K21o23m38M96L70m62m77Q58O58p71q15P46J006n95
2234I17j132J11J163k0j072k65R53O08p93n79N09L73p04p88M19R20l21j064Q1
2253f84J137rj272k51J051M27j202o26Q86N39p29n26P99P50n36r75K17Q03k73
2272d74p59j24P80M10m59m40M71M25k73m21J25K70n6j48M88N11j35j79L91M43
2292H46m53l90L80N12l05k63K95M44k06k66J01L26l53n00j07K78P3l38L8N04K45
2313H61m22n15J25L90j48m61K75O64j38m54K45M80j99m97O4N01k06o23k35M35
$$ plain form
2173 -799 -252 -601 -1381 -1757 -1331 -1022 -1374 -1644 -1125 -497 -612 -1058 -893 -380 -556 -1259 -1056 -103 38 -547
2193 -547 -625 504 873 -69 -551 194 617 -156 -731 -123 683 243 -303 106 674 584 -122 -212 299 339 -252
2214 -252 -282 371 778 428 195 743 964 341 -97 399 769 307 -170 688 1346 575 -240 506 1512 917
2234 917 -215 -104 1059 1039 -33 -298 655 1263 470 -109 400 773 69 -719 -300 620 299 -765 -684
2253 -684 453 444 -828 -1079 -28 399 -803 -1429 -543 -4 -733 -1259 -460 290 -246 -1221 -1004 -201 -474
2272 -474 -1233 -1357 -577 -167 -626 -1066 -595 -170 -443 -864 -739 -469 -525 -673 -185 326 191 12 403 846
2292 846 393 3 383 895 590 327 622 1066 860 594 695 1021 668 168 61 339 412 74 112 616 861
2313 861 439 -76 49 439 291 -170 105 769 631 177 422 902 703 206 270 771 565 -58 -293 142
2333A42K13j67j86l7q4j80k36k26m7RJ42K59l2k63m9Q5J68j77p7J78K23j82k48
2356g72M10M37l62m84M05P96m61r11J21J051rp52k19Q57L45o77l41N32M24m00
2376a0m55L22O56j18n89J42P95J18q18k90Q46M13o61m22O05O40n69p27N19P43
2396A140l64n88L08L75l46o08K08N87pl86r3L40K7m92k41L26L24k37k99K18K39
2417D31l86l44M13N51m73p12K68O25l67q69J28J001j0p72j56M06M9o33k98N89
2437e59L00m19l69M34M03k82n82J60O86J16n88k54N90L66l85j59O84L00m82l44
2457c84N61M56n45l71N22N83k13l54R5L11Jl19j04J06J57l4M9N9k7j27q9J11K6
2480D70k01j54K39K75k72l83K46J69j19l39L22K17k97l41J92K94k31k37K38M05
$$ plain form
2333 142 355 188 2 -35 -119 -299 -535 -761 -808 -799 -657 -398 -430 -693 -742 -657 -489 -666 -743 -565 -342 -524 -772
2356 -772 -362 75 -287 -771 -366 430 -31 -942 -821 230 221 -531 -750 107 452 -225 -566 -34 390 -10
2376 -10 -465 -143 513 395 -194 -52 743 861 43 -247 599 1012 351 -71 534 1174 605 -122 397 1140
2396 1140 776 188 496 871 525 -83 125 712 705 319 226 566 593 101 -140 186 510 273 -26 192 431
2417 431 45 -299 114 665 192 -520 -252 373 6 -863 -735 266 256 -516 -672 -266 -217 -850 -1148 -559
2437 -559 -259 -678 -1047 -613 -210 -492 -1074 -914 -228 -112 -700 -954 -364 2 -383 -542 142 442 -40 -384
2457 -384 177 633 88 -283 239 822 609 255 350 661 662 343 239 345 502 468 517 576 549 422 333 444 470
2480 470 269 115 354 629 357 -26 220 389 270 -69 253 470 173 -168 24 318 87 -150 88 493
2500D93k59m67M5K82j4k79R6K50K3k79k27J60K55k97k61K42L10j72n94k9M26J49
2522a47n37q8M96J08l97j00K01lj01J79K59j35l36J23L36L5j66m9L22J86j28k98
2544b40Q9K69M8j35R4K76Ll93M7M99K1m40r7O09R3m85j30M83J44l46j94M13K09
2567H37l75k35K54K84k39l43k5L29ol31k29K70J98l91l45K32K31l29k20K70K88
2588A25m84l11M22M40l09m12K81M56j63n08J02N08J27l73j30K04Kk19j21P4J65
2609a24j20k58O4R6k33l02J06M04N0m41l3M73M1l27J26N66k4l03R0N02Nl02N6
2632A12M20K29k02k59R7K07j14j50Mj9K8j87j16K41pl45Q4L45J10m58k60M73M20
2655F53j82l77M44L11j96k11J53P3j51j62J27Nk44k07N9k6j17k10k17n4j10r8
$$ plain form
2500 493 234 -233 -188 94 80 -199 -103 147 170 -109 -336 -176 79 -218 -479 -237 73 -99 -693 -722 -296 -147
2522 -147 -684 -772 -276 -168 -565 -665 -464 -467 -568 -389 -130 -265 -601 -478 -142 -107 -273 -322 0 186 58 -240
2544 -240 -151 118 166 31 125 401 404 11 58 557 578 138 41 650 743 258 128 611 755 409 215 628 837
2567 837 462 227 481 765 526 183 158 487 481 150 -79 191 389 -2 -347 -115 116 -213 -433 -163 125
2588 125 -359 -670 -248 192 -117 -529 -248 208 45 -463 -361 147 274 -99 -229 -25 -23 -242 -363 -289 -124
2609 -124 -244 -502 -438 -342 -575 -877 -771 -367 -317 -758 -791 -318 -277 -604 -478 88 64 -239 -149 353 358 56 112
2632 112 532 761 559 300 397 604 490 340 344 325 353 166 50 291 284 -61 23 368 478 20 -240 233 653
2655 653 471 94 538 849 653 442 595 668 517 355 482 487 243 36 95 69 -48 -258 -475 -529 -639 -737
2677g37j76J25K11j27j55J86K15mj59J94M54o5j94J55M17p0j27J53J52j98j30
2698A20J4n6k36j21K13P0k42k57R8J11j22k07p1J26K67j6j43J97L48P8k36J11
2720D6L53j45k64K70L30J9k76J18K75p4l68j3K14j10k24PJ50j5k54R8J82R7l21
2743I5k50K25K55j18k44P1L39J70m20n0K29Ml33q2K86R2n36j88M82J37n07k98
2765f41L64J56m21k63J46K26o1j86J56J77Kj64p3L37M3j95j36L88L41k64l39M38
2787C1M35l61k94J67M05k61k57J98K77j71l05J68L77k04m51N6K81N5k76j62K53
2808c9K33r9j72L8K54l0k05J09K73r2l50J44N74k9m28n0M23J49n02j04K74R1j28
2831C34j17J07qo9r6O7Nj81j51PQ9Q2m3j39J15J91j26k27l9N1j43k4J76l1j69
$$ plain form
2677 -737 -913 -788 -577 -704 -859 -673 -458 -462 -621 -427 27 -38 -232 -77 340 270 143 296 448 250 120
2698 120 134 78 -158 -279 -66 4 -238 -495 -397 -286 -408 -615 -686 -560 -293 -309 -452 -255 93 171 -65 46
2720 46 399 254 -10 260 590 609 333 451 726 652 284 271 485 375 151 158 308 293 39 137 319 416 95
2743 95 -155 70 325 207 -37 34 373 543 123 73 302 306 -27 -109 177 269 -267 -455 27 164 -343 -641
2765 -641 -277 -121 -542 -805 -659 -433 -494 -680 -524 -347 -345 -509 -582 -245 -202 -397 -533 -145 196 -68 -407 31
2787 31 466 105 -189 -22 383 122 -135 63 340 169 -136 32 409 205 -246 -190 91 146 -130 -292 -39
2808 -39 194 95 -77 -39 215 185 -20 89 362 270 -80 64 638 609 181 131 554 703 201 97 371 462 334
2831 334 217 324 316 247 151 218 223 42 -109 -102 -13 69 26 -113 2 193 67 -160 -199 -148 -291 -315 -139 -170 -339
2856c39l9K11j3l52j21K12oj73J6J11N8p2J55K00n6j84jJ89J25n0J6J86L01K1
2880C95j74NJ91Q4j69j99J59J82j67n0K49P5l56j10K89o3l69j29L97J5j68j49
2902f2K87Qk28r1J52J63j52l62J59L47l3l18J5L07K15l73l34K64L43k61k42K51
2924E5M12k56l89L14M26k70n25J77M84j45o23m6N51J37l97k05J10J95k15k80J7
2945d73K24j08k62L1M46q8l62K4M88M2n18r9M97J88l40j10N12K12l50j53L25J63
2967B89l78j02K71L01j99k33R7M37M5l65r4K36J31l19j10K33K75k46k10L23K26
2988F08m13m39L28L53k65m52K16L45j1l58R8J57p3j86j44J30j8n8kK73P2r6j65
3011a00K5K21p2l49K2L10j5r7j3J26q7j43K2J66k29k30J07K37l9j23J03K26j42
$$ plain form
2856 -339 -378 -167 -180 -532 -653 -441 -447 -620 -604 -493 -435 -507 -352 -152 -208 -392 -393 -204 -79 -129 -113 73 374 395
2880 395 221 226 417 501 332 133 292 474 307 257 506 581 225 115 404 341 -28 -157 240 255 87 -62
2902 -62 225 233 5 -86 66 229 77 -285 -126 221 188 -130 -115 192 407 34 -300 -36 307 46 -196 55
2924 55 467 211 -178 136 562 292 -233 -56 428 283 -340 -386 165 302 -95 -300 -190 5 -210 -490 -473
2945 -473 -249 -357 -619 -588 -142 -230 -592 -568 -80 -38 -556 -655 -158 30 -310 -420 92 304 -46 -199 126 289
2967 289 -89 -191 80 381 182 -51 46 483 528 163 69 305 436 117 7 240 515 269 59 382 608
2988 608 195 -244 84 437 172 -280 -64 281 270 -88 10 167 94 -92 -236 -106 -124 -182 -184 89 161 65 -100
3011 -100 -75 146 74 -275 -253 57 42 -55 -68 58 -29 -172 -150 16 -213 -443 -336 -99 -138 -261 -158 68 -74
3034g4j39P9K3j59j19K33J48j13j08l3K26J30k30j97K8L26o5l27j0L34J95k19
3056g1l7L68kl31L9L10L5k67kM53M9k76n6J60J95k69j43P8R8j57l2m6Q4j52j04
3081g6QJ89l1l80r7L39J69l81r5M47J73k55k84M03J67l76j52L14L21k93k68K28
3103G0M19k43m65K5L55K4l73j61J67J73j48k78K18K03j95l75O7M30j98m35K69
3124d51N36N5n16K1L55R6l56j3K47J52j96J6K22N0j20j70K09J30o7k88R1K51R
3147B63k58M8L04J22l43JK28J8m05mM69J21l64j13M22nl71j53J33J93j69k70J82
3170D9Q2j35k06K0N3n8j11q0J08J07l32j03L33K84k00k44J75L44j35k64J31L27
3192A45L8j91K45J45j15k58J59J40j16r4j6O2j13j08L8ml5k5n4N4j00j52l5J53
$$ plain form
3034 -74 -213 -134 -111 -270 -389 -156 -8 -121 -229 -262 -36 94 -136 -333 -305 21 -44 -371 -381 -47 148 -71
3056 -71 -108 260 258 -73 -34 276 311 44 42 495 544 268 212 372 567 298 155 233 331 174 142 96 180 28 -76
3081 -76 -68 121 90 -290 -387 -48 121 -260 -355 92 265 10 -274 129 296 -80 -232 82 403 110 -158 70
3103 70 489 246 -219 -194 161 185 -188 -349 -182 -9 -157 -435 -217 -14 -209 -584 -517 -87 -285 -720 -451
3124 -451 85 140 -376 -355 0 96 -260 -273 -26 126 -70 -54 168 218 98 -72 137 267 200 -88 3 254 263
3147 263 5 53 357 479 136 137 365 383 -22 -26 443 564 200 87 509 504 133 -20 113 306 137 -133 49
3170 49 131 -4 -210 -190 -137 -195 -306 -386 -278 -171 -503 -606 -273 11 -189 -433 -258 86 -49 -313 -182 145
3192 145 183 -8 237 382 267 9 168 308 192 98 82 144 31 -77 -39 -43 -78 -103 -157 -103 -203 -355 -390 -237
3216b37J63j06j96K36L47j16l60J69K15m3k12K01K83k22k39J69K85k06k84J02
3236e1K12J6k79j24J48K00q0j53J52J41nk94J00J96K1j47J22L58ml37n5L26J00
3259E63l94j60K25J21k36j38J27M0l53oK45j08k88r7J19J11n2j79O1L69o9j86
3281b85k04K24J57r4j44L74J89k26j18K41K76m39j31L22J45j91l33J75L36k08
3301F6k40J18R1O3k07o1J21N3r4j25K32J95j70k19P9K46n5l05J05L29M0l21R7
3324C8K74q8k79J20K78j00l36L4L21o0j98n9J31J49q9q1j33K43r5j61N5J06Q4
3347A54j41l8J90Nk74j35L07O7k60j40J79O2j14k10L58m6j90j4J15J9j20j36K18
3370a44J00Qp7n5J34rl1j49J02J89k5j12J83R1l14j7K46J40k81j29J67K07j99
$$ plain form
3216 -237 -74 -180 -376 -140 207 91 -269 -100 115 72 -140 61 344 122 -117 52 337 131 -153 -51
3236 -51 161 177 -102 -226 -78 122 42 -111 41 182 177 -117 -17 179 200 53 175 533 529 192 137 463 563
3259 563 169 9 234 355 119 -19 108 148 -205 -211 34 -74 -362 -459 -340 -229 -281 -460 -399 -30 -99 -285
3281 -285 -489 -265 -108 -202 -346 28 217 -9 -127 114 390 -49 -180 142 287 96 -237 -62 274 66
3301 66 -174 -56 35 98 -109 -170 -49 4 -90 -215 17 212 42 -177 -98 148 93 -212 -107 222 262 -59 38
3324 38 312 224 -55 65 343 243 -93 -59 262 202 4 -55 76 225 136 55 -78 165 70 -91 -36 70 154
3347 154 13 -25 165 170 -104 -239 68 135 -125 -265 -86 -24 -138 -348 10 -36 -226 -240 -125 -106 -226 -362 -144
3370 -144 -44 -36 -113 -168 -34 -43 -74 -223 -121 68 43 -69 114 205 -109 -126 120 260 -21 -150 17 224 25
3393B5j62J24J85n5j68J71Q3j88o1Q3R1p0n3OJ51j5j34j11O3J70r3j42p7K78m2
3418E9j66J41J81j42j88J76K29j43k86K32K03%k89N7K22j14n5k2k9l2l6j05R0
3441a7Nj19j23J43J8p4j93k5L22N6k60n5K68K2j45J0K95O5k56J6K86Rk58q9K83
3466A84J41l17q8J00P3n3r8m8J51K9j65m9J41O5j96o0J58K33j55k80K27K43j22
3489A14j33J13K61k24j27J58M1j48p2J43J11k15j42J8R8J4r4J0K2Q6k4r4rJ83
3513I0k9q5O5J28o0k35J75J79j2l27K7K68j47k17K6K08k1j43l1J17q3k01P4J32
3537a02N2r9j21O9J31j5j13OK26J17k07o4J49J37q0q2J04J5o6j48J80n7r9MJ46
3562H3L5j07n4O6o1nN9P9o8j40M5J41k1m2n9P7J2l3q5q1J43J26p2j42J03P7j46
$$ plain form
3393 25 -137 -13 172 117 -51 120 203 15 -46 37 128 58 5 11 162 147 13 -98 -35 135 42 -100 -177 101 59
3418 59 -107 34 215 73 -115 61 290 147 -139 93 296 296 7 64 286 172 117 95 66 34 -2 -107 -17
3441 -17 -12 -131 -254 -111 -93 -167 -360 -385 -63 -7 -267 -322 -54 -32 -177 -167 128 193 -63 -47 239 248 -10 -99 184
3466 184 325 8 -80 20 93 40 -58 -106 45 74 -91 -140 1 66 -130 -190 -32 201 46 -234 -7 236 114
3489 114 -19 94 355 131 4 162 203 55 -17 126 237 22 -120 -102 -4 10 -84 -74 -52 34 10 -84 -93 90
3513 90 61 -24 41 169 109 -126 49 228 216 -111 -84 184 37 -180 -154 54 33 -110 -141 -24 -107 -308 -234 -102
3537 -102 -50 -149 -270 -201 -70 -85 -198 -192 34 151 -56 -120 29 166 86 4 108 123 57 -91 89 32 -67 -63 83
3562 83 118 11 -43 23 -38 -43 16 95 27 -113 -68 73 52 10 -49 28 40 7 -78 -159 -16 110 38 -104 -1 76 -70
3589g0p0K79L9k09q7K02K9j92p9J32K05q8j41L7M2K4q9J2Q4lm8j51R6J07q9j18
3615a46P6K70j14k36L2J59M6j87N9J92j45j00N5Q0j09j30J82L3j35j39J62J36
3637D1o8q0P9J7o7q9J0O3P4l6q7J36J75j24k40J33L08n4k57k6L39J46l78L3K00
3662B48O8k52o1J52J16k33r3K34J01j25j45m2J33K8j34j49J15J81o7k70J38O1
3684Dq6j04M2J32k24q0J77J08j08j5J00L4j17p4O6J81k26R1K39J7j54r3P8K00
3708A88k4r1m2J39j7n6j30Q7J94j30j46L9J57j45j03N9K18q0k44P0J99p1k43k2
3732a94K88l9j03p5J2M9J5n0O2n6J8k1LL1k4n7K7J82l3q1K3Q2Q2j03N1P0p2p0
3760A7O1J36j10j08M8J59o0j79L2J26l0j25J2o0M8m7k2K2J48p3j29m4J50l7j71
$$ plain form
3589 -70 -140 139 178 -31 -118 84 113 -79 -158 -26 179 91 -50 -13 29 53 -36 -24 60 57 9 -142 -46 61 -28 -146
3615 -146 -70 200 86 -150 -118 41 87 -100 -41 151 6 -94 -39 41 -68 -198 -16 17 -118 -257 -95 41
3637 41 -27 -107 -28 -11 -78 -167 -157 -94 -20 -56 -143 -7 168 44 -196 -63 245 191 -66 -92 247 393 15 48 248
3662 248 316 64 3 155 271 38 -55 179 280 155 10 -32 101 129 -5 -154 -39 142 75 -195 -57 4
3684 4 -82 -186 -144 -12 -236 -316 -139 -31 -139 -154 -54 -20 -137 -211 -145 36 -190 -99 140 157 3 -90 -12 188
3708 188 164 73 31 170 153 97 -33 54 248 118 -28 11 168 23 -80 -21 197 117 -127 -57 142 71 -172 -194
3732 -194 94 55 -48 -123 -111 -62 -47 -97 -35 -91 -73 -94 -91 -60 -84 -141 -114 68 35 -46 -23 59 141 38 89 159 87 17
3760 17 78 214 104 -4 44 203 143 -36 -4 122 92 -33 -21 -81 -33 -80 -102 -80 68 -5 -134 -178 -28 -65 -236
3785b36r1K97J57k53p2K5K62j23j18J18J33n5j17J33M9j06J8N4K8n1n8j8P9M9
3809A04j7N6MJ8m9j56L6L8n6p5J34J47k53j25J67J41j16k31J47J82k52j08J36
3832a28J92j07j42R9J96p9j63o3J88J38j52j02J26J73p1j74J1J38N4j89MJ59K4
3855A32j82K3J80Pj42j18J85J5j63n5J76K3r9J8Kk1mM3Km0%r9L8J25jj05m3J29
3883B6N3j78p0J06Q7j10l7J60L4j45k2J79P8j60j23K27R4j20k19J39J31Q5j32
3906H3Nj8M8j28p6P9O4Qj57J02J35j15k56J41J16j1k37M6J49o5n9J46l7L0p0J09
3932C2P3j56o5M6J36K4n5j3L8J5o5q8N5l6L4n4M4P3j4j26N3K03j20j11J5J88K1
3959A47k40J5K60O0k07N2M7m6q5n5J25N4r6j41J51mj3q5p9J01p8o5QN7M5k9J1
$$ plain form
3785 -236 -327 -30 127 -126 -198 -173 89 -34 -152 -34 99 44 -73 60 109 3 21 75 103 52 -6 -24 55 104
3809 104 87 143 147 165 116 -40 -4 34 -22 -97 37 184 -69 -194 -27 114 -2 -233 -86 96 -156 -264 -128
3832 -128 64 -43 -185 -86 110 31 -132 -195 -7 131 -21 -123 3 176 105 -69 -58 80 134 -55 -51 108 132
3855 132 -50 -27 153 160 18 -100 85 100 -63 -118 58 81 -18 0 2 -19 -23 20 22 -18 -18 -117 -79 46 45 -60 -103 26
3883 26 79 -99 -169 -63 24 -86 -123 37 71 -74 -96 83 161 1 -122 105 199 79 -140 -1 130 215 83
3906 83 88 70 118 -10 -86 -7 57 65 -92 10 145 30 -226 -85 31 20 -217 -171 -22 -87 -146 0 -37 -7 -77 32
3932 32 105 -51 -116 -70 66 90 35 22 60 75 10 -78 -23 -59 -25 -79 -35 38 24 -102 -49 154 34 -77 -62 126 147
3959 147 -93 -78 182 242 35 87 134 88 3 -52 73 127 31 -110 41 37 24 -61 -140 -39 -117 -182 -174 -117 -72 -101 -90
3986i0Q9Mj13J8K06N0k00J8J71L6j12m5N7J54n7j04mj0r3L9M4P1j29r1J1lQ5j69
4014a67j0J20N8j18q7R4R6n4p1Q9J69j10p7JJ40q3j14J31J47kj51n7MQ4o2j5J6
4041b9k8K1r1N3N8N5j13J1J82k1k07J3J60O9j01n4J71K2j32n7J21m4o8l4J50m6
4067F1o0j27J67K5o5p7o4P5P0m7l1L4j0K9m6O4Q7j19r6J30O1j01j01R1J74q3q7
4094d6O5L8r5r2R4Q3j20j4R4j8r4K5NJ4P9K9j46M7R1Kj63J00J42k3j22N5P7q3
4122B4j44J11J28m2j06K8L4Kj03j3Q1m8J4J6N9o6O4p1J00k0kq5P7L7K0j46m6K11
4150A14M4j50J3J34L3j95n6J54K6j52M2J48Lk40K3J08n4p0PO8jO8n4J4Rl4n9N
4178e2R6L9j12n3N8J47j71n9J33N1j24o7Q2O1o8q5J42Q7j68j7J21J04j64m2L9
$$ plain form
3986 -90 -1 3 -110 -92 114 164 -36 -18 153 189 77 32 89 243 186 82 78 68 -25 14 58 129 0 -91 -80 -83 2 -167
4014 -167 -177 -57 1 -117 -204 -110 -14 -68 -139 -50 119 9 -68 -67 73 -10 -124 7 154 152 1 -56 -52 32 -30 -45 -29
4041 -29 -57 -36 -127 -74 -16 39 -74 -63 119 98 -109 -96 64 133 32 -22 149 171 39 -18 103 59 -9 -43 107 61
4067 61 1 -126 41 66 1 -76 -140 -65 5 -42 -73 -39 -49 -20 -66 -2 85 -34 -130 0 61 -40 -141 -50 124 41 -46
4094 -46 19 57 -38 -130 -36 47 -73 -87 7 -11 -105 -80 -75 -61 18 47 -99 -52 39 41 -122 -22 120 97 -25 30 107 24
4122 24 -120 -9 119 77 -29 -1 33 35 -68 -81 0 -48 -34 -18 41 -25 39 -32 68 48 46 -39 38 75 95 -51 -97 114
4150 114 158 8 21 155 188 -7 -63 91 117 -35 7 155 158 -82 -59 49 -5 -75 -68 0 -1 67 13 27 36 2 -57 -52
4178 -52 44 83 -29 -82 -24 123 -48 -107 26 77 -47 -114 -32 29 -39 -124 18 105 -63 -80 41 145 -19 -61 -22
4203b2P5J3p8n3Q2J34r8j1K9Op9n1J09J17j58j48J82J78j66j88O1K42r3j37K1
4228c3J11n9j33J12Q7l2j69J53L5j8j01k0P2K4L8j04l9P7J29j85o2J30k6j09R9
4253b3P7Qk24J06R7jk40P4J01N1j25l1M5M6qp3M2l0m0O1j0R3p4l4MQ4R4k10OP0
4283f4J43j04j22J10R8r9n2J63J3j04n7O0J18p2j03J20M5K8q8k0M9mK7q7j5LM8
4310C4J9N9j03k3n7J25pj10N1l2J33rj55Q2R3j28k1K8J03q6q0Q2J08j07q2N6J17
4337I0j15M8m3M9o4N8q1M8k4J0j1l7R1o7j09P8J08K3j74L1J76j02j34R4L1o1m2
4364a29R8R2j40J1M5K3O9j20L5R6QL1r0k7J18Jj07MJ68j35j09j1J99j2j68pK28
4391A71l2j22q5O6J17j50M3R2P7j18m3L1P2l3j19M5L5O5p8j00J05Q5j04r3J3Q2
$$ plain form
4203 -22 53 66 -12 -65 17 151 53 42 71 77 -2 -53 56 173 15 -133 49 227 61 -127 -66 176 83 -54 -33
4228 -33 78 19 -114 -2 85 53 -116 37 72 54 -47 -67 5 29 67 -37 -76 1 130 -55 -117 13 -13 -122 -23
4253 -23 54 62 -162 -56 41 40 -200 -126 -25 26 -99 -130 -85 -39 -47 -120 -78 -108 -148 -87 -97 -4 -78 -112 -108 -24 70 -140 -134 -64
4283 -64 79 -25 -147 -37 61 -38 -90 73 86 -18 -75 -15 103 31 -72 48 93 121 33 13 62 58 85 -2 -17 -14 34
4310 34 53 112 9 -14 -71 54 47 -63 -12 -44 89 80 -75 7 100 -28 -49 -21 82 -4 -84 -2 106 -1 -83 -27 90
4337 90 -25 23 -20 29 -35 23 -58 -10 -34 -24 -35 -72 19 -48 -157 -79 29 52 -122 -91 85 -17 -151 -57 -26 -87 -129
4364 -129 -31 61 -79 -68 -23 0 69 -51 -16 80 88 119 29 2 120 121 14 18 186 51 -58 -69 130 118 -50 -57 171
4391 171 139 17 -68 -2 115 -35 8 100 177 59 16 47 119 86 -33 12 47 112 34 -66 39 124 20 -73 -60 22
4417B2l1o6Q9R9j43j05jJ82q8j02Q4J14l7r9O9R5q4r3P0J24j63kK0J24l6l0k2
4444a0L2q6J11j97M9J18L1j22r8K38J1j73j4J61n9Po9Q9K0j8pJ58m9k2j72O6M7
4471D2J5m1J0K7L0oo9m3M1l5O2l1J6o2nO9L7p0K2J3O2q5MJ47q1l3j4R9n2j14N
4502d0R8n4o4O8K9m5m7l5k3Q7o6K2j64J56JM0j12J07O0j27m3J17J09j48m4J42
4528B4N8j05NJQ8o5nK1k6K7m8k3J09j0m7K0K7K6r6J0j2N1n8j7J42j7l7j07R9J64
4558A99p4j37P1J44r9j13K1J46j3j42p1J05Pj21K5L6N2K5j54J5R2N0j11l7R2J04
4584A12j25r6J09J07j32o3J12L9o8o9O9P8j40M2R7J9j00p6m5Q6k8j3Ml0N9Km0
4611i0RP3o8Qk5J58r8n4P9J7k4m7J46Qj27m8N2J08o6p8Q5K1M2j64J03M5O5o1j19
$$ plain form
4417 22 -9 -75 14 113 -30 -135 -136 46 -42 -144 -60 54 17 -82 -13 82 -2 -95 -25 99 -64 -66 -46 78 42 12 -10
4444 -10 22 -64 47 -150 -101 17 48 -74 -172 66 77 -96 -110 51 -8 -1 -70 19 39 21 14 172 123 101 -71 -5 42
4471 42 57 16 26 53 83 77 8 -35 6 -29 33 2 18 -44 -49 20 57 -13 9 22 84 -1 3 150 69 36 22 121 69 -45 -40
4502 -40 58 4 -60 8 37 -8 -55 -90 -113 -26 -92 -70 -234 -78 -77 -37 -149 -42 18 -109 -152 -35 74 -74 -118 24
4528 24 82 -23 -18 -17 71 6 1 22 -4 23 -25 -48 61 51 4 24 51 77 -19 -9 -21 30 -28 -45 97 80 43 -64 35 199
4558 199 125 -12 59 203 104 -9 12 158 145 3 -68 37 44 -77 -52 -16 36 61 -93 -78 14 64 -47 -84 8 112
4584 112 -13 -109 0 107 -25 -88 24 63 -5 -74 -5 73 -67 -25 72 91 -9 -85 -130 -44 -72 -85 -81 -111 -52 -50 -90
4611 -90 -81 -8 -76 -68 -93 65 -33 -87 -8 9 -15 -62 84 92 -35 -83 -31 77 11 -67 18 39 81 -83 20 65 130 69 -50
4640e0N0K9P7j08O0M8K0j32R7o5Q1q1l1J75o3j73Q6O6k4p3k5L6jm9jL3k4LQK3
4670hj00P9m0j1O6l3KnO3k6Qm6Q4m3n9M1O4Nr4n8J20K6o8m3J39p2n3N0J9Ln1P
4702c4P4o6LK3o6J22m0q8Q9J0jpj26R9P0m3n4N0Qk1J8RJ8q1k4J19R4j33lOJ08
4733A33q6K3L4n5O0m1k3M4k6q6J30k5J21r7j64JJ70qj86K7J21J5j16m8M3ol9K6
4761e8J31j15q7P7K0J8j26MJ9P1j0k1j35J84J9l2q6P2P5l4m8M9M7o6j1P8L2r6
4789b9J6Q8k1q6KN8Q6j42Q4O2l1p1j4L2L7j03M3j1L4M8j17k2J11N5Jj23O4P6j36
4818im0Q9M7k1m9N2P8j56J5n3M8Ol4K7Q1m8q8J39p0l4M8kj7L3J2r8K9k4J7p5O8
4849b9R5l8n0m9pR2q3L8N6m8r5K9Q2k6l5j5P0l0p3n3J6R7K6K9j2M6j9l2KP6j1
$$ plain form
4640 -50 0 29 106 -2 58 106 126 -6 91 26 107 26 -5 170 107 -66 20 86 62 -11 -36 0 -1 -50 -51 -18 -42 -39 -31 -8
4670 -8 -108 -29 -69 -80 -14 -47 -45 -50 13 -13 -5 -51 33 -10 -69 -28 36 41 -53 -111 9 35 -33 -76 63 -9 -62 -12 7 10 -41 -34
4702 -34 40 -26 -23 0 -66 56 16 -72 17 27 26 19 -107 -8 62 19 -35 15 23 2 20 29 47 -34 -58 61 155 22 19 25 133
4733 133 47 70 104 49 109 68 45 89 63 -23 107 82 203 106 -58 -57 113 105 -81 -54 67 82 -34 -82 -39 -45 -84 -58
4761 -58 73 -42 -129 -52 -32 -14 -140 -136 -117 -46 -56 -77 -212 -28 -9 -41 -127 -55 20 -14 -62 -13 34 -32 -43 35 67 -29
4789 -29 -13 75 54 -32 -30 28 114 -28 56 118 87 16 2 34 71 -32 11 0 34 82 -35 -57 54 109 110 -13 51 127 -9
4818 -9 -49 40 87 66 17 69 147 -9 6 -47 1 7 -27 0 81 33 -55 84 14 -20 28 26 9 42 54 -44 -15 -39 -22 -97 -29
4849 -29 66 28 -22 -71 -78 14 -69 -31 25 -23 -118 -89 -7 -33 -68 -83 -13 -43 -116 -169 -153 -56 -30 -1 -13 33 14 -18 -16 60 49
4880D9o4L7R7M3j80qK2J46r4l3P2K2r8L2M9pj14J7J38oj45n8O6J34j08PL4m3Q7
4909I4k6k3J3j7j9pJ8M7q7o8J27K7n5j22J05N1j20o8P9M2k6r1N5J09q9j4qR3p0
4938e0qj02J39Q3m3m1%K5N3o2o0Q8k1o5K3P2j0k20Q9Q4l5l5o2J45k4l8%P8L5m5
4968gj9Q0l1l5L2K5Q1Mo9l2N2L7q6nO7m3j1o7N4K2o6L4Q8l1p3k1K5L8p5K7M6K8
5000F9o0k8q6J82o0k2Oj8M9q2lJ10o0n4p8R2J7l9r0O6P6l4j1j5Rk2kK9K2j05N5
5031h7P5Lp9O7k1J06r8J3LmNO2q4O2o0l4R4l3K0K3j22N9P2n2l0m4J52j4q7R1j
5062E7No7N3O9j02qkJ27p2kK6k3O9q3j0l6M6M0r8kM6L6r9J5J15r7o8l8J37J5j34
5093h5N3P9l1o3J9J4J1m8M2K2j7o7l3Q4l0j9nnL0Jn1j8Q9O5m3j30P3M7j3p4J58
$$ plain form
4880 49 -15 22 119 162 -18 -26 -4 142 48 15 87 109 11 43 92 85 -29 -12 126 120 -25 -83 -17 117 9 16 50 7 94
4909 94 68 45 58 41 22 15 33 80 -7 -75 52 79 24 -98 7 58 -62 -130 -51 -9 -35 -126 -71 38 -51 -65 -73 20 -50
4938 -50 -58 -160 -21 62 19 -22 -22 3 56 -6 -66 22 1 -64 -41 31 21 -199 -110 -26 -61 -96 -158 -13 -37 -75 -75 3 38 -7
4968 -7 -26 54 23 -12 20 45 126 130 61 29 81 118 32 27 94 51 40 -27 27 49 -17 17 105 74 1 -20 5 43 -32 -5 41 69
5000 69 9 -19 -105 77 17 -5 1 -17 32 -50 -53 57 -3 -57 -135 -43 -26 -65 -155 -89 -13 -47 -58 -73 -64 -86 -88 -59 -37 -142 -87
5031 -87 -12 -9 -88 -21 -42 64 -34 -21 -18 -22 -17 45 -39 23 -37 -71 23 -10 10 33 -89 -30 42 -10 -40 -84 68 54 -33 58 57
5062 57 62 -5 48 117 15 7 5 132 60 58 84 61 130 47 37 1 47 87 -11 -13 33 69 -30 -15 100 3 -65 -103 34 49 -85
5093 -85 -32 47 16 -47 -28 -14 -3 -51 -9 13 -4 -71 -104 -20 -50 -69 -74 -79 -49 -48 -99 -117 -28 37 -6 -136 -63 -16 -29 -103 55
5124E5J3j49o0J41M6l5pl1J05o5o7R7j0N3o1KMK0m1p8M2R4k1N0n8PN2r9N1PN3
5155A10j30R7M3rr5M9O3r5l4PK6mn4M2k5L5l0oo2K7L2N0j14J30p0p3N4l4L1o4
5185a03J16l6k3l1o8J25K2j24J6O6m2j9K8J0J3n3l7J36Ol8j9p3J42J9n8l5Q4k1
5213CM8q5J8M6j5M6L1p8k4jK9R4j04N3m3jn2N1L2l8Ko4J12J4k5o3J02N2n7o0k
5244B1N8NK5p3L2Q4q6k1M5K5m4j00M5K3K4m9j7R7j09J8o4L4L6n8K5rL8o9MN1r8
5275a07PK5j1R5l3m9RJ2pk5J1N6J0j66J4J19Jo7K1O5L0n0j3J01ml2n5J27m5M7
5305H6l4J8k0M3o6j6J36Jq3OK2N5j00j1N0M1n0r6R4l6o4K2Q4Lr3nK7j0J4pl3N0
5337B8j5J7qpj5R8r7J7j1K6j17O1N1j16MP5P1j30JlP5k0pj3k5Q9q2p1R8Mq3J18
$$ plain form
5124 55 68 -81 -141 0 46 11 4 -27 78 13 -54 43 33 86 25 27 31 51 10 -68 -26 68 47 97 39 46 98 -1 50 57 110
5155 110 -20 77 120 111 16 65 128 33 -1 6 32 28 -26 16 -9 26 -4 -10 -72 -45 -13 37 -77 53 -17 -90 -36 -70 -39 -103
5185 -103 13 -23 -46 -77 -145 -20 2 -122 -106 -40 -82 -101 -73 -63 -50 -103 -140 -4 2 -36 -55 -128 14 33 -25 -60 24 3
5213 3 51 -34 -16 30 15 61 92 14 -10 -11 18 112 8 61 18 17 -35 16 48 10 12 -52 60 74 49 -14 88 140 83 23 21
5244 21 79 84 109 36 68 152 66 45 90 115 71 -29 16 39 63 14 -3 94 -15 3 -61 -27 9 -49 -24 -33 5 -64 -60 -9 -107
5275 -107 -100 -75 -86 9 -24 -73 -64 -52 -59 -84 -73 -17 -7 -173 -159 -40 -39 -106 -85 -20 10 -40 -53 48 44 12 -43 84 39 86
5305 86 52 70 50 93 27 11 147 148 65 71 93 148 48 37 87 128 78 -18 76 40 -24 -2 82 85 -8 -13 14 4 18 11 -22 28
5337 28 13 30 22 15 0 98 1 18 7 33 -84 -23 28 -88 -84 -9 62 -68 -67 -70 5 -15 -22 -35 -60 29 -53 -124 -26 -22 -105 13
5369A3j30N3n1N1J2M9k5k8L2lOnp7O1J00j46N6M6m8Ql0R7k2p0O6p2J28n9lmN8
5400F3n7M7Ok9M6j4M7J1K0j18Q6Nm7n9O1j7O3m7kJ9m1q7JO6Qp3q0J41Rq2M1NL9
5433C1j21RJ2N8J3m3KJ6l3nm6N8J6N%qK5m1k7Q3oN7j60M8J5o5Q8o7R4m9l9O5k7
5466d2n7M3Q9k9jl5O0oJ3K6p7M9m1Q7o2k3R7j6k4oQ3k3j3n7RQ8p6k0J7ln8N4L4
5499H0r2O2LM5q6N5l8j9Q4k1p7K1l6L8nm4KPj6m8J3P0Qq8J07J3o8l9J4JL2j48
5531a70J38o4N5k0M7j11M7R3j03M0K5qrO5o3M0p7M0N3Rq9j7P1j5PoQ2k1m5rj2
5562b7P0o4O1qK1q1O8O0p5L0K4j1j1N5n1J5lkJ3l0J0Jk1j6J03r6r0J32n4j9j6
5593a2L9K6J6j09kO7j0j7mM1J1p6oK5k7j2K1k3m0M3m1k7O4j5n7O7J11j41qM7K9
$$ plain form
5369 13 -117 -64 -115 -64 -52 -3 -28 -56 -24 -27 -21 -26 -103 -42 58 -88 -32 14 -34 -26 -56 41 19 -51 15 -57 71 12 9 5 63
5400 63 6 53 59 30 76 62 109 120 140 22 108 113 66 7 68 51 114 67 65 84 43 -44 -43 23 31 -42 -122 19 28 -54 -13 -8 31
5433 31 -90 -81 -69 -11 2 -41 -39 -23 -56 -61 -107 -49 -33 -28 -28 -36 -11 -52 -79 4 -2 55 -105 -57 -42 -107 -19 -86 8 -41 -80 -15 -42
5466 -42 -99 -56 33 4 3 -32 28 22 35 61 -16 33 -8 79 17 -6 91 75 51 45 128 105 92 35 44 132 56 36 53 50 -8 46 80
5499 80 -12 50 53 98 12 67 29 10 94 73 -4 17 -19 19 14 -30 -28 -21 -37 -85 -72 -2 6 -82 25 38 -30 -69 -55 -54 -22 -170
5531 -170 -32 -96 -41 -61 -14 -125 -78 15 -88 -48 -23 -31 -40 25 -38 2 -75 -35 18 27 -62 -79 -8 -23 -16 -22 60 39 -6 -15 -27
5562 -27 43 -21 40 32 53 -28 40 100 25 55 79 68 57 112 61 76 73 71 84 54 64 65 44 28 131 35 -55 77 23 4 -12
5593 -12 27 53 69 -40 -42 25 15 -2 -6 35 46 -30 -36 -11 -38 -50 -29 -52 -92 -49 -90 -117 -53 -68 -125 -58 53 -88 -96 -49 -20
5624b0J0p0K0K0k4J2K4NOJ7o9M7L8J0o2j2J0K5K3o6Q1K0n1q0N3Q8k1o1P8L6po8
5656A2R8n4L2n5R3j0p6l0O5J3n1j7j9L6JL8k1pjL3r9L9j3l0K7J5K2n4j6l3N7L6
5688C1o1LN6J1r4MQ3j06L2j15J22n5j1l5LM4m1k4L0J32j10J00q4Q5m5K9K2j05
5716i9N0L1M2K3l3J8j06P4nK8PL0j3NK0n4L0m9L4l1rpNJ7P8j00J10m1N3o2M4k9
5748F1jLK4r2K9J08r4k3LO5n3K5j02L5JM9l0J0q0K3J6N0o5PP0m5L8n5m9P0j1l9
5780e2M5o7Q7pp3P5J5o1o0K0L0Jq3M6M3j4%j4j8j6J0P7J1M4n3k2K2n8P4lO0j3
5812D6J5o9N2LLoJ2M5k3orJ4l1k6JO3l6o1J2R1q8M2p2L9O5p5J2oL5K3J0p2kP5
5846G6k1l3m9J33r5o5J18j7K1q9KJ03j37j8N9m4k5M1l2k2N9L2j00P6p0L7L5p0
$$ plain form
5624 -20 -10 -80 -60 -40 -64 -52 -28 -23 -17 0 -69 -22 16 26 -36 -48 -38 -13 10 -56 25 45 -6 -86 -33 55 34 -27 51 87 80 12
5656 12 110 56 88 33 126 116 40 10 75 88 37 20 1 37 38 76 55 48 47 80 -19 20 7 -23 4 19 41 -13 -29 -62 -5 31
5688 31 -30 -27 29 40 -54 -50 33 -73 -41 -156 -34 -89 -100 -135 -132 -88 -129 -153 -123 9 -101 -1 -85 0 -45 -16 6 -99
5716 -99 -49 -18 24 47 14 32 -74 0 -5 23 30 60 47 52 72 18 48 -1 33 2 -7 -14 -9 8 86 -14 96 55 108 46 90 61
5748 61 60 63 87 -5 24 132 38 15 18 83 30 55 -47 -12 -11 38 8 18 -62 -39 -23 27 -38 -31 39 -6 32 -23 -72 -2 -13 -52
5780 -52 -7 -74 13 6 -67 8 23 -38 -98 -78 -48 -47 -130 -84 -41 -55 -55 -69 -87 -103 -93 -16 -5 39 -14 -36 -14 -72 2 -1 59 46
5812 46 61 -8 44 47 50 44 56 101 78 72 63 77 46 20 21 84 48 -13 -1 90 2 44 -28 11 76 1 13 7 42 65 75 3 1 76
5846 76 55 22 -27 106 11 -54 64 47 68 -21 -19 84 -53 -71 -12 -56 -81 -40 -72 -94 -35 -3 -103 -27 -97 -60 -25 -95
5874i5J17q2m0L6O5q9J2NL2Kmk8M2K3m9l8N3nk4N9Rn0O6o4J4K7k8J6Q8M0r0N3
5906G3m5O2J5m8ORN0k4l4kL5n5j9J04m6l5J8p7J09k9m1K3k7m8J09j9n9mO5l7k9
5937@qJ3N6o9L3K5l6l1kK5p7K0k8MK7J4n5m3O1j8J3J2q9J44n6j6Q1j8M2o4J4k0
5969d6L5l4kP0m4Q6r3n3N6M8k3P8q2J2k3L8j9L0L0K0j02L4P8p6J7J5K8j06M7P4
5999I3m5K5O6n0m3J9n%lm5N1j7om2M9o9Q8Qm0r0Q6k9Pk6M7Km3Jl9O5j14O8l2K7
6033c6M1o8L4k2M9m0km0K6Lm3R6l1K5p1N6L7n9l9N4P6j7r3M9J4L2m6l8L1l6j3
6064g1O2k9M4QL3J3j27P6k0l9R4J2Oppl0j8L5M3l5K9k2j0j1m9P8m2O7m3K9k2N
6096E2o1P9j1k1n8L0Nk2P%Q8o4l3J7k4J3L0j3j5k9j0j3QP1j16M9l1P2j8q0LLM8
$$ plain form
5874 -95 22 -60 -100 -64 1 -88 -76 -71 -39 -37 -41 -69 -27 -4 -53 -91 -38 -43 -67 -8 1 -49 17 -47 -33 -6 -34 -18 70 110 20 73
5906 73 28 90 105 57 63 72 122 98 64 62 97 42 23 127 81 46 64 -13 96 67 26 49 22 -26 83 64 5 1 66 29 0
5937 0 -8 5 61 -8 25 50 14 -17 -19 6 -71 -51 -79 -75 -48 -34 -89 -132 -71 -89 -76 -64 -153 -9 -65 -81 0 -18 24 -40 -26 -46
5969 -46 -11 -45 -47 23 -21 65 -28 -81 -25 23 0 78 -4 8 -15 23 4 34 64 84 -18 16 94 18 35 50 78 -28 19 93
5999 93 48 73 139 89 46 65 60 60 57 12 63 46 40 -2 47 -22 66 74 34 -56 30 1 8 -18 29 31 -12 -11 -50 15 -99 -31 -63 -36
6033 -36 5 -63 -29 -51 -2 -42 -44 -84 -58 -55 -98 -2 -33 -8 -79 -23 14 -45 -84 -30 46 29 -64 -15 -1 31 -15 -53 -22 -58 -71
6064 -71 -9 -38 6 14 47 60 -67 9 -11 -50 44 56 62 55 48 18 0 35 78 43 72 50 40 29 -20 58 16 83 40 69 47 52
6096 52 -9 70 59 38 -20 10 15 -7 0 0 88 24 -9 8 -16 -3 27 14 -1 -30 -40 -53 -45 26 -90 -41 -72 0 -18 -98 -95 -92 -44
6129d4j1Nlj8ro4J06K0K4k1Mo8P4k2j1K4m1J12m0p0O7o1L0O3p0j9J2P4lm6K0M3
6161E7kK7p2N6k0m2n2N0N7j0j2K6k6m5O0k9P4p3M9L1p4M2o7J6L4l7R3j37%L1p9
6192g4Q4o5J44j51N6J5o1J6L7J7l1nr0L5PO7q5M1m3N0k0kn5O2K1n9N8m1P4l7n
6223d0pL3Np2M7j3J0j7K2P5n0L6k5l9O9m7QNK9k2L7m0J02pr8O0j6j7J7m1R5l2
6255F7j0l1J15m4r8L4L8l6j1K2l6qOO3m8K4l7RK2k0l1N2m4k5M4o2n3L5J00m7j8
6286b8O9p7L5k8J3j3m2O3m5K4k3j3o8O8M0q4J08l1J0J5p6P0N8r8M8L3p9N7l0P9
6316E5l6o0j1N1P9o0l3K4k1J4L2M3kl6qJ5M4m6k9j2PJ0K2n1mJ01q0l0O3oM0r0
6348a5J08l4j7j3N7n5Mn4K5O3q3O9q0O9n1kK7M4r6j2O1n9P3n8m1J9K1Nn7L4nJ8
$$ plain form
6129 -44 -55 -50 -53 -71 -80 -144 -38 -18 6 -15 -11 -79 -5 -27 -38 -14 -55 57 17 -53 14 -47 -17 46 -24 -43 -31 43 40 -6 14 57
6161 57 55 82 10 66 46 4 -48 2 59 49 37 63 37 -8 52 23 97 24 73 104 30 72 5 21 55 18 111 -26 -26 5 -74
6192 -74 10 -55 89 -62 -6 9 -52 -36 1 18 -13 -18 -108 -73 -66 1 -84 -43 -86 -36 -56 -58 -113 -51 -30 -89 -31 -72 2 -35 -40
6223 -40 -47 -14 -9 -81 -34 -47 -37 -54 -32 43 -7 29 4 -35 34 -13 -5 0 29 7 44 4 106 99 1 61 45 28 45 4 99 67
6255 67 57 26 141 97 -1 33 71 35 24 46 10 2 8 71 23 47 10 19 41 21 -10 42 -2 -27 17 -45 -98 -63 37 -10 -28
6286 -28 41 -36 -1 -29 -16 -29 -71 -8 -53 -29 -52 -65 -133 -65 -25 -109 -1 -32 -22 -7 -83 -13 45 -53 -5 28 -51 6 -24 55
6316 55 19 -41 -52 -1 78 18 -15 9 -12 2 34 77 75 39 31 46 90 44 15 3 10 20 42 -9 -13 88 8 -22 41 35 75 -15
6348 -15 93 59 42 29 86 31 35 -19 6 69 -14 55 -25 44 -7 -9 18 62 -34 -46 15 -44 29 -29 -70 -51 -30 -25 -82 -48 -53 -35
6380c5l7N0JK0o3J4KK8l7J14q4m5L8j0L1m7K6OqrNK4K5p3J2K5R9o0k1Pj6K1P0
6413G3p3L4rN3p1kN8l7M0nk0j3Rm3K5K0n5L1Q8j01Lj8j1PL7P%M4k0m9N4k1l5M9
6447D9m3M7k4k5j9lL6J0p8M%%O2n9O0q3qL9L6l8J5Jn2P0m0L0k6J4J8q1N6kJ3J0
6481a1L3k7q2Q4p0J48j09k1KN4mO6p2l7L5N1p1L1K0J1LJ7j8J6l0J7J2n3mN1M0
6512H2J5j0j25P5P4q1j9k0J21o1n9M2N9m0l7l9J5K3LoK8K5q2RlL0Lq2K1L0n2L5
6544b6P2j7j20O0l1M3Nl1M6k0JpK6k6m7P0m9P1j3r0P4K5Km3j0J9Qj0O1j19N4l
6576b5M5l1L8m8J7m4M3L3p9L9R9n4q8J00l9RQn2J5R7r3L8l9P4n5N0j11L0N9j1
6606B5pj3O0p3N7n3j9N5K7o5P6p1j1K8J0n0Q2o3l0R3p2j7l0L8M1o1m2J1O4n6M1
$$ plain form
6380 -35 -72 -22 -21 -1 -64 -50 -48 -20 -57 57 -27 -72 -34 -44 -13 -60 -34 -28 -36 -45 -40 -16 9 -64 -52 -27 72 12 -9 -2 -18 3 73
6413 73 0 34 25 78 7 5 63 26 66 61 41 28 37 -6 19 39 -16 15 103 2 5 -13 -24 -17 20 27 27 71 51 2 56 35 0 49
6447 49 6 53 29 4 -15 -18 18 28 -50 -46 -46 -46 16 -43 17 -66 -74 -35 1 -37 -22 -21 -73 -3 -43 -13 -39 -25 -7 -88 -32 -34 -21 -11
6481 -11 22 -5 -87 -3 -73 75 -34 -55 -53 1 -3 63 -9 -46 -11 40 -31 0 20 31 34 51 33 49 19 36 48 -5 -9 42 82
6512 82 97 87 -38 37 111 30 11 -9 112 51 -8 34 93 53 16 -23 -8 15 18 12 40 65 -17 -8 -11 19 22 -60 -39 -9 -61 -26
6544 -26 46 29 -91 -31 -62 -19 -14 -45 1 -19 -18 -25 1 -25 -72 -2 -51 20 7 -83 -9 16 18 -25 -35 -16 -8 -18 43 -76 -22 -25
6576 -25 20 -11 27 -21 -4 -48 -5 28 -51 -12 87 33 -55 45 6 15 23 -29 -14 83 -10 28 -11 63 8 58 -53 -23 36 25
6606 25 18 5 65 -8 49 -4 -23 32 59 -6 70 -1 -12 16 26 -24 58 -5 -35 58 -14 -31 -61 -23 18 -43 -85 -74 -10 -66 -25
6637b5L3kj4m0NjK4J0m9O1j5Pm8L3J2k7N7n3kR5j9l2o8N0N9j04ML6M0m3K6kn2
6670d4N2M8m5K6n8J4N7l2M6n9L8l7K7kk5M0j8m2qP9LJ5l0o7J16j52L6N2Nk8k6
6701a9P4m9j2l0k0Q0l9L1O3p6L6o0J9j4N4j21N6%M0l7K5n2L0jj0l7J7L4k1K0N
6732a4m2jK9n9M9m6N4l1K1K1n2N6m3K6O3rk9M7m0%M8O1j06k8J4J6J3OJ8mrJ8q4
6765c7J12l7M4n3N5q0J2P9p6j7J7K2K0ooj3p7M1L7N0p6M7l0j1l2J1J9k2%k6l9
6796g2k4Q1j3Kj2J6l0J9j4M2K3p3M8Pp1O1l1l1RP9m7n3Q0l5pL0o0N9Q8j53LQ5
6828Fl1Ll8J9O6Ll4l9K7O3p0n5J31n0L3J4K5l9l0P0o0N4m9L6l2J8KL9j2l0J5K1
6860G6p3P1jk5p5M6K8m8k4M8pOk5Ol4J2nL5m8K0J8k2J9p0L7J0pjK2l6oK7J8K2
$$ plain form
6637 -25 8 6 -8 -48 -43 -44 -20 -10 -59 2 -13 -6 -54 -21 -9 -36 21 -32 -34 61 42 10 -58 -8 51 -53 -49 -13 27 -16 10 8 -44
6670 -44 8 56 11 37 -21 -7 50 18 64 5 43 6 33 31 6 46 28 -14 -22 57 60 75 45 -22 94 -58 -22 30 35 7 -19
6701 -19 55 6 -6 -36 -56 24 -15 16 79 3 39 -21 -2 -16 38 -83 -27 -27 13 -24 1 -51 -21 -22 -32 -69 -52 -18 -39 -19 -14
6732 -14 -56 -57 -28 -87 -38 -84 -30 -61 -40 -19 -71 -15 -58 -32 31 22 -7 40 0 0 48 109 3 -25 -11 5 18 24 42 38 29 47 -37
6765 -37 75 38 82 29 84 4 16 95 19 2 19 41 61 55 49 36 -41 0 37 87 11 58 28 17 -15 -4 15 -7 -7 -33 -72
6796 -72 -96 -15 -28 -26 -38 -22 -52 -33 -47 -5 18 -55 -7 0 -71 -10 -41 -72 -63 16 -31 -84 -4 -39 -46 -16 -76 -17 71 -82 -79 6
6828 6 -25 -22 -60 -41 25 28 -6 -45 -18 45 -25 -80 51 1 34 48 73 34 4 74 14 68 19 55 23 41 43 82 70 40 55 76
6860 76 3 74 73 48 -27 19 47 -1 -25 23 16 22 -3 3 -31 -19 -24 11 -37 -17 1 -21 -2 -72 -35 -25 -32 -33 -11 -47 -53 -26 -8 14
6894A4k6j8J5jllm2rK0M3k1PQpK1L5%MkLo6NK5oJ3j9j1JK6L5k7L4p6O2n7N2J8
6931D7l7Mm6P6o9Q1k8jK9k4k2On7Q6K6Rm6J9k6J5M0n8oL3k4Oj7k0L8k9j0M1o2
6964b6PolQ5l8k8j5j7kK2n1J6J5l5l9Q3j8J7l8M9j4m4M4KO0o2kqN3J3m1k2N3Q
6998A8LJ0o8N7l8J0m4j6R9J4j6jk8qJ2k8J00k2p0L3L1Pk1p5K3KR5k0j2j9nK2P
7031E2L2o2j3jj5J7L3m0Q7o0J8m7k4k2K0j4oK9k7j4k5J50q2KM1j34Q6k0k3N4n
7062a3l5J6N0m5m2K0OK7j8N0r5M0Pk2L5m5L1P0j09L8l0O3j0j2qk0J4P4Nj9K5N
7094E3jk1n3N6l0oQ2j04M3m7P7PM3n8K5p9mM7Qq2R7r5M5P6m4JL8o3Pn5Q0m3J12
7127A12q1k2kl9L4J7l6l0J5M7m7q4J26m7l6K2M0J8qk5k7RL6Nq9k0J13Kj0J2l8
$$ plain form
6894 14 -12 -30 -15 -16 -19 -22 -64 -73 -53 -10 -31 -24 -16 -23 -2 33 33 37 35 38 -28 -23 2 -4 9 -10 -21 -20 6 41 14 48 -28 34 -23 29 47
6931 47 10 14 -32 44 -25 56 28 27 56 32 10 16 -41 45 71 80 34 53 27 42 82 24 18 51 27 33 16 -4 34 5 -5 36 -26
6964 -26 -19 -25 -28 57 19 -9 -24 -41 -43 -21 -72 -56 -41 -76 -115 -32 -50 -33 -71 -22 -36 -80 -36 -34 26 -36 -38 -46 7 20 -21 -43 10 18
6998 18 21 31 -37 20 -18 -8 -52 -68 31 45 29 28 0 -8 4 -24 76 54 -16 17 48 55 34 -41 -18 -16 79 59 47 28 23 45 52
7031 52 84 22 9 8 -7 10 43 3 90 30 48 1 -23 -45 -25 -39 -45 -16 -43 -57 -82 68 -14 -12 29 -105 -19 -39 -62 -8 -13
7062 -13 -48 -32 18 -27 -69 -49 -43 -16 -34 16 -79 -39 -32 -54 -19 -64 -33 37 -72 -34 -64 -1 -11 -23 -31 -51 -37 37 42 23 48 53
7094 53 52 31 -22 34 4 -2 80 -24 19 -28 49 56 99 41 66 -13 -17 30 38 -44 53 -42 3 79 35 36 74 11 18 -37 43 0 112
7127 112 31 9 7 -32 2 19 -17 -47 -32 15 -32 -116 10 -37 -73 -51 -11 7 -1 -26 -53 -44 -8 -3 -92 -112 1 3 -7 5 -33
7158c3P5n6m2Pl6R0Nm1KN8n5j4j1j8P5j05P4M7n3J7K9P1K7o6j5J0l0oQ5o3lk7
7190bQ1k5j2%qj1l3P4m0k9KJ2j3pO5n6k3N9p0O3Nl1L6k3Q7m6j4l5R5j70P1L8p7
7223c7Q2n2k5L2n7N7K4m3Ql3j7j6J15l3l2L3l3O7j9p0P5k5j7Rp2QP4k7J7J6L2
7254D1j4p5L5k5N8r2KQ7k4n4O8K5M1j06R2k8j6PM0o2N7L0k7J4k8O6o3n4N4Lk8
7285B4l3L5l7j2O6n1O1j1L2j4l6q5N0l8N6l5P8r2lK0j2K5j9J8n2L9J1l5K9j9P3
7316C3m1mk1q1M6K1K0n1J4MQ5m4J5j9M9p8K0KPl5L2m6N4n1k6L7P5j1Lm3j0K3J7
7349dM8k0O6Lq4J5N3o4J1p5O1m6N5J9O5p0Pj5k3L4k5O7q1L5L2n1J2p1Q4L0k6j9
7381B3o2L5L7J4Oj1mp3O3o9k8J1L0k5J7J4m6P8j19O3J1j9K5N6j23J06j19P7rQ1
$$ plain form
7158 -33 42 -14 -56 -49 -85 5 10 -31 -29 29 -26 -40 -51 -69 6 -99 -25 22 -31 -14 15 86 113 47 32 42 12 6 91 28 25 -2
7190 -2 79 54 42 42 34 23 -10 64 24 -5 -3 9 -4 -11 54 -2 -25 34 -36 27 32 1 37 14 101 55 41 6 101 -69 2 40 -37
7223 -37 45 -7 -32 0 -57 0 24 -19 -11 -44 -61 -77 38 5 -27 6 -27 40 21 -49 26 1 -16 -7 -79 -71 3 -24 -7 9 41
7254 41 27 -48 -13 -38 20 -72 -70 17 -7 -61 7 32 73 -33 59 31 15 22 62 0 57 87 60 74 46 112 49 -5 49 52 24
7285 24 -9 26 -11 -23 43 -8 53 42 74 60 24 -61 -11 -49 7 -28 50 -42 -45 -25 -37 -12 -31 -13 -65 -26 -15 -50 -21 -40 33
7316 33 -8 -12 -33 -114 -68 -47 -27 -78 -64 -60 25 -19 -4 -23 26 -52 -32 -30 -23 -58 -26 -72 -18 -69 -95 -58 17 6 9 -34 -44 -21 -4
7349 -4 44 24 90 93 9 24 77 13 24 -51 10 -36 19 38 103 33 40 25 2 36 11 78 -3 32 64 13 25 -46 38 68 42 23
7381 23 -39 -4 33 47 53 42 38 -35 28 -41 -69 -58 -28 -53 -36 -22 -68 10 -109 -46 -35 -54 -29 27 -96 10 -109 -32 -41 40
7411D0k6l8j8l4N2n6M7k0P5m0j18O8P1k7O5%m2l8K3O5k1n3j8O6l7L6N7n4p4N7
7441HL0qk7k6N2J8k3N1l0m6j4j4Q1K7Nl4o0L9Ok1M8Kl0k3k4M1j7L2n7j6jJ0K2
7474Ap4J06l2m7K6R4q2L2m3j8NoJ5p4Q7RL0n8m3JJ22p6m5P3j4pj0j2L4Kr2L4m1
7507a03O4k1N4m6P3j8l6KN5k2L4k4pk2mO5n0k5J06q3N1K9n0j5N4Prk5M4k0l8J0
7539C0Jl0j7nO4n6Q6J9m3M1o4N3m6p3M3Jo3K3L8j1M6qK4j38J35m6K6l7pk6lL3
7571a0OJ7J7l7J2q7M9p7L8K3J8lm3QJ0Q7j7N4j35Q5j8k6mL6l2k1M5Jm6O3j8l7
7603d2N2j3L4n0J41r9j7l9%K7kP3o5K8oj7N4j4o6O6J5%Pm4m1J32o9N7p7Lo3L8
7635CL3N5j25O4M6l4KK4k5o3L4k8Jjk3N0k2ll4k5J05po7lL7m4pQ7%q6K8j2m9K8
$$ plain form
7411 40 14 -24 -42 -76 -24 -80 -33 -53 22 -18 -136 -68 3 -24 41 41 -1 -39 -16 49 28 -25 -43 23 -14 22 79 25 -49 8
7441 8 38 30 3 -23 29 47 24 75 45 -1 -15 -29 52 79 84 50 -10 29 35 14 62 64 34 11 -13 28 11 43 -14 -30 -31 -21 1
7474 1 -73 33 1 -46 -20 74 -8 24 -19 -37 -32 -38 -23 -97 -10 -1 29 -29 -72 -71 51 -25 -70 3 -11 -18 -28 -40 -6 -4 -96 -62 -103
7507 -103 -39 -60 -6 -52 21 3 -33 -31 24 2 36 12 5 -17 -21 44 -6 -31 75 -8 43 72 22 7 61 68 59 34 78 58 20 30
7539 30 31 1 -16 -21 43 -13 73 92 49 90 26 79 33 -40 3 4 -59 -36 2 -9 37 29 53 -85 50 4 30 -7 -14 -40 -43 -10
7571 -10 -4 13 30 -7 5 -82 -33 -110 -72 -49 -31 -34 -77 -69 -59 28 11 65 -70 15 -3 -29 -33 3 -29 -50 -5 -4 -50 13 -5 -42
7603 -42 10 -3 31 -19 122 23 6 -33 -33 -6 -8 65 0 28 22 5 59 45 -21 45 60 60 67 23 -18 114 45 102 25 28 -35 3
7635 3 36 91 -34 30 76 42 44 68 43 -20 14 -14 -13 -14 -37 13 -9 -12 -46 -71 34 27 -40 -43 -6 -50 -57 30 30 -56 -28 -40 -89 -61
7669f1J2nnK5k2N5qlk2PK5o3J7Q3Kj00L5L6K0n0J9m4R6rL9p1Rk4j1L6j7M6j04
7702e7L7J7j3nJ6K9O2on4l9L7NN4L6o7m2N0r5J0O1m7MJK3MJ6l2mlO1j03P2n4n8
7736h4M9K6l1J4K1K1m7q4J03q9N0nQK4m1m6Q5k6P4k1o6Q7J6j13K3O0l6l6L2K2
7766a0l2P1m5j9O1l8l7P2K1m4k9K0l3jK1j0M3J7M7k7j7nPL1J6m1m7N4M0k1L4n7
7798D2o0Q2m1k6mK3j3l2P0j12R3n4N5P8j7p3k9l8P6l4j5M2kn5L4mo5O7j5rkK2
7830a6m2M7q5P8L3r9Q5QRm3k7M5q6L7ON5j06N7RO9o4K2K7L1m8L0ql1J8M3m9k6
7862b1O7rQQoj2k0l0J0J2j3L0m4N0L5p5QMJ3k0K5RK5J0pk4j4l3kn5Q4m7L0M0L2
7897F8r2N7pln4K4K0k3M6p4LPkLKj3j6M4k2k7P2J0j7l3L8J4J1m6j44R8O8k9J2
$$ plain form
7669 -61 -49 -54 -59 -34 -56 -1 -9 -12 -34 -27 -2 -65 -48 35 37 -63 -28 8 28 -22 -3 -47 49 40 79 8 17 -7 -18 18 1 47 -57
7702 -57 -20 -3 -16 -21 -5 24 86 80 26 -13 24 29 83 119 52 10 60 -35 -25 36 -11 -7 -6 17 21 37 5 1 -2 59 -44 28 -26 -84
7736 -84 -35 -9 -40 -26 -5 16 -31 -115 -12 -101 -51 -56 -48 -24 -65 -111 -26 -52 22 1 -65 22 38 -75 -52 8 -28 -64 -32 -10
7766 -10 -42 29 -16 -35 26 -12 -49 23 44 0 -29 -9 -42 -43 -22 -32 11 28 75 48 31 26 33 64 80 39 -8 46 86 65 99 42
7798 42 -18 64 23 -3 -7 16 3 -29 41 -71 22 -32 23 101 84 11 -18 -56 20 -14 -29 13 11 -44 -10 -14 -79 -12 -27 -36 -38 -16
7830 -16 -58 -11 -96 -18 15 -84 1 9 18 -25 -52 -7 -93 -56 -50 5 -101 -44 -35 34 -30 -8 19 50 2 32 24 -7 11 54 5 -21
7862 -21 46 37 45 53 47 35 15 -15 -5 7 -6 24 -20 30 65 -10 -2 2 15 -5 20 29 54 64 57 33 19 -14 -16 -71 13 -34 -4 36 68
7897 68 -24 33 26 23 -31 -7 13 -10 36 -38 -35 -28 -30 -27 -25 -38 -54 -10 -32 -59 13 23 6 -27 11 25 36 -10 -154 -56 12 -17 -5
7930eKj8L9l0QPJ6k3j0Lm9P8l6M9l1JM2j1j1N2J9j49J46r3LO3l7n5O1O3q5N3n6
7963FK2kN7q3M3j8M5r9O2k4l3NK3l0J14j09N0n6L4nj0m0R9l8j0m0m7M5J9L4qj7
7995a1Rj7l8K0Mj7L7j0j5n8K6PJ8K9l5JM9n5J6K6L4p8K1L0p8P8k4NK5p4N1M6m2
8028b0L3j5m6N5k6K2J4mL8j01j5J57n3JJm4oK0L6M9p3M7m0l4NN4kn4j5M5oqJ11
8061A26j17j7K5lK8Qp0N6l3LQ1q6q8R5pn5k9P8PQp7P8l6j0k5l8M7kJ9l1PM7m2
8094e3O1p7n9R3K5K1m7KKL7l9M8m2n7N5nK1K8m6O5o8j5J13l2LJ8l7L2j5K7k8m3
8126a2N6l7O5q7%j0Q2n8K1j3l4R8m0L9p6P1pq2M0j3O8p4L2n9J3K7j3L9l4L6j06
8157f8O1j2PN4l5l6%L5l1j9j9O0l7m2L6J5q2Q6n1O9k8mL8l1K2J1M2q8K8L5k3q
$$ plain form
7930 -5 -3 -21 18 -12 -4 3 19 -4 -14 -11 -60 18 -18 31 0 1 43 32 21 73 92 -57 89 -4 -1 62 25 -30 31 94 9 62 6
7963 6 28 26 83 0 43 25 70 -29 33 9 -24 -19 4 -26 88 -21 29 -27 7 2 -8 -48 51 13 3 -37 -84 -39 -20 14 6 -11
7995 -11 -2 -19 -57 -37 -33 -50 -13 -23 -38 -96 -70 -63 -45 -16 -51 -50 -1 -56 -40 -14 20 -58 -37 -7 -85 -7 -31 -26 -1 -75 -24 22 -20
8028 -20 13 -2 -48 7 -19 3 17 13 51 -50 -65 92 39 40 41 -3 -9 11 47 96 23 70 30 -4 1 55 53 -1 -16 29 23 15 126
8061 126 9 -8 17 14 42 50 -20 36 3 6 87 1 -87 8 1 -54 -83 -5 2 10 -67 11 -25 -35 -60 -98 -51 -53 -34 -65 -58 -11 -53
8094 -53 8 -69 -128 -35 -10 11 -36 -34 -32 5 -34 14 -28 -85 -30 -35 -14 14 -32 33 -35 -50 63 31 34 52 15 47 32 59 31 -12
8126 -12 44 7 72 -15 -15 -25 57 -1 20 7 -27 71 31 70 -6 65 58 -24 16 3 71 -3 29 -30 -17 10 -3 36 2 38 -68
8157 -68 -7 -19 -12 42 7 -29 -29 6 -25 -44 -63 -3 -40 -82 -46 -31 -113 -27 -78 -9 -37 -41 -3 -34 -12 -1 41 -47 -19 16 -7 -15
8189a5M5o
$$ plain form
8189 -15 30 24
8191B4
$$ Imaginary data points
##PAGE= N=2
##DATA TABLE= (X++(I..I)), XYDATA
0@%%%%%%%%%%%%%%Mj2J5j5J6j6J6k0K6l0L2l6M2m8N4n9O7p6Q3r3J06j17J29j44
38g6J59j75J93k13K37k64K92l23L59m01M52n12N83o72P82r25J125j410J852k618
58a555M183q543M1449J49924j25981k20088K2302J79582j027j93551q0286J35615
70i7976J05467q1010j02831N1306J09891J546p2542p738N6431K0665k5920l37
82d3048L2663J4800N37K6826K8535j9825l6576J1363L2716j7761m7347L957M8892
95C5732J3259l2405j1452K3189M555k3227n772J1945j2476k3545J9849M4694m672
108C9674m4743M691N9808R831p3168m3473N5955N2533n3900p7967L0319Q7339
120D6899o897r0796k2551P2984K7610p4780n5827M4796N4646k3378l8035K8940
$$ plain form
0 0 0 0 0 0 0 0 0 0 0 0 0 0 0 0 4 -8 7 -8 8 -8 8 -12 14 -16 16 -20 22 -26 28 -31 36 -40 43 -50 56 -61 68 -76
38 -76 83 -92 101 -112 125 -139 153 -170 189 -212 240 -272 311 -361 421 -504 621 -789 1063 -1555
58 -1555 2628 -5915 35534 185458 59477 -160611 -138309 41273 40246 -153305 -233591 -97976
70 -97976 7491 -73519 -176350 -125044 -15153 -13607 -86149 -93887 -37456 -16791 -42711 -43048
82 -43048 -10385 4415 4952 31778 60313 40488 3912 15275 47991 30230 -17117 -13160 35732
95 35732 48991 16586 5134 28323 32878 9651 3879 15824 3348 -20197 -348 44346 39674
108 39674 -5069 -378 59430 69261 -3907 -47380 8575 61108 7208 -70759 -40440 46899
120 46899 40002 -50794 -73345 -361 27249 -47531 -103358 -58562 -3916 -27294 -65329 -36389
132c6389M8086j0254l3221J4817L5914r563l0900J6506M6589K927l5700J422M7973
145E8207J8664l8741k8658K4750K2978l0702m1041R310L6099J497k9504j1802
157h943J3629N159j6401k0936j2055J111J4633J0793j3981j9791J5106L7591J582
170G497m0195j5407L6509K4393l2795l3861K8717N0305m611m0084M175M5990O183
183C6816m9391k3655L8263K8479l1513l0055L1842M2840j6029l8616J0839L5172
195C4992j2147m2516J223L9362O381l1486k493L8499J5654l1081k1761J9991J6952
208C1570k1933k3998J3706K4029o741j8535R010K1461p264k5938l443J4565n534
221I55k0923L076K4007L624j6857K733K2098k358k8334n699K5633Q409k4352j0169
$$ plain form
132 -36389 11697 1443 -31778 -16961 18953 9390 -21510 -5004 41585 44512 8812 10234 58207
145 58207 76871 38130 9472 34222 57200 26498 -14543 -5233 30866 32363 2859 -8943
157 -8943 4686 9845 -6556 -27492 -39547 -38436 -23803 -13010 -26991 -46782 -31676 5915 7497
170 7497 -32698 -48105 -11596 12797 -19998 -53859 -25142 25163 20552 -19532 -15357 30633 36816
183 36816 -12575 -36230 2033 30512 -1001 -31056 786 43626 27597 -11019 -180 34992
195 34992 22845 -19671 -18448 20914 27295 -4191 -6684 31815 47469 16388 -5373 14618 31570
208 31570 9637 -14361 -655 23374 16633 -1902 7108 28569 21305 -4633 -8076 6489 955
221 955 -19968 -16892 7115 10739 -6118 -3385 18713 16355 -11979 -17678 7955 16364 -7988 -18157
235a8157K6521K0376j5703j6560J5037J7609j5026k4169N261J8708p162k1639
247a4904N795K7708K847k6454r905J9747O670k5195j5930J8448J5831j4868j3097
260b3307J8806J9413j3989k0400J0630K0374r527k4591K943K4831O306j6015l195
273g721J8821R896j4168j2413Q551R735r441j2114Q571J6839l21j1119K722J2754
287B0592j005j3473l956O576p43p326K529R949M25p025J409P197l275j1919l488
302c533N147p74p500M4R420M662n206l533N041L174q090r728J844Q175M01m818
318e274L655R525M20p886o80O140l580j2403k156J0590M070q062k858R406O195
333G102o628p857O12J739m547m526L287O431J213k202J693N914J546o489o419
$$ plain form
235 -18157 8364 28740 13037 -3523 11514 29123 14097 -10072 -4811 13897 6735 -14904
247 -14904 -9109 18599 21446 -5008 -14913 4834 11504 -13691 -29621 -11173 4658 -10210 -23307
260 -23307 -4501 14912 923 -19477 -8847 11527 2000 -22591 -19648 5183 11489 -4526 -7721
273 -7721 11100 20996 6828 -5585 2966 12701 3260 -8854 -283 16556 16235 5116 7838 20592
287 20592 19587 6114 2158 8734 7991 665 3194 13143 13568 6543 7952 15149 11874 -45 -3533
302 -3533 1614 840 -6660 -6616 2804 7466 2260 -1273 3768 6942 -1148 -10876 -9032 -857 -456 -5274
318 -5274 -1619 7906 8326 440 -240 5900 2320 -10083 -12239 -1649 2421 -5641 -8499 907 7102
333 7102 474 -7383 -6771 -5032 -9579 -14105 -10818 -4387 -3174 -5376 -3683 2231 3777 -2712 -9131
348i131J163M117o24k240K393M618J697M26J836j374n963l048L305J821l843j491
364f338N925N334n65j169K332N95l995k905J983K559m75o47L263N540K345k415
380A1367l016N0Q11k861l540Q94K848j058k034K868L884k822o397j181K251k620
396e56n842p74L932J780j301K42K023K6k853l208r45J425R57j505j253K718M898
413b36J323k611j306R47O9j742j243m42k59J773L686J520j706j274M25q34k156
430d066o41J34j189o69K429K953m1j831k24Q82J00r92j721j532Q22L420K649r
448D74R4J345L69p16M0N57j113r80K330L419P11j247K71J339O55j01r98k408j746
467B295J502K394k59j667L02J311l32j621j504j368q46L60L77r15l80J048M50
$$ plain form
348 -9131 -7968 -3851 -4475 -6715 -4322 296 1993 2419 4255 2881 -3082 -6130 -2825 -1004 -4847 -6338
364 -6338 -413 4921 4356 3187 5519 6114 2119 -786 1197 3756 3281 2634 5897 11437 13782 11367
380 11367 8351 8401 9212 6351 2811 3705 6553 5495 3461 6329 10213 7391 994 -187 2064 -556
396 -556 -6398 -7172 -3240 -1460 -2761 -2519 -496 -470 -3323 -6531 -7476 -6051 -5094 -6599 -7852 -5134 -236
413 -236 1087 -1524 -2830 -1883 -1814 -3556 -4799 -5241 -5500 -3727 -41 1479 -227 -1501 -1076 -1910 -4066
430 -4066 -4707 -4573 -5762 -6431 -4002 -1049 -1090 -2921 -3145 -2263 -2163 -3155 -4876 -6408 -5586 -2166 483 474
448 474 568 1913 2282 1566 1606 2163 1050 70 2400 5819 6530 5283 5554 6893 7548 7447 6449 4041 2295
467 2295 3797 6191 5932 4265 4567 5878 5546 3925 2421 1053 207 567 944 29 -351 697 1147
484A147j111k16J237m37k759j302J157P71n11K56P25l54n17L15o10k282j296N13
502e274J96p78j55J56o05j1J661R05j459j346Q11J180K57Q11J789J312M91J121
520A062J456M45l77n67l37J176K200m66l720j669L579K515l547m656O42K182j654
537a736l033J88J644q7m02J672J868n46j494J147L565K549l53j121J683L592J196
554A0332j314J55J947n96k493L20J776k409m615M08L432j824o523k060K950n6
570e70m315j325K839L97l597j443L213K179k474k249K623L810j094l916O94M503
586g25J54n237j448M354L69o837l193O118L823o359n826M172N117m201n601L384
602a1936O597o61l849K929O980O87m202J132P237L430m327k726N118N619k008
$$ plain form
484 1147 36 -180 1057 620 -2139 -3441 -2284 -1513 -2024 -1768 -1043 -1397 -1914 -1599 -2209 -4491 -5787 -5274
502 -5274 -5078 -5856 -6011 -5855 -6460 -6471 -4810 -3905 -5364 -6710 -5899 -4719 -4462 -3651 -1862 -550 -59 1062
520 1062 2518 2963 2586 2019 1682 2858 5058 4592 872 -797 2782 5297 1750 -2906 -2264 -82 -1736
537 -1736 -4769 -4581 -2937 -3024 -3426 -1754 114 -432 -1926 -779 2786 5335 4982 3861 5544 9136 10332
554 10332 9018 9173 11120 10524 8031 8351 10127 7718 3103 3511 6943 5119 -1404 -3464 -514 -570
570 -570 -4885 -6210 -3371 -2974 -6571 -8014 -4801 -2622 -5096 -7345 -4722 -912 -2006 -5922 -5228 -725
586 -725 -571 -5808 -7256 -2902 -2533 -9370 -12563 -6445 -2622 -8981 -14807 -10635 -5518 -9719 -15320 -11936
602 -11936 -5339 -6000 -9849 -6920 60 747 -3455 -2323 4914 8344 4017 1291 6409 12028 10020
617A0020l984K744M480l383o401J097M459l797q089R68P527r22r059k577O132
632g85K040o399l783L756L060k622j613L861L640j615k395K530L987p69l605N64
648a48M269P84k600J27L367ql521N00M021j608o892r45O232J558o227k078N975
665B806K942n512m282L445K865l766l484L106L716k515m034J672M313n31m142
680c401o33K902q08m731q13M700J848l731q25N276J861n839l629M557L598l861
696c529k189N598M389l962k679N936N096m465n442L809N996k415n725K327P532
711A0277J023n089j33N272l43p725k696O394L230o579m112P330O576n552p611
726B62L153N290n202p356L705P184l407o718M709Q827l557j0625O20R316m80j0884
$$ plain form
617 10020 6036 8780 13260 9877 3476 4573 9032 5235 -2854 -1886 5641 4719 -4340 -6917 -785
632 -785 1255 -5144 -8927 -5171 -2111 -4733 -6346 -2485 1155 -460 -2855 -325 3662 2893 -712 -148
648 -148 4121 4905 2305 2432 5799 5791 2270 2770 6791 5183 -1709 -2654 3578 5136 -1091 -3169 2806
665 2806 5748 236 -4046 -601 2264 -1502 -4986 -1880 1836 -679 -4713 -3041 1272 741 -3401
680 -3401 -4034 -1132 -1940 -6671 -7484 -2784 -936 -4667 -5492 -216 1645 -4194 -7823 -3266 332 -3529
696 -3529 -5718 -120 4269 307 -2372 3564 8660 4195 -1247 2562 8558 6143 418 2745 10277
711 10277 11300 6211 6078 11350 11007 3282 586 6980 10210 3631 -481 6849 13425 7873 262
726 262 3415 8705 3503 -3853 -148 7036 3629 -3089 1620 10447 6890 -3735 -3115 6201 5721 -5163
742e163k581R721M431q038m274R166O678q793j0311N034R381n068j1417L861J4213
757F840J280j1915k686J0134K288j0857m760Q752M641p945m670Q035N854o530
771a539n864N838N586o873q524L846Q335k550p333M302J1627k4j1088k068J0533
786D204L727j0298n111J0652Q689o756p134P097Q680n645r778K789P631l877r445
801d575J157Q434N1p347r84O224M49p277k640N073J279o350k391Q032O441m601
817I75n173N385P124m270r026J368P609j2n725J286O497p68o778p32N111j113
833A758p678k457M583J032n311j812N471L818l076k959K307J717m582m205L873
848g521O575j33l512K594O271p11o627j268M746P3n681r62N413J398m933q79N972
$$ plain form
742 -5163 -7744 1977 6408 -1630 -5904 3262 9940 1147 -9164 -4130 5251 183 -11234 -7373 6840
757 6840 8120 -3795 -6481 3653 5941 -4916 -9676 -924 3717 -4228 -8898 -863 4991 -1539
771 -1539 -7403 -1565 4021 -2852 -11376 -7530 805 -1745 -9078 -4776 6851 6827 -4261 -6329 4204
786 4204 7931 -2367 -7478 3174 11863 5107 -2027 5070 13750 8105 -1673 1116 8747 4870 -4575
801 -4575 -3418 5016 5067 -2280 -3264 2960 3409 -3868 -6508 -1435 -156 -6506 -8897 -865 5576 975
817 975 -4198 1187 8311 4041 -4985 -3617 3992 3980 -1745 -459 6038 5270 -1508 -2240 2871 1758
833 1758 -5920 -8377 -3794 -2762 -8073 -9885 -4414 -596 -3672 -6631 -4324 -2607 -7189 -11394 -7521
848 -7521 -946 -1079 -4591 -1997 4274 3563 -3064 -4332 414 487 -5194 -6156 -743 655 -4278 -5157 815
865H15J945o338m182L285K335m172k885N128O367m80l001K454M806j187n426q06
881a342M917K125k669k52M673K701k866j980J797l93n152k520L299J327m147j541
897b023M708K443m583l163L432J830n618m433M111N152k840m307M212Q046o36
912F331p787k520N525J781o192l305O041N233l833m868L722M665m614p014K269
927d566O076k711p619P40P471J274n094l39N640J195o271l358L915K892l124k088
943e967M936N534j642m983O08M447l09m953q03L871J140l203J7M502J527l214
959A508r14L037k25m884j765L902K134k599k88M648K603l396l102K434K456l033
975B516m263J666M749O60k952L89M224N97m922l088K574J417m198k922L833M234
$$ plain form
865 815 2760 -3578 -7760 -4475 -2140 -6312 -9197 -4069 2298 1818 -1183 1271 6077 4890 -536 -1342
881 -1342 3575 5700 3031 2779 7452 10153 7287 5307 7104 6711 1559 -961 2338 3665 -482 -2023
897 -2023 2685 5128 545 -2618 814 2644 -2974 -7407 -3296 1856 -984 -5291 -1079 6967 6331
912 6331 -1456 -3976 1549 3330 -2862 -6167 -126 5107 1274 -3594 128 4793 179 -6835 -4566
927 -4566 1510 -1201 -8820 -8080 -609 665 -4429 -4768 872 2067 -4204 -7562 -3647 -755 -3879 -5967
943 -5967 -1031 4503 2861 -2122 -1514 2933 2624 -2329 -3132 739 1879 -1324 -1307 3195 4722 1508
959 1508 594 3631 3406 -1478 -3243 659 2793 194 -94 4554 7157 3761 659 3093 5549 2516
975 2516 -1747 -81 4668 5328 2376 2765 6989 7586 2664 -424 2150 3567 -631 -3553 280 4514
991D514k357l920J805L457k031m911m99K026j055k602J446M207J122k284n07K083
1007D94J76l693k918J543L044M56j410Q67K510J31k135m62R72j238k802j12K174
1024b403M55j234Q69L004O44j957j235J94r24j658P04K546J284o13N72K219J113
1041C580j485k020P1J219r6j373J63K306J607l25k04R88j48k228j424N87L70j005
1059E83K79K194J000j041k17J375k80k573j647R04J025r48r62J465K317M37j549
1076B362j149Q8k58j864j532Q23J755k81r88R05J793l89k015p49K61q26j358L03
1094c119R61j00K65J873J563j290k384o64R26L4j408p83J262K435J145q51r11
1111a046O11Q11r46j508l57L83M96Q43J194O73L57P58K62j647j692N27J324p40
$$ plain form
991 4514 2157 -1763 42 3499 1468 -3443 -3942 -1916 -2971 -5573 -4127 80 1202 -1082 -1589 494
1007 494 670 -3023 -5941 -4398 -1354 -898 -2308 -1441 1069 1200 -935 -1397 -425 -1663 -4465 -4577 -2403
1024 -2403 -1948 -3182 -2313 691 1335 -622 -1857 -1663 -2587 -4245 -3541 -995 289 -324 248 2467 3580
1041 3580 2095 75 146 1365 1269 -104 59 2365 3972 3647 3443 4431 4283 2055 631 1218 1588 583
1059 583 862 3056 4056 3015 2798 4173 3893 1320 -327 577 1602 654 -308 1157 3474 3911 2362
1076 2362 1213 1301 1043 -821 -2353 -1530 225 -56 -1044 -139 1654 1265 -750 -1499 -1238 -2064 -3422 -3119
1094 -3119 -2158 -2258 -1993 -120 1443 153 -2231 -2895 -1969 -1935 -3343 -4126 -2864 -429 716 -135 -1046
1111 -1046 -435 376 -570 -2078 -2435 -2052 -1556 -713 481 1154 1511 2269 2531 884 -808 -281 1043 303
1129C03j272J591L316P16k122j108J510J174j503k642m71K097J846n63p95J214
1145C291J814m79k023j053J23l87o13L88R54J82L19J002L7j564j200L74N9j619
1163c95j338Q36J914P56o66m67K73K55o44j967j331L92J128J78j36M47N97K59
1181I1j55n69j051r13P9L51o34j25J715J700n25j084M05Q67q88k046m29J299J256
1200f56K86O6M20Q52P37j54j100q81k47L75O33N13J92J62J279J534j85j948r10
1219I68Q10M32j167l42J412J433j1r0M28R8p81r49n03l37J16M25J91M5O04P59
1239C541r4j276j079m77k29j88l23j45M77J121L88p29p67K15k44j225p70M69N60
1258g75k49K06J208M88o35m80J99n72j213k41P01L82l32J28P98N10k08r14q68
$$ plain form
1129 303 -969 622 3938 4654 2532 1424 2934 4108 2605 -37 -508 1589 3435 2872 2077 3291
1145 3291 5105 4626 2603 1550 1673 1286 673 1061 2015 2197 2516 3518 3555 1991 791 1165 1224 -395
1163 -395 -1733 -897 1017 1773 1107 640 913 1168 524 -1443 -2774 -2382 -1254 -1076 -1212 -765 -168 91
1181 91 -64 -633 -1684 -2597 -2518 -2167 -2801 -2926 -1211 489 -36 -1120 -715 152 -736 -2782 -3211 -1912 -656
1200 -656 -370 -304 116 968 1705 1551 451 -430 -677 -302 331 844 1036 1198 2477 4011 3826 1878 968
1219 968 1778 2210 1043 701 2113 3546 3535 3445 3873 3971 3190 2241 1738 1401 1517 1942 2133 2178 2782 3541
1239 3541 3447 2171 1092 615 386 198 -125 -270 207 1328 1716 987 220 435 191 -1034 -1804 -1335 -775
1258 -775 -1024 -818 390 878 243 -237 -38 -610 -1823 -2064 -1363 -981 -1313 -1185 -387 123 -85 -999 -1867
1277a867j20K07j23n94J43Q20O96M93K87j75o67j79Q09L6r70j94J541J278k19
1296A202k38J101L73r32p01N36L34q97m20J067J080J52m39jK45j02o05m78n1p1
1316A155j25M85J176M06j032m02J025O02j909j763Q42J461p35j416P61J497m86
1333A542j610k90O18q52j626k51R13K31m06K5R60L20p95p59K72N74q41q15J090
1352a700J694K5j057N15J771k61j851m65J227j00j536J08J933O14j426l68J229
1369C52K8j695j117Q42Q95n31k94R63J142l26r42M88J346k14j719k29K043J090
1387B122j123n82J776J184j046j081P28N15j281n19J503J114j242r79J209J209
1403C507r64j586L65R78j90j096j13J041L35q63k23P75L01j314j101P49Q08q16
$$ plain form
1277 -1867 -1987 -1780 -1903 -2497 -2354 -1534 -838 -345 -58 -233 -900 -1079 -270 -234 -1204 -1398 143 1421 1202
1296 1202 964 2065 2438 1506 805 1341 1675 778 358 1425 2505 2657 2218 2217 2462 2360 1755 1277 1226 1155
1316 1155 1030 1515 2691 3097 2065 1663 2688 3290 1381 -382 460 1921 1186 -230 531 2028 1542
1333 1542 -68 -358 260 -592 -2218 -2469 -1556 -1325 -1731 -1706 -746 -426 -1221 -1980 -1708 -1134 -1975 -2790 -1700
1352 -1700 -6 19 -1038 -523 1248 987 -864 -1329 -102 -202 -1738 -1630 303 917 -509 -877 352
1369 352 380 -1315 -2432 -1590 -695 -1226 -1520 -557 585 259 -683 -195 1151 937 -782 -1011 1032 2122
1387 2122 999 417 2193 3377 2331 1250 1978 2493 1212 693 2196 3310 2068 1089 2298 3507
1403 3507 2543 957 1322 2300 2110 1014 901 1942 2277 1414 1191 1966 2267 953 -148 601 1409 593
1421E93j066L94Q50o89j014M67N69j158r40O91O62j259j203J173J306o18j399
1438b641N22J136k23j279J11J351M53r59n55J153R55o64n78J053J157p97j248
1455a053N14J368o64j194J066K144n80k112J78J834p5j815K8J772K11j513k57
1472a48J483M45j113m49J200P11j392j123P89J413k29r36O63J239o14j765L64
1489E38J603l27k089L11K575L23k662q68K338J160k316j690J583J356j570j474
1505a209J401J540j149k061N38J785o19k249l38K029O11k058j076J595J295j607
1521a572j553J166J568j724j767J309K215p59j967O73J871n39k040L22K060L00
1537d37j306Q3J486K89j422l87J647J078j012p91J155J147r18j302J066K044m75
$$ plain form
1421 593 -473 -79 771 82 -932 -465 104 -1054 -1994 -1303 -641 -1900 -3103 -1930 -624 -1242 -2641
1438 -2641 -2119 -983 -1206 -2485 -2374 -1023 -570 -1529 -2084 -931 24 -640 -1218 -165 992 195 -1053
1455 -1053 -539 829 165 -1029 37 2181 1601 -511 -333 1501 1426 -389 -361 1411 1622 109 -148
1472 -148 1335 1780 667 218 1418 2129 737 -386 403 1816 1587 651 1314 2553 1939 174 538
1489 538 2141 1814 -275 36 2611 2934 272 -596 1742 2902 586 -1104 479 1835 265 -1209
1505 -1209 192 1732 583 -1478 -940 845 226 -2023 -2361 -332 279 -1779 -2855 -1260 35 -1572
1521 -1572 -3125 -1959 -391 -2115 -3882 -2573 -358 -1117 -3084 -2411 -540 -1079 -3119 -2797 -737 -437
1537 -437 -1743 -1660 -174 115 -1307 -1694 -47 1031 19 -772 383 1530 612 -690 376 2420 1945
1554A945j981K63K032q8k169j7K273O54j884q62J508K27j604n81J703Q27j397
1571H49j033J112R67j023j610M98J619l9j414m17J234M49j211n39J196M89j323
1588a96r16J189J022j110j094Q64J159o30j096K97M97n12n28L95M07n81m20P23
1606e30O29p64r56J96O04o5q28M7R85K87r72m07P68M50r58n41J241Q91j113j088
1626b124J020J225p97r01J155J389p18j495N90J589k48j182M91J680L00j296m62
1643B16J065Q23p84o44Q68J054o61j345L53J348Nj129R8J039j15j397l17R14j13
1662A278j011L26J229k23j483l69J159J36j253n68Q35M53p63p28O69O69o79r57
1680a280M73Q50o28j370l1J477L64j467l04J514O77j586q81J182O20j422q06J556
$$ plain form
1554 1945 -36 227 2259 2171 2 -15 2258 2912 1028 166 1674 1901 297 -284 1419 2246 849
1571 849 -184 928 1895 872 -738 -240 1379 1340 -74 -491 743 1192 -19 -558 638 1127 -196
1588 -196 -1112 77 1099 -11 -1105 -241 918 288 -808 -511 -14 -526 -1054 -659 -252 -833 -1253 -530
1606 -530 99 -665 -1621 -1425 -821 -886 -1714 -1667 -682 -395 -1367 -1774 -1006 -556 -1514 -2055 -814 77 -1036 -2124
1626 -2124 -1104 121 -676 -1577 -422 967 249 -1246 -656 933 685 -497 -6 1674 1974 678 216
1643 216 1281 2104 1320 676 1544 2598 1937 592 945 2293 2298 1169 1267 2306 2191 794 477 1391 1278
1662 1278 267 593 1822 1599 116 -253 906 1042 -211 -779 56 509 -254 -982 -313 356 -323 -1280
1680 -1280 -807 43 -585 -1955 -1986 -509 -145 -1612 -1916 -402 275 -1311 -2192 -1010 -390 -1812 -2618 -1062
1698a062J495q93j368P90J624n06j843k09J537Q25r84p46R31J080n32r92M43R79
1716E69l55j104J66R97m8q42N37J224o3r55Q6P30l91r24L16J196L34o66k8Q20
1736A599J75o72m26M79M21m05n61K42O55o6o34m7P51Qr41n53M48J3o85j83R10
1757E28K14q79j74Q46L8j278p21Q58O83p08n79L14P81j06n71j63J52jn07k32L71
1778a134J50m30l08N91P22m50p10J34N55l38o12J45P90r1j84O09N41l20n35K70
1798f05M93r8l87J41M84L01M8K14N9J02m4j44P0j18j93j41M29N39l6l63L94N40
1820A685n68q23J37O70j53o98L81R71K9q09o2O63p0q75l42M32J81m29k76L73M96
1841I13j59o69l21K42L4p70m89L83M12l46r6M13K12o46l39L33L0p47l41O57P27
$$ plain form
1698 -1062 433 -460 -1828 -1038 586 80 -1763 -1972 -435 390 -594 -1340 -409 671 139 -853 -410 569
1716 569 214 -890 -724 273 225 -617 -80 1144 1081 126 212 942 551 -373 -57 1139 1473 807 779 1599
1736 1599 1774 1102 676 1155 1576 1171 610 852 1507 1441 807 760 1511 1519 578 25 473 486 -199 -382 528
1757 528 742 -137 -311 535 573 -705 -1426 -568 115 -593 -1172 -858 -77 -183 -754 -917 -765 -766 -1273 -1505 -1134
1778 -1134 -984 -1414 -1722 -1131 -409 -859 -1569 -1435 -880 -1218 -1830 -1685 -895 -986 -1170 -561 -20 -340 -875 -605
1798 -605 -112 -210 -597 -456 28 329 377 591 650 752 708 564 634 516 323 182 611 1150 1114 751 1145 1685
1820 1685 1117 294 431 1101 948 250 631 1602 1631 822 760 1423 1353 478 136 568 749 320 44 417 913
1841 913 754 85 -236 6 40 -730 -1219 -836 -424 -770 -866 -453 -241 -887 -1226 -893 -863 -1610 -1951 -1294 -567
1862e67k99j37L64K77j79l55K8J13j87j37K78L66J15j48J9L19K15m08n89n1L76
1883e87q9j08N06M45k46j47M21L51p59n35M29P29k15m20M08P84J15m05Q4J98p2
1904H87n50j46L16K80k1k13M12M78k50o93r1L98j23o93o0P22K14k79j72O28L6
1925A080n49l60L4q7m09%M64J79k83lJ74j48o26m20m1k2j04l18P2K47J95k48k2
1948a195K07n9p67m50N97M49l46r5O55O66j67l40J27J05j46o3L81J27j59J75N56
1969B58L78q4k12r4J68o4k95j66K26N21J50n8K42J36k85m45J24K31l17m22K33
1990B25N51M5j87K06J81k33m38j1q5l05j12M05L05m3j06J14lk15k96j52qnl5l
2014b05K02K39m4j21N8Pn03n16K80J98k14l12O11O08l96o52R1K76l27o63L3L83
$$ plain form
1862 -567 -866 -1003 -639 -362 -541 -896 -868 -755 -942 -1079 -801 -435 -320 -468 -449 -130 85 -323 -912 -963 -587
1883 -587 -676 -784 -278 167 -79 -226 195 546 -213 -748 -319 410 195 -225 183 967 1082 677 761 959 887
1904 887 337 191 507 787 766 553 965 1443 1193 500 409 807 684 -9 -69 653 867 588 416 1044 1080
1925 1080 531 171 205 118 -291 -291 173 352 69 66 240 92 -534 -954 -995 -1017 -1121 -1439 -1367 -1120 -925 -1173 -1195
1948 -1195 -988 -1047 -1814 -2264 -1667 -1218 -1564 -1659 -1004 -338 -505 -845 -718 -613 -759 -822 -441 -314 -473 -298 258
1969 258 636 552 340 246 414 350 55 -111 115 636 786 728 970 1106 821 376 500 731 414 -8 225
1990 225 776 821 634 840 1021 788 350 339 254 -51 -163 242 547 504 398 512 509 294 -2 -154 -162 -167 -202 -205
2014 -205 -3 236 192 71 129 136 -367 -883 -603 -405 -619 -931 -320 288 -108 -760 -669 -393 -720 -1383 -1350 -967
2036i67o4j67J48M84o2l69j09J78k4m55k99N37O15J09k47L15N18j21o04J51O16
2057A83j42p11L33J113K07q04L3J021K50q18p88M95N11j86k65M73N06p9l74o4
2077H94L06j34o48k64O63K50o28m14O20N86n65p37J51L73o51o49L34M62k85l94
2097g30M35N70l84n34K5M38j74l64JM60K28k24L1L10K31l02n07PL45l17n08K21
2119g42N81j22n77K5O52k26p69j61M24J30n06PN37K76j92J37L30l9l01j65K81
2140d20J97N0j39J62N06L10k60k96Q0J51j70k69J63K91L3J45L15O9j97oK19k04
2162G30k00K34J72j42m5M96N54m35o36J56M98m33q77k22O21K16m58l66K35L12
2182D10n10o59kL26k88n71J11Q83P6p31m5R29J24r89m47Q33N44p29m40Q10P98
$$ plain form
2036 -967 -1031 -1198 -1050 -566 -628 -997 -1106 -928 -952 -1407 -1706 -1169 -554 -445 -692 -377 141 20 -584 -433 183
2057 183 41 -670 -337 776 983 179 212 1233 1483 665 -123 372 883 697 432 905 1411 1332 958 894
2077 894 1200 1066 418 154 817 1067 439 25 645 1231 666 -71 80 453 -198 -847 -513 -51 -336 -730
2097 -730 -295 275 -109 -643 -618 -180 -354 -718 -717 -257 -29 -253 -222 88 319 17 -490 -483 -138 -455 -963 -742
2119 -742 -161 -283 -860 -835 -183 -409 -1178 -1339 -915 -785 -1291 -1284 -747 -471 -663 -526 -196 -235 -536 -701 -420
2140 -420 -223 -173 -312 -150 356 666 406 110 190 341 171 -98 65 356 389 534 849 918 721 715 934 730
2162 730 530 764 936 794 749 1245 1799 1364 728 884 1382 949 72 -150 471 687 229 -137 98 410
2182 410 -100 -759 -761 -435 -723 -1294 -1183 -300 -224 -955 -1000 -71 53 -936 -1383 -550 -6 -735 -1175 -365 433
2203D33n17o91L86N51l74o40J12N32N4m83m8P29K04n17k44L10K51n18m20O85M83
2224B78m86l00P21N73q09q19Q55R90o74j049L05J317l6j040l0J135L64p37o42
2243h4O58N08n93n76O36R46l70r93K39J088k05j256j57J110L07j202n51R42P24
2262A171q21n92P59N84q36q94L00Q22k06q12J4P17K86o76n13K68L32l63o01N5
2282a006L24j45k33K69L67l01m31K00L54m03m27M83N97j34l05M03N26j64l85L55
2302e6K86k61l36J09N14J01k12Q8L63N7n97n08J60M81j56l75L84N05j40o12K27
2323B2N26j15m42Q8O56m9n45J41O67K34k81j63R8k0j51k10L1K8N7J14K6k00l49
2346A63j85O0P0j73k07R9K14k53k14J93M23l27n40L47O04m88q51L33J041o0r34
$$ plain form
2203 433 -84 -775 -389 162 -212 -852 -740 -208 -154 -637 -685 44 248 -269 -513 -203 48 -470 -890 -205 278
2224 278 -208 -508 213 786 -23 -842 13 1003 329 -720 -415 902 866 -174 -204 931 1295 558 -84
2243 -84 574 1082 489 -87 549 1495 1125 132 371 1459 1254 -2 -159 951 1258 56 -495 447 1171
2262 1171 350 -242 517 1101 265 -629 -329 493 287 -525 -511 206 492 -184 -697 -429 -97 -460 -1061 -1006
2282 -1006 -682 -827 -1060 -791 -424 -725 -1156 -956 -602 -1005 -1432 -949 -352 -486 -791 -388 138 -26 -411 -56
2302 -56 230 -31 -367 -258 256 357 145 233 596 653 56 -452 -292 189 33 -342 42 547 407 -205 22
2323 22 548 433 -9 79 735 686 141 282 949 1183 902 739 837 817 666 456 487 515 572 686 712 512 163
2346 163 -22 38 108 -65 -272 -173 41 -212 -426 -233 190 -137 -677 -330 274 -214 -1065 -732 309 249 -685
2367f85j50Q57K03p37m62N44L43m82m16M06O07l01o52J43P43j8q37j51Q98M04
2387B57o86m61O68O25n59n84O54P31m40o32L80N16l00n29L95O25L0n14q6L30m
2408D16l18j61M88L10k99k34K38K60l02k92M71M81n02o28K97P78l30p15L44Q79
2428A181q6p89k77N29M3o05p6N26K61n92l89L41L21n09n35J82M86o7o56k78O09
2449c80K31n46k48N12J94o44l08N29M57n39l26N49N53l39n18K06M43k0j71j35
2469e00K97J84M3qN7Pj06p9J78J82j97r0K45K38l14k49L09K24j69k64K30L17l32
2492B03l04K87L32k41k76K79L57l37m09R6M44k0k60K2L45j1l51n5K43J81j86j72
2514A67K25K90k83n64J53N33jn16q7L41K1m64k16L70o4j91M0K53l11l52J01L46
$$ plain form
2367 -685 -835 22 225 -512 -974 -430 -87 -569 -985 -579 28 -273 -925 -782 -39 -57 -894 -1045 -147 257
2387 257 -429 -890 -222 403 -156 -740 -86 645 205 -427 -47 469 169 -360 35 660 690 176 90 420 416
2408 416 98 -63 425 735 436 202 440 700 398 106 577 1058 556 -72 225 1003 673 -42 302 1181
2428 1181 1095 306 29 558 601 -4 -80 446 707 115 -274 67 388 -121 -656 -474 12 -55 -711 -989 -380
2449 -380 -149 -695 -943 -431 -237 -881 -1189 -660 -203 -742 -1068 -519 34 -305 -823 -617 -174 -194 -365 -500
2469 -500 -203 -19 24 16 73 80 -26 -105 73 255 58 -32 213 451 137 -112 197 421 252 -12 218 535 203
2492 203 -101 186 518 277 1 280 637 300 -109 -13 431 411 151 173 518 507 156 101 344 525 339 167
2514 167 392 682 399 -165 -12 521 520 4 -83 258 279 -185 -401 -31 -95 -286 -246 7 -304 -656 -555 -209
2536b09pl68RK32J13k43k20J34K60m5j59K5K74j26m01J31M56J6m82L3M97J55m22
2559c47k21M88K83l64j98M17K52l14j07L64K54j53l53K30L64N5l14j54L47K52
2579G81l31k57K53K25j78l01K06J38l85k91L69L24l32n30K97M25k64l94J08O33
2599D96p5l26j69K44J93j73q6J99K54j57k29L1J38r1m33J63K40j32n47p9L75j64
2621c28l53o8L54j36l95q8M53K0l45K0N39J77l01j72K44L22L2j43j2K34N3j20
2643a3J6K10j04k13l1K32K7m81j58N15K34k78m00L97K92k10k13K64L06Qj26K46
2665E20K73q5p1K38J30n3j34j42R3o1j26j47J1K8k06l71omk37k33O4K68j63k90
2689g04K12K90l4j47J46K78j00o1J40K04j04Q9K53P6k65k30J02R5j68l11j09J80
$$ plain form
2536 -209 -216 -584 -575 -343 -230 -473 -693 -559 -299 -344 -503 -478 -204 -330 -731 -600 -144 -128 -610 -577 -80 75 -347
2559 -347 -568 -80 203 -161 -359 58 310 -4 -111 253 507 354 1 231 595 650 336 182 529 781
2579 781 450 193 446 671 493 192 398 536 151 -140 229 553 221 -309 -12 413 149 -245 -137 496
2599 496 421 95 -74 170 363 190 104 303 557 400 171 202 340 249 -184 -21 219 87 -460 -539 -164 -328
2621 -328 -681 -749 -395 -531 -926 -1014 -561 -541 -886 -866 -327 -150 -451 -623 -379 -57 -25 -168 -180 54 107 -13
2643 -13 3 213 109 -104 -135 97 124 -357 -515 0 234 -44 -444 -47 245 35 -178 86 392 400 274 520
2665 520 793 708 637 875 1005 952 818 676 769 708 582 435 446 474 268 -103 -109 -113 -350 -583 -519 -251 -414 -704
2689 -704 -492 -202 -236 -383 -237 41 -59 -120 20 224 120 209 462 538 273 43 145 240 72 -239 -348 -168
2711a68N9j70k75J7J44p2k96M1J67k5j89J95M83%l53K23L48p3k72Q0L10L5k47
2734c8K16K04p8k23R9J91m6l51j49J89K99j13k37J28L15Q5l58j25L06P9k74L0
2756A49M44J35m99j0N93j2m57k07L32J96l91l28K13K55j22k69l6M8n4k87p6J21
2778b62N4k27j67L82J38k68l54M08L26l35l02K41M08k24j85K33L44j98k96J93
2798i1K61q3m11P2L61P6m10j12K25K75k07k84K3K47o7l74R6K76k5l40J89M40m
2821A33m63q2N46P2k64k34L78J87q4q9J66J22j14j2N2Rj65J1P5P8J17m2r5J30
2845D32l1j04j30L3N5M5L4J72q1j95j16K99J7m15m8J79Pl16p1K31Kk12l1O6k28
2870d06k57O1J14M6j48n6K02J63Jk43M0J04J66j54r3J96K51k4l9K40K9k92m0K37
$$ plain form
2711 -168 -109 -279 -554 -537 -393 -465 -761 -720 -553 -578 -767 -572 -89 -89 -442 -219 129 56 -216 -136 174 209 -38
2734 -38 178 382 304 81 180 371 325 -26 -175 14 313 200 -37 91 406 491 133 8 314 393 119 149
2756 149 593 728 229 219 812 800 343 136 468 664 273 -55 158 413 291 22 -14 34 -20 -307 -383 -262
2778 -262 -208 -435 -602 -220 -82 -350 -704 -296 30 -305 -607 -366 42 -182 -367 -134 210 12 -284 -91
2798 -91 170 87 -324 -252 109 185 -225 -337 -112 163 -44 -328 -305 -58 -125 -499 -403 -127 -152 -492 -303 137 133
2821 133 -330 -412 134 206 -58 -292 86 273 189 100 266 388 274 262 314 323 158 169 244 322 439 397 302 432
2845 432 401 297 167 200 255 300 334 506 425 230 114 413 430 15 -33 146 153 -163 -234 -3 -1 -213 -244 -178 -406
2870 -406 -663 -602 -488 -442 -590 -646 -444 -281 -280 -523 -483 -379 -213 -367 -460 -264 -13 -37 -76 164 193 -99 -139 98
2894I8J17l30n6M60J00k67j57L04O6l26n3J64J71j76k63J99K96m9m42K7L06Q0
2916B69l24l67M36K82j88l53L10L78k97l62K95M33k74m74K44N42j34m91J38N16
2936E79J56m53j04J43J91j84k49N5K28q6k62K6K43r6m32k9L45L5n85j88M52K09
2958fm27l9M00J17m72j88K78K40m22j01L60K74j57k88J76K15jk31r5K97N0k15
2980b35J1L26J80k49j19K51K45m10k91L74M85l60l47L41M60j95m18j8K47K3l29
3001b8j0J38Q8o9j0R0J24k26j64K1J40l2j37o3L86P5k50J9J85m3k12k4K01j77
3025B2k55K90L23k29j99Q0J61j62k76Q5J14n5r4J32J87q9k31K3K13L3k18j30Q8
3048a87K31j22k99J07K29Q9m30o5K18ol37J8L55O0k96j2M73j2k82o1L35J12p5
$$ plain form
2894 98 215 -115 -171 289 389 122 -35 269 335 9 -44 120 291 115 -148 51 347 298 -144 -117 189 269
2916 269 -55 -422 14 296 108 -245 65 443 146 -216 79 512 238 -236 8 550 416 -75 63 579
2936 579 735 282 178 321 512 328 79 134 362 276 14 40 283 187 -245 -274 71 106 -479 -667 -215 -6
2958 -6 -433 -472 -72 45 -427 -615 -337 -97 -519 -620 -260 14 -143 -431 -255 -40 -41 -272 -367 -70 -20 -235
2980 -235 -224 102 282 33 -86 165 410 0 -291 83 568 208 -139 202 662 467 49 31 278 301 -28
3001 -28 -38 100 188 119 109 199 323 97 -67 -46 94 62 -75 -138 248 323 73 92 277 234 22 -2 199 22
3025 22 -233 57 380 151 -48 32 193 31 -245 -160 -46 -101 -195 -63 124 35 -196 -173 40 73 -145 -275 -187
3048 -187 44 -78 -377 -270 -41 48 -382 -447 -229 -235 -572 -554 -199 -139 -435 -447 26 14 -268 -329 6 118 43
3071D3j01J82J76q4j5P6R7q0j48O1J99j01l01p6L60J1l58j18L54R2l52k24K73
3094c4J32l05j97N18K57l37k20L27L92k67l89J65L86R2l70j58K75K66k62j95J60
3115B36J35k59l97J31L49k08m15K07N73j74o27O7K95k4l64l0L18J79k33j24K61
3136a04kj62l7J05Q1j13j06O6K87k3k78L2K36N7k66j46K85Q9k46l3M44J56l76
3159e4k6L77R2l41r8L14J76o6k05J92J27q8j53R4J05r8j62j09J60K5k72j44K64
3182A10J81l29l08J23J60k09k70J89K95o5k10J47J96j85n4K40J59k5j77R4N8J9
3204A39O2L5N9o5p5N3o2q1j81l4J93R2j61k72J93J45k29l02N1K96m1k11J96L05
3228A05j32k59K41K73k16k10M9K96J2l11l8J06K39j61j56Q0Q0j36j87j8K27P6
$$ plain form
3071 43 -58 124 300 216 201 277 374 294 146 207 406 305 4 -72 288 299 -59 -177 177 269 -83 -307 -34
3094 -34 98 -207 -404 114 371 34 -186 141 533 266 -123 42 428 520 150 -8 267 533 271 76 236
3115 236 371 112 -285 -154 195 -13 -428 -221 352 178 -449 -382 -87 -111 -475 -505 -187 -8 -241 -365 -104
3136 -104 -106 -268 -305 -200 -119 -232 -338 -272 15 -8 -286 -254 -18 39 -227 -373 -88 1 -245 -278 166 322 -54
3159 -54 -80 297 389 48 -50 264 440 374 169 361 488 400 247 341 446 348 186 77 237 262 -10 -154 110
3182 110 291 -38 -346 -223 -63 -272 -542 -353 -58 -123 -333 -186 10 -175 -229 11 170 145 -32 62 120 139
3204 139 201 236 295 230 155 208 146 65 -116 -150 43 135 -26 -298 -105 40 -189 -491 -440 -144 -185 -396 -200 105
3228 105 -27 -286 -45 228 12 -198 -149 147 159 -152 -190 -84 155 -6 -162 -82 -2 -138 -325 -343 -116 -40
3250d0j42MM32j21l06n8M40P6k76KK86J73k00n0K32P0k47L7J55ol03o8J60J24
3274C74j48k10m2K10o3l42j58J83K03k53j15J65K40k69j79K67J91l37j55L49K27
3295A38j93k29J68L16q5l09J66J91j08j77O5K3Q4j82m7K21J20j90l03QL94q1k94
3318c04oL21P7k79K0K93j13j57l8M30j41k72J16J95J0j94l3K07J08k02q5N6O1
3341G0K2q9O6J04J2j18L9J10l0k38q6L31J14k50q7J49J83k70p1K24N8k57q6K08
3365A08R1k77p8J32Q2p6j08n0Q9J1j07kO9R8m7n6J16j6j28pJ19O8j94j05K45J61
3391A38k39j71K27J85j59r5N2P2j15n5J55R0o8r9L1J10L3q6j19J05J49j07r2q7
3415a45K17l1j19K6J11j22j27P2J95j26j92J27K36m4k46J31J69J24k30J40P9j1
$$ plain form
3250 -40 -182 -178 254 133 -173 -231 209 285 9 11 297 470 270 220 452 522 275 312 467 461 158 90 250 374
3274 374 226 16 -26 184 121 -221 -379 -196 7 -246 -361 -196 44 -225 -404 -137 54 -283 -438 -89 138
3295 138 -55 -284 -116 200 115 -194 -28 163 55 -122 -57 -34 50 -132 -179 42 162 -28 -331 -323 71 -10 -304
3318 -304 -310 11 88 -191 -171 122 9 -148 -186 244 103 -169 -53 142 152 -42 -75 132 240 38 -47 9 70
3341 70 92 3 69 173 185 67 106 216 186 -52 -138 193 307 57 -30 119 302 32 -39 185 243 -14 -100 108
3365 108 199 -78 -156 -24 58 -18 -126 -176 -87 -76 -183 -185 -116 -18 -65 -121 -5 -21 -149 -156 -37 31 -163 -268 -23 138
3391 138 -101 -272 -45 140 -19 -114 -62 10 -105 -160 -5 85 17 -82 -51 59 92 6 -113 -8 141 34 -58 -145
3415 -145 72 41 -78 -52 59 -63 -190 -118 77 -49 -241 -114 122 78 -168 -37 132 256 26 166 245 234
3437B34l4l8O0J40j40j44N8N8n7l10J11J83n0k10n1K20k9k31m6K25o6k02J3K98
3461hN0k67k7K83J61k35q5J67J20o6j20J27J30nk71o3R4O8k27o1K12J11k45k22
3485c79L27K12k00k18J89J67j59p0J16J43l9n9J19J02j33j68O6J85J0j61Ol1J10
3508A35o6j37N2Q1Qj40O8O6m7j71J55K41j15k01N5L07n5k52O4K44l9j84K7Q6j05
3533G7k41R8K29M1j99j83P8J32o9j83n6K12J39k53q6J56J16r1n7J36M3j94K0J44
3557IM8j17k1J91j6j22l1Q7Mq6P2M2r3r0O1Q8Rn9n3N2J01K0j22p3J88P3j24j48
3585a10J26M6j35q1K43M8k72q6L37J6k15j43K30K21j56k84R9K04k4j12K9R7k0
3608E8m4j61K1K40k4j68R4J79q1l40J28K21K3j51MO7m2n5P4J70j37j62J99P9k25
$$ plain form
3437 234 200 162 222 362 222 78 136 194 137 -173 -62 121 71 -139 -190 30 1 -230 -276 -51 -117 -319 -306 -8
3461 -8 42 -225 -252 31 192 -43 -128 39 159 93 -27 100 230 225 -46 -109 -15 53 -174 -235 -23 88 -157 -379
3485 -379 -52 160 -40 -258 -69 98 -61 -131 -15 128 89 30 149 251 118 -50 16 201 211 50 56 25 135
3508 135 69 -68 -16 65 73 -67 1 67 20 -151 4 245 130 -71 -16 291 236 -16 48 292 253 69 96 182 77
3533 77 -164 -66 163 204 5 -178 -100 32 -37 -220 -276 -64 75 -178 -264 -108 8 -83 -140 -4 39 -155 -135 9
3557 9 57 -60 -81 110 94 -28 -59 28 32 -54 18 60 -33 -123 -62 26 35 -24 -77 -25 76 96 -26 -99 89 162 38 -110
3585 -110 16 62 -73 -154 89 137 -135 -221 116 132 -83 -226 4 225 69 -215 -116 88 64 -48 -19 78 58
3608 58 14 -147 -126 114 90 -78 16 195 114 -226 -98 123 146 -5 -1 66 24 -31 43 213 76 -86 113 192 -33
3633c3r4Q5K31r4j67M5l0rq9RQ4N2o0q5L4R8r3j83R8K72Nm00JL53nk11l5L17K3
3662A19k65j9J51N6q8p0K80J03j75j84Q3J29R7j50nQ4J26p9j77P0J49j13j20J13
3686A15J45k81L4N9Q7j11j34Q2L7j70o7R7M9j16m1J21Q1j96p6J92J11n3r2J0J14
3711cP7j23o8J29J91r1k28O6K06j50j89K18K50j67j85M7K74r6k51j2K45J03j58
3734H5j02m4R1NNr4K5OpqJ6m5l1J8O6L7k06j5J06Q7l9m4M0J2j56J41J35k7j13
3763e6O5J76m9j24K5J43qk1r7J23k7l1r7P6M7o0j54J3J77lk45l7L03R6l05k30
3789c00J91J30j45j20R4K04j71n7Q0J23j41k2M0P2m1r9M1M9R2M9l4N1l1lr1L1
3815hM6q9R4J42Q2j99q1J09J66j75j78Q9J68j11k31J93J50r2j74M0J02m9k18q
$$ plain form
3633 -33 -127 -42 189 95 -72 -27 -57 -66 -155 -146 -62 -10 -70 -155 -121 -23 -116 -299 -201 71 76 -324 -323 30 25 -186 -221 96 119
3662 119 -146 -165 -14 42 -46 -116 164 267 92 -92 -9 120 217 67 62 146 272 193 16 86 235 122 2 115
3686 115 260 -21 13 72 159 48 -86 -4 33 -137 -204 -107 -58 -174 -215 -94 -13 -209 -285 -93 18 -35 -127 -117 -3
3711 -3 74 -49 -117 12 203 112 -116 -50 156 6 -183 35 285 118 -67 -20 254 158 -93 -105 140 243 85
3734 85 -17 -61 30 35 40 -54 -29 -23 -30 -38 -22 -67 -98 -80 -14 23 -183 -198 -92 -5 -44 -88 -48 -36 -192 -51 84 57 -56
3763 -56 9 185 136 12 37 180 172 151 54 177 150 119 22 98 145 85 -69 -56 121 118 -127 -164 139 235 -70 -300
3789 -300 -109 21 -124 -244 -150 54 -117 -174 -94 29 -112 -134 -94 -22 -63 -162 -121 -72 20 69 35 86 55 52 -39 -8
3815 -8 38 -51 43 185 267 68 -13 96 262 87 -91 -2 166 55 -176 17 167 75 -99 -59 43 -6 -224 -232
3839b32K48J24j48j53Q8J49j9k19K1J80N1j49p3K35Oj63K5J41M3k44p7K57L3j71
3863d7pJ29M1n8o8R7m4p6J01qn6q9N1L6J02m6j05p1J82Qk24k3J90R0j80j48J96
3890b7Q2k02m7K04Q4k17j33K21R0j74j17K03P5J21j83jQ8L3J2q2K1K41r0j10M3
3915A35O6o3j96J9J74m8j20l2J10l1j36Q8J85j10j69J61l8n6j19J15Q9M2q7M2
3939B1o7k4Q8k6k5N8Mj9pK0k7p4O2J19j40j60L1K54l0k66%K78N0j56P9O1r5n3
3967d4J00Q9L5m4q6J55K1o3j66j3Q7M6p9j21N1J57j51r0Q9l1j06r8J81J03k26
3992b04rJ42M6q0J4N9J33r2m4J46j5n9N7Q4J5n5o2j5R9n8j20mQ7Q8j37k33J25
4019i2J67j21r6M2Q0j22j17J37J19k0j48J20J83l8j39o9J22J24j25l8o0K18rj73
$$ plain form
3839 -232 16 140 -8 -161 -73 76 57 -162 -141 39 90 -59 -132 103 109 -54 -29 112 155 -89 -166 91 124 -47
3863 -47 -54 75 116 58 -10 87 43 -33 68 60 4 -85 -34 2 104 58 -47 -118 64 72 -152 -175 15 105 -75 -223 -27
3890 -27 55 -147 -194 10 94 -123 -256 -35 55 -119 -236 -33 42 163 -20 -21 67 100 112 30 51 292 202 92 135
3915 135 201 138 -58 -39 135 87 -33 -65 45 14 -122 -34 151 41 -128 33 -5 -61 -180 -65 24 66 -21 21
3939 21 -46 -70 18 -8 -33 25 29 10 3 23 -4 -78 -16 103 -37 -197 -166 88 58 -208 -208 70 120 -36 43 104 9 -44
3967 -44 56 145 180 136 50 205 226 163 -3 -16 71 117 38 -83 -32 125 -26 -116 -27 -58 -164 -262 -81 22 -204
3992 -204 -213 -71 -25 -105 -91 -32 101 9 -35 111 96 37 94 178 193 138 76 61 160 102 -18 -22 65 153 16 -217 -92
4019 -92 75 -46 -142 -100 -20 -142 -259 -122 -3 -23 -171 -51 132 94 -45 -114 8 132 7 -31 -91 127 118 -55
4043e5P4P1n2j43RO1J0j20QJ37R2j51l3J08M0j19m9J32K6j29Q2J39l4q1r9K40
4069A64r4l5r8R8P4n7%p0O0J5m8p7Q3K7j16l2O7J27j93r5J24J99j06m1N2J23j53
4096bk7JQ1o5J2L1J8p2j22O5Q5k1k1p8j0J26l8k2l0O4l1q3JJ03n3l6J03J21k5
4125G5j68J46Q3j29l5j5O7K0q7Q8j1p6K7M8l8K3j54K8R0Q2l0j20M7J19n3j66L0
4152a09K05K8j83QJ71pj53M9K03j11j31n5J67J7j21J2L2P4n9K3n1M5K5J6j27L8
4178FJ0j3o6N9N0p2l7M9J02l6j44J05j9k4k4J27j3j63L8R2k0j27o6J56J40r1j32
4205a13L7J08mk0LM3j7l3r0J55P9q8j25J33J43k11q6Q8J24n3j48J03J01l3j54
4230e8J01R8k2j25oP9mj51MQ8J71j34j14R3Q2K3o4j50K00k7j08jP6L0q1N7J02
$$ plain form
4043 -55 19 90 38 -105 -96 -35 -25 -145 -137 0 92 -59 -92 16 56 -63 -112 20 46 -83 -1 138 104 23 -76 164
4069 164 70 35 -63 35 109 52 52 -18 42 57 9 -68 15 42 -74 -106 -39 88 -105 -200 -76 123 17 -24 28 151 -2
4096 -2 -29 -28 53 -12 0 31 49 -23 -145 -80 5 -16 -37 -115 -125 1 -37 -59 -89 -25 -56 -139 -138 -35 -88 -124 -21 100 75
4125 75 -93 53 136 7 -28 -43 24 44 -43 45 34 -42 -15 33 -5 18 -136 -108 -18 64 34 -86 -39 80 27 -139 -109
4152 -109 96 124 -59 -51 120 113 -40 9 212 101 -30 -85 82 99 -22 -10 22 96 37 60 9 54 79 95 -32 6
4178 6 16 3 -63 -4 46 -26 -63 -14 88 52 -92 13 -6 -30 -54 73 60 -103 -65 27 7 -120 -186 -30 110 19 -113
4205 -113 -76 32 28 8 11 54 37 4 -86 69 148 60 -65 68 211 0 -86 2 126 73 -75 28 129 96 -58
4230 -58 43 141 119 -6 -12 67 63 -88 -84 4 175 41 -73 20 102 125 61 -89 111 84 -24 -25 51 81 0 57 159
4257A59l5j65J4Q2R5j51q0J74n1p8Q1Roj22K8N8J04m6j34k7J35O8j89nj6J22o5
4284d1j72J63J01k4r9O8M6j36r6J19R7j57lR7L7j3p8Q2L0O2r8O4j15J1P0q2J34
4311F7m2o9N0K5K7n4j04J37P0n8j29Q5J00j73m8K10l0o9p6P2J32o5j72N5J04O
4337E1j00k7Q7j2L3k9J9N6qr2M3J52r2j34J8J52r7j3r8J58K3j20k2Q0l5j12J48
4364B9m6p5o9M1P6K8j54PJ48o3J9k5M9l5QKm1J05l2j17R2R9K2r4p6J41M3j50m5
4393a13J84P8o8j66J00N4j17p3J37l3Q0j11Q4N3J1l6k8jJ70j32m2MJ58k1k11P1
4419C2M0j4j49J05R6r8o1O2J16j22j60J15N5k9Lq7Q8m3KNP2M0o6k7j1R4n5j23
4447a20J27R4L5k59j6J20Q0j43k8J07n3l7n7J23L9j19l9J54J1K0j11P4l2O2j2
$$ plain form
4257 159 124 -41 -27 55 150 -1 -81 93 42 -36 45 54 48 -74 -46 12 116 70 -64 -91 44 112 -77 -82 -98 24 -41
4284 -41 -213 -50 51 27 -72 -4 42 -94 -190 -71 26 -131 -134 -37 0 -13 -91 -9 21 83 -15 49 -66 -55 15 -67 67
4311 67 25 -44 6 31 58 4 -100 37 107 49 -80 5 105 -68 -116 94 64 -5 -81 -9 123 58 -114 -59 45 51
4337 51 -49 -76 11 -1 32 3 22 78 70 -22 21 173 81 -53 -35 117 20 7 -91 67 90 -30 -52 28 -7 -119 29
4364 29 -17 -92 -161 -120 -44 -16 -170 -163 -15 -78 -59 -84 -35 -70 -62 -60 -101 4 -28 -145 -53 46 68 -26 -102 39 82 -68 -113
4393 -113 71 149 81 -85 15 69 -48 -121 16 -17 63 -48 36 89 100 64 36 35 205 73 31 35 193 172 -39 32
4419 32 72 58 -91 14 110 12 -49 13 129 7 -153 -38 17 -12 -9 -96 -8 -51 -49 -44 28 68 2 -25 -36 58 3 -120
4447 -120 7 101 136 -123 -139 -19 61 -82 -110 -3 -56 -93 -150 -27 12 -107 -146 8 19 39 -72 2 -30 32 20
4472B0r1Q9Rj1r3K8J39j8l6Q0k9r5j28J36O4k1q4L0k8K1j8J33q4l8M6M7m0r3J8
4501d7J31O8p7mJ03rm0p4K5K0K4j06J3Qj3m5q4J12L5o1j44J20R5j32q0J16K7k6
4529d5j20R9K2N5q1K2P7p7m7L5N3j6K5p7J15o9J2j0o3Q7j7m2rR8p7m8P1J28j03
4558bj05M8J86p4j95J01J90%j13p6J38Nlp3M0lo7J1J0J14r0n0l8J68m5j12p8O2
4586e1J05k9j05R9N0j02j5J02L1l7r0P5J16j30k6MQ5J3o0n8mJ3M1m7K8J7n7Jm0
4615g1K7l9p7O9J33r7m9N7L1k1p8Q4N3j09m8J7J70j09o9Q3L4j8o6l4k2J58j2n5
4643e8j5P4Lj37J68n4Q5l0nJ15r0o5P1Q1ol7k6J07j43j5R6n4M3l9O9k7j13N1n1
4672bN1j05J32J6r0J5K1q3lQ5K6q2p1J13m0o5M5O1O2r4l7J09l0j45L6J40q0J3
$$ plain form
4472 20 -71 18 27 16 -77 -49 90 72 36 116 87 -8 -136 0 64 43 -41 -11 -39 -18 -36 97 13 -25 21 68 28 -65 -47
4501 -47 84 152 75 71 174 165 125 51 76 96 120 14 27 35 22 -23 -107 5 40 -21 -165 -45 50 -82 -162 -46 -19 -45
4529 -45 -165 -66 -44 11 -70 -48 29 -48 -95 -60 -7 -23 2 -75 40 -29 -17 -27 -90 -3 -20 -62 -71 27 -50 -98 -27 101 -2
4558 -2 -107 -59 127 53 -142 -41 149 149 36 -40 98 103 100 27 67 64 -3 8 18 132 42 -8 -46 122 77 -35 -113 -51
4586 -51 54 25 -80 19 69 -33 -48 54 85 48 -42 33 149 19 -7 -3 82 95 35 -23 -27 -14 27 -20 8 25 -32 -31 -71
4615 -71 -44 -83 -160 -91 42 -55 -104 -47 -16 -37 -115 -31 22 -87 -135 -118 52 -57 -126 -43 -9 -27 -93 -127 -149 9 -3 -58
4643 -58 -73 1 4 -133 35 -19 66 36 31 146 56 -9 62 143 137 100 74 181 38 23 119 65 108 69 138 111 -2 49 -2
4672 -2 49 -56 76 92 2 17 38 -45 -48 37 63 -19 -90 23 -17 -82 -37 24 86 -8 -45 64 34 -111 -75 65 -15 -2
4700bp2J4Q1p2L6M5qjj32M1L9N6r0j5M7J32j46n0N8J00p7p5L9P7o2k6M9J28j25
4729a1r3O5R4q9p0J30O2m8j50J03K2N1lm0J2M8o5RJ6J41q5j14P8J28r9p2p6J31
4757G5J6o1K4Q3K3j86N8M3j6n8l4L7Q2p4n5N5J3L5q6Kk8O9j01J0M9k7m8L6J02
4786C8K3j86J9O3J4j37oJ30K4jr5QJ15o9M3jJ2L7j56J17k7K1o7M7pN8lq5O0R6
4816H5p9k2JN9o8q7J44N0p7j05J03P9m6o9N5O2l5k5l3Q0j5o2J8L7m6j0M1k4N2
4845F3k6o7M6N0Lp0k3J6M8K9n4L3J2o5M7N1n4j25M8M5K3j41N4j1J0N8j87J33J7
4874c7j32J07n5J25o2o4j8Q7j0po2P2K1ml2O1J35j89J0Q5k9j4M6L6m7k5p5P1J45
4903A39j11k5N1l7m7M9j3L6O7p5J7L2K7j6o3J24k0j19L8P7mk4l5kP8q7m0P3Kn0
$$ plain form
4700 -2 -74 -60 21 -51 -15 30 22 21 -111 -70 -31 25 -65 -80 -33 99 -47 -97 -39 61 -16 -91 -52 25 -37 -63 -14 114 -11
4729 -11 -104 -39 55 -34 -104 26 88 40 -110 -7 15 66 63 23 35 83 18 27 43 184 99 -15 63 191 92 20 -56 75
4757 75 91 30 54 137 160 -26 32 75 59 1 -33 4 86 12 -43 12 25 60 -26 -24 -52 17 -84 -74 -25 -52 -100 -64 38
4786 38 61 -125 -106 -43 -29 -166 -172 -42 -18 -19 -114 -106 9 -60 -17 -18 -6 31 -125 -8 -35 -14 -81 -34 -41 17 14 -71 -11 85
4816 85 6 -16 -15 44 -24 -111 33 83 6 -99 4 83 37 -32 23 85 50 25 -8 72 57 -5 13 50 4 -6 35 11 63
4845 63 37 -30 16 66 69 -1 -24 -8 40 69 15 48 60 -5 42 93 39 -86 -38 7 30 -111 -57 -68 -58 0 -187 -54 -37
4874 -37 -169 -62 -117 8 -54 -118 -136 -49 -59 -66 -128 -56 -35 -39 -71 -10 125 -64 -54 31 2 -12 34 70 23 -2 -77 -6 139
4903 139 28 3 54 17 -30 19 6 42 109 34 51 83 110 94 31 155 135 16 54 131 127 103 68 66 144 57 17 90 92 42
4933D2l1K5k6J4l2LN8n7L3l8l6P0%q1N3O2lp7K2N5j3j47P9P8r7l5lJ21jj84pO4
4965h9O1o2J3J8l8k0jJ42k1rn4l2Q4L0o6n6J79O0j34m7Q0N2o7oJ04p7j1k3%L2
4995D2j7J9o0R3o9m3K6O9p4J07k1n9M8kn5K8M8q7l0P6M6K3j65J36M0q8l7L9K0
5024E3q8J2kPj6n8%Q0j13L0n6J12l6k2Q1m5j2K9J3K9nl5j6k1L4J6j02J08O1o0
5054b2j16M5P7l2j4J00M3j42j2OO9n0KJ3N8l3o8O6L9k5Rm5O6J04k5p6k2Q3om6
5084D6j9J3j1n7k7K60j42j3o5O9M2j41M7N1NPm6O1k8p0nM4M1l6j8P7l7K1o6p2
5114f9Q2J03k15k6R0L9o1p7J04N4o0p0J6J04l9j03P2O3nq0pM2N6n8n1J00l8n3
5142h7J35k9nl1o6L4jJ06j13J3K7O0r9L1K8jj9P9l1k1J8KM7r4J09m2K9nmn5K1
$$ plain form
4933 42 11 36 10 24 -8 -5 53 -4 29 -9 -45 25 25 -56 -3 59 56 -21 1 56 43 -104 -25 53 -44 -79 -82 39 38 -146 -153 -89
4965 -89 -28 -90 -77 -59 -97 -117 -118 24 3 -6 -60 -92 -8 22 -44 -100 79 139 5 -42 38 90 23 17 121 44 33 10 10 42
4995 42 25 44 -16 77 8 -35 -9 60 -14 93 72 13 61 59 4 32 80 -7 -37 39 85 108 -57 79 119 31 -6 33 53
5024 53 -35 -23 -25 -18 -34 -92 -92 -12 -125 -95 -151 -39 -75 -97 -16 -61 -73 -44 -31 -2 -7 -42 -58 -79 -45 -29 -131 -23 38 -22
5054 -22 -138 -93 -16 -48 -62 38 81 -61 -73 -67 2 -48 -46 -33 25 -8 -76 -10 29 4 13 -32 34 138 113 37 15 98 92 46
5084 46 27 40 29 -28 -55 205 63 50 -15 54 96 -45 2 53 58 65 19 80 52 -18 -23 21 62 26 8 85 48 69 3 -69
5114 -69 13 116 -99 -125 -35 4 -57 -134 -30 24 -36 -106 -90 14 -25 -128 -56 7 2 -78 -85 -43 13 -45 -96 4 -34 -87
5142 -87 48 19 14 -17 -83 -49 -50 56 -57 -44 -17 43 -56 -25 3 2 -17 62 31 10 28 30 77 -17 92 50 79 74 70 15 36
5173C6O1j7lj1M0l4p8L1O0nq5M5M3Kj41Q9P1n1j3k6M0m4l3k6M4m1jjM4n7km8N3
5206e8j1P2l2k8m7N6l8JJ1K5JK1j5J4Pp9J18jo3K9KM1o1N2J4n7j2KP2j05pN5N9
5239C8p8j4M0nM3l0M1j12Q2N8N2j12L8R1j9o7k3L6Qo1P9J8k6k0j7pO8q0L5J16
5269A72o6m7J6k1n6J1k1J6O4m4k8J6qJ9j3J2k1Pn8J8P6p1r8J02Nj7j12Q2MN1j11
5300a21O9OK1k9m2p3J39qj0lk9K1N7l4O1K1n8n8K8J67o6k4k8O8j4l8N1L4q8oM2
5331E6k8J1K1o1J0L3M6r0N8JM6n2j01J26n7M8J2K1q3N8K6K8n4o3N5k3k8J4q6O4
5361HK7m2P6q3K4j10J01M7o2Kj7jl6M5N0p1j3O7n3r0J15j9Lk1j5P1l4L1j4n8J5
5392e7j4k3J01j35R2J9m0PM3r0jP1RoR3o5N6p3Q3j7m8qQ4n0K4L2j9N1o0l9R9k8
$$ plain form
5173 36 97 80 77 66 106 72 -6 25 85 80 -5 40 83 85 -56 33 104 53 40 14 54 10 -23 -49 -5 -46 -47 -48 -4 -61 -63 -111 -58
5206 -58 -69 3 -29 -57 -104 -48 -86 -85 -74 -49 -48 -27 -42 -28 -21 -100 18 17 -46 -17 -15 26 -35 17 31 -26 -38 -36 36 -69 -76 -21 38
5239 38 -40 -54 -14 -19 24 -6 35 -77 5 63 115 3 41 132 113 46 23 59 67 6 85 103 77 57 40 33 101 21 56 172
5269 172 106 59 75 54 -2 9 -12 4 68 24 -4 12 4 23 10 22 1 8 -50 -32 44 -27 -125 -23 -18 -35 -147 -65 -61 -10 -121
5300 -121 -52 -46 -25 -54 -96 -169 -30 -38 -48 -51 -80 -59 -2 -36 25 46 -12 -70 -42 125 59 35 7 75 61 23 74 108 20 14 56
5331 56 28 39 60 -1 9 42 88 -2 56 57 103 51 -50 76 19 67 79 100 17 75 101 129 75 12 67 44 16 30 -56 8
5361 8 35 -7 69 -14 10 -100 1 48 -14 -12 -29 -30 -66 -21 29 -42 -55 12 -41 -131 -16 -35 -32 -53 -68 3 -31 0 -14 -72 -57
5392 -57 -71 -94 7 -128 -36 -17 -57 -50 -7 -97 -98 -27 -18 -24 69 4 60 -13 70 53 5 -3 81 31 55 87 68 119 59 20 119 91
5424I1o8J6M6K4l7k8N6m6m2J3mL3qm5l1N8l4M7l5M5Rnp6O5N4j68J1Q8J0jj37O0
5456c9L7l6k1M1K3q0j1qM6m0lPP8k8m2POK5l8Jj8K8M0m3k7O3J3m1kQ2l9m8J2M0
5490a5j6o7N2L7J3l3J3k2R6L6q0M8q3R6J6Mk0jj7n4N8N7q1KK7Qk6J1M7j6l4J4
5522G0JRk3p0k7M1j0qJ1j0m2Q8j01J16n4l2O9j01Q2q6M4n2N3j7j0RK4n7J2j2N4
5553b9J2n3jOL4Oon1K1L5K1rk9jj3N1K8l5o0L5j5pR5OL0o2J4o9R1K9r1K4L5NJ0
5588E7p2K8pK1lJ09q0m4m4J41j02J4K4J08j00J8l8Qm4M9Q4j31P1K2p6KM5J1p5
5617dl1Q9k2r2pJ09l3j8p6L0K4k7jJ7K9Kq5N2N2o5J1j9M8M8j18K1PM9l8o9P8n1
5649i0N8k4k3P4no4MP8n4j2M7j3N5oj1q2N5P5K7l5l5j2K3j6j8M4jr3J40k0n3k9
$$ plain form
5424 91 23 39 85 109 72 44 100 54 12 25 21 54 46 1 -30 28 -6 41 6 51 60 55 -21 44 98 -70 -59 29 39 38 -99 -39
5456 -39 -2 -38 -59 -18 5 -75 -86 -94 -48 -88 -91 -84 -6 -34 -76 -69 -63 -38 -76 -75 -93 -65 -25 -68 -95 -32 -19 -60 -62 20 -19 -67 -55 -15
5490 -15 -31 -98 -46 -9 4 -29 -16 -38 58 94 14 62 -21 75 91 95 75 74 57 3 61 118 37 39 66 74 48 59 106 90 56 70
5522 70 71 80 57 -13 -40 1 -9 -17 -6 -16 -58 30 -71 45 -9 -41 28 -73 9 -77 -33 -85 -32 -49 -59 -50 -26 -83 -71 -83 -29
5553 -29 -17 -70 -71 -65 -31 -25 -31 -82 -61 -26 -5 -14 -43 -44 -57 -6 22 -13 -73 -38 -53 -60 35 41 71 9 23 -46 45 74 -17 7 42 47 57
5588 57 -15 13 6 27 24 133 53 9 -35 106 4 18 42 150 50 68 30 38 -6 43 127 -4 67 89 13 15 60 71 -4
5617 -4 -35 54 32 -60 -67 42 9 -9 -85 -55 -31 -58 -59 -42 -13 -11 -96 -44 8 -57 -46 -65 -17 31 -87 -66 -59 -10 -48 -117 -39 -90
5649 -90 -32 -56 -79 -5 -10 -74 -70 8 -46 -58 -11 -24 31 25 14 -68 -13 62 89 54 19 7 30 14 -4 40 39 -54 86 66 13 -16
5681a6Q1J1n6lP1k8Q6l9m8J1j3MM7l6p4LPN3K6m4M2q8K7K3j53O7L7j28Q0Mrn9
5713a14nM7L2o8j6Q7k0L9r3Q0o0K8L3qM3r5N8mJ02j11p9K9N3n5QJK0M2j7jO2j1
5745Gp6M8j3M1J2j6LP9n8j3L4%K4jjL5r6L4L5l8m6L5KM0j3lo7M0l8J7P7n4J3K1
5779F4l3j4M6K8n0K4K3k2j10N4O8l1o9K2jNk6m1J20j08K6o0N8l5m3k7M8L9p1N6
5809f0m4K2%O1j11J04l4N4l3L3J7l7OJJ5nn0L9Q8p9J7J5kl6O2l2k5L4j5m6Q7j20
5841g4O0oP8M4m5k5j0R7o6J0qJ08p9j2K0j1o6MO8J1l1j16J22p7L1Jj6o1O5K3j0
5872B9n1L5k2k9j1K8l0L5k5JN6n7jJ1P6q2nj1k3LN9k0l5mk7Q0m9l1K9K7n8R6k3
5905b9m6Lj4P6j23P4L3K4K3M1q4M6NPN4j12j4R6k0k6nJ09n9m1R0r7O2o6N3j4k2
$$ plain form
5681 -16 65 76 20 17 88 60 146 107 59 70 57 61 108 72 -2 1 8 61 87 43 85 -3 24 47 -106 -39 -2 -130 -50 -46 -55 -114
5713 -114 -119 -72 -40 -108 -124 -37 -57 -18 -111 -31 -91 -63 -30 -38 5 -90 -32 -36 66 -45 -124 -95 -42 -97 -89 -88 -68 -26 -43 -44 18 7
5745 7 -69 -21 -34 7 19 3 6 85 27 14 48 48 72 71 70 105 9 43 78 40 -6 29 31 71 58 55 -12 28 -10 7 84 30 43 64
5779 64 31 17 63 91 41 65 88 66 -44 10 78 47 -22 0 -1 4 -22 -63 57 -51 -25 -85 -27 -62 -105 -132 -84 -45 -116 -60
5809 -60 -104 -82 -82 -21 -132 -28 -62 -8 -41 -8 9 -28 -22 -21 -6 -11 -61 -22 66 -13 4 19 17 -19 43 11 -14 20 5 -41 46 -74
5841 -74 -14 -20 58 102 57 32 22 119 53 63 55 163 84 72 92 81 15 19 87 98 67 -49 73 -4 27 28 12 -49 16 39 29
5872 29 -22 13 -9 -38 -49 -21 -51 -16 -41 -40 16 -41 -42 -31 45 -37 -42 -53 -76 -73 -14 -34 -69 -73 -100 -20 -69 -100 -71 -44 -102 -6 -29
5905 -29 -75 -72 -86 -10 -133 -59 -26 -2 21 62 -22 24 29 36 90 -22 -36 60 40 14 9 118 59 18 108 11 73 7 60 46 24
5936B4j6j3N5j2j9O1L4j44Q4Nk5Rj3L3m5L0N7r8J7qN2J2q4m5J28j07L5Kk6Pr7
5967a07M4J8l2J6J7l1L2k4K5Ko4J11o2m1J25q3l5KK9j2L4k1NN8j05L4M9k0J4K3
5997AK6p9rL5M1l2j5K8K7M1J1n1K8Kp3Q0J3l8J4j5k5L2O0r5kJ7N6p2J4RO2r4j3
6030a6R9o3lK9m5LK8k2J3l6QM8j17O3M6qq0l3R4m1L0n7L8m3K1L1Mm0k5P1j22J32
$$ plain form
5936 24 8 -5 50 38 19 80 114 -30 54 59 34 43 30 63 18 48 105 7 24 16 68 80 -4 -49 79 -28 7 9 -17 -10 -107
5967 -107 -63 -45 -77 -61 -44 -75 -43 -67 -42 -40 -104 7 -55 -96 29 -54 -89 -87 -58 -70 -36 -57 -52 6 -99 -65 -16 -36 -22 1
5997 1 27 -52 -61 -26 15 -17 -32 -4 23 64 75 24 52 54 -19 61 74 36 50 35 10 42 102 7 5 22 78 6 20 29 91 -3 -16
6030 -16 83 20 17 46 1 4 32 10 23 -13 -5 43 -74 -11 35 27 -53 -86 8 -33 -3 -60 -22 -65 -44 -13 -9 -49 -74 -3 -125 7
$$ [...]
8191h
##END NTUPLES=NMR FID
##END=
