##TITLE=1H_BAU-j-5.02N
 CDCl3, 8 sc, 
 5.2.2019
##JCAMPDX= 6.0         $$ Bruker NMR JCAMP-DX V2.0
##DATA TYPE= NMR FID
##DATA CLASS= NTUPLES
##ORIGIN= UXNMR, Bruker Analytische Messtechnik GmbH
##OWNER= root
$$ XWIN-NMR		Version 3.5
$$ Tue Feb  5 14:16:36 2019 Russian Standard Time (UT+4h)  she@DPX200
##.OBSERVE FREQUENCY= 200.1313
##.OBSERVE NUCLEUS= ^1H
##.DELAY= (6, 6)
##.ACQUISITION MODE= SIMULTANEOUS
##.ACQUISITION SCHEME= undefined
##.AVERAGES= 8
##.DIGITISER RES= 18
##SPECTROMETER/DATA SYSTEM= spect
##.PULSE SEQUENCE= zg30
##.SOLVENT NAME= CDCl3
##.SHIFT REFERENCE= (INTERNAL, CDCl3, 0, 15.7039)
##AUDIT TRAIL= $$ (NUMBER, WHEN, WHO, WHERE, WHAT)
$$ ##TITLE= Audit trail, XWIN-NMR		Version 3.5
$$ ##JCAMPDX= 5.01
$$ ##ORIGIN= Bruker BioSpin GmbH
$$ ##OWNER= she
$$ F:/spectra/data/she/nmr/H-F/1/audita.txt
$$ ##AUDIT TRAIL=  $$ (NUMBER, WHEN, WHO, WHERE, WHAT)
(   1,<2019-02-05 14:15:07.48 +0400>,<she>,<DPX200>,
      <created by zg, POWCHK disabled, PULCHK disabled
       configuration hash MD5:
       00 E9 B6 7A A2 85 ED C7 34 08 36 98 17 FE 4E 26
       data hash MD5: 16K
       D1 01 61 94 CF 44 68 E8 7E D4 D3 4D 43 74 7D 3C>)
$$ ##END=
$$ 
$$ hash MD5
$$ 40 86 A6 BF EF F0 49 16 FE 32 4D E6 AC B1 5A 5B
##$RELAX= 
##$RELAX= 
##$RELAX= 
##$RELAX= 
##$RELAX= 
##$RELAX= 
$$ Bruker specific parameters
$$ --------------------------
##$DU= <F:/spectra>
##$EXPNO= 1
##$NAME= <H-F>
##$PROCNO= 1
##$TYPE= <nmr>
##$USER= <she>
##$AMP= (0..31)
100 100 100 100 100 100 100 100 100 100 100 100 100 100 100 100 100 100 
100 100 100 100 100 100 100 100 100 100 100 100 100 100 
##$AQSEQ= 0
##$AQ_mod= 1
##$AUNM= <au_zg>
##$AUTOPOS= <>
##$BF1= 200.13
##$BF2= 200.13
##$BF3= 200.13
##$BF4= 200.13
##$BF5= 200.13
##$BF6= 200.13
##$BF7= 200.13
##$BF8= 200.13
##$BYTORDA= 1
##$CFDGTYP= 0
##$CFRGTYP= 5
##$CHEMSTR= <none>
##$CNST= (0..31)
1 1 145 1 1 1 1 1 1 1 1 1 1 1 1 1 1 1 1 1 1 1 1 1 1 1 1 1 1 1 1 1 
##$CPDPRG= <>
##$CPDPRG1= <>
##$CPDPRG2= <>
##$CPDPRG3= <>
##$CPDPRG4= <mlev>
##$CPDPRG5= <mlev>
##$CPDPRG6= <mlev>
##$CPDPRG7= <mlev>
##$CPDPRG8= <mlev>
##$CPDPRGB= <>
##$CPDPRGT= <>
##$D= (0..31)
0 1.2 0 0 0 0 0 0 0 0 0 0.03 0 0 0 0 0 0 0 0 0 0 0 0 0 0 0 0 0 0 0 0 
##$DATE= 1549361706
##$DBL= (0..7)
120 120 120 120 120 120 120 120 
##$DBP= (0..7)
150 150 150 150 150 150 150 150 
##$DBP07= 0
##$DBPNAM0= <>
##$DBPNAM1= <>
##$DBPNAM2= <>
##$DBPNAM3= <>
##$DBPNAM4= <>
##$DBPNAM5= <>
##$DBPNAM6= <>
##$DBPNAM7= <>
##$DBPOAL= (0..7)
0.5 0.5 0.5 0.5 0.5 0.5 0.5 0.5 
##$DBPOFFS= (0..7)
0 0 0 0 0 0 0 0 
##$DE= 6
##$DECBNUC= <off>
##$DECIM= 32
##$DECNUC= <off>
##$DECSTAT= 4
##$DIGMOD= 1
##$DIGTYP= 9
##$DL= (0..7)
0 120 120 120 120 120 120 120 
##$DP= (0..7)
150 150 150 150 150 150 150 150 
##$DP07= 0
##$DPNAME0= <>
##$DPNAME1= <>
##$DPNAME2= <>
##$DPNAME3= <>
##$DPNAME4= <>
##$DPNAME5= <>
##$DPNAME6= <>
##$DPNAME7= <>
##$DPOAL= (0..7)
0.5 0.5 0.5 0.5 0.5 0.5 0.5 0.5 
##$DPOFFS= (0..7)
0 0 0 0 0 0 0 0 
##$DQDMODE= 0
##$DR= 18
##$DS= 0
##$DSLIST= <SSSSSSSSSSSSSSS>
##$DSPFIRM= 0
$$ [...]
##$SUBNAM2= <"">
##$SUBNAM3= <"">
##$SUBNAM4= <"">
##$SUBNAM5= <"">
##$SUBNAM6= <"">
##$SUBNAM7= <"">
##$SUBNAM8= <"">
##$SUBNAM9= <"">
##$SW= 20.0189088683792
##$SWIBOX= (0..15)
0 0 2 0 0 0 0 0 0 0 0 0 0 0 0 0 
##$SW_h= 4006.41025641026
##$TD= 16384
##$TD0= 1
##$TE= 0
##$TE2= 300
##$TE3= 300
##$TEG= 300
##$TL= (0..7)
0 120 120 120 120 120 120 120 
##$TP= (0..7)
150 150 150 150 150 150 150 150 
##$TP07= 0
##$TPNAME0= <>
##$TPNAME1= <>
##$TPNAME2= <>
##$TPNAME3= <>
##$TPNAME4= <>
##$TPNAME5= <>
##$TPNAME6= <>
##$TPNAME7= <>
##$TPOAL= (0..7)
0.5 0.5 0.5 0.5 0.5 0.5 0.5 0.5 
##$TPOFFS= (0..7)
0 0 0 0 0 0 0 0 
##$TUNHIN= 0
##$TUNHOUT= 0
##$TUNXOUT= 0
##$USERA1= <user>
##$USERA2= <user>
##$USERA3= <user>
##$USERA4= <user>
##$USERA5= <user>
##$V9= 5
##$VALIST= <valist>
##$VCLIST= <CCCCCCCCCCCCCCC>
##$VD= 0
##$VDLIST= <DDDDDDDDDDDDDDD>
##$VPLIST= <PPPPPPPPPPPPPPP>
##$VTLIST= <TTTTTTTTTTTTTTT>
##$WBST= 1024
##$WBSW= 4
##$XGAIN= (0..3)
0 0 0 0 
##$XL= 0
##$YL= 0
##$YMAX_a= 373034
##$YMIN_a= -360854
##$ZGOPTNS= <>
##$ZL1= 120
##$ZL2= 120
##$ZL3= 120
##$ZL4= 120
##$ABSF1= 10
##$ABSF2= 0
##$ABSG= 5
##$ABSL= 3
##$ALPHA= 0
##$AQORDER= 0
##$ASSFAC= 0
##$ASSFACI= 0
##$ASSFACX= 0
##$ASSWID= 0
##$AUNMP= <proc_1d>
##$AZFE= 0.1
##$AZFW= 0.1
##$BCFW= 1
##$BC_mod= 2
##$BYTORDP= 1
##$COROFFS= 0
##$CY= 11.3945322036743
##$DATMOD= 1
##$DC= 2
##$DFILT= <>
##$DTYPP= 0
##$F1P= 18.9103706918063
##$F2P= -1.10871071338519
##$FCOR= 0.5
##$FTSIZE= 0
##$FT_mod= 4
##$GAMMA= 1
##$GB= 0.15
##$INTBC= 1
##$INTSCL= 1
##$ISEN= 128
##$LB= 0.24
##$LEV0= 0
##$LPBIN= 0
##$MAXI= 10000
##$MC2= 0
##$MEAN= 0
##$ME_mod= 0
##$MI= 1.114404
##$NCOEF= 0
##$NC_proc= 0
##$NLEV= 6
##$NOISF1= 3.799351
##$NOISF2= 2.8
##$NSP= 1
##$NTH_PI= 0
##$NZP= 0
##$OFFSET= 15.70392
##$PC= 1
##$PHC0= -9194.917
##$PHC1= 9.20004
##$PH_mod= 1
##$PKNL= yes
##$PPARMOD= 0
##$PSCAL= 0
##$PSIGN= 0
##$REVERSE= no
##$SF= 200.130013532006
##$SI= 16384
##$SIGF1= 3
##$SIGF2= 2
##$SINO= 400
##$SIOLD= 16384
##$SREGLST= <1H.CDCl3>
##$SSB= 0
##$STSI= 0
##$STSR= 0
##$SW_p= 3612.71676300578
##$SYMM= 0
##$S_DEV= 0
##$TDeff= 0
##$TDoff= 0
##$TI= <>
##$TILT= no
##$TM1= 0
##$TM2= 0
##$TOPLEV= 0
##$USERP1= <user>
##$USERP2= <user>
##$USERP3= <user>
##$USERP4= <user>
##$USERP5= <user>
##$WDW= 1
##$XDIM= 8192
##$YMAX_p= 0
##$YMIN_p= 0
$$ End of Bruker specific parameters
$$ ---------------------------------
##NTUPLES= NMR FID
##VAR_NAME=  TIME,          FID/REAL,        FID/IMAG
##SYMBOL=    X,             R,               I
##VAR_TYPE=  INDEPENDENT,   DEPENDENT,       DEPENDENT
##VAR_FORM=  AFFN,          ASDF,            ASDF
##VAR_DIM=   8192,          8192,            8192
##UNITS=     SECONDS,       ARBITRARY UNITS, ARBITRARY UNITS
##FACTOR=    0.0002496,     1,               1
##FIRST=     0,             0,               0
##LAST=      2.0444736,     0,               0
##MIN=       0,             -360854,         0
##MAX=       2.0444736,     373034,          0
$$ Real data points
##PAGE= N=1
##DATA TABLE= (X++(R..R)), XYDATA
$$ [...]
626c221K68K969J603M64J578n19m175k105K326K557j37k080r35K014J007l220
$$ -3221 -2953 16 1619 2083 3661 3142 -1033 -3138 -812 1745 1608 -472 -1407 607 1614 -1606
642a606j584J911l28N7N166K475n104k677L787P86m322m37L975l35l779J756L252
$$ -1606 -3190 -1279 -1607 -1550 3616 6091 987 -1690 2097 2883 -1439 -1876 2099 1764 -2015 -259 2993
659B993m558l952N248L442m795l47N571j360n983R31L512k035k158L315K217l367
$$ 2993 -1565 -5517 -269 3173 -1622 -1969 3602 2242 -3741 -2810 702 -1333 -3491 -176 2041 -1326
675a326j356M541J810l966p48L210p46k418J749J643k328j794O25M5o87q8J645
$$ -1326 -2682 1859 3669 -297 -1045 2165 1419 -999 750 2393 65 -1729 -1104 -1059 -1746 -1834 -189
692a89K016j82j456P14R29j811j739J174J873Q8p88K49j69k400q10L484J453l135
$$ -189 1827 1645 189 903 1832 21 -1718 -544 1329 1417 629 878 709 -1691 -2501 983 2436 -699
710f99j8L564r63l878N57J261k547q60L431J878k208q38K415k50l172P93M176
$$ -699 -717 2847 1884 -1994 -1437 -176 -2723 -3583 -152 1726 -482 -1320 1095 845 -2327 -1534 2642
727B642qk093J326L03l706j587K353O89r94R62J726n32j688m09J006R5m70J133
$$ 2642 2634 541 1867 2170 -1536 -3123 -770 -81 -1075 -113 1613 1081 -607 -1016 -10 85 -385 748
745G48R28j295j119M05M2l05l0L01P45O89m07R0P07j031j579O86P03r70j42J336
$$ 748 1676 381 -738 -333 -291 -596 -626 -325 420 1109 702 792 1499 468 -1111 -425 278 -692 -834 502
765E02o5j613o15J127N59o07O24J756m82j665R18Q88j695n79J720L2j587J56J296
$$ 502 437 -1176 -1791 -664 -105 -712 -88 1668 1186 -479 439 1327 -368 -947 773 805 -782 -626 670
784F70p2n68o6J52q30o16J062J279m98o06K91p14j157N14J114N01N51K12o40l33
$$ 670 598 30 -36 116 -714 -1330 -268 1011 513 -93 198 -516 -1673 -1159 -45 456 1007 1219 579 246
804B46l22m58L76P41mr5r0o15n48p2K7K79Q1N1Q78M53p55k74M75n84m67R60P25
$$ 246 -76 -534 -158 583 579 484 394 -221 -769 -841 -814 -535 -454 -403 475 928 173 -101 374 -210 -677 283 1008
827A008j50J78mj131r23j07O80P26K52O6j21j071r40M05P36R3N82L70o32l78L07
$$ 1008 858 1036 1032 -99 -1022 -1129 -449 277 529 595 474 -597 -1537 -1132 -396 -303 279 649 17 -361 -54
848e4j57NN05R9q5P4k08O7K92j39m03m08l22K61Q17J0l69O1m37n03M33M73K9M87
$$ -54 -211 -206 299 398 313 387 179 246 538 399 -4 -412 -734 -473 344 354 -15 46 -391 -894 -461 12 41 528
872E28K92m91k80L6L0K29Rj74N7o8m03J25L01l23j19j29n24P4O40L23J5N6m45
$$ 528 820 329 49 85 115 344 353 179 236 168 -235 -110 191 -132 -251 -380 -904 -830 -190 133 148 204 -241
895b41n44J56K17M03Q56M65n09p50n00j9N50M38O5J24m73p17J64P3l79K58M40
$$ -241 -785 -629 -412 -9 847 1312 803 53 -447 -466 84 522 587 711 238 -479 -315 -242 -621 -363 77
916G7k07q9M15J31k53k23j16K36J84J09L70L30m80m17j56m77k80Q13N65k71k24
$$ 77 -130 -219 196 327 74 -149 -265 -29 155 264 634 964 484 67 -89 -566 -846 -33 532 261 37
937C7l62n61m0J25N03O84K12l75k23l17j81O01O34k25l30j9r2L8J5Q6J67j53o68
$$ 37 -325 -886 -926 -801 -298 386 598 223 0 -317 -498 103 737 512 182 163 71 109 124 210 377 224 -444
960d44K9M38o3N2K91m12n66J86M26J25J54J24R7p1l69k2L85k8l18K30k09n50K15
$$ -444 -415 23 -40 12 303 -109 -675 -489 -63 62 216 340 437 366 -3 -25 360 332 14 244 35 -515 -300
983c00M56j94k92O5j74j64K42M59L93j18n34p2n6l81M73Q96N1m07p0l09n78K91
$$ -300 156 -38 -330 -265 -439 -603 -361 98 491 373 -161 -233 -289 -670 -197 699 750 343 273 -36 -614 -323
1005c23P54L44j70m06j09j24n37j12N91J77k86K21J18n24Q6O39Qn18j63N14M95
$$ -323 431 775 605 199 90 -34 -571 -683 -92 85 -201 20 138 -386 -300 339 347 -171 -334 180 675
1026F75j77m70J26k34n82L05P45l35j43O54j55j123j82N91M97r8j45J06k11n93
$$ 675 498 28 154 -80 -662 -357 388 53 -90 564 409 -714 -896 -305 192 94 -51 55 -156 -749
1046g49K07R56j06l99O76L25j002k24P28K37l84j36P5l55o37J18R72p7q09K20
$$ -749 -542 414 308 -91 585 910 -92 -316 412 649 265 129 204 -151 -788 -670 302 225 -584 -364
1066c64N42n66l08Q86M48n67K0M44k48m76N2P90j94r56J66Q73k79p52N01L0q99
$$ -364 178 -388 -696 190 638 71 91 535 287 -189 -137 653 459 -497 -331 542 263 -489 12 42 -857
1087h57N7R24L4o68K38P19k01j015J43J093L42m66M18J06j114m18Q20J43n80K90
$$ -857 -800 124 158 -510 -272 447 246 -769 -626 467 809 343 761 867 -247 -665 155 298 -282 8
1107HO04l43j026k80P60L49k32K39L13n82l55Q82K72q42j37O70K01m14m9K94j39
$$ 8 612 269 -757 -1037 -277 72 -160 79 392 -190 -545 337 609 -233 -370 300 501 87 38 332 193
1128A93n09K0N95l57m63O76M41q63n15O92J98m24K34L83j44m48P5N27k33m91N92
$$ 193 -316 -296 299 -58 -521 155 596 -267 -782 -90 108 -316 -82 301 157 -291 -216 311 78 -413 179
1149A79O87q16p34O18L09l23L27L79o12o67L43N52j54k69K93L56o30p07N20M30
$$ 179 866 50 -684 -66 243 -80 247 626 14 -653 -310 242 88 -181 112 468 -162 -869 -349 81
1169H1k68K88L74m98l22M46K99l39k17K04N33n2n21k1J16l58j77M40k0k59K10
$$ 81 -187 101 475 -23 -345 101 400 61 -156 48 581 529 8 -13 103 -255 -432 8 -12 -271 -61
1190f1L67l12m72m3M38K71j86J81L79k78o50L84K08m13K65O43j99o94k37K41n2
$$ -61 306 -6 -478 -521 -83 188 2 183 562 284 -366 18 226 -187 78 721 522 -172 -409 -168 -220
1211b20k27K81M43m66m86M87L98n95L5Q50j15m40K83L52l96r5J65J7k93k86L62
$$ -220 -447 -166 277 -189 -675 -188 210 -385 -350 500 385 -55 228 580 184 89 254 271 -22 -308 54
1232E4J90n53j65L65ll22K60K68k25j2K30k2OK8J07K88k47m03J75L20k17l1J75
$$ 54 244 -309 -474 -109 -112 -434 -174 94 -131 -143 87 65 71 99 206 494 247 -156 19 339 122 91 266
1255B66j24l76j24N3J07L1R2K58q9n13KN28j58m8N78J33n36r0K38k21k75J95L27
$$ 266 142 -234 -358 -305 -198 -167 -75 183 94 -419 -417 111 -47 -95 483 616 80 -10 228 7 -268 -73 254
1278B54j05l58J13J74l56j95M56J46l58J81M87l44l68K27m2q2J42K92M4j73j41
$$ 254 149 -209 -96 78 -278 -473 -17 129 -229 -48 439 95 -273 -46 -88 -170 -28 264 308 135 -6
1299fm6P3j24J09L89j31k31o6j45p8J36J28m4R3o9j11J26Oj29J84K08k04j90J10
$$ -6 -52 21 -103 6 395 264 33 -33 -178 -256 -120 8 -36 57 -12 -123 3 9 -120 64 272 68 -122 -12
1323a2J16j67O9M8P2j32k63K88P7k63J58J55j99k34K71j8k64J38J65k9l9J25J14
$$ -12 104 -63 6 54 126 -6 -269 19 96 -167 -9 146 -53 -287 -16 -34 -298 -160 5 -24 -63 62 176
1346A76k9j37K6J71j11L6K31p1l94M8q9j05J25K54m3j2j2k50n6O4J43J51R6q9
$$ 176 147 10 36 207 96 132 363 292 -102 -54 -143 -248 -123 131 88 76 64 -186 -242 -178 -35 116 212 123
1370A23o5j34q8J01J91p1J04P9k37q8J41j03k33J63J21j39J9J96j67o1J4N8Q3
$$ 123 58 -76 -164 -63 128 57 161 240 3 -85 56 -47 -280 -117 4 -135 -116 80 -87 -148 -134 -76 7
1393Gm8K05K03j27k29J00k8j65J13K31j32j27K5j49p7P3P7J4L8r5n3KR5M2N1J0
$$ 7 -41 164 367 240 11 111 83 -82 31 262 130 3 28 -121 -198 -125 -48 -34 4 -91 -144 -142 -47 -5 46 56
1419E6j13Q6j10R8J48M7j31k2k9k39P8J57p4m3M1l3j12n9J30R2R1j04P0K0p8J08
$$ 56 -57 29 -81 17 165 212 81 59 30 -209 -131 26 -48 -91 -50 -83 -195 -254 -124 -32 59 -45 25 45 -33 75
1445G5N2r6K2Q6k0n3J58j5j64r6J2p2O5N1O0pr9j45q9O8Q9J65R2j3j12q6q6Q7
$$ 75 127 31 53 139 119 66 224 209 45 -51 -39 -111 -46 5 65 58 -41 -186 -275 -207 -118 47 139 126 14 -72 -158 -71
1473g1J72o3Q5k4j28r4kQ1J4k3O7o9k4KP0kr7L6N6r0N2J81J02n9r1n7oK9J02O1
$$ -71 101 38 123 99 -29 -123 -125 -44 -30 -53 14 -55 -79 -77 -7 -9 -106 -70 -14 -104 -52 129 231 172 81 24 18 47 149 210
1503B10n7j47m1l4p2RJ15K1o8p0M4mQ2R9Rl2o2n3K1O2P0J1K3j39j30m6J64P1O1
$$ 210 153 6 -35 -69 -141 -132 -17 4 -64 -134 -90 -94 -12 87 96 64 2 -51 -30 32 102 113 136 -3 -133 -179 -15 56 117
1532A17L8j81j00o4M3O2M7R6n6n7l3M9J77O2q8J4qrl2j9K2m5j24r7L8K4O9J31
$$ 117 155 -26 -126 -190 -147 -85 -38 58 2 -55 -88 -39 138 200 112 126 118 109 77 58 80 35 -89 -186 -148 -124 -55 76
1560G6%j10o4o4L3J46P7M3n4m5j20n2J10P8O1J1n8j52J17n3L3J6n4n4j15R5K6
$$ 76 76 -34 -98 -162 -129 17 94 137 83 38 -82 -134 -24 54 115 126 68 -84 33 -20 13 29 -25 -79 -194 -99 -73
1587g3J11Qp0m7O7M1K5J02j0K6j62r2m6R7p0J38P3j72j24O5M7J2J34j1mr9n4J4
$$ -73 38 46 -24 -71 -4 37 62 164 154 180 18 -74 -120 -23 -93 45 118 -54 -178 -113 -66 -54 80 69 65 -34 -88 -74
1615g4L6j9P3J1q0j22J55J40oM0K7j76l8L8M7j6n9O1r7q5p3J91O7N3o2M6q0j06
$$ -74 -38 -57 16 27 -53 -175 -20 120 114 154 181 5 -33 5 52 36 -23 38 -59 -144 -217 -26 41 94 32 78 -2 -108
1643a08M8R5J12k3j04l8L6q3P3J48m6j50oRr1Q0J28nk00k08J11P2J37R7J01j06
$$ -108 -60 35 147 124 20 -18 18 -65 8 156 110 -40 -46 -37 -128 -48 80 75 -125 -333 -222 -150 -13 84 185 79
1669G9j76R3R2o9P7K01m5k53j59J55k2p6N3Q7r5r4N7J29p1k7J16Mj99Q6J68rl7
$$ 79 -97 -4 88 19 96 297 252 -1 -160 -5 -27 -103 -50 37 -58 -152 -95 34 -37 -64 52 56 -143 -57 111 102 65
1696F5P4j25j08Q7pJ68k5r6j19m0p7j9K09R8r3o9j5ORJ70N0M5j02j69N0L6p2J59
$$ 65 139 14 -94 -7 -14 154 129 33 -86 -126 -203 -222 -13 85 -8 -77 -92 -86 -77 93 143 188 86 -83 -33 3 -69 90
1724I0J00k35j75J35Q7r9R7K12j13j85o5R3L9kP2J01k52q1K22k0p7J51J13j77
$$ 90 190 -45 -220 -85 2 -97 0 212 99 -86 -151 -58 -19 -21 51 152 -100 -181 41 21 -56 95 208 31
1748C1j36P5Q7K9n9k9k6j40j0K43J8l4L8q2j47L9J50K9M1J5j85j20LJ4J18K22
$$ 31 -105 -30 57 86 27 -2 -28 -168 -178 65 83 49 87 5 -142 -103 47 76 117 132 -53 -173 -170 -156 -38 184
1774A84J5r1j10l5R1k6M6K25j97j26j25Q3q4K1J44o4j14M4K04p3N7P2m5j59P8
$$ 184 199 108 -2 -37 54 28 74 299 102 -24 -149 -66 -150 -129 15 -49 -163 -119 85 12 69 141 96 -63 15
1799A5O4Pj2N6l4j94j22J56L8o0J17O2k14r8J43J29m8O7M1j09p0j0J32N5M2J08
$$ 15 79 86 74 130 96 -98 -220 -64 -26 -86 31 93 -121 -219 -76 53 5 72 113 4 -66 -76 56 111 153 261
1825B61j13l10J6J93N1o4M6j02k91M9J50J4J75Q7o0q7o1P2j1M0P0l5n5j46Q6m7
$$ 261 148 -162 -146 47 98 34 80 -22 -313 -264 -114 -100 75 162 102 15 -46 26 15 55 125 90 35 -111 -25 -72
1851g2n5J58K8k33L9J45L2q9J75p2j84P5Q7J6j0J46j08j53j75J81J40J0L2Q3j42
$$ -72 -127 31 59 -174 -135 10 42 -47 128 56 -128 -53 34 50 40 186 78 -75 -250 -69 71 81 113 196 54
1876E4k37O2J80j14O8J84j78j49LJ04J9O6J9l9j09m9Q8N5j8Q8m4j09m8J37J6M4
$$ 54 -183 -121 59 -55 13 197 19 -130 -127 -23 -4 62 81 42 -67 -116 -28 27 9 97 53 -56 -104 33 49 93
1902I3N0r3r3j0P3q1M7J11j17p7j0O2N6L1M0J8j80l3K16pj4Q9K2k62j08K03L7
$$ 93 143 50 -43 -53 20 -61 -14 97 -20 -97 -107 -45 11 42 82 100 -80 -113 103 96 82 171 193 -69 -177 26 63
1929F3n3P5M6k74j28J51R7jm3J30rk48j3K26N5q3J94K5k60L9N2o0k4P4n1p8l0
$$ 63 10 85 131 -143 -271 -120 -23 -24 -67 63 54 -194 -207 19 74 -9 185 210 -50 -11 41 -19 -43 31 -20 -98 -128
1956a28JO9L5l0K1J7n1J54J26p2n1k5j35k5R6Q5o0K5j4j93M1J17N9L6N7Lk37n6
$$ -128 -127 -58 -23 -53 -32 -15 -66 88 214 142 91 66 -69 -94 2 87 27 52 38 -155 -114 3 62 98 155 158 -79 -135
1984a35N1Q9p0M3R9r3k33J52K43j35L1J24j11k14J27P5j01PJ08k8j56J2J37O1
$$ -135 -84 5 -65 -22 77 -16 -249 -97 146 11 42 166 55 -159 -32 43 -58 -51 57 29 -127 -115 22 83
2008H3j20N7J64k40m3J80O6k25KM8j10LJ65LL6j5k3M4K3j9J32N3j77j09j39q3
$$ 83 -37 20 184 -56 -99 81 147 -78 -76 -28 -138 -135 30 33 69 54 31 75 98 79 211 264 87 -22 -161 -244
2034b44R2J26K1L2L9k02j7J20O6NJ67j8j99r7J06k9o6M5J81j12j39N8J67j30j24
$$ -244 -152 -26 -5 27 66 -136 -153 -33 33 38 205 187 -12 -109 -3 -32 -98 -53 128 16 -123 -65 102 -28 -152
2059a52K34k0k12Q6K26k23j05J51K6j66J74J66lj77O9%n3j86K05J40k11j10J14
$$ -152 82 62 -150 -64 162 -61 -166 -15 11 -155 19 185 182 5 74 74 21 -165 40 180 -31 -141 -27
2082b7o2k09K64Q2K9o4M5Rj33N8K9Q5n6j55Q4k4p8L0J39m4m3N5l7L4N4r3Q9Q3
$$ -27 -89 -298 -34 48 77 13 58 67 -66 -8 21 106 50 -105 -21 -45 -123 -93 46 2 -41 14 -23 11 65 -28 61 144
2110A44k05%J25o5j97K08K1j00nJ40L0q0j08J39o8p5K7L13j03l67K70L6k12oK93
$$ 144 -61 -61 64 -1 -198 10 31 -69 -74 66 96 16 -92 47 -21 -96 -69 244 141 -226 44 80 -132 -138 155
2135A55m6j73K9J20j96j07J80K21j89m9J34pk29M8K91l6j59Q4M4j16q4J29K4m0
$$ 155 109 -64 -35 85 -111 -218 -38 183 -6 -55 79 72 -157 -109 182 146 -13 71 115 -1 -85 44 68 28
2159B8j14R7%p9r9J56M0j86J56J63r6JL7m3J4j05p4K57K7k95R1O1k35N9J53O6
$$ 28 -86 11 11 -68 -167 -11 29 -157 -1 162 66 67 104 61 75 -30 -104 153 180 -115 -24 37 -198 -139 14 80
2185H0j75L6J14n5j43O1K45q1j51P4J32k52k9K90L3k56L6K02j36j71J07R7m0o4
$$ 80 -95 -59 55 0 -143 -82 163 82 -69 5 137 -115 -144 146 179 -77 -41 161 25 -146 -39 58 18 -46
2209d6N7J01k08q4K01N6k69K11J61q3j29Q0qq7k8J15L9J5j70m3P0j12J3J60R8
$$ -46 11 112 -96 -180 21 77 -192 19 180 97 -32 48 40 -47 -75 40 79 94 -76 -119 -49 -161 -148 12 110
2234A10o6m7L3j8m5l1J07J21j85o3J73j12j83K04J90j64p6K02l2k17N7J60o1j53
$$ 110 44 -3 30 12 -33 -64 43 164 -21 -84 89 -23 -206 -2 188 24 -52 150 118 -99 -42 118 57 -96
2258i6P2J53p0k67K11R6k35K2K80j17j52J13J16j94p5J77P1q2l2L9L0j48L1J74
$$ -96 -24 129 59 -208 3 99 -136 -114 166 49 -103 10 126 -68 -143 34 105 23 -9 30 60 -88 -57 117
2282A17m5j30P4N2k21oJ74l0N0K2p3j4M3j18J77J16q6r8J05q3j20J04K0J8l3k3
$$ 117 72 -58 16 68 -153 -159 15 -15 35 57 -16 -30 13 -105 72 188 102 4 109 26 -94 10 30 48 15 -8
2308hl1M0k10J38J28j43l1K36j5j66K7J11j08r9J36R7pr6K3Pj42p3K47L3j96J22
$$ -8 -39 1 -209 -71 57 -86 -117 119 104 -62 -35 76 -32 -131 5 102 95 -1 22 29 -113 -186 61 94 -102 20
2334B0P1j89j39K36O5o4M2N0ok09L7J27l1O0OL7k01l7K22q9r1J73m8p4N0m5K1
$$ 20 91 -98 -237 -1 64 0 42 92 86 -123 -86 41 10 70 76 113 -88 -125 97 8 -83 90 42 -32 18 -27 -6
2361foQ7r7M5J6o2n9J22o0l6O1q2J11K1q1L4L6j97J20J18o7kJ09j55j46J33R7
$$ -6 -12 75 -22 23 39 -23 -82 40 -20 -56 5 -77 34 55 -26 8 44 -153 -33 85 18 16 125 -30 -176 -43 54
2388E4m0QJ5p5r9l6J23J43q0J7J15r0j31J62Qj15J54Q9j81j09j4j0M0O5l5j8N0
$$ 54 14 22 37 -38 -137 -173 -50 93 13 30 145 55 -76 86 94 -21 133 222 41 -68 -82 -92 -52 13 -22 -40 10
2415A0j17J04k2k2L0Q2o4J1P2j10n5J12p2q2J82k1n6J38j18j03%N0J8O8N0o0j6
$$ 10 -107 -3 -25 -47 -17 65 1 12 84 -26 -81 31 -41 -123 59 38 -18 120 2 -101 -101 -51 -33 35 85 25 9
2442Ij35M3J38L8j51K25k4k20PJ19m1n5J58j14n9k6M2N4JJ1k1O5j69J2J39q3M8
$$ 9 -126 -83 55 93 -58 167 143 -77 -70 49 8 -47 111 -3 -62 -88 -46 8 9 20 -1 64 -105 -93 46 -37 11
2469A1Q7k2j62R3m4n9M7J01m9k6L4jm2Q9j35O9k2j3Q9Kj4k7k7p1R9M6J5mQ4j85
$$ 11 98 76 -86 7 -37 -96 -49 52 3 -23 11 10 -32 57 -78 -9 -31 -44 45 47 33 6 -21 -92 7 53 68 64 148 -37
2499c7q5J21L7m0J38mj76K5MJ6k2P0J3J0j32kJ24n3m7J65J0j83n1J52r2m3J26
$$ -37 -122 -1 36 -4 134 130 -46 -21 -17 -1 -23 47 60 70 -62 -64 60 7 -40 125 135 -48 -99 53 -39 -82 44
2526D4J4m8J8l3L2K8p4P2k8j33M4J69j19m9O9o1k9P4L9P6l3k0l6j3m2R2M2j5k14
$$ 44 58 10 28 -5 27 55 -19 53 25 -108 -64 105 -14 -63 6 -55 -84 -10 29 105 72 52 16 3 -39 53 95 80 -134
2555a34Q2K5o1O0J7L6K6qj43M1K9l1J37O5j18r8N6j11K3J51P1l6lm8J6r7o5J41
$$ -134 -52 -27 -88 -28 -11 25 51 43 -100 -59 -30 -61 76 141 23 -75 -19 -130 -107 44 115 79 76 28 44 -53 -118 23
2583B3N3j80N2J35j33j03J67J01k06R9J12m2PJl7%j67M9J17l3j46J82ok20N4K30
$$ 23 76 -104 -52 83 -50 -153 14 115 -91 8 120 78 85 86 49 49 -118 -69 48 15 -131 51 45 -175 -121 109
2609A09J9n9N2kj82m8K5J19K7j23O5J6j34l2K22L2l4k2P0j68J8l8jJ04n6K4qo6
$$ 109 128 69 121 119 -63 -111 -86 33 60 -63 2 18 -116 -148 74 106 72 50 120 -48 -30 -68 -69 35 -21 3 -5 -71
2637g1j29K12J09j09K3L4l3p9K7L1k1n7m2P0M7j62J40J30j69n1K57n2j01J5P6
$$ -71 -200 12 121 12 35 69 36 -43 -16 15 -6 -63 -105 -35 12 -150 -10 120 -49 -100 157 105 4 19 95
2662I5j38p5K4O0j1JP7R7j48j14K09nk9P1L2k17q5O8N4L7%N7qj28r5R2J10p8R3
$$ 95 -43 -118 -94 -34 -45 -44 33 130 -18 -132 77 72 43 114 146 -71 -156 -88 -34 3 3 60 52 -76 -171 -79 31 -47 46
2691D6J46k59J8j0J4O1L5KL2rr2L6P0o0j41J36n2j46J12Q2m4k6kMM7m1O6J33j18
$$ 46 192 -67 -49 -59 -45 16 51 53 85 76 -16 20 90 30 -111 25 -27 -173 -61 21 -23 -49 -51 -47 0 -41 25 158 40
2720D0j31J24Pj07P2J04j11r9O2J4l0L8J16K4j72k6J1O6l6O8J73j63j88J02Om3
$$ 40 -91 33 40 -67 5 109 -2 -101 -39 -25 -55 -17 99 123 -49 -75 -64 2 -34 34 207 44 -144 -42 -36 -79
2746g9J37K6J6q7j61Q2J10r2O5J58j28j49O4R2p0k4J18n3o1k1N7J17q9j32P9M2
$$ -79 58 84 100 13 -148 -66 44 -48 17 175 47 -102 -38 54 -16 -40 78 25 -36 -57 0 117 28 -104 -25 17
2772A7j23R3J27k2j88O8L3j44J37J11N0j12r7l4K5m1J00K09j17r9m8J7m1Q3J39
$$ 17 -106 -13 114 92 -96 -28 5 -139 -2 109 159 47 -50 -84 -59 -100 0 209 92 -7 -55 -38 -79 4 143
2797A43m6q1m2p9M2RJ50P7p0j50J8N5j51J38J19p6q6n8jQ8K0n4J02Lj52J7O4O4
$$ 143 97 16 -26 -105 -63 -54 96 173 103 -47 -29 26 -125 13 132 56 -30 -88 -89 -1 19 -35 67 70 -82 -65 -1 63
2825F3r3Q6m6r8k7J52MM2k6r5j9j38J45J59J2j40l2j0q8O4K14P7j09k6j17l6Q
$$ 63 -30 56 10 -88 -115 37 41 83 57 -38 -57 -195 -50 109 121 -19 -51 -61 -149 -85 129 206 97 71 -46 -82 -74
2852g4N1J28J4j16m1%j07J7J76P6r5l7n2n4Q8J0Q7l1r8k3R7P6q3P1K7j45l0N6
$$ -74 -23 105 119 3 -38 -38 -145 -128 48 124 29 -8 -60 -114 -26 -16 71 40 -58 -81 16 92 9 80 107 -38 -68 -12
2880a2l0Q6J0k2r7l0j4J78m0MOqk00R9J54J2N6n8n6j11r2M1J59M4M3j45k7j12
$$ -12 -42 44 54 32 -65 -95 -109 69 29 33 39 31 -169 -70 84 96 152 94 38 -73 -165 -124 35 79 122 -23 -50 -162
2908a62O8J42J28p0l4j38j08P8P4P3R6j02k9o3o3K2J16J31j73m7K4o9O5R8l1J8
$$ -162 -94 48 176 106 72 -66 -174 -96 -22 51 147 45 16 -47 -110 -88 28 159 -14 -61 -37 -106 -41 57 26 44
2934D4j25K9j0J66m2K4Pj13p5J04J5L5N3o9j59k5L9J12J54m6m1k8q6j67K16J12
$$ 44 -81 -52 -62 104 62 86 93 -20 -95 9 24 59 112 43 -116 -141 -102 10 164 118 77 49 -37 -204 12 124
2960A24oP4j62j62L9N6L3J18J3l9j33k1k4R4J12r2%q1q1K4J50j3K5j1r8oO0J2
$$ 124 118 192 30 -132 -93 -37 -4 114 127 88 -45 -66 -90 4 116 24 24 -57 -138 -114 36 23 48 37 -61 -67 -7 5
2988EN9P2q7j22pK3l0J20P6r1n5k7j3J01N6k4K1r9j51L2J27N5L5Oj29m9K8M0J30
$$ 5 64 136 49 -73 -80 -57 -87 33 109 18 -37 -64 -77 24 80 56 77 -22 -173 -141 -14 41 76 82 -47 -96 -68 -28 102
3017A02P0K3j45q0j58J49J17J6k0K3k30l8J18P9N6Qk8n5o9l2N4J69p6o9Q2j45
$$ 102 172 195 50 -30 -188 -39 78 94 74 97 -133 -171 -53 26 82 90 62 7 -62 -94 -40 129 53 -16 66 -79
3043g9J4O7O5j5Qk9r8P5J6O6J5m1j72PM6L0Q8R2j47r5K2k5N7J28Q1l5j74j33m
$$ -79 -65 2 67 52 60 31 -67 8 24 90 105 64 -108 -101 -55 -25 63 155 8 -87 -65 -90 -33 95 176 141 -33 -166 -170
3072a70J51J8M2J00j45p1m2J15K1N9L2j05p0l7K6R7L5m2N9j24o0R0P2j4J2L0j33
$$ -170 -19 -1 41 141 -4 -75 -117 -2 19 78 110 5 -65 -102 -76 21 56 14 73 -51 -111 -21 51 37 49 79 -54
3099e4r1Q0M6J1P8k1j17JK3L7J47n2j22J6j3n5J65J0On8p1m8rP8Q9J26j05j88
$$ -54 -145 -65 -19 -8 70 49 -68 -67 -44 -7 140 88 -34 -18 -31 -86 79 89 95 37 -34 -82 -91 -13 76 202 97 -91
3127i1l1Q6o1J64Q6r1j31m1K0J8J04lM1K6k57J6J34j0L0J58j06j37q7J24M5J00
$$ -91 -122 -36 -97 67 153 62 -69 -110 -90 -72 32 29 70 96 -161 -145 -11 -21 9 167 61 -76 -163 -39 6 106
3153A06j08LJ1j15N5P3L9q9P9n9j85P5J61M3j4p5n2l3K7J6J69J7j31p1J06j64
$$ 106 -2 1 12 -103 -48 25 64 -25 54 -5 -190 -115 46 89 75 0 -52 -85 -58 -42 127 144 13 -58 48 -116
3179a16J9K68n1o5k7j30L6L8J3J28k0j98l5Q0K5L6J35L8j90n0RkR6J0K9o1r5r6
$$ -116 -97 171 120 55 28 -102 -66 -28 -15 113 93 -105 -140 -60 -35 1 136 174 -16 -66 -57 -59 37 47 76 15 -80 -176
3207a76J77Q9j03M8P5j85r8J69J26j11M8J9j19m3M5Q8M0q0J3m0j21k2K42N0r1
$$ -176 1 90 -13 35 110 -75 -173 -4 122 11 59 78 -41 -84 -39 49 89 9 22 -18 -139 -161 81 131 40
3232D0j8o0j10j2J43Q5P5q1j20M6j51R3J61M8k2j71M2j21P7O1R3k9j17k8K1Q6
$$ 40 22 -38 -148 -160 -17 68 143 62 -58 -12 -163 -70 91 139 117 -54 -12 -133 -56 5 98 69 -48 -76 -55 31
3258C1p8P1P0o8p1K2L5j5O4L5j05p4m1J66M3p3qR4j47j28J39K44j82L8J7j07j17
$$ 31 -47 24 94 26 -45 -23 12 -3 61 96 -9 -83 -124 42 85 12 4 98 -49 -177 -38 206 24 62 79 -28 -145
3285a45O7Q8J10o7k4o1o7p3J07J99j60P7j7r9n4M5J69j7J4m8j35QJ5NJ78j3j73
$$ -145 -78 10 120 53 29 -32 -99 -172 -65 134 -26 51 34 -65 -119 -74 95 78 92 44 -91 -83 -68 -63 115 102 -71
3312g1N4j7j0R0Q2l5m4n6j3M0nqO9l1j16l7J28m9M4N0n1j02J0N5J8N1Ml9p1r8
$$ -71 -17 -34 -44 46 128 93 49 -7 -20 20 15 7 76 45 -71 -108 20 -29 15 65 14 -88 -78 -23 -5 46 50 11 -60 -158
3342a58L8J78J3o5N2m9j28oJ56K3K2%o2o5n5N6J35J5n4MJ7j14L3J27j02k8Q0j36
$$ -158 -120 58 71 6 58 9 -119 -125 31 54 76 76 14 -51 -106 -50 85 100 46 50 67 -47 -14 113 11 -17 63 -73
3370g3L0M5L7nOm4q5Q9p2P4N9Kj16L4o4N5N3M1k9M8j15j14J05J13K2j8kj44o0
$$ -73 -43 2 39 34 40 -4 -89 0 -72 2 61 63 -53 -19 -83 -28 25 66 37 85 -30 -144 -39 74 96 78 76 -68 -128
3399a28Q5M5P4L0j03p7N1q1J34N5n1k8Q3j93k1J54M4m0RK0r5l3N5j0O4m4m5k4
$$ -128 -43 2 76 106 3 -74 -23 -104 30 85 34 6 89 -104 -125 29 73 33 42 62 -33 -66 -11 -21 43 -1 -46 -70
3427g0j0O7R1k7o3j7M1o0N2K7K7o6L1j16R5J2L5M9Pr3q1K3QM9M2j2m8K0p1M0P1
$$ -70 -80 -13 78 51 -12 -29 12 -48 4 31 58 -8 23 -93 2 14 49 98 105 12 -69 -46 -38 11 53 41 -7 13 -58 -18 53
3458E3M6q4R5o0p6n8J08j9N2M8q6j36R6m2J27m0k4L4p4j19J16J03p0M3m4kp4R0
$$ 53 99 15 110 50 -26 -84 24 5 57 105 19 -117 -21 -63 64 24 0 34 -40 -159 -43 60 -10 33 -11 -13 -87 3
3486CL9L3k9p5m8M1nP0O3j03q6O8k5O3R6j7p4J0L0j52P0O6L3M6Mn2j32M3MP0L9
$$ 3 42 75 46 -29 -77 -36 -41 29 92 -11 -97 -29 -54 9 105 88 14 24 54 -98 -28 38 71 117 121 69 -63 -20 -16 54 93
3517I3m6q7Qn9R4j1K8j8L7j26L3J11n9l7P5nq7qP1o1M2Pj9m7M4J2M7M9p9k4l7
$$ 93 47 -40 -32 -91 3 -8 20 2 39 -87 -54 57 -2 -39 36 31 -56 -64 7 -54 -12 -5 -24 -71 -27 -15 32 81 2 -22 -59
3548e9m2N2J63m0q1L0p9m8J39mK4Jq4n2O3m6kJ54p0n6L3m9n6L9J08k0O3q3j08
$$ -59 -101 -49 114 74 -7 23 -56 -104 35 31 55 56 -28 -80 -17 -63 -65 89 19 -37 -4 -53 -109 -70 38 18 81 -2 -110
3577a10J14m7m5J75o1j21N2M2k5J7M0o9JJ4oN9L7m1Q1j14l0l1J37j9q5K3M5r0
$$ -110 4 -43 -88 87 26 -95 -43 -1 -26 -9 31 -38 -37 -23 -29 30 67 26 107 -7 -37 -68 69 50 -35 -12 33 -57
3605e7L2N2pN1n6l9l4J2M4R0L2j30j7L2j23N0K7N3K3l1l4l0Pl2O5J25p2j6J6n7
$$ -57 -25 27 20 71 15 -24 -58 -46 -2 88 120 -10 -27 5 -118 -68 -41 12 35 4 -30 -60 -53 -85 -20 105 33 17 33 -24
3635b4j2J03k6m2J3K7k1j1m9M0L7q9o3J35Mn3Q0l0m1o4P0N8M8k7l5J5j01l8J44
$$ -24 -36 67 41 -1 12 39 18 7 -42 -2 35 -54 -117 18 22 -31 49 19 -22 -86 -16 42 90 63 28 43 -58 -96 48
3664D8M1j13M0P1j77jJ09L8m1Nj9l2k7PL5O7n7Q9j9j01q0J16M5r4M8K8l8l7J02
$$ 48 89 -24 16 87 -90 -91 18 56 15 20 1 -31 -58 -51 -16 51 -6 83 64 -37 -117 -1 44 -50 -2 26 -12 -49 53
3693E3j30J35o2l4M1P7r4P9K9j11j9Q1jqj7j9J6m9p3J12R7j81N8J17p7j28J20
$$ 53 -77 58 -4 -38 3 80 -14 65 94 -17 -36 45 44 36 19 0 16 -33 -106 6 103 -78 -20 97 20 -108 12
3720A2L6q5K3K7J8r2l6P0J01%j65J14j6o2K1J50j87k2J25J2m3k2O4l1o0K9L9l
$$ 12 48 -37 -14 13 31 -61 -97 -27 74 74 -91 23 7 -55 -34 116 -71 -93 32 44 1 -21 43 12 -48 -19 20 17
3748A7k9l9J65j23n2O3M3k4J4M4j01Nk3nM8K9o1M4n0o7J09QJK8n3l6%n1Q3J6l5
$$ 17 -12 -51 114 -9 -61 2 45 21 35 79 -22 -17 -40 -45 3 32 -29 15 -35 -102 7 15 16 44 -9 -45 -45 -96 -13 3 -32
3779c2k1R8J0j39N5Q0p1p7J35J9l4q9Q3J0q0OR4k3l0l3J17m9q6O8J8r6O3J07j45
$$ -32 -53 45 55 -84 -29 51 -20 -97 38 57 23 -66 17 27 -53 -47 47 24 -6 -39 78 29 -57 11 29 -67 -4 103 -42
3808d2j9P1mK2J7k7M5n5m9K6O8j19R1K4n1n8N0K9m5j0M5j0N4q9L5Q6l9q6Q4om6
$$ -42 -61 10 6 28 45 18 63 8 -41 -15 53 -66 25 49 -2 -60 -10 19 -26 -36 9 -1 53 -36 -1 85 46 -40 44 38 -8
3839hj9jJ6j7N8K8m4Mj06J36k0j55J24M3j03M9P0j10k1O3L7l9OP2Qo6j20O9L4
$$ -8 -27 -28 -12 -29 29 57 13 17 -89 47 27 -128 -4 39 -64 -15 55 -55 -76 -13 24 -15 -9 63 71 5 -115 -46 -12
3868a2m6J4J25m2j11P4K6o5R1K4m7l8Ll0K6J5n1J06m3p7OP9n0P0j4l1k8P5j15
$$ -12 -58 -44 81 39 -72 2 28 -37 54 78 31 -7 -4 -34 -8 7 -44 62 19 -58 -52 27 -23 47 33 2 -26 49 -66
3897f6J9O3ql8O2n5j0K7K0m7k5N9oM0n5Lrq9N3L2NL2P0j9n8n7P3q2N9M7J9k7p0
$$ -66 -47 16 8 -30 32 -23 -33 -6 14 -33 -58 1 -5 35 -20 -17 -26 -115 -62 -30 -25 7 77 58 0 -57 16 -66 -7 40 59 32 -38
3930c8J3K6L0o8O5L7j22L2L7j3k6R7r0K0j0o9Q3l6%P3j0p6K3M2k1l1N9o5J0N8
$$ -38 -25 1 31 -37 28 65 -57 -25 12 -1 -27 70 -20 0 -10 -79 4 -32 -32 41 31 -45 -22 20 -1 -32 27 -38 -28 30
3960C0J0n0J2k6j12Q0R0k6K9k6k1q5Q8pk7Q1J3j4p2j1RM5jkQ0n0r6N0O4m5K3Q
$$ 30 40 -10 2 -24 -136 -56 34 8 37 11 -10 -95 -7 -14 -41 40 53 39 -33 -44 -35 10 9 7 87 37 -59 -9 55 10 33 41
3992D1p5KJK5pJ3KK5j4n0P9j3LJ1J7r5pJ26j9j5k7j28M6L1K9M1L4m9q4O8q5N5
$$ 41 -34 -32 -31 -6 -13 0 2 27 13 -37 42 29 32 43 60 -35 -42 84 65 50 23 -105 -59 -28 1 42 76 27 -57 11 -74 -19
4024a9O6N8r4K8l1o3ON2O9j1J0j21M5n0L1N1Kj1n7L3J7oo3O7J6J3l3k0M3k6N4
$$ -19 47 105 11 39 8 -55 -49 3 72 61 71 -50 -5 -55 -24 27 29 18 -39 -6 11 5 -58 9 25 38 5 -15 28 2 56
4055E6L9j00o9O1M3J0l8M3p9J5kJJ3j6N2l4n1m8N6J04m0N6k5j17O5j9L3N3N4j41
$$ 56 95 -5 -74 -13 30 40 2 45 -34 -19 -21 -20 -7 -23 29 -5 -56 -104 -48 56 16 72 47 -70 -5 -24 9 62 116 -25
4085b5k7J1L1kO1m7n2O6Nl8rO5J8p0k4m3R2k1l7J33o3l7j9M2k4N9n5N0p6n0P0
$$ -25 -52 -41 -10 -12 49 2 -50 16 21 -17 -26 39 57 -13 -37 -80 12 -9 -46 87 24 -13 -32 10 -14 45 -10 40 -36 -86 -16
4116a6N8m2n2J03m7j00K0J18K8m0J0n6l5L5J9l5J58n7p4L2n0K0K9j4K8k8p7PL7
$$ -16 42 0 -52 51 4 -96 -76 42 70 30 40 -16 -51 -16 3 -32 126 69 -5 27 -23 -3 26 12 40 12 -65 -58 -21
4145b1L8l7P6r0n2N6j9j7P7N7r3M3k9j6L7krqjOKN6p9L8J4j9j4N6n2J4qK6p8J0
$$ -21 17 -20 56 -34 -86 -30 -49 -66 11 68 -25 18 -11 -27 10 8 -1 -9 -10 -4 -2 54 -25 13 27 8 -6 50 -2 12 4 30 -48 -38
4179c8M0K7L6lj2o4k4J6J0O9k0J8k8k5k5N8j7mK5n4n1j7Q7j1M6Nk9j7l6J8N3Q
$$ -38 2 29 65 62 50 -14 -38 -22 -12 57 37 55 27 2 -23 35 18 14 39 -15 -66 -83 4 -7 39 44 15 -2 -38 -20 33 41
4211D1Pm7n3l2J45j5l2J5m8k6J5R0o6M8k6j8J5m3m0J29k8k3j1J4m9J5M0j7pM3
$$ 41 48 1 -52 -84 61 46 14 29 -19 -45 -30 60 -6 42 16 -2 13 -30 -70 59 31 8 -3 11 -38 -23 17 0 -7 36
4241C6o8n4Q2LMP7l7j01P6p3kJ14m3l0L1n6j9JJ09o0J1K5r9Q2rM5j4m9k4KO2o2
$$ 36 -32 -86 -4 -1 3 80 43 -58 18 -55 -57 57 14 -16 15 -41 -60 -59 50 -10 1 26 -73 9 0 45 31 -18 -42 -40 22 -40
4273d0R4j3m2k7O0p4L8M2K1n0k0J1J2n2K0J4L4n3n8O0J02n1J0n0mj3PL2l4L9l3
$$ -40 54 41 -1 -28 32 -42 -4 38 59 9 -11 0 12 -40 -20 -6 28 -25 -83 -23 79 28 38 -12 -16 -29 -22 10 -24 15 -18
4304a8R2j20k0P6j8PN7m3m5J5J9m2O7oK5qo4k6M7j5oN0Mk4j5O4k6qJ3J5q8j3L6
$$ -18 74 -46 -66 10 -8 -1 56 13 -32 -17 2 -40 27 21 46 38 -26 -52 -5 -20 -26 24 28 4 -11 53 27 19 32 47 -41 -54 -18
4337a8jJ9n2J6NMmk7R6m1qj8K8K7o2J17p5K5j06J13k4mm6N3L0q1J7ok1L8l2M0
$$ -18 -19 0 -52 -36 -31 -27 -31 -58 38 -3 -11 -29 -1 26 -36 81 6 31 -75 38 14 10 -36 17 47 -34 -17 -23 -44 -6 -38 2
4369BMJ6j06J09nk4PrJ2J0k3L0nn5L0KK1k9J8j9Ml0J1m1N1k2P3nJ5p5O3om4qN1
$$ 2 6 22 -84 25 20 -4 3 -6 6 16 -7 23 18 -37 -7 -5 16 -13 5 -14 -10 -40 -29 -70 -19 -41 32 27 42 -33 30 24 -20 -28 23
4404B3%l0m4O1L1l2rlPK5n1K6l7J1K1mmM0n6O9k4JLm3Ql7M8k7KK9J8Lno2%N6n
$$ 23 23 -7 -51 10 41 9 0 -3 4 29 -22 4 -33 -22 -1 -5 -9 31 -25 44 20 21 24 -19 -11 -48 0 -27 -25 4 22 25 20 -42 -42 14 9
4441Ik1pj7RL1k2m2M3J7k9qN1mm6J3K6k7P0Jp0l2M3J8j7N6j7j1m4K8Nj7M8j9o5
$$ 9 -12 -19 -36 -27 4 -18 -60 -17 0 -29 -37 14 10 -36 -23 3 -24 46 47 -23 -55 -12 6 -11 45 28 17 -27 1 6 -11 37 18 -47
4475d7M9K1k4M3l2m7mJ7K2oJ8Km4N9l3J2%m7J2L5k2k7P3j1J4K7n1j3k3N4l9J9
$$ -47 2 23 -1 42 10 -37 -41 -24 -2 -8 10 12 -32 27 -6 6 6 -41 -29 6 -16 -43 30 19 33 60 9 -4 -27 27 -12 7
4507GNj4L7Np6O7o5O3n9K1L4j3k2m4Q3lq7R6k7LO6m6n9M4p2N3kl5K5L9l6%l8J03
$$ 7 12 -2 35 40 -36 31 -34 29 -30 -9 25 12 -10 -54 29 26 -61 35 8 11 77 31 -28 16 -56 -3 -5 -40 -15 24 -12 -12 -50 53
4541E3l6l3L6k2j2LMm2R6j1m3JK4o6M0nL5k2%qqNQ2pp4pM4l2J8rN8m1m0L1m4j6
$$ 53 17 -16 20 -2 -14 -11 -7 -49 47 36 -7 -6 18 -48 -8 -13 22 0 0 -8 -16 -11 71 64 -10 -17 27 -5 13 4 62 21 -19 12 -32 -48
4577d8O6Qok3Ok1k4L2m0Q2m1l7k3N2L7Rm3Jk1L4K9ln6J01m1q2J1J5J9N6k5pmp
$$ -48 18 26 20 -3 3 -18 -42 -10 -50 32 -9 -46 -69 -17 20 29 -14 -13 -34 0 29 26 -30 71 30 -52 -41 -26 -7 49 24 17 13 6
4611FJ3Pq2J4j8J8O4M2p6J4j03J11k0l0N2m8P8m3L2o2M1k6L3JJ7q2J1jM9QM1Q
$$ 6 19 26 -56 -42 -60 -42 22 64 -12 2 -101 10 -10 -40 12 -36 42 -1 31 -31 10 -16 17 18 35 -47 -36 -37 12 20 61 69
4643F9p3JK6rONKn0LN9p3Q8n9K3k3M3n5j5L9n1K3P0q0L7L4n4P5%n7jpl0K7rkj0
$$ 69 -4 -3 23 14 20 25 27 -23 -20 39 -34 54 -5 18 -5 38 -17 -32 7 -44 -21 49 -31 6 40 -14 61 61 4 3 -4 -34 -7 -16 -18 -28
4679b8K4j7j2J3pO2mo8L1nl6L1K1LM5Kj16NL6P3q2K8J2J2J1l5O4nnq1L3L5M0r1
$$ -28 -4 -21 -33 -20 -27 35 31 -37 -6 -11 -47 -16 5 8 53 55 -61 -56 -20 53 -29 -1 11 23 34 -1 63 58 53 -28 5 40 80 -11
4713a1JN1n4j7J4K7MK4l7n7K7K3M6m9LO9j20nM3M1o2O5Lo3J0K6j8M8om4lK1k0
$$ -11 -10 41 -13 -30 -16 11 15 39 2 -55 -28 -5 41 -8 -5 64 -56 -61 -18 23 -39 26 29 -34 -24 2 -16 32 26 -18 -21 0 -20
4746b0O8O7j35L0P7o8j9%lL3l4r3J09k8K0k2L1l1l0P4Kk8pL4ml7l2Q8l8j9J7%
$$ -20 48 115 -20 10 87 19 0 0 -3 30 -4 -97 12 -16 4 -18 13 -18 -48 26 28 0 -7 27 23 -14 -46 42 4 -15 2 2
4778B%m8J05o4lN2pm1k0K0K9NK2k7L7p1n0J11j13R9n8L8k3j8O0k8J2l8j1K2m3
$$ 2 2 -46 59 -5 -8 44 37 -4 -24 -4 25 30 52 25 62 -9 -59 52 -61 38 -20 18 -5 -23 37 9 21 -17 -28 -6 -49
4809d9O7K9n2K4k8l7M1l1L6O0m8k6K9J0jj9J1l5Mm7J01l4OPjK5m6Qk7M7LL3q1
$$ -49 18 47 -5 19 -9 -46 -5 -36 0 60 12 -14 15 25 24 5 16 -19 -15 -62 39 5 11 18 17 42 -4 4 -23 24 27 60 -21
4842b1RRk8J9L5rL0M1q8M4m9N3Npo4nN5N7j06pMkP2o2K1Ll8J0K9q1L5J3K5j0N
$$ -21 -12 -3 -31 -12 23 14 44 85 -3 41 -8 45 50 43 -21 -26 29 86 -20 -27 -23 -25 47 -15 6 9 -29 -19 10 -71 -36 -23 2 -8 -3
4877cr0J13om2J4Q4k7r0j7Q0k5m0P8m1N9j18M3J9K6n6P0j0k1qjO6l3l4O2p0JL7
$$ -3 -93 20 14 -28 -14 70 43 -47 -64 16 -9 -49 29 -12 47 -71 -28 -9 17 -39 31 21 0 -8 -9 57 24 -10 52 -18 -17 20
4909B0j2J3j02M7N8o2L0K8k3j9M9o3rK9K1j2j9PRk5j2P1K9l4j06M5P6k2k0N5m
$$ 20 8 21 -81 -34 24 -38 -8 20 -3 -22 27 -36 -45 -16 5 -7 -26 -19 -10 -35 -47 24 53 19 -87 -42 34 12 -8 47 43
4940D3Jm2km4M5l4R3j3m3k2Ql9M6M8J2%k8Jj6l0l0P0%m9l4M1K1JkM1r7M8J4nJ7
$$ 43 44 2 0 -44 1 -33 60 47 4 -18 -10 -49 -3 45 57 57 29 30 14 -16 -46 24 24 -25 -59 -18 3 4 2 43 -54 -6 8 3 20
4975B0om0j1J09q8K8K6q6J1oP8j01J30p7k8N1m2J4L7n0N1K5jj2k3J0p6J18m8l5
$$ 20 14 -26 -37 72 -16 12 38 -48 -37 -43 35 -66 64 -13 -41 10 -32 -18 19 -31 20 45 44 32 9 19 -57 61 13 -22
5005b2M5Lm2l7N1J0KJ2r0O2M4o1K2k5J3J2L9l1q0M6J5M4j8j1olk0k3Q2q6M2k2
$$ -22 23 26 -16 -53 -2 8 10 22 -68 -6 38 -23 -1 -26 -13 -1 38 7 -73 -27 -12 32 14 3 -3 -6 -26 -49 33 -53 -11 -33
5037c3O1p8M9L0k3pM7k3J2k8L5k9K9o4L5J3m6K0J6k3m1O3o5M3j6L3m5L1k2K7J0
$$ -33 28 -50 -1 29 6 -1 46 23 35 7 42 13 42 -22 13 26 -20 0 16 -7 -48 15 -50 -7 -23 10 -35 -4 -26 1 11
5068A1%K8o6O5rk8KJ6k1k4K5rO8q6M9K2o2K6Lk4J2O9j23L0QO7n0l0N2j4Kq8j0
$$ 11 11 39 -27 38 29 1 3 19 -2 -26 -1 -10 58 -28 21 43 -19 7 10 -14 -2 67 -56 -26 -18 49 -1 -31 21 7 9 -79 -89
5101h9J42m1nj0Qo0R0l3j0m9L8oL9p9KR5l3mk9N1m3mK5rk4O9J4j7p5qL4M8m3O5
$$ -89 53 12 7 -3 5 -55 35 2 -8 -57 -19 -25 14 -65 -63 32 -1 -5 -34 17 -26 -30 -5 -14 -38 31 45 28 -47 -55 -21 27 -16 49
5135D9rn1pJ3Oj5J1J1NmRk4Oj2KM4j0l9M3Ln0j5MO4Oo7j5J5L9l7O4m6nOJ2j6K0
$$ 49 40 -11 -18 -5 1 -14 -3 8 13 9 18 -6 0 -12 -10 34 24 -15 28 31 -19 -34 -30 34 40 -27 -42 -27 12 -25 39 -7 -12 -6 6 -10 10
5172A0oL2r3M2K2j8M1k2j1nM6o9N5%q8M8j5kK5l5LP6pn2L6o0J1R2n5m1N9m5pj2
$$ 10 4 36 -57 -15 7 -11 30 8 -3 -8 38 -31 24 24 -64 -16 -31 -33 -8 -43 -40 36 29 -23 13 -47 -36 56 1 -40 19 -26 -33 -45
5206d5O0K0o5Pl2OL6RK1Ql4k4K4m4o1J20K4n0k8J25n1k1l0M4j1kr3J13qPL3o2
$$ -45 15 35 -30 -23 -55 -49 -13 -4 17 25 -9 -33 -9 -53 -114 6 30 -20 -48 77 26 5 -25 19 8 6 -87 26 18 25 58 -4
5238dn8J08Oj9k2k6j0J0k5j0P9n1J2k9J13j03k6P9po0O9J1p9K7m7L8J8j9jJ8K7
$$ -4 -62 46 52 33 11 -15 -25 -15 -40 -50 29 -22 -10 -39 74 -29 -55 24 17 -43 26 37 -42 -15 -62 -24 -6 -25 -26 -8 19
5269A9o6P7ol3l1K0j6N4O1q1o4M0Nk9N1k1P8o2q9P5O3n5J1M8n5l5N6n7O1l1P8
$$ 19 -47 30 24 -9 -40 -20 -36 18 79 -2 -66 -26 -21 -50 1 -20 58 -4 -93 -18 45 -10 1 49 -6 -41 15 -42 19 -12 66
5300F6q0j5m2lP7M3j11J13q0m0J17k9ll1J7l7MK3j4lO6l4ol8K1k8Q1Om8L6Jj3
$$ 66 -14 -29 -71 -74 3 46 -65 48 -32 -72 45 16 13 -18 -1 -38 -34 -11 -25 -28 38 4 -2 -40 -19 -47 34 40 -8 28 29 16
5332A6j3J4QPq4L5N5Oj04M1J6j7J4O2n3k3NM4kq9LJ5l4N7J6N5l5r2N4j6lR7m9
$$ 16 3 17 25 32 -52 -17 38 44 -60 -19 -3 -20 -6 56 3 -20 -15 29 27 -62 -59 -44 -78 -21 -5 50 15 -77 -23 -39 -42 55 6
5365Fj9K0l6M5K0m6L6K1k5n0J13q5k7N7K4j3l8J1pJ2p7Q7l4j4k4O4j4n0j2K2r
$$ 6 -13 7 -29 16 36 -10 26 47 22 -28 85 0 -27 30 54 41 3 14 7 19 -58 29 -5 -19 -43 21 7 -43 -55 -33 -42
5396d2P9K8j5l3l3j0j4R0m3k0Q5p9j7l1K9m2L9O1j8k7l7O5M8p4J1K9k0j8m8K4
$$ -42 37 65 50 17 -16 -26 -40 50 7 -13 72 -7 -24 -55 -26 -68 -29 32 14 -13 -50 15 63 -11 0 29 9 -9 -57 -33
5426c3%KJ6J8J3m7J6N6j7k4pK8q2P0l4N9m7L5o1QN3J9rm5LLRj9n5J26o7J9m7J1
$$ -33 -33 -31 -15 3 16 -31 -15 41 24 0 -7 21 -61 9 -25 34 -13 22 -39 -31 22 41 32 -13 -10 -7 2 -17 -72 54 -13 6 -41 -30
5460c0K6j0P5o7J9M9q6N4J2q7Q5l9n3R1n2JM3L5p2k0N8o7NQ0j7j3m2p7L2J00m2
$$ -30 -4 -14 61 -6 13 62 -24 30 42 -45 40 1 -52 39 -13 -12 31 66 -6 -26 32 -35 -30 50 33 20 -22 -99 -67 33 -9
5491iM5m3K5r1J02j1m2Q0o6No0K0L6l0N8q9N0K9J6o4P3nj6M4o2l3K6J1L4n8J2
$$ -9 36 -7 18 -73 29 18 -24 56 -10 -5 -65 -45 -9 -39 19 -70 -20 9 25 -39 34 29 13 57 -5 -38 -12 -1 33 -25 -13
5522a3L6rq7R6M2o6M9p4O8r7K8ML8M9r2L3l8oL8N3q0l4J5K3%P2k4l8J3j8j4JR4
$$ -13 23 14 -73 23 65 -1 48 -26 42 -55 -27 -23 15 64 -28 5 -33 -39 -1 52 -28 -62 -47 -24 -24 48 24 -14 -1 -19 -33 -32 62
5555F2l5o5O0q9nO7L5m4O7m0j0j5l6P0OKl0m%o0J14j3q4P9K0j21J04o1J1P2q0
$$ 62 27 -38 22 -67 -72 -5 30 -14 53 13 3 -12 -48 22 28 30 0 -4 -4 -64 50 37 -47 32 52 -69 35 -26 -15 57 -23
5586b3L2k5mKJ6L2j06N1N8q1LQ9n7j4j9KL0m8P1KM0j26j0Q5l6P8mk3Nk3j7%M6
$$ -23 9 -16 -20 -18 -2 30 -76 -25 33 -48 -45 44 -13 -27 -46 -44 -14 -62 9 11 51 -75 -85 0 -36 42 38 15 20 -3 -20 -20 26
5619B6k9l5M5m5K8ONj5nqK6m1%K3mK8K0l1L7o7RM5Nk0N3k7q5M7k4j9O1J0p5L3
$$ 26 -3 -38 7 -38 -10 -4 1 -14 -19 -27 -1 -42 -42 -19 -23 5 25 -6 31 -36 -27 18 23 3 56 29 -56 -9 -33 -52 9 19 -56 -23
5653b3J2K5j2Oj6k1J2RL2j6jM6o8j0L3LK2q5N2m0K1PM0j0P2o4l8J7l5OJ2L9k8
$$ -23 -11 14 2 8 -8 -29 -17 -8 24 8 7 53 -15 -25 8 11 33 -52 0 -40 -19 -12 28 18 90 26 -12 5 -30 -24 -12 27 -1
5686am5qM6K4m7N7M7j19O1M1r7L9KJ0m6N1q9N9M3l1m2oj4K0K8N2o9P0l5lqL6J7
$$ -1 -46 -54 -8 16 -31 26 73 -46 15 56 -41 -2 0 10 -36 15 -74 -15 28 -3 -45 -51 -65 -45 -17 35 -34 36 1 -2 -10 26 43
5719D3Pm1L1K0l0o7L2N6o0k4R1q2m4P8L3l4n7M1n7l0Q2J0R8j08%j1j1K4L9J5p0
$$ 43 50 9 40 60 30 -37 -5 51 -9 -33 58 -24 -68 10 43 9 -48 -7 -64 -94 -12 -2 96 -12 -12 -23 -34 -10 29 44 -26
5750b6k2L7o3J2M7K3L3pq4J4O3p8Q6n7N7n5MO6m7l2R6r0qM1n9P4q%%l9J0M2k7
$$ -26 -48 -11 -74 -62 -15 8 41 34 -50 -36 27 -51 35 -22 35 -20 -16 50 3 -29 67 -23 -31 10 -49 25 17 17 17 -22 -12 30 3
5783Cj5M9m9j8Rj2N3j6J5k2o8N8l6Q1KJ9k8J6q0nL8L2j1L5n7M1j5J4m4N9m4kO
$$ 3 -12 37 -12 -30 -21 -33 20 4 19 -3 -71 -13 -49 32 34 53 25 41 -39 -44 -6 26 15 50 -7 34 19 33 -11 48 4 2 8
5816HL1k1MJ8l7M0m8jM0q0L8Kk1N7n3L4j1LMl8j4K9n2J14j9K6o0%l4j2N4j3J5
$$ 8 39 18 22 40 3 43 -5 -6 34 -46 -8 -6 -27 30 -23 11 0 3 7 -31 -45 -16 -68 46 27 53 -7 -7 -41 -53 1 -12 3
5849CPPr1P9N8m8m5P6m9Ol0P4m8L8rl1mK2l8O0k2lL1r5L8k2P6l4j6j3o4J12Ml5
$$ 3 10 17 -74 5 63 15 -30 46 -3 3 -27 47 -1 37 28 -3 -7 15 -23 37 15 12 43 -52 -14 -36 40 6 -10 -23 -87 25 29 -6
5883fKN0p2l3Q0p4M9L7nMk7n5L1M3l5K1k2jj8qK0M6K1k3j05J22o9jM2l7J6k7j9
$$ -6 -4 46 -26 -59 21 -53 -4 33 28 32 5 -50 -19 24 -11 10 -12 -13 -31 -39 -19 27 48 25 -80 42 -27 -28 14 -23 -7 -34 -53
5916e3J1j3L7N7p8L3l7N2k8L0M9l5p7M6M0k5J7mq6N6L6r0N6lL9j5l5J0j6N0q2
$$ -53 -42 -55 -18 39 -39 -6 -43 9 -19 11 60 25 -52 -6 34 9 26 22 -64 -8 28 -62 -6 -9 30 15 -20 -10 -26 24 -58
5947e8O4K2Ljj2j7k3N6K1j9k5j3K2kk0o0O0K2m2M7l7NN6n0o9P3k8j4N4N0m5n7
$$ -58 6 28 31 30 18 1 -22 34 55 36 11 -2 20 18 -2 -62 -2 20 -22 25 -12 -7 49 -1 -70 3 -25 -39 15 65 20 -37
5979c7N8p2P4K2j8k1k9kJ4Nl1k5P4l2kJ7N5q3P6l6n5P6j06Q2M7j3n1O2m0l1O9
$$ -37 21 -51 23 45 27 6 -23 -25 -11 -6 -37 -62 12 -20 -22 -5 50 -33 43 7 -48 28 -78 4 51 38 -13 49 9 -22 47
6010D7m0K4O9n0m3jKk9M8J9l7p3J2M2PN%J3m5K1KO4q7O8Qo7O2j5m5j1L0J2r9J07
$$ 47 7 31 100 50 7 6 8 -21 27 46 9 -64 -52 -10 -3 2 2 15 -30 -9 -7 57 -30 38 46 -21 41 26 -19 -30 0 12 -87 20
6044B0n8Q5jn5K1J2l3o4M4pN6m7K0j7RN2r5P3J0j7k6loN2j4j6K1l4qL7n9l1J3
$$ 20 -38 47 46 -9 12 24 -9 -73 -29 -36 20 -27 -7 -24 -15 37 -58 15 25 8 -18 -21 -27 25 11 -5 16 -18 -26 11 -48 -79 -66
6077f6J02p5L7m7J8O7k7k7Rk9P5j06P5O4r6N0J0q9Q2K4p2K0mkK3k4%N5p1R1j21
$$ -66 36 -39 -2 -49 -31 36 9 -18 -9 -38 37 -69 6 70 -26 24 34 -55 27 51 -21 -1 -5 -7 16 -8 -8 47 -24 67 -54
6108e4Q3l2l0Q5m0k3K5k5MmN1l3l2K0J4J6m0m6P6k2J7j6mn2L3K1k5M1nk5l0Q1
$$ -54 29 -3 -33 52 12 -11 14 -11 -7 -11 40 7 -25 -5 9 25 -15 -61 15 -7 10 -6 -10 -62 -29 -8 -33 8 3 -22 -52 29
6140B9n7K0K0m4K0L9k3M5M5p3j2Mj3k0N0n8j1j9j0J19K0l9J8L3j06N0m0K1j7J7
$$ 29 -28 -8 12 -32 -12 27 4 49 94 21 9 13 0 -20 30 -28 -39 -58 -68 51 71 32 50 83 -23 27 -13 8 -9 8
6170Hj1J3j5q4P0j9N4nJ1o0K6J3OK9l1lk9oQ9q1kRK8L4p1K6K6n1O1K8p1j0m1O1
$$ 8 -3 10 -5 -89 -19 -38 16 11 22 -38 -12 1 7 36 5 2 -27 -33 56 -25 -27 -18 10 44 -27 -1 25 -26 35 63 -8 -18 -59 2
6204BM8q8N0q4K0O0j7j9L2O5o2j9NLoJK4m3qK7J7k4oL8n6P6n9k7P8K0l4l4k5R7
$$ 2 50 -38 12 -72 -52 8 -9 -28 4 69 7 -12 -7 -4 -10 -9 15 -28 -36 -9 8 -16 -22 16 -40 36 -23 -50 28 48 14 -20 -45 52
6238E2lj12K6Q8k3l1l3J2P1k8p8M9N4p0L2Mk0j9K7K5j4rM3n7L5o7O7m4M1j9L9
$$ 52 49 -63 -37 51 28 -3 -36 -24 47 19 -59 -10 44 -26 6 10 -10 -29 -2 23 9 0 43 -14 21 -46 21 -23 18 -1 38
6269C8n8Rm4J7M8k4l0P1Pk3l4l%K5N1k0l9jK8m1N3n0O5j6j2k3M9n3pK4K4n7J7
$$ 38 -20 -11 -55 -38 10 -14 -44 27 34 11 -23 -26 -26 -1 50 30 -9 -10 18 -23 30 -20 45 29 17 -6 43 -10 -17 7 31 -26 -9
6302ij2J3k7kN9j0J9o0M1mn1L1j3K9K0k1Kk4j3L9k3K1n4R8q7RN9o2K6Jm4L4O2
$$ -9 -21 -8 -35 -37 22 12 31 -29 12 8 -43 -12 -25 4 24 3 5 -19 -32 7 -16 5 -49 49 -38 -29 30 -32 -6 -5 -49 -15 47
6335D7o9O8m5k4K5oJL0l2l0j6Q4jj7J3k1R1r9J2M0j8o1N2M3m6l7n6K2M8Pl6oJ2
$$ 47 -22 46 1 -23 2 -4 -3 27 -5 -35 -51 33 32 15 28 7 98 -1 11 51 33 -28 24 67 21 -16 -72 -50 -2 5 -31 -37 -25
6368b5J2K1n7N4n6N5mK3m6l1N4N1k5qj7l4L9K4Nj3L9l7Jj4j8K6rK1mJ0l7k7O0
$$ -25 -13 8 -49 5 -51 4 0 23 -23 -54 0 51 26 18 1 -33 6 30 35 22 61 24 25 11 -7 19 10 31 27 37 0 -27 33
6401C3k0j0P4m8j7l8O7m4J5j0K4l9K0NK1n2J8K6J4no0K6oj3J0K1l4M9N0n2l9r
$$ 33 13 3 77 29 12 -26 41 -3 12 2 26 -13 7 12 33 -19 -1 25 39 34 -26 0 -6 -19 -9 12 -22 27 77 25 -14 -23
6433b3J0%qj4QM0J0Qk0k5j9J32j21K3j5l6R7m1q7M4N1J0Lo0J5Q2r8L1L0j1Jm9
$$ -23 -13 -13 -21 -35 -27 13 23 31 11 -14 -33 99 -22 1 -14 -50 47 6 -81 -37 14 24 27 -33 -18 64 -34 -3 27 16 17 -32
6465c2Pj3L2K7r0K2P6L9j2o0j5JK2jn1J00q4O5M4q4J2KjK2M4j37R1Rl6m8QRK8
$$ -32 -25 -38 -6 21 -69 -47 29 68 56 -4 -19 -18 4 3 -48 52 -32 33 77 -7 5 7 6 28 72 -65 26 35 -1 -49 -41 -32 -4
6498dj7J3J6J3k2MJ3l4LpJ2k9M1oj2J7J6l9P5p4%pk4O8Lj6L0Nl0lK1j8l6K7j3
$$ -4 -21 -8 8 21 -1 3 16 -18 -15 -22 -10 -39 2 -4 -16 1 17 -22 53 -21 -21 -28 -52 16 19 3 33 38 8 5 26 8 -28 -1 -14
6533a4L2k1j2N8rrq3K6L2j5k1L6k7l0M9Kj2m1O9pj6K6M3n5J8K5j36J21Oo1l1P8
$$ -14 18 -3 -15 43 34 25 -58 -32 0 -15 -36 0 -27 -57 -8 -6 -18 -59 10 3 -13 13 56 1 19 44 -92 29 35 -26 -57 21
6565B1l8L5k9J5L6j3Nk7k3O5k0j6K5on1k1Q1k9l4N4No3MJ4N4jl9K7Ll1jK6J1k4
$$ 21 -17 18 -11 4 40 27 32 5 -18 47 27 11 36 30 -21 -42 39 10 -24 30 35 -28 -24 -10 44 43 4 31 34 3 2 28 39 15
6599A5K9l0n2J1Q2o7rj3rJ5olK7K6m0k6%Q0j3m8K7J7m1N3l6OM9l7K8l6J2ONM5
$$ 15 44 14 -38 -27 55 -12 -21 -34 -43 -28 -34 -37 -10 16 -24 -50 -50 30 17 -31 -4 13 -28 25 -11 -5 44 7 35 -1 11 17 22 67
6633F7l4n2N0m9N9o4PP5j01RO7rj4l1M0m2K2k9nP6l5J2k2m2P2j3kJ6k7Kk7NK2
$$ 67 33 -19 31 -18 41 -23 -16 59 -42 -33 34 25 11 -20 20 -22 0 -29 -34 42 7 19 -3 -45 27 14 12 28 1 3 -24 -19 3
6666CN5o0l0K0J1K5J3j07O2M1k4k4K6J5k6L4k4J1j2p0L8JL1J9k2J1l%k2N3p6J7
$$ 3 58 -2 -32 -12 -1 24 37 -70 -8 33 9 -15 11 26 0 34 10 21 9 -61 -23 -22 9 28 6 17 14 14 -8 45 -31 -14
6698a4p0K7MN4L0pk2K9n3L8k8K6k2J9nKj8nR0r4nK4JJ3L1q6P1j8J5pk7L3j5J8
$$ -14 -84 -57 -53 1 31 24 2 31 -22 16 -12 14 -8 11 6 8 -10 -15 75 -19 -24 0 1 14 45 -41 30 12 27 20 -7 26 11 29
6732B9l4KK3rKm1n7Q7q6M6lO5q5N6lp3N0J7ML7j1j1nl2K6L2k6j1K3l4M5n3J7K4
$$ 29 -5 -3 20 11 13 -28 -85 2 -84 -38 -41 24 -61 -5 -8 -81 -31 -14 -10 27 16 5 0 -32 -6 26 0 -11 12 -22 23 -30 -13 11
6766A1Nq0L7N6l2l6J09o9n1N8M6k7j8k3J6K1j7M3o0L7ML7q4Q0j14L4Pm2j1K6N
$$ 11 16 -64 -27 29 -3 -39 70 1 -50 8 54 27 9 -14 2 23 6 49 -11 26 30 67 -17 63 -51 -17 -10 -52 -63 -37 -32
6797c2k4P1k3K2l0K8mqMl7N8l0k4K7m1N1K1m3M0j2J4jp5K9L4ol9j2P5n1K9oj4
$$ -32 -56 15 -8 14 -16 12 8 0 4 -33 25 -5 -29 -2 -43 8 29 -14 26 14 28 27 -48 -19 15 9 -30 -42 33 -18 11 5 -9
6830iK6j8jPl9J4lK7k9M6k6Lpnm3O2nn%k1M7j9l6N1lLn0j3J8J3N6n6L3K7l1J2
$$ -9 17 -1 -2 5 -34 -20 -23 4 -25 21 -5 -2 -9 -14 -57 5 0 -5 -5 -26 21 2 -34 17 14 17 -33 -46 -28 -15 41 -15 18 45 14 26
6866B6k4rl7j0J04k2QQl3k6m5R4M5j18N8j4l6J5j2M7n2L1jm3N3l8PP3o4Oj9J3
$$ 26 2 -7 -44 -54 50 28 36 44 11 -15 -60 34 79 -39 19 5 -31 -16 -28 19 -33 -2 -3 -46 7 -31 -24 49 -15 -9 -28 -15
6898a5Ml8O1Rk9J2K3m2K2j0l7J4K5j0m3R9k7qj7PL7k7o2J2O9n1j0L2Rn1J1K1%
$$ -15 -11 -49 12 21 -8 4 27 -15 7 -3 -40 -26 -1 -11 -54 45 18 10 -7 0 37 10 -52 -40 29 -22 -32 0 9 -42 -31 -10 -10
6931a0kJ4j2M7l8o0M9lJ4K4q7N8rj9OM5k8L9o0K8m0M2k0NORM2m5K1m4K1P2o9n5
$$ -10 -12 2 -10 37 -1 -61 -12 -15 -1 23 -64 -6 -15 -34 -28 17 -11 28 -32 -4 -44 -2 -22 -17 -11 -2 40 -5 16 -28 -7 65 -4 -59
6965e9N4LKpnR7j03pP8j7o5M0KNpj7k6nK3L2k7J1k8j9P5j3j0k9L5j8KQo4R9o9
$$ -59 -5 -2 0 -7 -12 85 -18 -25 53 36 -29 11 13 18 11 -6 -32 -37 -14 18 -9 2 -26 -45 30 17 7 -22 13 -5 -3 5 -59 40 -29
7000b9M2o0L6J4o6P3l7J8L5k7j9l3K5M1j3N5k8r2M9J2J0J2O3j10K6k7Ql1Q6n3
$$ -29 13 -47 -11 3 -63 10 -27 -9 26 -1 -20 -53 -28 13 0 55 27 -65 -16 -4 6 18 81 -29 -3 -30 -22 -53 33 -20
7030b0KRMK3N3o0K5p7L2n7J5O9l6P1p5Ql2L2k4O2q4O5K5k3m6JN9o0RQJ4j4R9q4
$$ -20 -18 -9 -5 18 71 11 36 -41 -9 -66 -51 18 -18 53 -22 -14 -46 -14 -38 24 -60 5 30 7 -39 -38 21 -39 -30 -22 -8 -22 77 -7
7064gk2N3l3N8p8J2P5rl9Ll0K0l9P0Om4rL8m5j3N4k0o4O6k3M8O4r4L0n0Pk0O6
$$ -7 -29 24 -9 49 -29 -17 58 49 10 13 -17 3 -36 34 40 -4 -13 25 -20 -33 21 1 -63 3 -20 28 92 -2 28 -22 -15 -35 31
7097C1Qk4j9k0J9M8o4O1m8J1LO0n2K5q0mM3J3Pk6L4l6mJ7K9n3N6J2q8K7K9J8k8
$$ 31 39 15 -4 -24 -5 43 -21 40 -8 3 6 66 14 39 -41 -45 -2 11 18 -8 26 -10 -14 3 32 -21 35 47 -41 -14 15 33 5
7130Em3K7J0N4l4l9L0M9p6K3k5OLM0k6l0%J8RJ8j4lN2q1K1M9L6r7O1o7M8Oo0O
$$ 5 -38 -11 -1 53 19 -20 10 59 -17 6 -19 -13 -10 30 4 -26 -26 -8 1 19 5 2 54 -27 -6 43 79 -18 43 -24 24 30 -30 -24
7164b4N5j1l0j9jJ8QM3l9J4J8n2J8j0O1m0jjl8M2l0j1L9j6M2m7k0LK7j4l0K0M
$$ -24 31 20 -10 -29 -30 -12 -4 39 0 14 32 -20 -2 -12 49 9 8 7 -31 11 -19 -30 9 -7 35 -12 -32 -29 -2 -16 -46 -26 -22
7197b2O1l0JK9j2Pn2K7pl4O6n9L9j6K4l5L9J1k1pl9L2K9n0p4Q1l0mL3m2P6J0k9
$$ -22 39 9 10 39 27 34 -18 9 2 -32 34 -25 14 -2 22 -13 26 37 16 9 -30 2 31 -19 -93 -12 -42 -46 -13 -55 21 31 2
7230Bj9N6p3L8l6J3P8p3Ql5M1k8%MJ3K8L2Pk1j5m9K7k1N2o0R7n4j7k9J9R1j2N
$$ 2 -17 39 -34 4 -32 -19 59 -14 -6 -41 0 -28 -28 -24 -11 17 49 56 35 20 -29 -2 -23 29 -31 66 12 -5 -34 -15 76 64 69
7263F9n9l1J5N8m1L4k3l4K4n0PK3kK9K3k8j2LJL0l1j7L5j6j8j8K1K0K2l5Ll6K
$$ 69 10 -21 -6 52 11 45 22 -12 12 -38 -31 -8 -10 19 42 14 2 5 6 36 5 -12 23 7 -11 -29 -8 12 34 -1 2 -34 -32
7296c2M3pl3N9q2L1K6J3l8nN7K8l3m2M1QJ2l0rO2r6O8o6j9R5k1l3J8k7j5qN8J5
$$ -32 11 4 -29 30 -52 -21 5 18 -20 -25 32 60 27 -15 26 34 46 16 7 69 -27 41 -25 -44 51 30 -3 15 -12 -27 -35 23 38
7329C8p9j3K5j6N6p0J06n0j9m8M7Rk0pJ3J0L1Mn0K7J6l4J3K7mn5oP3j1j0j8n3
$$ 38 -41 -54 -29 -45 11 -59 47 -3 -22 -70 -23 -14 -34 -41 -28 -18 13 17 -33 -6 10 -24 -11 16 12 -43 -49 24 13 3 -15 -68
7361f8R1jpK6j7Qn1O4j1o6j7O1j05M3M1JL2m0nK1M7m7j8PJ6n9O3j02N4P1j8Lj9
$$ -68 23 22 15 41 24 32 -19 45 34 -32 -49 12 -93 -50 -9 -8 24 -16 -21 0 47 0 -18 -11 5 -54 9 -93 -39 32 14 17 -2
7394bj1L5k1k3P1m8L5Op0J08l7l8M6l6k2K8j1jJ7n4ML6m9l5j1O1j4MJ9M4m4P5
$$ -2 -13 22 1 -22 49 1 36 42 -28 80 43 5 51 15 -7 21 10 9 26 -28 -24 12 -37 -72 -83 -22 -36 -32 -13 31 -13 62
7426F2j09lO1J8q6K6K8rQj4M3km8K2n1J1L4k5L3oJ5m1P1Jj3pMjk8N1j5k1J2l9
$$ 62 -47 -50 11 29 -57 -31 -3 -12 -4 -18 25 23 -25 -3 -54 -43 -9 -34 -1 -7 8 -33 38 39 26 19 23 22 -6 45 30 9 21 -18
7460a8K8l9J6L2m1J3L5M4q7l6L1l8P9n6j6Q2K5p1M0o5N3J3n2J3L6K4m8%M0J7o
$$ -18 10 -29 -13 19 -22 -9 26 70 -17 -53 -22 -60 19 -37 -53 29 54 -17 23 -42 11 24 -28 -15 21 45 -3 -3 37 54 48
7491D8m9j5K3QN3p9RRJ5jl4K6Mk5L7l%l2rO8m0k9K2pK1n5m2L4K3%L4jk6M1p2J0
$$ 48 -1 -16 7 15 68 -11 -2 7 22 21 -13 13 17 -8 29 26 26 -6 -15 53 13 -16 6 -1 20 -35 -77 -43 -20 -20 14 13 -13 28 -44 -34
7527c4K5j3O4o2M8k7j5L7o9L1rL4k1K6JJj9qK0Pm8K1K3m3M7j%J1%j8M8j8n1k4
$$ -34 -9 -22 42 -20 28 1 -14 23 -46 -15 -24 10 -11 15 16 17 -2 -10 10 17 -31 -10 13 -30 17 16 16 27 27 9 57 39 -12 -36
7561c6K4l9J13m3J5j6k1Jn1N5l1O0k4k8n4J8J6N3J4m5J8%N2l6j6M3n5K5l9O8k
$$ -36 -12 -51 62 19 34 18 -3 -2 -53 2 -29 31 7 -21 -75 -57 -41 12 26 -19 -1 -1 51 15 -1 42 -13 12 -27 41 39
7592C9p6J13n8k4Lj7P6k5p8N2L5o2k4N1J4m3M3K4k3O5j34N4l6k4P0n8PP0j4J7
$$ 39 -37 76 18 -6 -3 -20 56 31 -47 5 40 -22 -46 5 19 -24 19 43 20 85 -49 5 -31 -55 15 -43 -36 34 20 37
7622C7On2n4P4jJ3Mn3N6P0j58N3ML1mj0J8l5j9J00j13N3%j23J16L3Rn8l3P0l8
$$ 37 43 -9 -63 11 10 23 27 -26 30 100 -58 -5 -1 30 26 16 34 -1 -20 80 -33 20 20 -103 13 46 55 -3 -36 34 -4
7653dlO4q7k2P5j4K3l1Ol2L0Ll6K9NL8o5mj2K8J5J3jl0N0m0L3n3K2Ok2L9K2m1
$$ -4 -7 57 -30 -52 23 9 32 1 7 -25 5 8 -28 1 6 44 -21 -25 -37 -9 6 19 18 -12 38 -2 31 -22 0 6 -16 23 45 4
7687Dj1P3l0n3J7m4R5j3k7J5No8N5N6o2n8J5N8q1N9K0l2l2N5m1J3mQ1q8rK8K1
$$ 4 -7 66 36 -17 0 -44 51 38 11 26 31 -37 18 74 12 -46 -31 27 -54 5 25 -7 -39 16 -25 -12 -16 65 -23 -32 -4 17
7719A7k8j1K3n5K8PK1m6O0m1P7j40Q4Rl4N3nn1%k3M7K8k8LnJ5k1O2p7N6l3K1L9
$$ 17 -11 -22 1 -54 -26 -19 2 -44 16 -25 52 -88 -4 5 -29 24 19 -32 -32 -55 -8 20 -8 -5 -10 5 -16 46 -31 25 -8 13 52
7752E2q7N4m0K6Om5P0m9RK0k2k2m4M9K6Kn0LM1L2j2n1PPL2l5oK7l8J06m6j8k8
$$ 52 -35 19 -21 5 11 -34 36 -13 -4 16 -6 -28 -72 -23 3 5 -45 -42 -1 31 19 -32 -25 -18 14 -21 -27 0 -38 68 22 4 -24
7785b4L1o6R7o0N1k5j9mJ1Qj2j3M8n3M5J1rj4jlP0k5l5O4p9q7J16l2J6l5P7l5
$$ -24 7 -59 38 -22 29 4 -15 -19 -8 0 -12 -25 23 -30 15 26 17 3 2 -1 69 44 9 73 -6 -93 23 -9 7 -28 49 14
7817A4Pm9K2J7m4M6l0%J3koO0j4J2J0q8K5M2n6K3kk2N1p5O3l6J7JL2n0k3P1q9
$$ 14 21 -28 -6 11 -33 13 -17 -17 -4 -6 -12 48 34 46 56 -32 -7 35 -21 2 0 -22 29 -46 17 -19 -2 -1 31 -19 -42 29 -60
7850f0P6l0QK9q5N5J3K6n4nk3J3N5ml6p0R2M8k2l3L9q8Q4r3K8N2Mk8K8J5k1l6
$$ -60 16 -14 -6 23 -62 -7 6 32 -22 -27 -50 -37 18 14 -22 -92 0 48 26 -7 32 -56 28 -65 -37 15 19 -9 19 34 13 -23
7882b3L0l6qN1k3N8l4m1J0M1n4L8lm4N1n3M9l2j5N9p5N6J4m8OK8m1O8j2n0R1o7
$$ -23 7 -29 -37 14 -9 49 15 -26 -16 25 -29 9 6 -38 13 -40 9 -23 -38 21 -54 2 16 -32 -26 2 -39 29 17 -33 58 -9
7914ij5j5P7K5j24K4M1l1M3j4rJ1n5P0k3N9o1P2p5L9L2n8J7n4K8l4N0n1L5l2m9
$$ -9 -24 -39 38 63 -61 -37 4 -27 16 2 -7 4 -51 19 -4 55 -6 66 -9 30 62 4 21 -33 -5 -39 11 -40 -5 -37 -86
7945h6R8l5j2L8JM8j1o3j8R9p4K2km9P3l2o3P9rj1O3n0m0J6%K2J0J0j2L0o2l4
$$ -86 12 -23 -35 3 4 52 41 -22 -40 59 -15 7 5 -44 29 -3 -66 13 4 -7 56 6 -34 -18 -18 4 14 24 12 42 -20 -54
7977e4M3j4L6k5K2rJ8k0rM0om4K9l7J1m8P6n0K5nL9jK9j8l8O%Ql6Ok6MpM0K5L
$$ -54 -11 -25 11 -14 8 -1 17 -3 -12 28 22 -22 7 -30 -19 -67 9 -41 -16 -21 18 17 46 28 -10 -4 -4 4 -32 -26 -52 -48 -55 -15 10 13
8013A3rN1n0l9J1P2m7O1n9J9j1l9k2J03o5QO5n0J4k7L9k2K5l9J0k8M7m4K5O7m6
$$ 13 4 55 5 -34 -23 49 2 63 4 23 12 -27 -49 54 -11 -3 62 12 26 -1 38 16 41 2 12 -16 31 -13 12 79 33
8044C3o1J2rL7J1q9%O0K5m8L1m1J02o0l8M9k1L6k1K9k3j6j0l5M0RL4j2L2m4rm1
$$ 33 -28 -16 -25 12 23 -66 -66 -6 19 -29 2 -39 63 3 -35 14 -7 29 8 37 14 -2 -12 -47 -7 2 36 24 56 12 3 -38
8076c8L5k3pLK4K9k5Pj1L5j6K4k1j0J0n2P3p7j0M7L6p7K9M7M1p1l4M5n3M7Ql0
$$ -38 -3 -26 -33 -30 -6 23 -2 5 -6 29 13 37 16 6 16 -36 37 -40 -50 -3 33 -44 -15 32 73 2 -32 13 -40 7 15 -15
8108a5l4L0j4M2l3R0p0k0L2Jm6P5K1q3L7j0R2n3JMl1J9p8M2m5L8l5N0Jmkk5j9
$$ -15 -49 -19 -33 9 -24 66 -4 -24 8 9 -37 38 59 -24 13 3 95 42 43 47 16 35 -43 -1 -46 -8 -43 7 8 4 2 -23 -42
8141d2J2j3K3L3o9O4j6lL1l1m6j4L9J2L0n8J1N0M6o3k9L4K7k9J0k6N2Pj9n7R0
$$ -42 -30 -43 -20 13 -56 8 -8 -11 20 -11 -57 -71 -32 -20 10 -48 -37 13 59 -4 -33 1 28 -1 9 -17 35 42 23 -34 56
8172E6k6m9rN0o8Q7m6J9J2k4Ml0L6m8L6J6n5J7O
$$ 56 30 -19 -28 22 -46 41 -5 14 26 2 6 -24 12 -36 0 16 -39 -22 -16
8191a6
$$ Imaginary data points
##PAGE= N=2
##DATA TABLE= (X++(I..I)), XYDATA
0@%%%%%%%%%%%%%%%LlOj4J6j6J6k0K8l2L2l6M4n0N6o4P2q2R3j02J13j28J43j59
$$ 0 0 0 0 0 0 0 0 0 0 0 0 0 0 0 0 3 0 6 -8 8 -8 8 -12 16 -16 16 -20 24 -26 30 -34 38 -44 49 -53 60 -68 75 -84
39h4J77j95K16k39K63k90L19l52L89m27M69n19N72o31O99p73Q58r59J078j219
$$ -84 93 -102 114 -125 138 -152 167 -185 204 -223 246 -273 299 -332 367 -406 452 -507 571 -648
59f48J389j600J871k229K720l430M540o466J0397k1205J00851K86844m27484l06404
$$ -648 741 -859 1012 -1217 1503 -1927 2613 -3853 6544 -14661 86190 373034 -54450 -360854
73c60854L68715J34564l96442j2604M34426k4045l80278J22887L85930j30612
$$ -360854 7861 142425 -254017 -266621 167805 143760 -236518 -113631 272299 141687
83A41687l21261J60107K50037j94690k05594J93397J47776j99924j31728J60771
$$ 141687 -179574 -19467 230570 35880 -169714 23683 171459 -28465 -160193 578
93E78Q3552j55089n2597J79883O1971j84904o3303J89981N4233j95397l7874J95012
$$ 578 84130 -70959 -123556 56327 118298 -66606 -129909 60072 114305 -81092 -118966 76046
105G6046J0760j80148O0328K16768r3285k33554J18398K21863j51035j86379J83648
$$ 76046 86806 -93342 -33014 183754 90469 -143085 -24687 197176 46141 -140238 43410
116D3410J07033k68116q6678K82597L6588k78636J9389K60700n9915j94302J58931
$$ 43410 150443 -117673 -204351 78246 114834 -163802 -144413 116287 56372 -137930 21001
127B1001J97681j89350j77120J90597J21842k01572q2331J74273Q803j76705J7102
$$ 21001 218682 29332 -147788 42809 164651 -36921 -119252 55021 63824 -112881 -95779
138i5779J40954n0708j14256P7900J25149l8458q2363L9367O7681l9838o9552
$$ -95779 45175 -5533 -119789 -41889 83260 44802 -37561 1806 69487 29649 -39903
149c9903K8400O5273k1403n9815J9543M6560m6939o2778O6086P9911q0263q1223
$$ -39903 -11503 53770 32367 -27448 -7905 38655 -8284 -71062 -4976 74935 -5328 -86551
161h6551J05933Q3770j15001o5884J07364R332j21592M4385J52518n5439j44660
$$ -86551 19382 103152 -11849 -77733 29631 38963 -82629 -38244 114274 58835 -85825
172h5825O7280J12478r8895r0410J21444O6307j32614l6508J26895j4368j39473
$$ -85825 -18545 93933 -4962 -95372 26072 92379 -40235 -76743 50152 35784 -103689
183a03689L4868J30160l8444q8432O4293P2289o4826n0168O5326L6108o1679k7266
$$ -103689 -68821 61339 22895 -65537 -1244 71045 6219 -43949 21377 57485 -4194 -31460
195c1460N2203J3328n2832j4449L9997O084m2209j4896M0865L1203k7695k2593
$$ -31460 20743 34071 -18761 -33210 6787 12871 -29338 -44234 -3369 27834 139 -22454
207b2454M1970K1457n7568j7658O9931J1901o8857P061O6845l0529p1502L9945
$$ -22454 19516 40973 -16595 -34253 35678 47579 -21278 -14217 52628 22099 -49403 -9458
219i458O1726n8829o0140O5615M7937p1203k6544P7319K855p9445J8982P4496
$$ -9458 52268 -6561 -66701 -1086 46851 -24352 -50896 26423 29278 -50167 -31185 43311
231D3311l3483n4707N7430N3205n7421m6672M0258J7855m3388J178N3987k750
$$ 43311 9828 -44879 12551 65756 8335 -38337 1921 19776 -23612 -22434 31553 28803
243B8803n1629J420L1811j7280k4389K7561K8414j4379j6866Q542Q441j1798j4779
$$ 28803 -22826 -21406 10405 -6875 -31264 -3703 24711 10332 -6534 2008 10449 -1349 -16128
256a6128J0781K1922o716j7797J5008J8219k3239k3994J7504J5977j9481o818
$$ -16128 -5347 16575 9859 -7938 7070 25289 2050 -21944 -4440 11537 -7944 -14762
268a4762L0607O935l8156q834L3887n652l5416K3925M5341k2318l4088K4269J3391
$$ -14762 15845 22780 -15376 -24210 9677 4025 -31391 -7466 37875 15557 -18531 5738 19129
281A9129l7988p508M2136O613l6318R0L0103j3404l2357K1202L3046k1983k2193
$$ 19129 -18859 -26367 15769 22382 -13936 -13846 16257 2853 -29504 -8302 24744 2761 -19432
294a9432K8180J4408k7922m835K4669m827k6127K705J9050m322j4054R839J6252
$$ -19432 8748 23156 -4766 -9601 15068 10241 -15886 -13181 5869 1547 -12507 -2668 13584
307A3584j2359j8826J1128J6105q007n173J4760N776j4490r238O611M382r668
$$ 13584 1225 -17601 -6473 9632 1625 -3548 11212 16988 2498 -6740 -129 4253 -5415
320e415m966J3744N347j6375j743J9003l977k2170N643K0449n144j1671J3633
$$ -5415 -10381 3363 8710 -7665 -9408 9595 5618 -16552 -10909 9540 4396 -7275 6358
333F358J3594j6974j8836J1257J0947j5148l18K8592K338k9613k676J8116j0574
$$ 6358 19952 2978 -15858 -4601 6346 -8802 -9120 19472 21810 -7803 -10479 7637 -2937
346b937j6210J9005K0691j4281j7242Q854N393j8106m905K4081Q946j7654J257
$$ -2937 -19147 -142 20549 6268 -10974 -2120 3273 -14833 -19738 4343 13289 -4365 -3108
359c108J8973p693j9626Q357J5075r168j0766R944R295j0958j2510O046O086j0635
$$ -3108 15865 8172 -11454 -3097 11978 2810 -7956 1988 11283 325 -12185 -6139 -53 -10688
373a0688k221J9204Q017j3103j971J0926m775j4949L093J5683l9j4296l28J1116
$$ -10688 -12909 6295 14312 1209 -762 10164 5389 -9560 -6467 9216 9177 -5119 -5447 5669
387E669p334j4719J1456J6554j0422q848J6041O325j7143l265J6496j007k0637
$$ 5669 -1665 -16384 -4928 11626 1204 -7644 8397 14722 -2421 -5686 10810 9803 -10834
400a0834k060J7029j846j5622Q729J7501j2344j5930J3822J0992j3032j351J8494
$$ -10834 -12894 4135 2289 -13333 -4604 12897 553 -15377 -1555 9437 -3595 -4946 13548
413A3548P90j9210m439J1573j326j2509N337J6906l048j2951O034R046j0857q626
$$ 13548 14338 -4872 -9311 2262 936 -11573 -6236 10670 7622 -5329 705 9751 -1106 -9732
427i732J0383O361r094m236Q652K750j2669p379J1306P447p481L248J6804j150
$$ -9732 651 7012 -2082 -6318 2334 5084 -7585 -14964 -3658 3789 -3692 -444 16360 15210
441A5210j6355L4Q991p703j0736R427J2578q541j3470M683M301j2449n72K2146
$$ 15210 -1145 -1111 7880 177 -10559 -1132 11446 2905 -10565 -5882 -1581 -14030 -14602 7544
455G544O445j5919r7J3601n786j3522N972R745o726o410Q471M758j0976n194J0648
$$ 7544 13989 -1930 -2027 11574 5788 -7734 -1762 7983 1257 -5153 3318 8076 -2900 -8094 2554
470B554K110j1863N96J3038lr634l59K965l868k691M561M947k100l416N667P338
$$ 2554 4664 -7199 -6603 6435 6432 -3202 -3561 -596 -4464 -7155 -2594 2353 253 -3163 2504 9842
486I842m977q201L642N230m272k901M469j94q312l113P099K902p025p25R119k00
$$ 9842 4865 -3336 306 5536 1264 -1637 2832 2638 -5674 -8787 -1688 1214 -5811 -6536 2583 2383
502B383o694P470J0009q615j0446M979M019n170J957Q509k769j0942n69P167j292
$$ 2383 -4311 3159 13168 4553 -5893 -914 3105 -2065 -108 8401 5632 -5310 -5879 1288 -4
517dn434N434O737m647l617M083k089p041K042N318q90q7L528L59l499l916j823
$$ -4 -5438 -4 6733 2086 -1531 2552 463 -6578 -4536 782 -108 -195 3333 3692 193 -3723 -5546
534e546K452N273K227k692l594M1K366l84j916n20j280J535Q606L858r402p104
$$ -5546 -3094 2179 4406 1714 -1880 -1839 527 143 -1773 -2293 -3573 -2038 6568 10426 1024 -6080
550f080L389J653j573L627L212l382k611J983l4l522M65N743K090l742q12K934
$$ -6080 -2691 -1038 -2611 1016 4228 846 -1765 218 184 -3338 -2873 2870 4960 1218 406 3340
566C340p89k374N27j628k481L436L430k614k351J5j298M01K920j197l263J201
$$ 3340 2551 177 704 -924 -3405 31 3461 847 -1504 -1489 -2787 -2386 534 -663 -3926 -2725
582b725L352J94q65J155j10l411N9N367J188l776J245K336n698l514N774R21o552
$$ -2725 627 821 -44 1111 1001 -2410 -2351 3016 4204 428 1673 4009 -1689 -5203 571 1492 -5060
599e060N49N866r12k466M076J698n966k172P356L897m817j414M410k202o329J743
$$ -5060 -4511 1355 443 -2023 2053 3751 -2215 -4387 2969 6866 2049 635 5045 2843 -3486 -1743
615a743K977m198m31O866J185n813k055K235j96j911R88L180Q56j305m15r10k887
$$ -1743 1234 -2964 -3395 3471 4656 -1157 -3212 -977 -1173 -3084 -2096 1084 1940 635 220 -690 -3577
632c577k86M224L132p01k000p50J513M49l514k103K246O31q32K976J217n255k287
$$ -3577 -3863 361 3493 2792 792 42 1555 2004 -1510 -3613 -1367 -736 -1568 1408 2625 -2630 -4917
649d917N008K523l271L1M508J31m145L81K839l685m063N048M036m799j747N372
$$ -4917 91 2614 -657 -626 3882 4013 -132 249 3088 -597 -4660 388 4424 -375 -2122 3250
665C250n59n873J167M846j678l070K248J524l934k077L807J706m057q41M259P89
$$ 3250 2691 -3182 -2015 2831 1153 -1917 331 1855 -2079 -4156 -349 1357 -2700 -3541 718 1507
681A507k132J743K232k292k127J024M26j040k97R19Q79j054j803N61J396p24q27
$$ 1507 -625 1118 3350 1058 -1069 -45 381 -659 -956 -37 842 -212 -2015 -1454 -58 -782 -1609
698a609K037K154m59j626m48k81j587k68L157J579l101m58L650l61l730P20K447
$$ -1609 428 2582 2123 497 49 -232 -1819 -2087 1070 2649 -452 -910 2740 2379 -1351 -631 1816
715A816j591j164K745Q45l603k044J758J55k478J179M484K71k816P40J187k585
$$ 1816 225 -939 1806 2651 -952 -2996 -1238 -1083 -3561 -2382 2102 2373 -443 297 1484 -1101
731a101q95L224R84j806k14R14j202k069L3J621P52k58Q67P59j205j279O31M10
$$ -1101 -1996 1228 2212 406 192 1106 -96 -2165 -2132 -511 241 -17 850 1609 404 -875 -244 166
749A66o10j19K93L03K89m35k65O92l63q35J203J480p03n20Q13l96j916o13R99
$$ 166 -444 -563 -270 33 322 -113 -378 314 -49 -884 319 1799 1096 576 1389 993 -923 -1536 -537
768e37N71q04O3J280n00j627Q62J516j036o55J863L35j770M1J413l14j040p3L56
$$ -537 34 -770 -707 573 73 -1554 -692 824 -212 -867 996 1331 -439 -398 1015 701 -339 -412 -56
787e6l09k03J136J049q07j130N5k66q98P18J202pk72k96o75k75K91K79P66Q32
$$ -56 -365 -568 568 1617 810 -320 -265 -531 -1429 -711 491 484 212 -84 -759 -1034 -743 -464 302 1134
807A134k7m31j72m72l96K04J76J12q6j08J63J33r74m54O52Mk62J083Q25n35j91
$$ 1134 1107 676 504 32 -364 -160 16 128 42 -66 97 230 -744 -1198 -546 -542 -804 279 1104 569 378
828C78r6p57l96O50J096N27k31n13l93q43n69P52R88j66r4K4q53n25M41O9O3M53
$$ 378 282 -475 -871 -221 875 1402 1171 658 265 -578 -1147 -395 593 427 333 357 -496 -1021 -580 -511 -448 5
850EJ39k29n3J3J66L26r4l37p7P1L65O13k24p35j34k73l74M85M78j63k0J56n53
$$ 5 144 -85 -138 -125 41 367 273 -64 -141 -70 295 908 684 -51 -185 -458 -832 -347 131 -32 -52 104 -449
873d49j44K35L28K13J69l8Olj60J40L75k73k29j6l03M8O14L8m62k84m85l48K93
$$ -449 -593 -358 -30 183 352 314 320 317 157 297 672 399 170 154 -149 -101 513 551 89 -195 -680 -1028 -735
896g35N03J67M42j4q06o00N8N40R07M32j98j48m10n12K37M43k66K2M07l58l83
$$ -735 -232 -65 377 363 -443 -1043 -985 -445 462 894 696 548 138 -374 -137 306 40 62 469 111 -272
917b72K58K1m79j60N0K98L26J64K07J06m74m19K98R0Q3Q09L72n94o41k89l02M2
$$ -272 -14 7 -472 -632 -582 -284 42 206 413 519 45 -374 -76 14 97 906 1278 684 43 -246 -548 -506
939e06L59K76L17k52p44k95R7O3N72N92l57m51P2J28J33J40M9O4p0l85J04N03
$$ -506 -147 129 446 194 -550 -845 -748 -685 -113 479 122 -329 -257 -129 4 144 193 257 187 -198 -94 409
961D09Lj83P5l84o26L72M52o1j44k5n6q3j64J51O00J06k75J80M8m28J71N43k95
$$ 409 412 229 304 -80 -706 -334 118 57 -87 -112 -168 -251 -415 -264 336 442 167 347 395 -33 138 681 386
984C86n18l1Qj30J88L05J33l52o07J0K38l4M25O83k67p70j98k3j43M65Q87J33
$$ 386 -132 -163 -155 -285 -97 208 341 -11 -618 -608 -370 -404 21 704 437 -333 -531 -554 -697 -232 655 788
1006G88l95m37jK18k73m4O33K02o30j05Q1n01j24O44J5n99J02O53L58k84n07R2
$$ 788 393 -44 -45 173 -100 -144 489 691 61 -44 37 -464 -588 56 71 -528 -426 227 585 301 -206 -114
1028a14J74l61K98O98k88m29L63k8r55m5R91M28l74l85l8k11m65J72P90k00o42
$$ -114 60 -301 -3 695 407 -22 341 313 -642 -687 304 732 358 -27 -65 -276 -741 -569 221 21 -621
1049f21M33L42o39k77J101L73l90j19J44q1l20J79O63j60j022l0O25n25m36P94
$$ -621 -188 154 -485 -762 339 712 322 203 347 266 -54 125 788 628 -394 -424 201 -324 -760 34
1069C4L51p53q1N01n0m34K57O92m7q49K71R64k87q69L94L80q04N4Q79j41q56n9
$$ 34 385 -368 -449 52 2 -432 -175 517 470 -379 -108 856 569 -300 94 474 -330 -276 603 462 -394 -453
1091d53N19k89r32K77J152K52p08J12L11p74j02J209K99o36J51M66o08r11j8Q62
$$ -453 66 -223 -1155 -878 274 526 -182 -70 241 -533 -635 574 873 237 388 854 246 -665 -683 179
1111A79L47n43p9J73n12l00P88L39q16j59Q55J74m99j02L11N3l73M0O42j75n66
$$ 179 526 -17 -96 77 -435 -735 53 392 -424 -583 272 446 -53 -155 156 209 -164 -124 518 343 -223
1132b23M34N49r26n63Q21L73n92p7M21j93m73J26N24j18m67M06O13o93p80P84
$$ -223 211 760 -166 -729 92 465 -127 -204 217 24 -449 -323 201 83 -384 22 635 -58 -838 -54
1152e4N42m18j2L56n12n03M62N99q3l97J42L10n65o22O56N87m57n2K39n38l58
$$ -54 488 70 58 414 -98 -601 -139 460 377 -20 122 432 -133 -755 -99 488 31 -21 218 -320 -678
1173f78M84L13l19j27L31M57j35m88pL57j61n1M05P3m51J09J97l89m58Q6M68J70
$$ -678 -194 119 -200 -327 4 461 326 -162 -169 188 27 -24 381 454 3 112 309 -80 -538 -452 16 186
1195A86k99n0K99l08o11N01N46k74R8O79k57p73n0M94K01k25J41J87m41n70K96
$$ 186 -113 -163 136 -172 -783 -282 264 -10 88 767 510 -263 -313 181 382 157 298 485 44 -526 -230
1216b30L79n68k03O67Oo00K92M15j73j96M14J61k24p0K74K12m92k12L07L7m44
$$ -230 149 -419 -622 45 51 -549 -257 158 -15 -211 203 364 140 70 344 556 64 -148 159 196 -248
1237b48J25K44l05j56K33J4j19L2R0J29j27k10K05M69j36j62K11rl69J5L33j8
$$ -248 -123 121 -184 -340 -107 -93 -212 -180 -90 39 -88 -298 -93 376 240 78 289 280 -89 -74 259 241
1259B41m3q6P0k14n47M4N45p9j98M07J62o31q1M90L1j70K74L17j61l85m4J62j88
$$ 241 198 112 182 -32 -579 -535 10 -69 -267 140 302 -329 -410 80 111 -59 215 532 371 -14 -58 104 -84
1282h4k59L47K98m12j5L52k59m36K24K79j36R0K11j03k49j09O0J45M4J20K68q5
$$ -84 -343 4 302 -110 -125 227 -32 -468 -244 35 -101 -11 200 97 -152 -261 -201 -56 -12 108 376 291
1304B91l29j1J31q8J63O2j21n3j5j81l6J65p7J40J26j89j70J65J78j23j1j7J0
$$ 291 -38 -49 82 -6 157 219 98 45 30 -151 -187 -22 -99 41 167 -22 -192 -27 151 28 17 0 10
1327A0j10j04K30J67k85Q2L09k26k62L38L3l28K8J83m8k57N3O7m0j74J10K77r
$$ 10 -100 -204 26 193 -92 -10 299 73 -189 149 182 -146 -118 65 17 -240 -187 -120 -160 -334 -224 53 44
1350D4lK05k4l38j7K66l1N7K07j19k46p6j40j3J59K54Oo4j07j68kK0J09J14l5
$$ 44 41 246 222 -116 -133 133 102 159 366 247 1 -75 -215 -228 -69 185 191 127 20 -148 -150 -130 -21 93 58
1375E8l3J38j10j70J48N7j72J90J93j95j38O4j39j01m7P3PO9R4O1j17k06J15K21
$$ 58 25 163 53 -117 31 88 -84 106 299 104 -34 30 -109 -210 -257 -184 -177 -108 -14 47 -70 -276 -161 60
1399F0j03J56J87j10k28Q2m2m3J88Ln9q9l7m0R3j3N9J9j24r8K9O9mK22m7j77m4
$$ 60 -43 113 300 190 -38 44 2 -41 147 150 91 2 -35 -75 18 5 64 83 -41 -139 -110 -41 -45 177 130 -47 -91
1426i1P9m6R7K11j14Kq0r7j15jJ45Om3j30Q4Lp7j0J09m8j6J70Oj5M2O8j45p2J21
$$ -91 -12 -58 39 250 136 138 58 -39 -154 -155 -10 -4 -47 -177 -93 -90 -167 -177 -68 -116 -132 38 44 29 71 139 -6 -78 43
1455D3L5J57ll3o6j20j81J01P1L6N6k9j78j10J10lJ11J77r4j9pq4o1J11M5n5P2
$$ 43 78 235 232 199 133 13 -168 -67 4 40 96 67 -111 -221 -111 -114 -3 174 80 61 54 -30 -91 20 65 10 82
1482H2j00Pn9JJ35n7j19j9oM6o1J58J4j16p8K8L4J52Q3J04k2j24l3N7j0qO7n7
$$ 82 -18 -11 -70 -69 66 9 -110 -129 -135 -89 -150 8 22 -94 -172 -144 -110 42 125 229 207 83 50 107 97 89 156 99
1510I9o3j50J7R7l9j4J6k7j5L0qR6N8p1j0r9k9L0J74R0p1o8k7qj06R2Q4Qj07r1
$$ 99 36 -114 -97 0 -39 -53 -37 -64 -79 -49 -57 39 97 26 16 -83 -112 -82 92 182 111 43 16 8 -98 -6 78 86 -21 -112
1540a12o0m9P8M9M4m8O3l0R5N6O0Kj5k4o5j6P7J05j23j08j24j0L6N4J00P1r1k6
$$ -112 -172 -221 -143 -94 -50 -98 -35 -65 30 86 146 148 133 109 44 28 105 210 87 -21 -145 -155 -119 -65 35 106 15 -11
1568a1q0k2R6R1J2l5pj10n0O5R0J09m1p2n8M9j4kJ06p8j50n8j8J03O7N1P7r2p1
$$ -11 -91 -113 -17 74 86 51 44 -66 -116 -51 39 148 107 35 -23 26 12 10 116 38 -112 -170 -188 -85 -18 33 110 18 -53
1597e3k5R1Q1M5N5o8j59j36L5J60oK2O1j31j51J41N3M7L8l1l8j72o8J34J60j32
$$ -53 -78 13 94 139 194 126 -33 -169 -134 26 20 42 103 -28 -179 -38 15 62 100 69 31 -141 -209 -75 85 -47
1623d7L4k0p5o4K64M4Q3q9j1m2j17J1J18J8q0o1n9m7mN5K27n6p1K5r4Q3k5O5N4
$$ -47 -13 -33 -108 -172 92 136 219 130 119 77 -40 -29 89 107 27 -34 -93 -140 -144 -89 138 82 11 36 -58 25 0 65 119
1652A19l7j40k4R7P8k2J32j02k29q3J40J18j6m9Kj20j68M7K25N5qJ19K6k48m8
$$ 119 82 -58 -82 15 93 71 203 101 -128 -211 -71 47 31 -18 -16 -136 -304 -257 -32 23 15 134 160 -88 -136
1677a36K26L5l6K1j7j20r2Q8RJ1r3J08j0j55Q7J38N1j11k9m2m2J18J22M0K5j09
$$ -136 90 125 89 110 93 -27 -119 -31 -22 -11 -104 4 -6 -161 -74 64 115 4 -25 -67 -109 9 131 171 196 87
1703H7o6m2OP4R4J2j25j24j05NO8J14K5P2j89j32J67J36qL8N2j31k18J64O3L2
$$ 87 21 -21 -15 59 153 165 40 -84 -189 -184 -116 -2 23 95 -94 -226 -59 77 69 107 159 28 -190 -26 37 69
1729F9l3N8Lk95L4J83J08m8J2M7k15j38J96R0r2M3O8j34j04R6J53N3j16J5n0j57
$$ 69 36 94 97 -198 -164 19 127 79 91 138 -77 -215 -19 71 -21 22 90 -44 -148 -52 101 154 38 53 3 -154
1755a54J31J86p4j10n1pr3J06J85OJ2j00j15j08M8J21J10Q1p3k31o6J7J03J96
$$ -154 -23 163 89 -21 -72 -79 -172 -66 119 125 137 37 -78 -186 -138 -17 93 174 101 -130 -196 -179 -76 120
1779A20P6K0j15r4mJ63j30K1Q4j15k52Q1J53j07RJ50q0j89O9K32P2q3K8J6j71
$$ 120 196 216 101 7 3 166 36 57 141 26 -226 -145 8 -99 -90 60 -20 -209 -140 92 164 81 109 125 -46
1804d6q4J29J35n4p0J05k46n5J25J64j19L9N6k23n1J8J88K0J6l8n0o2J5K63P0
$$ -46 -130 -1 134 80 10 115 -131 -186 -61 103 -16 23 79 -144 -195 -177 11 31 47 9 -41 -103 -88 175 245
1829B45j06K3p4j68MJ28L6ll1j87p6K9M3J78N7k8j4p2l7Q8L5%M1m9k14K3J71K8
$$ 245 139 162 88 -80 -76 52 88 85 54 -133 -209 -180 -137 41 98 70 56 -16 -53 35 70 70 111 62 -152 -129 42 70
1857G0j71N2mj55J02K30K5j33L0n1j77K2J94J70q2r1M0j35j87J99K03k6l1Q1j69
$$ 70 -101 -49 -53 -208 -106 124 149 16 46 -5 -182 -160 34 204 122 31 71 -64 -251 -52 151 125 94 175 6
1882Fk35R4J59O4J3m0j18n5O2O1J12p6p3Q5j30n5J70K1j07P8lj17P5J15m1%L1
$$ 6 -229 -135 24 88 101 61 -57 -112 -50 11 123 47 -26 59 -71 -126 44 65 -42 36 33 -84 -9 106 65 65 96
1909I6n3k17J04N0Q5j7o4q4j05M5K06J01k13M8J00j93j9K54J41j83P4n6j97j15
$$ 96 43 -174 -70 -20 65 48 -16 -100 -205 -160 46 147 -66 -18 82 -111 -130 124 265 82 156 100 -97 -212
1933b12J52K01l7n5l3m8k25Q8K00M3j01N8M7j58k3K18jq4J16k7j15LM3l2j22K8
$$ -212 -60 141 104 49 16 -32 -257 -169 31 74 -27 31 78 -80 -103 115 114 30 146 119 4 7 50 18 -104 -76
1959g6n5PK0P6R0q2o8M1l5Q8J24K3r9J7j06k10J14J53J3m7J07q0q8j9J82J7j6
$$ -76 -131 -124 -104 -28 62 -20 -88 -47 -82 6 130 153 54 71 -35 -245 -131 22 35 -12 95 15 -73 -92 90 107 91
1986I1n0N3r4j79Q3K57j54p4J69j36j23M8K38n6m8O3o7r6j06J68Q6j75M1J16l2
$$ 91 41 94 0 -179 -96 161 7 -67 102 -34 -157 -109 129 73 25 88 21 -75 -181 -13 73 -102 -61 55 23
2011B3j86K44R1j62k1Mm6rP3j5j10j5k8P1J9J12O3R9j76N6o1Q5k5J39p5j75kj39
$$ 23 -163 81 172 10 -11 -7 -53 -62 11 -4 -114 -129 -157 -86 -67 45 108 207 31 87 26 111 86 225 150 -25 -27 -166
2039a66o0J74N8n0J19J9k18kK20l5J6J6L4j00q9k9J81j10q5K41p0j50N8J92j89
$$ -166 -226 -52 6 -44 75 94 -124 -126 94 59 75 91 125 25 -64 -93 88 -22 -107 134 64 -86 -28 164 -25
2064b5j81J50J6j15J5K06J4k06M5J39Or2J48J86k38j47J26k0j93J96O7k2k10O5
$$ -25 -206 -56 -40 -155 -140 66 80 -126 -81 58 64 -28 120 306 68 -79 47 27 -166 30 97 75 -135 -70
2088g0N3k9K3Q5J50q1j15M0J7j09M1R4q2j01p7P2N1J6K2L7P6j40o0J66n1j77J99
$$ -70 -17 -46 -23 62 212 131 16 56 73 -36 5 99 17 -84 -161 -89 -38 -22 0 37 113 -27 -87 79 28 -149 50
2115E0P5j79rJ10J2j25o1J04J45j75L8J80q1k50J25K04k21kK47l6j84kQ1q5j01
$$ 50 125 -54 -63 47 59 -66 -127 -23 122 -53 -15 165 84 -166 -41 163 -58 -60 187 151 -33 -35 46 -39 -140
2140a40J98J60j75j89J25J47l03K6L36j12j50O0J01j79l9K44K6j24j1R2L3j85
$$ -140 58 218 43 -146 -21 126 -177 -151 185 73 -77 -17 84 -95 -134 110 136 12 1 93 126 -59
2162e9p9J81K1j58N7Q2j00l2J0J0K0PQK47p3j63j6J39o9j32K19L1k72m2J76J4
$$ -59 -138 43 64 -94 -37 45 -55 -87 -77 -67 -47 -40 -32 215 142 -21 -37 102 33 -99 120 151 -121 -163 13 27
2188B7j17O8J85p6k32R1J70j31j73L40N3k69l8K14j04k00J84J85q5j37Q4N9j36
$$ 27 -90 -22 163 87 -145 -54 116 -15 -188 152 205 -64 -102 112 8 -192 -8 177 92 -45 39 98 -38
2211c8j22K04kj66O8J72m0k62J30J11j12J27Q8k3l9q6k3O5q1n9J86M5k10Jk6J4
$$ -38 -160 44 42 -124 -56 116 76 -186 -56 55 -57 70 158 135 96 10 -13 52 -29 -88 98 143 -67 -66 -92 -78
2237g8L2O7N7J04j44j08R2j8j85J56J95j72j52J38Oj38Q7J81o6r2PJ57l9k51J35
$$ -78 -46 21 78 182 38 -70 22 4 -181 -25 170 -2 -154 -16 -10 -148 -61 120 54 -38 -31 126 87 -164 -29
2262b9K13k46p5L19n1l32J41J41q6j16J92K5o6j65R8J08j06L2J66l0j81Q9O6j78
$$ -29 184 -62 -137 182 131 -201 -60 81 -5 -121 71 96 30 -135 -37 71 -35 -3 163 133 -48 41 107 -71
2286g1k2J38O9j11o4j4p2M1J0M3J56m0r0M4l4r4J78O6Ml8r0K2P4k35Q0J70J8j70
$$ -71 -93 45 114 3 -61 -75 -147 -106 -96 -53 103 63 -27 17 -17 -111 67 133 137 99 9 31 105 -130 -50 120 138 -32
2314c2P1Q1j78RJ45j16j15K03Q1j21p7Q9J3j04m7K40M7k44K4Q2j58j22K87M6j32
$$ -32 39 120 -58 -49 96 -20 -135 68 149 28 -49 40 53 -51 -98 142 189 -55 -31 51 -107 -229 58 104 -28
2339b8K9Rj16K9JQ8J47j55NJ04k27PJ72%l8O1J6j72o6J45J2nK2k3l6Q4Lp5Q0k8
$$ -28 1 10 -106 -77 -76 12 159 4 9 113 -114 -107 65 65 27 88 104 -68 -134 11 23 18 40 17 -19 65 68 -7 73 45
2369D5p5N1kj1K5k6n1K8j36J36J55p2j59K01j26j24J16J89n0j41N0o0r3L1J60
$$ 45 -30 21 19 8 33 7 -44 -16 -152 -16 139 67 -92 109 -17 -141 -25 164 114 -27 23 -37 -130 -99 61
2394F1M9q9j06J15r3j25K26J14j14m3K23j72j37J06J07o7qkm8L0o5OpJ7j6R7p1
$$ 61 110 21 -85 30 -63 -188 38 152 38 -5 218 46 -91 15 122 55 47 45 -3 27 -38 -32 -39 -22 -38 59 -12
2421a2k4P0L1p1L8k8NR1k8o9L8K7j49RJ33J3k7p1L3k7j12J3J09J00j17qL5j24
$$ -12 -36 34 65 -6 32 4 9 100 72 3 41 68 -81 -72 61 74 47 -24 9 -18 -130 -117 -8 92 -25 -33 2 -122
2449a22M1K32m1l3L6rj86M8J06k8K7k8m7o1KrJ03L3q4J07k8j52P0J01j21M9J44
$$ -122 -81 151 110 77 113 104 -82 -34 72 44 71 43 -4 -65 -63 -72 31 64 -20 87 59 -93 -23 78 -43 6 150
2476A50j37m3M2n8P1k1p9K0N0K2L3K7j47l0J11j09J17Q5l9o7O0j14p9Q5J38J9
$$ 150 13 -30 12 -46 25 4 -75 -55 -5 17 50 77 -70 -100 11 -98 19 104 65 -2 58 -56 -135 -50 88 107
2502A07J9n6q1q9J12J7P1j6J6k6j17o3R5L6n2J24oj48n7K00n9r6J23Ro0m7O8q3
$$ 107 126 70 -11 -100 12 29 100 84 100 74 -43 -106 -11 25 -27 97 91 -57 -114 86 27 -69 54 63 3 -44 24 -59
2530e9N0j0J9O0j25Q3R8p6j67J42n9n3N6O5jo8j2l2N8O6K4P0l1j28M7l5j8kJ03
$$ -59 -9 -19 0 60 -65 18 116 40 -127 15 -44 -97 -41 24 23 -45 -57 -89 -31 35 59 129 98 -30 17 -18 -36 -38 65
2559F5Mm1r7nK7N1NJ19M2j81j03J12k5r2J18R8q3p0J9OnO9K8R6q8j20Q3k4j43
$$ 65 69 28 -69 -74 -47 4 9 128 170 -11 -114 -2 -27 -119 -1 97 14 -56 -37 -31 -36 33 61 157 69 -51 32 8 -135
2588a35Q3J11j88QJ76l8q7L0M0L2q8M0J43k0j16k9R6j76m2K69r0p6N0j7l7M0N4
$$ -135 -52 59 -129 -121 55 17 -70 -40 0 32 -56 -16 127 107 -9 -38 58 -118 -160 109 19 -57 -7 -24 -61 -21 33
2615C3P0P3j35ro7p1q0K58m4k2j1Oo0LJ32K3M2j51l2O7p5j06J90K1r9m9Q0M8j31
$$ 33 103 176 41 32 -35 -106 -186 72 28 6 -5 1 -59 -56 76 99 141 -10 -42 25 -50 -156 34 55 -44 -93 -13 35 -96
2644i6J41O5m7o9j7L8pj31J10J16j87j0K25L6k16J33Ln4n9qJ19m0n6oK5j53r7
$$ -96 45 110 63 -6 -23 15 8 -123 -13 103 -84 -94 131 167 -49 84 87 33 -26 -34 85 45 -11 -17 8 -145 -242
2671b42K74M4j3Mj7o3j02J35N9K4j8m2n6q5j6Q9R5j22O9Kj8j27R8J7L4k6kK1o
$$ -242 32 76 63 67 50 -13 -115 20 79 103 85 43 -13 -98 -114 -25 70 -52 17 19 1 -126 -28 -11 23 -3 -5 16 10
2700A0o5L0J10rr6R0Lq3J5R2j21n1M9QK4n1J0J37j19j59J82J07j42P4J15j42j50
$$ 10 -55 -25 85 76 -20 70 73 -10 5 97 -24 -75 -26 -18 6 -45 -35 102 -17 -176 6 113 -29 45 160 18 -132
2727a32J12P5o1J2L3j4j54r6Q3K18j23N9Q6j08j93J52J31m6N4Nq0j27J9P1P1J2
$$ -132 -20 55 -6 6 39 25 -129 -225 -142 76 -47 12 98 -10 -203 -51 80 34 88 93 13 -114 -95 -24 47 59
2753E9j7J1K8k20J20P1m8p4R6j1n2K7K9N4n3q6N7Q6j71Q0J45q3k02J42l7M2m7
$$ 59 42 53 81 -139 -19 52 4 -70 26 15 -37 -10 19 73 20 -66 -9 77 -94 -14 131 48 -154 -12 -49 -7 -54
2780e4R4L6j14j36N9J41Qj2Q8l5k80J25N7PP2M2o0m3q0M7J1L8KJ00p2j36K7J55
$$ -54 40 76 -38 -174 -115 26 34 22 110 75 -205 -80 -23 -16 56 98 38 -5 -85 -38 -27 11 13 113 41 -95 -68 87
2808H7l2j2O0m0j03k8M4N3m8N2J6Pj35m3K00l9l8O2o6j32J38N3po2k0j8L2%K2
$$ 87 55 43 103 63 -40 -68 -24 29 -19 33 49 56 -79 -122 78 39 1 63 -3 -135 3 56 49 -13 -33 -51 -19 -19 3
2837CP6M1k25j9J17n6J8J94l0j60k4o1N8Q2J00M7p3j32q0J39m9R0J55p7k19lK3
$$ 3 79 120 -105 -124 -7 -63 -45 149 119 -41 -65 -126 -68 14 114 161 88 -44 -124 15 -34 56 211 134 -85 -88 -65
2864f5j3J03M5l1k8j32M6P5J2k3Q7k3j42j5J34MJ3O9o3r1o9O1O0P9n5q6J3j31
$$ -65 -78 25 70 39 11 -121 -75 0 12 -11 76 53 -89 -104 30 34 47 116 53 -38 -107 -46 14 93 38 -48 -35 -166
2892a66K4K19L9nj50K1r0R3N1J15m8j15m0m0pM4J48J15k15l7J0p6J16O8R4p5r4
$$ -166 -142 77 116 111 -39 -18 -108 -15 36 151 103 -12 -52 -92 -99 -55 93 208 -7 -44 -34 -110 6 74 168 93 -1
2919an7mM0l1J53K2j55l8jK1MJ83p3r0n7J1N9N4j8m8QNq3J33M5Lqq2j27NR2O7
$$ -1 -58 -62 -22 -53 100 122 -33 -71 -72 -51 -47 136 63 -27 -84 -73 -14 40 22 -26 -18 -13 -96 37 82 85 77 -5 -132 -127 -35 32
2951C2J11o5j20m1l6l4K00J29p6j00o1o5m8J56J28k1Oj69j5m0M1J35R3j17o7K0
$$ 32 143 78 -42 -83 -119 -153 47 176 100 0 -61 -126 -174 -18 110 89 95 -74 -89 -129 -88 47 140 23 -44 -24
2977b4j13J02J25l0m3Qr7j41J73O8mJ0m3j14Q0K7O8K9Oj57J0n2L1J31J05j36L7
$$ -24 -137 -35 90 60 17 25 -72 -213 -40 28 24 34 -9 -123 -43 -16 52 81 87 -70 -60 -112 -81 50 155 19 56
3004E6j29m6J44J10m1m3m7j17n9Q2J27L1N7j11j11qk7J67J44K5j42o1p8j35J58
$$ 56 -73 -119 25 135 94 51 4 -113 -172 -90 37 68 125 14 -97 -105 -132 35 179 204 62 1 -77 -212 -54
3029e4Q8J5l2r0j1l2J08N5P4n5j16L0m8KR3J46j61m1pm6Q4R6N6r0m3o5p6J25R1
$$ -54 34 49 17 -73 -84 -116 -8 47 121 66 -50 -20 -68 -66 27 173 12 -29 -36 -82 2 98 154 64 21 -44 -120 5 96
3058I6Nq2m9j55J11L9Q0Q1L3j36k9j59K8K17O1o0q3J1k30J21J50M6p2J15j81q7
$$ 96 101 19 -30 -185 -74 -35 45 126 159 23 -6 -165 -137 80 141 81 -2 9 -221 -100 50 96 24 139 -42 -129
3084a29P7M6R2K6m8r1l5m0Q9R7J7r5O5j18m6O9J12o2k4j1p5k4J35N3L5j09j52
$$ -129 -52 -6 86 112 64 -27 -62 -102 -13 84 101 6 71 -47 -93 -24 88 26 2 -9 -84 -108 27 80 115 6 -146
3111a46J28K1o1J43P7j24j43JMN8J33m1P6r7j60K5J27L3j1J30j20j31o9L4J40
$$ -146 -18 3 -58 85 162 38 -105 -104 -100 -42 91 50 126 29 -131 -106 21 54 43 173 53 -78 -147 -113 27
3136B7Q2ok3m0j80L4J58L3o2Q4n2j69N0J11L4j9p4j8J0n8M1O3O0j27LK3q7MK21
$$ 27 109 103 80 40 -140 -106 52 85 23 107 55 -114 -64 47 81 62 -12 -30 -20 -78 -37 26 86 -41 -38 -15 -102 -98 123
3165A23o9j08Jo5N1L7Q8O9l1k04kK4J0J08J72p9j47j07J5O3Q0R0j8q2o4q5Q7L6
$$ 123 54 -54 -53 -118 -67 -30 58 127 96 -108 -110 -86 -76 32 204 125 -22 -129 -114 -51 29 119 101 19 -45 -130 -43 -7
3193gM8J7j3j05p4O3J02M7N9j08lj49MJ27J17j00o5M6j34l5K08J5o0l4K9o1l6
$$ -7 41 58 45 -60 -134 -71 31 78 137 29 26 -123 -119 8 125 25 -40 6 -128 -163 45 60 0 -34 -5 -66 -102
3220a02P2Q9N6q8j44J16r8N4K04rn5j88Q7j14K2K03lM1j63j50O1O6j5J05J37j49
$$ -102 -30 59 115 27 -117 -1 -99 -45 159 150 95 -93 -6 -120 -98 105 102 143 -20 -170 -109 -43 -58 47 184 35
3246C5j43R0j6qJ16j6l0n8j15M8J91p7k9R9j42j14J31J16o8L4k1j6j01j6J40Q8
$$ 35 -108 -18 -34 -42 74 58 28 -30 -145 -97 94 17 -12 87 -55 -169 -38 78 10 44 23 7 -94 -110 30 118
3272A18m5j13RK3j31J53J48l3j27Or9J9L8J61M0j85m7JqjJ65O1q9j03Rok9R5J62
$$ 118 73 -40 -31 -8 -139 14 162 129 2 8 -91 -72 -34 127 167 -18 -65 -64 -72 -73 92 153 64 -39 -30 -36 -65 30 192
3301A92r6p7l9r1M0J04KO0q1j06J06lm9K3R3j26N3p0L1L2Q5o8K5n7r4Q0J10l1
$$ 192 96 19 -20 -111 -71 33 35 95 14 -92 14 11 -38 -15 78 -48 5 -65 -34 -2 83 15 40 -17 -111 -31 79 48
3329D8m6J4l3o8LJ60Mom2p0J2j39J34J66q3j3k2n5r7M3J71M1j03jn0km8O4O2K3
$$ 48 2 16 -17 -85 -82 78 82 76 34 -36 -24 -163 -29 137 54 41 19 -36 -133 -90 81 122 19 18 -32 -34 -82 -18 44 67
3359F7j53K6O0p9L3J32l9m5k4J7m1N3M6j5l6o8J1O9L0k5Mj3j16oJ35nR0k0j5j44
$$ 67 -86 -60 0 -79 -46 86 47 2 -22 -5 -46 7 53 38 2 -66 -55 14 44 19 23 10 -106 -112 23 18 108 88 73 -71
3389g1o5O8J01K4k5m4M2n2r1J22L2L8Kq8j9j07O1J04N0n4o3K2q1j3J12N4n1K7
$$ -71 -136 -68 33 57 32 -12 30 -22 -113 9 41 79 81 -7 -26 -133 -72 32 82 28 -35 -13 -94 -107 5 59 8 35
3417C5lj38J7J36K7o0Kp3J3M1PJ5L5j43P9L2o8M8O4o6L1j12N3qM4L2m3j9k1m7
$$ 35 32 -106 -89 47 74 14 16 -57 -44 -3 4 19 54 -89 -10 22 -46 2 66 0 31 -81 -28 -36 8 40 -3 -22 -43 -90
3447i0K6J03J1L7qr4o4l1L2J34l4n0M0oj18O1J39l6j1L3j06o4O9J14j4l3n1L0
$$ -90 -64 39 50 87 79 -15 -79 -110 -78 56 22 -28 12 6 -112 -51 88 52 41 74 -32 -96 -27 87 73 40 -11 19
3475A9k1o4J23j5q7LJ7p0mJ59M1r1l6j1j5L5P8k9N6n9j33K6P0k8J10K7j17l7K3
$$ 19 -2 -66 57 42 -45 -42 -25 -95 -99 60 101 10 -26 -37 -52 -17 61 32 88 29 -104 -78 -8 -36 74 101 -16 -53 -30
3504c0j2L0Q6r8K2Rn0l4J25oL5M5l7j14J1%J0Q1r9N9K0j37J3J76j11QM3l0q7P4
$$ -30 -42 -12 74 -24 -2 7 -43 -77 48 42 77 122 85 -29 -18 -18 -8 73 -26 33 53 -84 -71 105 -6 2 45 15 -72 2
3534BN7o0m3k1K3L5K6LO1n3q9k1M9n5J15L4K0j67O8l7QO5N1j0J4j84O2j3J00k4
$$ 2 59 -1 -44 -65 -42 -7 19 22 83 30 -59 -80 -31 -86 29 63 83 -84 -16 -53 -45 20 71 61 75 -109 -47 -60 40 16
3564A6J00j57k0K4N2k3K0P4q0M0j05O5m1N2OL2%q5k1J05Np4L8J0k0oOK6M1j17
$$ 16 116 -41 -61 -37 15 -8 12 86 6 46 -59 6 -35 17 23 55 55 -30 -51 54 59 -15 23 33 13 7 13 39 80 -37
3594c7J9Q0p2m9J50k9r8Kk4L3K%Q0n4q0l4O9j8k5J60J0p9r4N9pK6J13J3p9j2r5
$$ -37 -18 62 -10 -59 91 62 -36 -34 -58 -25 -23 -23 57 3 -77 -111 -42 -60 -85 75 85 6 -88 -29 -36 -10 103 116 37 25 -70
3625g0N0J2j2L9j8j8l0P0j6k7P9l0l8K6mLk6J2KRm9N1J0K2l5l1L5m3n1KR9Nq4
$$ -70 -20 -8 -20 19 1 -17 -47 23 7 -20 59 29 -9 17 13 16 -10 2 4 13 -36 15 25 47 12 -19 16 -27 -78 -76 23 28 -56
3658e6M6n6Pn7K32l4j04k4J08m4m4P3N6j11K0J4k8j03R0K1O5j30qR7n7p9R1Q1
$$ -56 -10 -66 -59 -116 116 82 -22 -46 62 18 -26 47 103 -8 12 26 -2 -105 -15 6 71 -59 -67 30 -27 -106 -15 66
3686F6j08J2N3pl1R7n5o2O0p6O7Jm6OM6l2n6R1ooM3m2o6P9pK9P4p6q4N6k1o1L8
$$ 66 -42 -30 23 16 -15 82 27 -35 25 -51 16 17 -29 -23 23 -9 -65 26 20 14 57 15 -51 28 21 50 124 48 -36 20 -1 -62 -24
3719b4J34j13p2J04k1o5L8J2R6p5p5R2K0j28J06J4o9PP0o0p0L3R5l8l2K6J5J3
$$ -24 110 -3 -75 29 8 -57 -19 -7 89 14 -61 31 51 -77 29 43 -26 -19 51 -9 -79 -46 49 11 -21 5 20 33
3747C3r6J8J08n0o4N2Q5j06j1O2q1l9Q5MMMk2L7n9r4J07J20mq2K0lj22J52j05
$$ 33 -63 -45 63 13 -51 1 86 -20 -31 31 -50 -89 -4 0 4 8 -14 23 -36 -130 -23 97 93 11 31 28 -94 58 -47
3776d7N8%n5N2K3r4Q3N9l4o1K1L9j29Q0J5L0m9o2N7O4n9l3J62m8j64J09O6j00
$$ -47 11 11 -44 8 31 -63 20 79 45 -16 5 44 -85 -5 10 40 -9 -71 -14 50 -9 -42 120 72 -92 17 83 -17
3804a7mR5j15q5J33m2M8k3L4J4o6l9J14M4o4l3R1q0j39Q4J5O3m3N9p3j9N2l5P9
$$ -17 -21 74 -41 -126 7 -35 13 -10 24 38 -28 -67 47 91 27 -6 85 5 -134 -50 -35 28 -15 44 -29 -48 4 -31 48
3833D8n0m3J02J0q7J9N2q9lL0j4K3lm8Q1l5l5PJ47q8k0J2k1n6N7L4k3J2j2N2k2
$$ 48 -2 -45 57 67 -20 -1 51 -38 -41 -11 -25 -2 -5 -53 28 -7 -42 -35 112 24 4 16 -5 -61 -4 30 7 19 7 59 37
3864C7q7M2M7Jn6M4Rj18Q9N0p1l9J24p7l5K1L6K3pq0O0L0j40L5R9l5l2R2o7j3
$$ 37 -50 -8 39 40 -16 28 37 -81 8 58 -13 -52 72 -5 -40 -19 17 40 33 -47 13 43 -97 -62 37 2 -30 62 -5 -18
3894a8J0O3n9K2m8L6Jk4l9O0K1o5J1N1m0N1J6m2n0J7J2N0K3k7M7m6j43L8J17n1
$$ -18 -8 55 -4 18 -30 6 7 -17 -56 4 25 -40 -29 22 -18 33 49 7 -43 -26 -14 36 59 32 79 33 -110 -72 45 -6
3924fK7O2p2k8j4j3L6R3o0L9K0r3q1J01J9n2N6K6r0M4plo0J32j12k2P8Po2R8j19
$$ -6 21 83 11 -17 -31 -44 -8 85 25 64 84 -9 -90 11 30 -22 34 60 -30 14 7 4 -56 76 -36 -58 20 27 -35 63 -56
3955e6L2j3JM1P3m8p4O7p9L9N1l4j1N7j71O7O1M2j9k4L3j3j9q2M5O5K5k7N6j01
$$ -56 -24 -37 -36 5 78 30 -44 23 -56 -17 34 0 -11 46 -125 -58 3 45 26 2 35 22 3 -79 -34 31 56 29 85 -16
3985a6q5P5M4p0R6L2r5l7Q5j4j4L1n6M8n6j6L9N9m1n5P6o8j1J53k6p0mOK9k2L3
$$ -16 -101 -26 18 -52 44 76 -19 -56 29 15 1 32 -24 24 -32 -48 -9 50 9 -46 30 -38 -49 104 78 8 4 10 39 17 50
4016E0n5O6j21j0k4J12m9N4j5M6m3o0p0J37L1j2J0l1p9K6RL4M5ok7nm8M3M6JJ2
$$ 50 -5 61 -60 -70 -94 18 -31 23 8 54 11 -49 -119 18 49 37 47 16 -63 -37 -28 6 51 45 18 13 -35 8 54 55 67
4047F7m8p0k9J26k1nnN2p6q9J13N3j4o2K4K3Rq1Q8mK4q9N8n0p1R0L2%k8p4k3N8
$$ 67 19 -51 -80 46 25 20 15 67 -9 -98 15 68 54 -8 16 39 48 -33 55 51 75 -14 44 -6 -77 13 45 45 17 -57 -80 -22
4079b2RO0m1M0p2rL4k1N5N8j16k0J2L2j9J14m8po3M2n5M7J6k8N3p2mlM9l6N1L7
$$ -22 -13 47 6 46 -26 -35 -1 -22 33 91 -25 -45 -33 -1 -20 94 46 39 -24 18 -37 10 26 -2 51 -21 -25 -28 21 -15 36 73
4111G3j30L2K2jO5l8l7j8m5jP9O7o8j5j9L4j05Q1R7Nk8j04N8m6J0K4R1q0k9K0
$$ 73 -57 -25 -3 -4 61 23 -14 -32 -77 -78 1 68 0 -15 -34 0 -105 -24 73 78 50 -54 4 -42 -32 -8 83 3 -26 -6
4141frq8J34Lm1P8m1j49P2R3l6K4L2r6mK3j3KQ6m9J0l7J8k3k7J04p7J7m4k9Q8
$$ -6 -15 -103 31 34 -7 71 30 -119 -47 46 10 34 66 -30 -34 -11 -24 -22 64 15 25 -12 6 -17 -44 60 -17 0 -44 -73 15
4172A5rj9K1oj21J23J9l5J8NNp5M6J6M7l%m0k7j3nJ16%q6J2o3J4N8L2l2j3k5n0
$$ 15 6 -13 8 2 -119 4 23 -12 6 11 16 -59 -13 3 50 47 47 7 -20 -33 -38 78 78 -8 4 -59 -45 13 45 13 0 -25 -75
4205g5P6qM0J5o0J2J0L5r5P1l7lM1r9nR0k9Nk4Q8l3q3N0M2M9qo6k7L5k5oJ4J6
$$ -75 1 -7 33 48 -12 0 10 45 -50 21 -16 -19 22 -77 -82 8 -21 -16 -40 48 15 -68 -18 24 73 65 -1 -28 7 -18 -24 -10 6
4238FMl2j2j6O6L8k6nj8r6J29m0O5Jj2p3J8l6M3L1J0m4L8l7LK0n9M8k0k1RjM1
$$ 6 10 -22 -34 -50 16 54 28 23 5 -91 38 -2 63 64 52 -21 -3 -39 4 35 45 1 39 2 5 25 -34 14 -6 -27 -18 -19 22
4271B2n4N5j7k1l5O3o0M8mJJo2Q4M6l2k0OJ8k7j6o0O9Pn2P3p1n5J47l0Ol4mj4
$$ 22 -32 23 6 -15 -50 13 -47 1 -3 -2 -1 -63 21 67 35 15 21 39 12 -4 -64 5 12 -40 33 -38 -93 54 24 30 -4 -8 -22
4304b2J8m2Q1l6K3J7j2okm5M7m2j7k1k7R0K6J5k6k6mL0Mq4J15m6lQj9k9J6K8J
$$ -22 -4 -46 35 -1 22 39 27 21 19 -26 21 -21 -38 -59 -86 4 30 45 19 -7 -11 19 23 -61 54 8 5 13 -6 -35 -19 9 10
4337A0P5o8K2q3J2N2M2km8j6j2L4j5O8j4k6o0l2M8M3ll4L7k1m4O9J5o0L4qj0j4
$$ 10 85 17 39 -44 -32 20 62 60 12 -4 -16 18 3 71 57 31 -29 -61 -13 30 27 -7 30 9 -35 34 49 -11 23 15 5 -9
4369ij7L3MK0j7kk9j2L9J3k6NO1j04L7M2Pqo1nO2k3j2J4KRp5M9J5JK4p4L4j7O1
$$ -9 -26 7 11 31 14 12 -17 -29 10 23 -3 2 63 -41 -4 38 45 37 -24 -29 33 10 -2 12 14 23 -52 -3 12 13 37 -37 -3 -20 41
4404D1p0j1K5J6M0q6NL0k2K3J3mn0L9m4OM6L0o0P9n9rJ1n7R0k2K9n6N0Rk%L5m7
$$ 41 -29 -40 -15 1 41 -45 -40 -10 -32 -9 4 0 -50 -11 -55 -49 -3 27 -33 46 -13 -22 -11 -68 22 0 29 -27 23 32 30 30 65 18
4438A8l8J3j4M5K4o8M5l9L2l5L6J5l0J6n0J4J7PJ6Lp5K6l1P5k6mN2j3m4j4Nj4
$$ 18 -20 -7 -21 24 48 -20 25 -14 18 -17 19 34 4 20 -30 -16 1 8 24 27 -48 -22 -53 22 -4 -8 44 31 -13 -27 -22 -36
4470c6O1Ll7l2LL2R5j13O0l6j7j1P4q4N0mK7pp5J17n9Rl3O5o9jj0J3pL4rJ7mn7
$$ -36 25 28 -9 -41 -38 -6 89 -24 36 0 -17 -28 46 -38 12 8 35 28 -47 70 11 20 -13 52 -17 -18 -28 -15 -22 12 3 20 16 -41
4504d1M5JJ4j2k3O3j3j6k0J5J1k3nj8j9mK4K7p0O7J8m4Q0q3O9n2L9Kl3K7L5ml8
$$ -41 4 5 19 7 -16 47 34 18 -2 13 24 1 -4 -22 -41 -45 -21 6 -64 3 21 -23 57 -26 43 -9 30 32 -1 26 61 57 19
4537A9j1k8PJRl6O1p6P8K9pml0jOk9L5M4l4j6Pk1l1N5l0N3m1n8J6N5j9pK8l6K3
$$ 19 8 -20 -13 -12 -3 -39 22 -54 24 53 46 42 12 11 17 -12 23 67 33 17 24 3 -28 27 -3 50 9 -49 -33 22 3 -4 24 -12 11
4572A1M7n1l7O3M6q0L6n5K0M7m1Oj7KM0m4k2J04l1l8QJ6o6N6m5L1j6L0k3k9P2
$$ 11 58 7 -30 33 79 -1 35 -20 0 47 6 12 -5 -3 37 -7 -29 75 44 6 14 30 -36 20 -25 6 -10 20 -3 -32 40
4603D0J2q7N7k7K1k8K4pJ0Pl9L2j5k6M6p7R3l9N0p9L3j8O1j1j2l5N5l8RK5j2M
$$ 40 52 -35 22 -5 16 -12 12 5 15 22 -17 15 0 -26 20 -57 36 -3 47 -32 1 -17 44 33 21 -14 41 3 12 37 25 29
4635B9j7O6j22R4q6N3OOr6N5K0j4nJ7o3L1J4jL3O9k1m6K0n5OM4p2LL9l5l2R5M
$$ 29 12 78 -44 50 -36 17 23 29 -67 -12 8 -6 -11 6 -57 -26 -12 -13 20 89 68 22 42 -13 -7 37 -35 -32 7 -28 -60 35 39
4668C9n5J1m0L7L3k2M2j3Ro8P3o6L4O1l2m9%mK4l5Q8j9k2Rm5LqK9l0L1L4p0M4
$$ 39 -16 -5 -45 -8 25 3 45 32 41 -27 46 -20 14 75 43 -6 -6 -10 14 -21 67 48 26 35 -10 -7 -15 14 -16 15 49 -21 23
4701B3%J1%j5j6n8L4J1J2j2j8Q8r1K5pK7k1K7l7K6J0m1N1j4k6J5j1J0l4M0P4m2
$$ 23 23 34 34 19 3 -55 -21 -10 2 -10 -28 60 -31 -6 -13 14 -7 20 -17 9 19 -22 29 15 -11 4 -7 3 -31 9 83 41
4733D1l8M5r1qJ14p9J7l3J6K6j3n8M9K3k9lj4K3lj3P6m7o8O9J0k7N3l3L1Ll0L2
$$ 41 3 48 -43 -51 63 -16 1 -32 -16 10 -3 -61 -12 11 -18 -21 -35 -12 -15 -28 48 1 -67 2 12 -15 38 5 36 39 9 41
4765D1k2j4K7J7j03M6J6lk7P4l8ln4P1k1K0k0K5o6OQML9kl5rjK6j5K8P2o6k1K
$$ 41 19 5 32 49 -54 -8 8 5 -22 52 14 11 -43 28 7 27 7 32 -34 -28 -20 -16 23 21 -14 -23 -24 2 -13 15 87 21 0 2
4799BJ5k1p5P9KqLJ6K0q4M1L6j8p5Q4j9L5j7K0l2l4O0J3K8o4K8k4l2O1l6Q3l8
$$ 2 17 -4 -79 0 2 -6 -3 13 33 -51 -10 26 8 -67 17 -2 33 16 36 4 -30 30 43 71 7 35 11 -21 40 4 87 49
4831D9l4N6%p8K9q4L6K0N4j2k6j3k0N2mo8K9Rm2OM7On2K8j0L0%K2jl4mKN4n4K6
$$ 49 15 71 71 -7 22 -62 -26 -6 48 36 10 -3 -23 29 25 -43 -14 -5 -47 -41 6 12 -40 -12 -22 8 8 30 29 -5 -9 -7 47 -7 19
4866A9kJ3l1k0M5q5Q6J2n2j8K2nM1N7q8K5j2ml2Q8q2pO1q6M1l4L5Ok4LN4n5J3
$$ 19 17 30 -1 -21 24 -61 25 37 -15 -33 -11 -16 25 82 -6 19 7 3 -29 59 -23 -30 31 -55 -14 -48 -13 -7 -31 -28 26 -29 -16
4899a6pN4No0nK4Jk3n2M4Q0k4j4K4Qo2R4o9nl4O1l1pQ0k8n1O0l8k8L1N3m2j6L4
$$ -16 -23 31 36 -24 -29 -5 -4 -27 -79 -35 45 21 7 31 39 -23 71 2 -3 -37 24 -7 -14 66 38 -13 47 9 -19 12 65 23 7 41
4933D1o6M3k6rK6Pm0J2k9L4K2Lrj6k8j2O0m1M1o2L9J3kj1k4M8L4r6Q0onj3j3o
$$ 41 -25 18 -8 -17 9 16 -24 -12 -41 -7 15 18 9 -7 -35 -47 13 -28 13 -49 -10 3 1 -10 -34 14 48 -48 32 26 21 8 -5 -11
4967a1%M3n4J7K5j1K9q8R0l9PJ2j0O0m5j3qm4M1j2j9L5o1M0J4k6L0M1o5M0n1L
$$ -11 -11 32 -22 -5 20 9 38 -50 40 1 8 20 10 70 25 12 4 -40 1 -11 -30 5 -56 -16 -2 -28 2 43 -22 18 -33 -30
4999c0K4K5l2N9p2OM3l6L7LQl6l9J7L6M9j29J09K3o6Lk2O5m6rJ1O8j11M3J5j8
$$ -30 -6 19 -13 46 -26 -20 23 -13 24 27 35 -1 -40 -23 13 62 -67 42 65 -1 2 -20 45 -1 -10 1 69 -42 1 16 -2
5030bj7o0Q9K9j18N6M7k9j3P1r2K7l4N3J3k2lK5Np8K2Q9q9jM8k8J2k6K3L5J5r2
$$ -2 -19 -79 10 39 -79 -23 24 -5 -18 53 -39 -12 -46 7 20 -2 -5 20 25 -53 -31 58 -31 -32 16 -12 0 -26 -3 32 47 -45
5062d5L5N8p5k9M1Ok4N0J1j02P5Pj9J6N0l7J4n5k2K8P4r8N8Jn5qJ3n3O2j5K5j0
$$ -45 -10 48 -27 -56 -15 -9 -33 17 28 -74 1 8 -11 5 55 18 32 -23 -45 -17 57 -41 17 18 -37 -45 -32 -85 -23 -38 -13 -23
5094b3OLJ0Qp6J17m9k6K1L7m2l3L6k0O8n7P5n3J5M9j08N3L2p6O6J2n9mL2j9n7
$$ -23 -17 -14 -4 4 -72 45 -4 -30 -9 28 -14 -47 -11 -31 37 -20 55 2 17 66 -42 11 43 -33 33 45 -14 -18 14 -5 -62
5125f2J37ln2pn6k9O3L1k2P9n4l9O9n7m5J09p2l1O8r9L4L8j6J4lL5j06R6j1l3
$$ -62 75 72 20 13 -43 -72 -9 22 0 79 25 -14 55 -2 -47 62 -10 -41 27 -72 -38 0 -16 -2 -5 30 -76 20 9 -24
5155b4K4O7lq6J3M0j4J2k0PK6q7Q0j8kq1J04l3k6K5J1rJ4mJ8j4k9NL8rk5l7PK3
$$ -24 0 67 64 -22 -9 31 17 29 9 16 42 -45 35 17 15 -66 38 5 -21 4 15 6 20 16 34 20 -9 -4 34 25 0 -37 -30 -7
5189g%qNj2K3l1Q6m7N5o8M6l8p0J13p3J6N6n5k6J7J5OL8l0K4l8J6k6N9K5q4L0
$$ -7 -7 -15 -10 -22 1 -30 56 9 64 -4 42 4 -66 47 -26 -10 46 -9 -35 -18 -3 3 41 11 35 -3 13 -13 46 71 -13 17
5221A7j8k8K4J7j9mM6l9j3m2R0j5j2jK5j3mq0J31q3J7L1j2o8k3O8%R0j26N4M9
$$ 17 -1 -29 -5 12 -7 -11 35 -4 -17 -59 31 16 4 3 28 15 11 -69 62 -21 -4 27 15 -53 -76 -8 -8 82 -44 10 59
5252E9j05j6R1J2k2o3P3q4R8Rn0O6m2l5PK5m2N6k1qo4P1j3K0oj4k3J9jl8J9m4
$$ 59 -46 -62 29 41 19 -44 29 -55 43 52 2 68 26 -9 -2 23 -19 37 16 8 -56 15 2 22 16 2 -21 -2 -3 -41 -22 -66
5284f6j6Q1L4o7Q6on5j8j2L1K1k1K6M6o5j7O5q0L3k3J5j0K8jp7L3K1J5Mj0k5Q9
$$ -66 -82 -1 33 -34 52 46 -9 -27 -39 -8 13 -8 18 64 -1 -18 47 -33 0 -23 -8 -18 10 9 -68 -35 -14 1 5 -5 -30 59
5316E9l5m6k3Q3k6l6L2qk6M5J1J8p2k2K1Q9r0Q9l7r4M1K8K5p0L3J7K6qK3l1J7
$$ 59 24 -22 -45 38 12 -24 8 0 -26 19 30 48 -24 -46 -25 64 -26 63 26 -68 -27 1 26 -44 -11 6 32 24 47 16 33
5347C3J9l7P1m6m4j3R0j14M0Op3N7K6ok5N4k6K5m4j6NL8Jk3PJ9j04J43l0r9P2
$$ 33 52 15 86 40 -4 -17 73 -41 -1 5 -68 -11 15 9 -16 38 12 37 -7 -23 -18 20 21 -2 5 24 -80 63 33 -66 6
5378FN8o2Nl0l0O1k8MJ4K7l9K6rNLL1k5j1M9j1%jp7J2N4j8J2K4p1J1k5N7n6M4
$$ 6 64 2 7 -23 -53 8 -20 -16 -2 25 -14 12 3 8 11 42 17 6 55 44 44 43 -34 -22 32 14 26 50 -21 -10 -35 22 -34 10
5412A0O0j45Q6p7R8k5Q9q7oj7m0L9K1j4k4O0m5l6K8N3j1k8jN8o2L1k1N6p3J3L8
$$ 10 70 -75 11 -66 32 7 96 9 3 -14 -54 -15 6 -8 -32 28 -17 -53 -25 28 17 -11 -12 46 -16 15 -6 50 -23 -10 28
5443B8n5JN5k7J7ko4N9%LL9l0mp3M7j5m3J02L5o9J5o5oO2lm2N8l4K4l0Q4n3JN9
$$ 28 -27 -26 29 2 19 17 -47 12 12 15 54 24 20 -53 -6 -21 -64 38 73 4 19 -46 -52 10 7 -35 23 -11 13 -17 67 14 15 74
5477G4p1m3L8J8K4M1q7mN1m5k0N3Qj02Q6J4m9J7N1o6J6k0Om4Q5JRl3l0J2K9p1
$$ 74 3 -40 -2 16 40 81 -6 -10 41 -4 -24 29 37 -65 21 35 -14 3 54 -12 4 -16 -10 -54 31 32 41 8 -22 -10 19 -52
5509e2M1P8j10N7Jp8K6L9J0L4rk5Om7K3oL0N9r3L1j0l9N3K9n5j2knN7j2j6K0J0
$$ -52 -11 67 -43 14 15 -63 -37 2 12 46 37 12 18 -29 -6 -12 18 77 -16 15 5 -34 19 48 -7 -19 -21 -26 31 19 3 23 33
5542C3r3P9J4l4lJ8j3M2k1nk1M6l0j7P%l3J7N3l0p0N4%K2K1l0j4L7m9k9k1lR7
$$ 33 -60 19 33 -1 -4 14 1 43 22 17 -4 42 12 -5 2 2 -31 -14 39 9 -61 -7 -7 15 36 6 -8 29 -20 -49 -70 -73 24
5575B4L3r8RQ3o9K2L6ql0k2K9NrrJ9O6j17J4K8K1p1P6O2p5LJ7J4j4n8M5nm3O5
$$ 24 57 -41 -32 51 -18 4 40 32 2 -20 9 14 5 -4 15 81 -36 -22 6 27 -44 32 94 19 22 39 53 39 -19 26 21 -22 43
5608D3j7n3L2L0Pq2M8k2PN7o9m5kN2q5J48k2k7L6o0nMK4J1QK1j2l6j7N1OkJ3m6
$$ 43 26 -27 5 35 42 -40 8 -14 -7 50 -19 -64 -66 -14 -99 49 27 0 36 -24 -29 -25 -1 10 18 39 27 -9 -26 25 31 29 42 -4
5642dml7J1K7J9L1k2L4r4L5J6o1R5J1p5L2j1Nj0O7o0q9M1L3QN3l2L7p2j2P3Op6
$$ -4 -8 -45 -34 -7 12 43 21 55 -39 -4 12 -49 46 57 -18 14 3 8 -2 65 5 -84 -43 -10 -2 51 19 56 -16 -28 45 51 -25
5675b5L5M5q1J7J1j0pO4k5j8n8K2J8K1J4l3LK9q1M1O0m9JK6j4j6J1oK6P4j15l2
$$ -25 10 55 -26 -9 2 -8 -15 49 24 6 -52 -30 -12 9 23 -10 -7 22 -59 -18 42 -7 -6 20 6 -10 1 -5 21 95 -20 -52
5707e2N8l4L9L8j11j1J28o4J0km7L8N4l0NmJ8J7J2k7o0JPML5P9r0l1k2j4O2M8
$$ -52 6 -28 11 49 -62 -73 55 -9 1 -1 -48 -10 44 14 19 15 33 50 62 35 -25 -24 -17 -13 22 101 11 -20 -42 -56 6 54
5739E4m8M3j8l9o7P9J5NJ4l5k6L9m1mO1k0N3m8j0o5N3K6j4j0l6K2J6J6M4m1M7
$$ 54 6 49 31 -8 -75 4 19 24 38 3 -23 16 -25 -29 32 12 65 17 7 -58 -5 21 7 -3 -39 -17 -1 15 59 18 65
5770F5j06J3J6k0O4j3k8k7K6k0kN7J8j2Mj09R8M9n5j0k4J0l7N6p0M6M6oo0OO1
$$ 65 -41 -28 -12 -32 32 19 -9 -36 -10 -30 -32 25 43 31 35 -74 24 73 18 8 -16 -6 -43 13 -57 -11 35 29 -31 -25 36
5801C6k9K5m6j0K3n5kM3k2L2lj1l8J7O4p7L2L8k6K2m5N4K9Pq0O4j16Q9k9J7J7
$$ 36 7 32 -14 -24 -1 -56 -58 -15 -37 -5 -8 -19 -57 -40 24 -53 -21 17 -9 13 -32 22 51 58 -22 42 -74 15 -14 3 20
5832B0kMo8O6m2L5l4O8L0j00j0M8j5L8o5o%J3j8O3PM2j14P3j10O5K5k7K8J3j8
$$ 20 18 22 -46 20 -22 13 -21 47 77 -23 -33 15 0 38 -27 -33 -33 -20 -38 25 32 74 -40 33 -77 -12 13 -14 14 27 9
5863In2J9J4j5M1Ok7J7k5m6R9M2j22M2M0j05O3J2L0k4j0l1O5l8L3Lm6j7Q1j16
$$ 9 -43 -24 -10 -25 16 22 -5 12 -13 -59 40 82 -40 2 42 -63 0 12 42 18 8 -23 42 4 37 40 -6 -23 58 -58
5893e8N8O0r3K3m3M0Qk6J1J9O8p8l8K8K1J4k9Q0m6p3J2K6oMM2m1O4p5NMQ4k2l5
$$ -58 0 60 -33 -10 -53 -13 -5 -31 -20 -1 67 -11 -49 -21 0 14 -15 65 19 -54 -42 -16 -22 -18 24 -17 47 -28 -23 -19 65 43 8
5926Hj8j0OQP6k0K2o6L2k2m3M9Kj1o5R0m9K2N3q6QP0j00J2jL9K2Kk6l9j6O4l8
$$ 8 -10 -20 -14 -6 70 50 72 6 38 16 -27 22 24 13 -52 38 -11 11 64 -22 -14 56 -44 -32 -33 6 28 30 4 -35 -51 13 -25
5959b5R4nm0K0q2M4m1L1K7l1j5oM6k1n8Q6l2J0L0j0J9n4O3j9q0M8k2M3L0o7n8
$$ -25 69 64 24 44 -38 6 -35 -4 23 -8 -23 -29 17 -4 -62 24 -8 2 32 22 41 -13 50 31 -49 -1 -23 20 50 -17 -75
5990g5M3L2J7MJ3Jj8%p9R5p2RN2J1j3j8L3l9ok2j1J5N4o3K4K6jM0M3j34P8k6n
$$ -75 -32 0 17 21 34 35 17 17 -62 33 -39 -30 22 33 20 2 35 -4 -10 -32 -43 -28 26 -37 -13 13 12 52 95 -39 39 13 8
6023HO2o5rK4rlj7OK6k3J7okk1K9L2k9l0N8k8J7j09P3L3n4M1K4r1QK3O5p5J6L7
$$ 8 70 5 -4 20 11 8 -9 -3 23 0 17 11 9 -12 17 49 20 -10 48 20 37 -72 1 34 -20 21 45 -46 -38 -15 50 -25 -9 28
6057B8Rk8K9m7J2nn9M6k6M0O7p2LK2j7L1k6L7o7J1K9n5M3K9n6M8l1L2l2l5K8J8
$$ 28 37 9 38 -9 3 -2 -61 -15 -41 -1 66 -6 -3 19 2 33 7 44 -23 -12 17 -38 5 34 -22 26 -5 27 -5 -40 -12 6
6089Fk3l2R6k6m6%O0k5K0K8k1j02JJ5mO9l7%M7j7m1MK0m9MM7L1K0k9J4p5jN3L0
$$ 6 -17 -49 47 21 -25 -25 35 10 30 58 37 -65 -64 -49 -53 16 -21 -21 26 9 -32 -28 -8 -57 -53 -6 25 45 16 30 -45 -46 7 37
6123C7M9p7J2J3n8QL9l9M1k4QL8p5J8k8Q6k6n1J1P5o8j6L6K9o6N9r7L6M1Ppj3
$$ 37 86 9 21 34 -24 -16 23 -16 25 1 9 47 -28 -10 -38 48 22 -29 -18 57 -11 -27 9 38 -28 31 -66 -30 11 18 11 -2
6155bJ7n9J8pJ1L6r5J68r4qL0l0K8j1Pj2K5m2L1lOpL6p6jP4J5l7K6o6j4RP6j0
$$ -2 15 -44 -26 -33 -22 14 -81 87 -7 -15 15 -15 13 2 9 -3 22 -20 11 8 14 7 43 -33 -34 40 55 18 44 -22 -36 -27 49 39
6189C9m8Ql5M2J3l7N3k0J9n8P9k2k9Oj7J2j1Q8q1J3m0j0J6J4L2j5J3l0J9K3l6
$$ 39 -9 -1 -36 6 19 -18 35 15 34 -24 55 33 4 10 -7 5 -6 82 1 14 -26 -36 -20 -6 26 11 24 -6 13 36 0
6220@K4o3J11p6M6Qm4Lj4K4kj1k0J6K0o3P2n1L0jK8Lo3M0%lNj2Qk3l3P2j4j5m5
$$ 0 24 -39 72 -4 42 50 6 9 -5 19 17 6 -14 2 22 -41 31 -20 10 9 37 40 -23 17 17 14 19 7 15 -8 -41 31 17 2 -43
6255d3M7lL3k4l5J5M4k3j7O4n6%j1RPK6k0m8M0m2K4M9Lq4M2L1m1L7l9J3n3O2l1
$$ -43 4 1 34 10 -25 -10 34 11 -6 58 2 2 -9 0 7 33 13 -35 5 -37 -13 36 39 -45 -3 28 -13 24 -15 -2 -55 7 -24
6288b4N2l4N8j8o5qK3L1m8L3j9JLJ5l0LJ1k9O7Lqnj7K8kl9O2m9M3p8PM6l0J4k8
$$ -24 28 -6 52 34 -31 -39 -16 15 -33 0 -19 -18 -15 0 -30 -27 -16 -45 22 25 17 12 -5 23 21 -18 44 -5 38 -40 -33 13 -17 -3 -31
6323c1M2%qJ9n4lO9m9J9J7l8l0N2k5KM6m6j5M9l4O1l6jRJ1m1p9Q9Lj6j7M9p8R1
$$ -31 11 11 3 22 -32 -35 34 -15 4 21 -17 -47 5 -20 -18 28 -18 -33 16 -18 43 7 6 15 26 -15 -94 -5 -2 -18 -35 14 -64 27
6357B7j8j8K4l9M0l0Rk9J6L6k8j9Q1o6jMl3M7M0l3j8j8nK8L2K5r2Q9r4Qj4NL5
$$ 27 9 -9 15 -24 16 -14 -5 -34 -18 18 -10 -29 52 -14 -15 -11 -44 3 43 10 -8 -26 -31 -3 29 54 -38 51 -43 -35 -49 -44 -9
6390iJ0Qk2m5j1P7j1Mj0L0n3P9r1LO0l7K5k6l4P0Mj7m7P5kj6Ol6R3p1l2R8p6j5
$$ -9 1 9 -13 -58 -69 8 -3 1 -9 21 -32 47 -44 -41 19 -18 7 -19 -53 17 21 4 -43 32 30 14 20 -16 77 6 -26 72 -4 -19
6424a9Q6j13M4k4NN1j7jJ5l9mmO8j06O1K6k9L0n1L7Ql3o5J9L0%J5k7k0nO3L4k2
$$ -19 67 -46 -2 -26 -21 30 13 12 27 -12 -16 -20 48 -58 3 29 0 30 -21 16 24 -9 -74 -55 -25 -25 -10 -37 -57 -62 1 35 13
6457A3Qn2M1j4K5k9k7M2J2m2J2P7o6Pm2J4J7J8L2o5PJ7lok0j1R4o0m1J5k6NP6
$$ 13 21 -31 10 -4 21 -8 -35 7 19 -23 -11 66 0 7 -35 -21 -4 14 46 -19 -12 5 2 -4 -24 -35 59 -1 -42 -27 -53 -48 28
6490B8n5M1rl2K1K8kk8m6J4M8m7M3%j5K7l3lN2j5M6p9M1j6QMj1J4j8M2n3L7l5
$$ 28 -27 14 5 -27 -6 22 20 -8 -54 -40 8 -39 4 4 -11 16 -17 -20 32 17 63 -16 25 9 17 21 10 24 6 48 -5 32 -3
6523cnL6l4Jk6N9o6P5j5l7j9K0J4l7j7N1rl1qN3m7J8N2m5J7nL9l9%jMm1NN4nk0
$$ -3 -8 28 -6 -5 -31 28 -38 37 22 -15 -34 -14 0 -37 -54 -3 -12 -43 -51 2 -45 -27 25 -20 -3 -8 31 -8 -8 -9 -5 -46 -41 13 8 -12
6559a2M7L9p3k3J5N3j3k0l4Q2l0l6L5l7M1K1lm2n2J4J3J2m2L9L2k5m0pP5k9K4
$$ -12 35 74 1 -22 -7 46 33 13 -21 61 31 -5 30 -7 34 55 52 10 -42 -28 -15 -3 -45 -6 26 1 -39 -46 29 0 24
6590B4m4k9J7J8n6R3K7l5m4K5L2m0L6k0m9O0n1M0J7kj5p3P7LlK1n2M2n4P0l4K
$$ 24 -20 -49 -32 -14 -70 23 50 15 -29 -4 28 -12 24 4 -45 15 -36 4 21 19 4 -69 8 11 8 29 -23 19 -35 35 1 3
6622CqM1m5k4k0M3K6om9P2J4j2m0L2o2J15j1q5L6q7J13j5n8M2j2k7K3qj6M9Ln
$$ 3 -5 36 -9 -33 -53 -10 16 10 -39 33 47 35 -5 27 -35 80 69 -16 20 -67 46 31 -27 15 3 -24 -1 -9 -25 24 27 22
6654B2j4KL4k2k5J2L0k3KQ0p3k7Nk5L4j8K7o1L1oRJ8l4NK3j8k2K3NL4r0P6n5N4
$$ 22 8 10 44 22 -3 9 39 16 18 98 25 -2 3 -22 12 -6 21 -40 -9 -15 -6 12 -22 -17 6 -12 -34 -11 -6 28 -62 14 -41 13
6688A3k3J0j2l0M3qL1n2N3k5M1l8K1k0j5J8L2m8j8K0L9l9P8o5l1K0Mrl2L9Qj7
$$ 13 -10 0 -12 -42 1 -7 24 -28 25 0 41 3 24 4 -11 7 39 -9 -27 -7 32 -7 71 6 -25 -5 -1 -10 -42 -3 5 -12
6720a2j2J6J6J7kj00M2J19j16L5K4k4m3RL9Qm3m1Q8M1j23M8j7jj8PMM9lk6L6j1
$$ -12 -24 -8 8 25 23 -77 -35 84 -32 3 27 3 -40 -31 8 16 -27 -68 20 61 -62 -14 -31 -32 -50 -43 -39 10 7 -19 17 6
6752Fm7M9l9NN9n6O8k0p7O6J6nm9O9l1m6J2N5l0lK2mo9K4K8j5K7m3M6j6L2l1L
$$ 6 -41 8 -31 -26 33 -23 45 25 -52 14 30 25 -24 45 14 -32 -20 35 5 2 24 20 -49 -25 3 -12 15 -28 18 2 34 3 6
6785Fp1P5Pn4K1M8J0j0k2K2p1M2JJ6j9Jl1O1m7%LK6Po7Q1J5m6J9j0k2J0LJ3J4
$$ 6 -65 10 17 -37 -16 32 42 32 10 32 -39 3 4 20 1 2 -29 32 -15 -15 -12 14 21 -46 35 50 4 23 13 -9 1 4 17 31
6819C1o1M3j8j0Qk2L0j4j4j1L6Rl6N5r2P4l4MK5k9J6rL7J3J1n7PJ7J7j1m2J6l1
$$ 31 -30 13 -5 -15 -7 -29 1 -13 -27 -38 -2 7 -29 26 -66 8 -26 -22 3 -26 -10 -19 18 31 42 -15 -8 9 26 15 -27 -11 -42
6852d2R8j0k1mm9J9k3N2LJ7l8j6M3n9K3Rj8K8J9q2j4J07l0o0J2M2j6kJ6l8J1J7
$$ -42 56 46 25 21 -28 -9 -32 20 23 40 2 -14 29 -30 -7 2 -16 12 31 -51 -65 42 12 -48 -36 6 -10 -12 4 -34 -23 -6
6884fK3o3J21o5K7m8N8pp5J8L7k8Ol6L5M7p7K7j9MmlJ7j8K9l8P2l9K6o4P5q0K8
$$ -6 17 -46 75 10 37 -11 47 40 -35 -17 20 -8 -2 -38 -3 44 -33 -6 -25 -21 -25 -28 -11 -29 0 -38 34 -5 21 -43 32 -48 -20
6917b0qk6Q3n0k2k6P5J1n6K7pMj7L5K3k6Pl3Q%j3J7K5l4J3K8m1MQ0l1On5O1K1
$$ -20 -28 -54 29 -21 -43 -69 6 17 -39 -12 -19 -15 -32 3 26 0 7 -26 -18 -18 -31 -14 11 -23 -10 18 -23 -19 61 30 36 -19 42 63
6951F3n1J4J2m8OJ1J5k8J1n8NO2j6OLl4K2J9K2k9J8Lo0N8p1L4J8Mp7Q6m2K1Kl1
$$ 63 12 26 38 -10 -4 7 22 -6 5 -53 -48 14 -2 4 7 -27 -5 14 36 7 25 28 -32 26 -45 -11 7 11 -66 20 -22 -1 1 -30
6985c0RP5n5lLL1l6Rk6K4p0P1K2k3kJ8j4K2l2j0lj7N3J1J6l0l6j3J2k6J2J0J4
$$ -30 -21 54 -1 -4 -1 30 -6 3 -23 1 -69 2 24 1 -1 17 3 25 -7 -17 -20 -37 16 27 43 13 -23 -36 -24 -50 -38 -28 -14
7018a4j4L0k9PPK7n9j6N2M7p8L1J01n3o3jM1p1P2j2L7j5k5k8j2L0oN6j06O6L5
$$ -14 -28 2 -27 -20 -13 14 -45 -61 -9 38 -40 -9 92 39 -24 -25 16 -55 17 5 42 27 2 -26 -38 -8 -14 42 -64 2 37
7049C7p9N9n3Q0l3j3K5j6m4l4N5K4kl2K1m2M2L0n2Qj7K1J3LK6M9j41K8O2m2k1
$$ 37 -42 17 -36 44 11 -2 23 7 -37 -71 -16 8 6 -26 -5 -47 -5 25 -27 -19 -36 -15 -2 1 27 76 -65 -37 25 -17 -38
7080c8O0J9l8JnNm4K4N2n1J9l3L3Ok4ko2J08Rm8o1N8POk3K9mmm0O8n3%j4j0QO0
$$ -38 22 41 3 4 -1 4 -40 -16 36 -15 4 -29 4 10 -14 -16 -78 30 39 -9 -70 -12 -5 1 -22 7 3 -1 -41 27 -26 -26 -40 -50 -42 18
7116A8k6j0K7k3j1J8n4N9j0nK3n3J7J4J5J6rK7l8j7K7J8J9l8J4m6J4O3m9k1jk8
$$ 18 -8 -18 9 -14 -25 -7 -61 -2 -12 -17 6 -47 -30 -16 -1 15 6 33 -5 -22 5 23 42 4 18 -28 -14 49 0 -21 -22 -50
$$ [...]
8191E2
##END NTUPLES=NMR FID
##END=
