##TITLE=1H_BAU-j-5.02 NN2
 CDCl3, 8 sc, 
 5.2.2019
##JCAMPDX= 6.0         $$ Bruker NMR JCAMP-DX V2.0
##DATA TYPE= NMR FID
##DATA CLASS= NTUPLES
##ORIGIN= UXNMR, Bruker Analytische Messtechnik GmbH
##OWNER= root
$$ XWIN-NMR		Version 3.5
$$ Tue Feb  5 14:05:18 2019 Russian Standard Time (UT+4h)  she@DPX200
##.OBSERVE FREQUENCY= 200.1313
##.OBSERVE NUCLEUS= ^1H
##.DELAY= (6, 6)
##.ACQUISITION MODE= SIMULTANEOUS
##.ACQUISITION SCHEME= undefined
##.AVERAGES= 8
##.DIGITISER RES= 18
##SPECTROMETER/DATA SYSTEM= spect
##.PULSE SEQUENCE= zg30
##.SOLVENT NAME= CDCl3
##.SHIFT REFERENCE= (INTERNAL, CDCl3, 0, 15.7039)
##AUDIT TRAIL= $$ (NUMBER, WHEN, WHO, WHERE, WHAT)
$$ ##TITLE= Audit trail, XWIN-NMR		Version 3.5
$$ ##JCAMPDX= 5.01
$$ ##ORIGIN= Bruker BioSpin GmbH
$$ ##OWNER= she
$$ F:/spectra/data/she/nmr/H-F/1/audita.txt
$$ ##AUDIT TRAIL=  $$ (NUMBER, WHEN, WHO, WHERE, WHAT)
(   1,<2019-02-05 14:04:14.56 +0400>,<she>,<DPX200>,
      <created by zg, POWCHK disabled, PULCHK disabled
       configuration hash MD5:
       00 E9 B6 7A A2 85 ED C7 34 08 36 98 17 FE 4E 26
       data hash MD5: 16K
       69 9C 60 E9 27 D8 35 28 FB A6 81 4C 67 9C 5B 1D>)
$$ ##END=
$$ 
$$ hash MD5
$$ 24 BB 3C 6B 58 4B 72 6E BF B7 A5 B0 6C 91 7A C6
##$RELAX= 
##$RELAX= 
##$RELAX= 
##$RELAX= 
##$RELAX= 
##$RELAX= 
$$ Bruker specific parameters
$$ --------------------------
##$DU= <F:/spectra>
##$EXPNO= 1
##$NAME= <H-F>
##$PROCNO= 1
##$TYPE= <nmr>
##$USER= <she>
##$AMP= (0..31)
100 100 100 100 100 100 100 100 100 100 100 100 100 100 100 100 100 100 
100 100 100 100 100 100 100 100 100 100 100 100 100 100 
##$AQSEQ= 0
##$AQ_mod= 1
##$AUNM= <au_zg>
##$AUTOPOS= <>
##$BF1= 200.13
##$BF2= 200.13
##$BF3= 200.13
##$BF4= 200.13
##$BF5= 200.13
##$BF6= 200.13
##$BF7= 200.13
##$BF8= 200.13
##$BYTORDA= 1
##$CFDGTYP= 0
##$CFRGTYP= 5
##$CHEMSTR= <none>
##$CNST= (0..31)
1 1 145 1 1 1 1 1 1 1 1 1 1 1 1 1 1 1 1 1 1 1 1 1 1 1 1 1 1 1 1 1 
##$CPDPRG= <>
##$CPDPRG1= <>
##$CPDPRG2= <>
##$CPDPRG3= <>
##$CPDPRG4= <mlev>
##$CPDPRG5= <mlev>
##$CPDPRG6= <mlev>
##$CPDPRG7= <mlev>
##$CPDPRG8= <mlev>
##$CPDPRGB= <>
##$CPDPRGT= <>
##$D= (0..31)
0 1.2 0 0 0 0 0 0 0 0 0 0.03 0 0 0 0 0 0 0 0 0 0 0 0 0 0 0 0 0 0 0 0 
##$DATE= 1549361054
##$DBL= (0..7)
120 120 120 120 120 120 120 120 
##$DBP= (0..7)
150 150 150 150 150 150 150 150 
##$DBP07= 0
##$DBPNAM0= <>
##$DBPNAM1= <>
##$DBPNAM2= <>
##$DBPNAM3= <>
##$DBPNAM4= <>
##$DBPNAM5= <>
##$DBPNAM6= <>
##$DBPNAM7= <>
##$DBPOAL= (0..7)
0.5 0.5 0.5 0.5 0.5 0.5 0.5 0.5 
##$DBPOFFS= (0..7)
0 0 0 0 0 0 0 0 
##$DE= 6
##$DECBNUC= <off>
##$DECIM= 32
##$DECNUC= <off>
##$DECSTAT= 4
##$DIGMOD= 1
##$DIGTYP= 9
##$DL= (0..7)
0 120 120 120 120 120 120 120 
##$DP= (0..7)
150 150 150 150 150 150 150 150 
##$DP07= 0
##$DPNAME0= <>
##$DPNAME1= <>
##$DPNAME2= <>
##$DPNAME3= <>
##$DPNAME4= <>
##$DPNAME5= <>
##$DPNAME6= <>
##$DPNAME7= <>
##$DPOAL= (0..7)
0.5 0.5 0.5 0.5 0.5 0.5 0.5 0.5 
##$DPOFFS= (0..7)
0 0 0 0 0 0 0 0 
##$DQDMODE= 0
##$DR= 18
##$DS= 0
##$DSLIST= <SSSSSSSSSSSSSSS>
##$DSPFIRM= 0
$$ [...]
##$SUBNAM2= <"">
##$SUBNAM3= <"">
##$SUBNAM4= <"">
##$SUBNAM5= <"">
##$SUBNAM6= <"">
##$SUBNAM7= <"">
##$SUBNAM8= <"">
##$SUBNAM9= <"">
##$SW= 20.0189088683792
##$SWIBOX= (0..15)
0 0 2 0 0 0 0 0 0 0 0 0 0 0 0 0 
##$SW_h= 4006.41025641026
##$TD= 16384
##$TD0= 1
##$TE= 0
##$TE2= 300
##$TE3= 300
##$TEG= 300
##$TL= (0..7)
0 120 120 120 120 120 120 120 
##$TP= (0..7)
150 150 150 150 150 150 150 150 
##$TP07= 0
##$TPNAME0= <>
##$TPNAME1= <>
##$TPNAME2= <>
##$TPNAME3= <>
##$TPNAME4= <>
##$TPNAME5= <>
##$TPNAME6= <>
##$TPNAME7= <>
##$TPOAL= (0..7)
0.5 0.5 0.5 0.5 0.5 0.5 0.5 0.5 
##$TPOFFS= (0..7)
0 0 0 0 0 0 0 0 
##$TUNHIN= 0
##$TUNHOUT= 0
##$TUNXOUT= 0
##$USERA1= <user>
##$USERA2= <user>
##$USERA3= <user>
##$USERA4= <user>
##$USERA5= <user>
##$V9= 5
##$VALIST= <valist>
##$VCLIST= <CCCCCCCCCCCCCCC>
##$VD= 0
##$VDLIST= <DDDDDDDDDDDDDDD>
##$VPLIST= <PPPPPPPPPPPPPPP>
##$VTLIST= <TTTTTTTTTTTTTTT>
##$WBST= 1024
##$WBSW= 4
##$XGAIN= (0..3)
0 0 0 0 
##$XL= 0
##$YL= 0
##$YMAX_a= 103367
##$YMIN_a= -87094
##$ZGOPTNS= <>
##$ZL1= 120
##$ZL2= 120
##$ZL3= 120
##$ZL4= 120
##$ABSF1= 10
##$ABSF2= 0
##$ABSG= 5
##$ABSL= 3
##$ALPHA= 0
##$AQORDER= 0
##$ASSFAC= 0
##$ASSFACI= 0
##$ASSFACX= 0
##$ASSWID= 0
##$AUNMP= <proc_1d>
##$AZFE= 0.1
##$AZFW= 0.1
##$BCFW= 1
##$BC_mod= 2
##$BYTORDP= 1
##$COROFFS= 0
##$CY= 11.3945322036743
##$DATMOD= 1
##$DC= 2
##$DFILT= <>
##$DTYPP= 0
##$F1P= 18.9103706918063
##$F2P= -1.10871071338519
##$FCOR= 0.5
##$FTSIZE= 0
##$FT_mod= 4
##$GAMMA= 1
##$GB= 0.15
##$INTBC= 1
##$INTSCL= 1
##$ISEN= 128
##$LB= 0.24
##$LEV0= 0
##$LPBIN= 0
##$MAXI= 10000
##$MC2= 0
##$MEAN= 0
##$ME_mod= 0
##$MI= 1.114404
##$NCOEF= 0
##$NC_proc= 0
##$NLEV= 6
##$NOISF1= 3.799351
##$NOISF2= 2.8
##$NSP= 1
##$NTH_PI= 0
##$NZP= 0
##$OFFSET= 15.70392
##$PC= 1
##$PHC0= -9037.827
##$PHC1= 12.80004
##$PH_mod= 1
##$PKNL= yes
##$PPARMOD= 0
##$PSCAL= 0
##$PSIGN= 0
##$REVERSE= no
##$SF= 200.130013532006
##$SI= 16384
##$SIGF1= 3
##$SIGF2= 2
##$SINO= 400
##$SIOLD= 16384
##$SREGLST= <1H.CDCl3>
##$SSB= 0
##$STSI= 0
##$STSR= 0
##$SW_p= 3612.71676300578
##$SYMM= 0
##$S_DEV= 0
##$TDeff= 0
##$TDoff= 0
##$TI= <>
##$TILT= no
##$TM1= 0
##$TM2= 0
##$TOPLEV= 0
##$USERP1= <user>
##$USERP2= <user>
##$USERP3= <user>
##$USERP4= <user>
##$USERP5= <user>
##$WDW= 1
##$XDIM= 8192
##$YMAX_p= 0
##$YMIN_p= 0
$$ End of Bruker specific parameters
$$ ---------------------------------
##NTUPLES= NMR FID
##VAR_NAME=  TIME,          FID/REAL,        FID/IMAG
##SYMBOL=    X,             R,               I
##VAR_TYPE=  INDEPENDENT,   DEPENDENT,       DEPENDENT
##VAR_FORM=  AFFN,          ASDF,            ASDF
##VAR_DIM=   8192,          8192,            8192
##UNITS=     SECONDS,       ARBITRARY UNITS, ARBITRARY UNITS
##FACTOR=    0.0002496,     1,               1
##FIRST=     0,             0,               0
##LAST=      2.0444736,     0,               0
##MIN=       0,             -87094,          0
##MAX=       2.0444736,     103367,          0
$$ Real data points
##PAGE= N=1
##DATA TABLE= (X++(R..R)), XYDATA
0@%%%%%%%%%%%%%%%Qj6J6j6J7k5L2l6M4n0N8p2Q1q9J04j20J37j59J82k04K29k58
$$ 0 0 0 0 0 0 0 0 0 0 0 0 0 0 0 0 8 -8 8 -8 9 -16 16 -20 24 -26 32 -40 41 -48 56 -64 73 -86 96 -108 121 -137
37a37K90l25L63m04M50n00N55o15O79p49Q27r10J001j104J217j342J480j635J809
$$ -137 153 -172 191 -213 237 -263 292 -323 356 -393 434 -476 525 -579 638 -704 776 -859 950
56I50k005K230k489K794l156L597m149M854n798P142r214J2871k1266P8425L4781
$$ 950 -1055 1175 -1314 1480 -1676 1921 -2228 2626 -3172 3970 -5244 7627 -13639 64786 99567
71I9567m7314N1114l7223m9021l2557l0411k5911n650r688L8432J5790k0640L6400
$$ 99567 52253 103367 66144 17123 -15434 -45845 -71756 -77406 -87094 -48662 -32872 -53512 -17112
84a7112O7923o542k0423J2776J0244j7751j2966K168p510k5660k962J8326J1648
$$ -17112 50811 44269 23846 36622 46866 29115 16149 18317 10807 -14853 -17815 511 12159
97A2159j9184l0058J7738K9809l3792j7437K9858p651r251L3207J4172J645M695
$$ 12159 -7025 -37083 -19345 10464 -23328 -40765 -10907 -18558 -27809 5398 19570 21215 25910
110B5910k891K5791J2612m6896j8210J6792k5649k9085O367l351j4924N971K8179
$$ 25910 23019 48810 61422 14526 -3684 13108 -12541 -41626 -35259 -38610 -53534 -47563 -19384
123a9384K3610K148R03K0707K6073k15k4468k454O336l1666j8319J5038k2599
$$ -19384 4226 6374 7277 27984 54057 53842 29374 26920 33256 1590 -16729 -1691 -24290
136b4290k9624J4743J2117M311O733p476K0899L3106j2167k036K5423j3748j8258
$$ -24290 -53914 -39171 -27054 -22743 -16010 -23486 -2587 30519 18352 16316 41739 27991 9733
149I733J5634j672k4331j3553l78O077k777j4263o94J5091K896p913J2558J5172
$$ 9733 25367 23695 -636 -14189 -14567 -8490 -11267 -25530 -26224 -11133 -8237 -16150 -3592 11580
163A1580j5839k995K9609P6j8373Q339M679j794K379j5031m769Q001k1682q786
$$ 11580 -4259 -7254 22355 22431 4058 12397 17076 15282 17661 2630 -2139 5862 -15820 -24606
177b4606K0097j4408j8729K1845J3500l986P708Q476P636Q109m299l437L212j1655
$$ -24606 -4509 -18917 -37646 -15801 -2301 -6287 1421 9897 17533 25642 21343 17906 21118 9463
191I463j8146K947M063j9873q531J8196K481n762J4791N440q13J0121j999j432
$$ 9463 -8683 -5736 -1673 -21546 -30077 -11881 -9400 -15162 -371 5069 4256 14377 12378 10946
205A0946R092j6507r969J8349q487j9040J1818K167j0160P137J623n133N173q93
$$ 10946 20038 3531 -6438 11911 3424 -15616 -3798 -1631 -11791 -4654 -3031 -8164 -2991 -3884
219c884j536J0084n29q296Q908J0119q102l133R342n352r287N397m340r348L896
$$ -3884 -5420 4664 4135 -4161 4747 14866 6764 3631 12973 7621 -1666 3731 -609 -9957 -6061
234f061n137l426J2568m966o708J7670J835r196J3037K841j0169P040J054q013
$$ -6061 -11198 -14624 -2056 -7022 -13730 3940 5775 -3421 9616 12457 2288 9328 10382 2369
248B369L866l266q588O239l56j1350L042N817p138o43R273j905j990R277Q51k407
$$ 2369 6235 2969 -5619 620 264 -11086 -8044 -2227 -9365 -10008 -735 -2640 -4630 4647 5498 3091
264C091P551k821o200Q074n346j1146Q770k567j2130R581K961r016Q346M251o299
$$ 3091 10642 7821 1621 9695 4349 -6797 1973 -594 -12724 -3143 -182 -9198 -852 3399 -2900
279b900P299J618q455N608K037r366K803M846p372O44O944l969k204O262k765
$$ -2900 4399 6017 -2438 3170 5207 -4159 -1356 3490 -3882 -3238 3706 -263 -2467 3795 1030
294A030m256N821k780n654P564q61o898R473J784q350Q296K057r742N257J189
$$ 1030 -3226 2595 -185 -5839 1725 864 -6034 3439 5223 -3127 5169 7226 -2516 2741 3930
309C930j0657M089K589r175M653N040o232M816O785n479J657O142n013k288M856
$$ 3930 -6727 -2638 -49 -9224 -4571 469 -5763 -947 5838 359 2016 8158 3145 857 5713
324E713m673m459N539k578n572O614k01o706O698J010p777O452K237q486O546
$$ 5713 1040 -3419 2120 -458 -6030 584 383 -6323 375 1385 -6392 60 2297 -6189 357
339C57M032q396N674N030p910L548N174q414O52M549p239k59M833n373q95O489
$$ 357 4389 -4007 1667 6697 -1213 2335 7509 -905 -253 4296 -2943 -3202 1631 -3742 -4637 1852
355A852l373k455O889j475m902O078m69o310N263J674o946N467L088p010M732
$$ 1852 -1521 -3976 2913 1438 -3464 2614 2145 -4165 1098 2772 -4174 1293 4381 -2629 2103
370B103L341q087L567M077r141J883N128p445J026O104n350M16O570m707j238
$$ 2103 5444 -2643 924 5001 -4140 -2257 2871 -4574 -3548 2556 -2794 -2378 4192 -515 -1753
385a753N623l838l065N528k527m504N936L38n334N549K435o255L980K531p065
$$ -1753 3870 32 -3033 2495 -32 -4536 1400 1738 -3596 1953 4388 -1867 2113 4644 -2421
400b421K804K963p779K392M526p183K172O187o470P83O607n542j393N837m468
$$ -2421 383 3346 -4433 -2041 2485 -4698 -2526 3661 -2809 -2026 4581 -961 -2354 3483 -985
415i85j922N485l143k320O078j618l595N682j96n554M026Q87o307K628K331o172
$$ -985 -2907 2578 -565 -2885 3193 1575 -2020 3662 3466 -2088 1938 2825 -3482 -854 1477 -4695
431d695K726L842n454K164M809o038J420N843o227o20O249m637j454N954l638
$$ -4695 -1969 1873 -3581 -1417 3392 -2646 -1226 4617 -1610 -2230 4019 -618 -2072 3882 244
446B44j698N596k995k613M799k811m665N029j042n468M274J965m749L395L309
$$ 244 -1454 4142 1147 -1466 3333 522 -4143 886 -156 -5624 -1350 615 -4134 -739 2570
461B570m166K326L070m851J941L323o482Q66N618n684q36O471m460k042N860l304
$$ 2570 -1596 730 3800 -1051 890 4213 -2269 -1403 4215 -1469 -2305 4166 -294 -2336 3524 220
477B20k879M232l037k116M797k764l367O393J34m876N197K062n354K220L072m919
$$ 220 -2659 1573 -1464 -3580 1217 -1547 -4914 1479 1613 -3263 1934 3996 -1358 862 3934 -985
493i85P03K133m284J561L110m780J211N134n438o76O549m396l450N509k005l062
$$ -985 -282 1851 -2433 -872 2238 -2542 -1331 3803 -1635 -2311 4238 -158 -3608 1901 -104 -3166
509c166M084j502k107M646j531k814N333q94n099M984J356n777K052L332m296
$$ -3166 918 -584 -2691 1955 424 -2390 2943 2049 -3050 1934 3290 -2487 -435 2897 -1399
524a399J130K854l732M36L014m592N02M207n389r50O246l172k944N748j420k619
$$ -1399 -269 2585 -1147 -711 2303 -2289 -1787 2420 -2969 -3919 2327 -845 -3789 1959 539 -2080
540b080N188j320l031M049j442l172M676j060n337M243K147n556J942K401m143
$$ -2080 3108 1788 -1243 2806 1364 -1808 2868 1808 -3529 714 2861 -2695 -753 1648 -2495
555b495J039K512l625N85L262l839R76N161l951j326O290k554l190M477j562l800
$$ -2495 -1456 1056 -2569 -1984 1278 -2561 -1585 3576 -375 -1701 4589 2035 -1155 3322 1760 -2040
571b040L330j330l065L998j463l529N386N04n388L904K428m844J595K747l653
$$ -2040 1290 -40 -3105 893 -570 -4099 1287 1791 -3597 307 2735 -2109 -514 2233 -1420
586a420M73K221k512J284K446l683P89M558m433j863N341k826l901M841p06l376
$$ -1420 -947 1274 -1238 46 2492 -1191 -402 4156 -277 -2140 3201 375 -3526 1315 609 -2767
602b767L274j74k121L754j214l533M314j43m893L650K052n454K089L905l341J51
$$ -2767 507 333 -1788 1966 752 -2781 1533 1390 -3503 147 2199 -3255 -1166 2739 -602 -451
618d51K642k215P64K433m004K23L323l858j337M648k722l360M852m75l289K997
$$ -451 2191 -24 740 3173 -831 -608 2715 -1143 -2480 2168 -554 -3914 938 463 -2826 171
634A71J58k514L406k00l295M007M21m177L644K250m987J183K986l880Q3K201l286
$$ 171 329 -2185 1221 1021 -2274 1733 2154 -2023 1621 3871 -1116 67 3053 -827 -744 1457 -1829
651a829K18K381k722k32L716k869r97M650j808k818L952l51l108L199L8k828L050
$$ -1829 -1611 770 -1952 -2184 1532 -1337 -2334 2316 508 -2310 1642 1291 -1817 1382 1420 -1408 1642
668A642J16l556L318Q49m674K295K119m356Q71K637l585P06L067k656M43K657
$$ 1642 1758 -1798 1520 2369 -2305 -10 2109 -2247 -1376 1261 -2324 -1618 1449 -1207 -764 1893
684A893k696j70L889l133k001M306j390l021L621l60k687K923K80k799K613K3
$$ 1893 -803 -973 2916 -217 -2218 2088 698 -2323 1298 938 -1749 1174 1454 -1345 1268 1291
700A291l609L126O28m320K066K292l870J068L117k835j82L083k387k6K875k917
$$ 1291 -2318 808 1436 -2884 -818 1474 -2396 -1328 1789 -1046 -1228 1855 -532 -558 2317 -600
716f00n46L512k309j646L908j364k629L237j90l299K496J87l217K197M60l125
$$ -600 -1146 2366 57 -1589 2319 955 -1674 1563 1373 -1926 570 757 -2460 -263 197 -2928
732b928K747J374l501K112K604l371Q55K796k881q6K563k557m69K729k362q84
$$ -2928 -181 1193 -2308 -196 2408 -963 -108 2688 -193 -279 2284 -273 -742 1987 -375 -1259
748a259K997k285j625L535j366k842L271j22k673K646N13k649K557R87k886K058
$$ -1259 1738 -547 -2172 1363 -3 -2845 426 304 -2369 277 790 -1859 698 1685 -1201 857
764H57J478l507J407J958l483N61K779l069j89K939k420o41L117k371r79L062
$$ 857 2335 -1172 235 2193 -1290 -729 2050 -1019 -1208 1731 -689 -1330 1787 -584 -1563 1499
780A499j861j664L127p41k451K930J8k603K825P24l043K099Q10k987J615J414
$$ 1499 -362 -2026 1101 360 -2091 839 857 -1746 1079 1803 -1240 859 1669 -1318 297 1711
796A711l168J132K196l070N29K431k799o5K575k499o85K953j871j341L337j400
$$ 1711 -1457 -325 1871 -1199 -670 1761 -1038 -1103 1472 -1027 -1712 1241 -630 -1971 1366 -34
812c4j650L400p83k256L031k81k580K109M68k734J722P30l053J656J606l160P73
$$ -34 -1684 1716 933 -1323 1708 1427 -1153 956 1424 -1310 412 1142 -1911 -255 1351 -1809 -1036
829a036K279k669L44K393k538K3K821k059m43K907j679j131L003j296j826K456
$$ -1036 1243 -1426 -1082 1311 -1227 -1204 1617 -442 -885 2022 343 -788 2215 919 -907 1549
845A549p82k340K314k84k361J971O06k494J600J358k890J367J714k525O86K161
$$ 1549 767 -1573 741 457 -1904 67 673 -1821 -221 1137 -1753 -386 1328 -1197 -511 1650
861A650k448Q4K562k199j55K417j939q13K674j861j537K807j281k001K833m60
$$ 1650 -798 -714 1848 -351 -506 1911 -28 -841 1833 -28 -1565 1242 -39 -2040 793 333
877C33k243K380J5k321K240Q55k994J835J374k859J138J828k407O84K136k401
$$ 333 -1910 470 485 -1836 404 1259 -1735 100 1474 -1385 -247 1581 -826 -142 1994 -407
893d07MK453k332p14K627k087r60K637j466j774K911r01j723K347q9k134K287
$$ -407 -403 2050 -282 -996 1631 -456 -1416 1221 -245 -2019 892 -9 -1732 615 526 -1608 679
910F79L55k443J828R26k467J515J418k711J056J786k399n5K032k214l91K234k115
$$ 679 1034 -1409 419 1345 -1122 393 1811 -900 156 1942 -457 -512 1520 -694 -1085 1149 -966
927i66m63K375j588r80K841j356j429K671l56k082K418P7k223J939M08k341J795
$$ -966 -1429 946 -642 -1622 1219 -137 -1566 1105 749 -1333 1085 1162 -1061 878 1286 -1055 740
944G40M13k340J371J305k899Q09J827k540K95K044j984k87K565j729m82K238j302
$$ 740 1153 -1187 184 1489 -1410 -601 1226 -1314 -1019 1025 -959 -1246 1319 -410 -892 1346 44
961D4j031K386q60j807K585p07j914K151J02k093J864K48k268J381P68k333J128
$$ 44 -987 1399 539 -1268 1317 610 -1304 847 949 -1144 720 968 -1300 81 849 -1484 -356
978c56J258k347Q80J677k046J48K163j730k12K013j481o35K191j358j136K370
$$ -356 902 -1445 -565 1112 -934 -786 1377 -353 -565 1448 -33 -668 1523 165 -971 1399
994A399j055j555K370o17j955K054M4k389J874L65k225J508Q42j865R56J555k291
$$ 1399 344 -1211 1159 542 -1413 641 685 -1704 170 535 -1690 -182 660 -1205 -249 1306 -985
1011i85P59K016k208k0K031j870l58K181j637r34K200j191j248K246j144j516
$$ -985 -226 1790 -418 -438 1593 -277 -635 1546 -91 -1025 1175 -16 -1264 982 -162 -1678
1027a678K273l19j812J808M39k071J615N73j644J234R94k306J213J236k375N81
$$ -1678 595 276 -1536 272 711 -1360 255 828 -816 418 1412 -894 319 1555 -820 -239
1043b39J771k293qK189j845o63K095j237r53J975p73j308K125o72j619K286j21
$$ -239 1532 -761 -769 1420 -425 -1088 1007 -230 -1183 792 19 -1289 836 164 -1455 831 710
1060G10j800J735N20k100J580O14j928R85Q86j984O60J263k105L63J763j970j49
$$ 710 -1090 645 1165 -935 645 1259 -669 316 1202 -782 -122 1141 -964 -601 1162 -808 -957
1077i57J870j375n93J866j056n25J701q24j126J982n85j155J771j46j754J499
$$ -957 913 -462 -1055 811 -245 -770 931 107 -1019 963 378 -777 994 848 -906 593
1093E93L98k044J234Q03k107J148P93j829O11J575k178L02J692j660j42J807j206
$$ 593 991 -1053 181 984 -1123 25 818 -1011 -400 1175 -1003 -701 991 -669 -811 996 -210
1110b10p24K032q62r10J869p34j182J870n83j535J701j56j960J550L78j692R27
$$ -210 -934 1098 236 -674 1195 461 -721 1149 566 -969 732 576 -1384 166 544 -1148 -221
1127b21Q85j734Q84J091j853Q30J208j865N01J626j606k39J910j300q09J792r30
$$ -221 664 -1070 -186 905 -948 -118 1090 -775 -274 1352 -254 -493 1417 117 -692 1100 170
1144A70r14J540o45j112J567o41j425J952j63j664J564O26j736R59Q11j713R10
$$ 170 -744 796 151 -961 606 -35 -1460 492 329 -1335 229 855 -881 78 889 -824 86
1161H6R42j628N24J157j469J37J605j673k12J598j186r08J708q47j092J661m25
$$ 86 1028 -600 -76 1081 -388 -251 1354 -319 -531 1067 -119 -1027 681 -166 -1258 403 -22
1178b2j222J712k29j359J559K36j690J451N69j949R99J013j753O54J115j695N10
$$ -22 -1244 468 239 -1120 439 675 -1015 436 1005 -944 55 1068 -685 -31 1084 -611 -101
1195a01J134j811J51J487j366n43J799j099n57J619q72o42J431l68j184J617k76
$$ -101 1033 -778 -627 860 -506 -1049 750 -349 -906 713 -159 -801 630 262 -922 695 419
1212D19r70J289J77j581R80O08j557Q57N05j533M34J190j653M47J037j330J4J433
$$ 419 -551 738 915 -666 314 922 -635 222 727 -806 -372 818 -835 -388 649 -681 -667 766
1230G66j227k50J422p68n55J580o94q49J509m22j316J605k75j404J138L39j366
$$ 766 -461 -711 711 -57 -612 968 274 -575 934 512 -804 801 526 -878 260 599 -767
1247g67Q01M60j466Q09Q27j447K85J116j113J80J133j235%J519j344j59J273o44
$$ -767 34 494 -972 -163 664 -783 -498 618 -495 -315 818 -417 -417 1102 -242 -401 872 228
1265B28p71J241m55r29J305l05r90J086j15j279J169K77j524J237M26j407Q89
$$ 228 -543 698 243 -686 619 314 -676 410 295 -984 185 462 -1062 175 601 -806 83
1282H3P25j323M43J125j410J59J261j123l53J250r58l92J191o96q12J564p10q99
$$ 83 808 -515 -72 1053 -357 -198 1063 -60 -413 837 -121 -513 678 -18 -830 734 24 -875
1300h75J233k93j108J230R3j194J154K41j173R38N92j363Q85O01j293K80R25j098
$$ -875 358 65 -1043 187 280 -914 240 481 -692 246 838 -525 360 961 -332 -52 873 -225
1318b25r5J083j062m14J274p89m61J229o74o21J369o49r34J483j76j217J204K29
$$ -225 -320 763 -299 -713 561 -228 -689 540 -134 -755 614 -35 -969 514 338 -879 325 554
1336E54j076R50L10j285R37K65j042L14O84j107J12J000j091J00P75p87j25J129
$$ 554 -522 428 738 -547 390 655 -387 -73 611 -496 -384 616 -475 -375 400 -387 -512 617
1354F17q13l91J242o54o32J361m45r93J186J08j123J084K1j247R79K51j106M92
$$ 617 -196 -587 655 1 -631 730 285 -708 478 586 -537 547 568 -679 300 551 -555 -63
1372f3N41j247N51O86j252L86R16p80k42J047r19O2R98o27n13J131n31p56J408
$$ -63 478 -769 -218 468 -784 -398 518 -262 -504 543 -376 -314 684 57 -456 675 144 -612 796
1391G96n54q04R83k78q21R58J15j142P31M96j137O24M48j115N32Q05j024L35P48
$$ 796 242 -562 421 143 -678 280 395 -747 -16 480 -657 -33 415 -700 -168 637 -387 -52 696
1410F96q68J01P90q55q5R06o69m78R50o27m28R47m04p82J032qj029Q42L09r98
$$ 696 -172 -71 719 -136 -221 685 16 -462 488 -139 -567 380 -24 -806 226 218 -811 31 340 -658
1430f58P36L70r50N19O28j184O70O66j012K01O70q97p4J106j110q2Q19o16l99
$$ -658 78 448 -502 17 645 -539 131 797 -215 -14 656 -241 -315 791 -319 -401 418 -198 -597
1449e97J142m60p80J032k29q16R45m6p34Q56K79r05N64M04j096P53K57q84K92
$$ -597 545 85 -695 337 108 -708 237 191 -543 313 592 -313 251 655 -441 312 569 -315 -23
1468b3O07r21K30O28q89r2R98q61l70J050o12l81Q82r4n40Q33l00n48Q55j59q62
$$ -23 584 -337 -107 521 -368 -460 538 -323 -693 357 -255 -636 246 152 -388 445 145 -403 452 293 -569
1489e69Q73J03r51R14J18q57K39N59q70L43N34q11o9R41q62K7P38m79k96Q30n92
$$ -569 304 407 -544 370 488 -369 -130 429 -441 -98 436 -375 -444 497 -365 -338 400 -79 -375 455 -137
1510a37j90R61l62n32P37l56m15Q59l44o16O23r2o63N50L16q80N73L43q01J02
$$ -137 -327 634 272 -260 477 121 -294 565 221 -395 228 136 -527 23 339 -541 32 375 -426 -324
1530c24P00o49l3J058j031P5Q78p34m67J016l78m74Q33m28m67Q32l90n22O72J4
$$ -324 376 -273 -306 752 -279 -204 674 -60 -527 489 111 -363 470 42 -425 407 17 -505 167 181
1550A81q11O86K83q05N01M01r31L90O15p61L51L56o98K3P47o91r2P45o54l23P82
$$ 181 -630 56 339 -466 35 436 -495 -105 510 -251 100 456 -242 -219 528 -163 -255 490 -164 -487 295
1571B95k72n87Q89m43m26Q17k75n15P50K2n69O04n9o22N40L14r02O77J99p28L17
$$ 295 23 -564 325 -118 -544 273 -2 -517 233 255 -314 290 231 -391 149 463 -439 238 437 -291 26
1592B6L07o20N7M63n10o4N42m24k02P56n66k48Q74l39m48N69m4l38M68J00o17
$$ 26 333 -287 -230 233 -277 -341 201 -223 -425 331 -235 -483 391 52 -396 173 129 -209 259 359 -258
1613b58L43L72p67J07O52p24J32O04p35Q3N84p78MN24m38LN52m90j37P01m09j00
$$ -258 85 457 -310 -203 449 -275 -143 461 -274 -191 393 -385 -381 143 -295 -292 260 -230 -367 334 -75 -175
1635a75O06k66m80O58k86l73M66J74o42L48J10p04O21K13p28L64L77o16K33M69
$$ -175 431 165 -315 343 57 -316 150 324 -318 30 140 -564 57 270 -458 -94 283 -333 -100 369
1655C69p77J03P06o39P1O10o10J4M58k02n01P82k14o65O64J40p50M86J90p93M53
$$ 369 -408 -305 401 -238 -167 443 -167 -153 305 103 -398 384 170 -495 169 309 -441 45 235 -558 -105
1676a05L21m86L62K45n23P2M70m99o5N39n75J5N45l12j52M73m01r9N39k87m76
$$ -105 216 -270 92 337 -186 -114 356 -143 -208 331 -244 -229 316 4 -148 325 -76 -175 364 77 -399
1697c99N42l1k99L91j96l27L10K58p20P02l5o22M87K78o99L11K29m69K02M05k91
$$ -399 143 112 -187 204 8 -319 -9 249 -471 231 196 -426 61 339 -360 -49 180 -289 -87 318 27
1718B7j68L21k22j45N41l10m44O90l42k17L57o6l10P04k96l47M60j5l26K61J3
$$ 27 -141 180 -42 -187 354 44 -400 290 -52 -269 88 22 -288 416 120 -227 233 218 -108 153 166
1739A66m67M03K01n00P2M29o36J25M36n15J4N90n01J6N45m89j41M46l21r1L24
$$ 166 -301 102 303 -197 -125 304 -332 -207 229 -286 -272 318 -183 -167 378 -111 -252 194 -127 -218 106
1760A06n9n21P42P2m99M51o6m03K49J27n99M30K56o01K38K82m82J17M70n85J69
$$ 106 47 -474 268 340 -159 292 226 -177 72 199 -400 30 286 -315 -77 205 -277 -160 310 -275 -106
1781a06N15m16o5M08m17j63O31k74m07M21n2k61J85M2l16M31j31l21K38K20n10
$$ -106 409 -7 -72 336 -81 -244 387 113 -294 127 75 -186 -1 41 -275 156 25 -296 -58 162 -348
1802c48K93K63m46M0N35n44J57M09m97K37K23k02j22L87l50k82M94k32k87N58
$$ -348 -55 208 -238 -198 337 -207 -50 359 -138 99 322 120 -2 385 35 -247 247 15 -272 286
1822B86m90k12L42M3k54L81J47n03K80J38m69M29k2k76K62L32m73OM50n10j80
$$ 286 -204 -416 -74 -31 -285 96 243 -260 20 158 -311 118 96 -180 82 414 -59 -53 397 -113 -293
1843b93N89k35l09N57l69j42L17o9l39N50k90l81N14n1k68K56J98n57N64P2p06
$$ -293 296 61 -248 309 -60 -202 115 46 -293 257 -33 -414 100 49 -219 37 235 -322 242 314 -392
1864c92M95K34n50K22N02o07j9K52m50O8L97k67n5M51j91l58K84L6j09J73R7n05
$$ -392 103 337 -213 9 511 -96 -115 137 -313 -245 152 -115 -170 281 90 -268 16 52 -57 116 213 -292
1886b92M99Lo06M74L07o18M44l1l66J0K16k65K84J26m18K13K28l02k4L47j72k34
$$ -292 207 210 -396 78 385 -233 211 180 -186 -176 40 -225 59 185 -233 -20 208 -94 -118 229 57 -177
1908a77L74j84k39O11k52k68M72k74k37K18J36m28L48Om80M96j12m19L71J38l20
$$ -177 197 13 -226 385 133 -135 337 63 -174 44 180 -248 100 106 -374 122 10 -409 -38 100 -220
1929b20J16N02n76K52J64l64lL75k79j94N65j98m20P34m43k53L04j92jK96j31
$$ -220 -104 398 -178 74 238 -126 -129 246 -33 -227 338 140 -280 454 11 -242 62 -130 -131 165 34
1950C4k61J15M8k18K05R7l12K74K82m72J70O3k15R5L97m18j31N32k15k93M37k62
$$ 34 -227 -112 -64 -282 -77 20 -292 -18 264 -208 -38 25 -190 -95 302 -116 -247 285 70 -223 214 -48
1972d8j08L39j28k72L65jl98L36M2l38K68K2k14K26J70l43l1K67l43J81K48m65
$$ -48 -156 183 55 -217 148 147 -251 85 127 -211 57 79 -135 91 261 -82 -113 154 -189 -8 240 -225
1994b25n6N60l87M3J48l79J92J69j01k53M52k01k53M59K4l95L99K05n49K00K27
$$ -225 -281 279 -108 -65 83 -296 -104 65 -36 -289 163 -38 -291 168 192 -203 196 401 -148 52 279
2015B79m86K89J9j99J51J50l20J62K24l72L5K73k02k50M58k84k03M84k79J1L24
$$ 279 -207 82 101 -98 53 203 -117 45 269 -103 -68 205 3 -247 211 -73 -276 208 -71 -60 264
2036B64j33k02J72M9k41K59j37k38K76m2l59K65L35m75J62j4j55K36R7k28j35
$$ 264 131 -71 101 150 -91 168 31 -207 69 27 -332 -67 268 -207 -45 -59 -214 22 119 -109 -244
2057b44M95l30p1L00p4k58L89j29j82K91p1l13K81j3l50K80J46k24K47n5l06J67
$$ -244 251 -79 -150 150 76 -182 207 78 -104 187 116 -197 84 71 -279 1 147 -77 170 115 -191 -24
2079b4J91k57L7L66n59K11K65k30m6K27j99k5L29m18j1L71k19l26N01j63k81L17
$$ -24 167 -90 -53 313 -246 -35 230 0 -46 181 -18 -43 286 -132 -143 228 9 -317 184 21 -260 57
2101E7q2j88M07k3j98K80K6m54J40J99m19K78N1j25q6M98o18J14L33k04j29K95
$$ 57 -25 -213 194 171 -27 253 279 -175 -35 164 -255 23 74 -51 -137 361 -257 -143 190 -14 -143 152
2123A52k73J50q6M2k06M03j03j95K41m0m6nP9l00K48K30m05J78K06l89M9J36k58
$$ 152 -121 29 -57 -15 -221 182 79 -116 125 85 39 34 113 -187 61 291 -114 64 270 -119 -70 66 -192
2146a92J05K75j54r4M4M9j14K79k02j00K89r5k51L84n6m27L78L0m14L58p7k92
$$ -192 -87 188 34 -60 -16 33 -81 198 -4 -104 185 90 -161 223 167 -260 118 148 -266 92 15 -277
2168b77J47K58l45K2M26l79rM08k49j30K65k87K3K58k05n6L04j31l00L59j38k24
$$ -277 -130 128 -217 -195 231 -148 -157 251 2 -128 137 -150 -127 131 -74 -130 174 43 -257 102 -36 -260
2190b60M17q6j11J13j06j24L52J3n13L42J01l67L21o7k19Q5K69k21N8J28k32J75
$$ -260 157 71 -40 73 -33 -157 195 208 -305 37 138 -229 92 25 -194 -109 160 -61 -3 125 -107 68
2212F8J60k71l2J77j20n2K52m53Q8L43K6m14J38K02l41K92J4k85L74q7j07K08
$$ 68 228 -43 -75 102 -18 -70 182 -271 -183 160 186 -228 -90 112 -229 63 77 -208 166 79 -28 180
2234A80J0k38QL28k14k08L04k47q0J31m9m7N9J10q4J45j12j01J91J3l41L59n3
$$ 180 190 -48 -40 288 74 -134 170 -77 -157 -26 -75 -122 -63 47 -37 108 -4 -105 86 99 -242 117 64
2257F4j69J01L2j55L24N2k98J7K01k46m3L30m58L33J8j71j56K83k72RL79k09j13
$$ 64 -105 -4 28 -127 197 249 -49 -32 169 -77 -120 210 -248 85 103 -68 -224 59 -213 -204 175 -34 -147
2280a47L17j11m51M47N0j86J33p3j61J68J8k04J42J27m72L62J45j93n4L55m01
$$ -147 170 59 -392 55 105 -81 52 -21 -182 -14 4 -200 -58 69 -403 -41 104 -89 -143 212 -189
2301a89J91K95l17j33L20j02k39J41M4j71L06rn4l2J02p5J7L8l88L50K1k75K72
$$ -189 2 297 -20 -153 167 65 -174 -33 11 -160 146 137 83 51 153 78 95 133 -255 95 116 -159 113
2324A13Q4l66P8K26k53K59K7j49K6Q8k03P5K11k20j19R1j79n9K45J24j66K32j3
$$ 113 197 -169 -91 135 -118 141 168 19 45 133 -70 5 216 -4 -123 -32 -211 -270 -25 99 -67 165 152
2347A52k30l3K81l76L29N8l39P5K53j83R6rk74K28O5j64J04K18l25j09L71j21
$$ 152 -78 -111 170 -206 123 181 -158 -83 170 -13 83 74 -200 28 93 -71 33 251 -74 -183 188 67
2369F7j37K83m82L1L22j40M0M6j18j36J70J65j87J48J13k43M2K27k79l7K91k20
$$ 67 -70 213 -269 -238 84 -56 -16 30 -88 -224 -54 111 -76 72 185 -58 -16 211 -68 -105 186 -34
2391c4j48L45j65j48K26l8k66K51j52j08L40o0j89L26j53j98K03P9p2M3Pl21K17
$$ -34 -182 163 -2 -150 76 38 -228 23 -129 -237 103 43 -146 180 27 -171 32 111 39 82 89 -232 -15
2414a5O9l44L49R0l21J53K20l55M1K05k72J06L41l90M6L43l62q5L02k34j56L57
$$ -15 54 -290 59 149 -172 -19 201 -154 -113 92 -180 -74 267 -123 -77 266 -96 -181 121 -113 -269 88
2436H8J8k03J55Jl03L74o4j28J67j14j78J56J10j16k4J80j47j25K88j32j17J69
$$ 88 106 -97 58 59 -244 130 66 -62 105 -9 -187 -31 79 -37 -61 119 -28 -153 135 3 -114 55
2458E5j76J13J53r4j23M1N4j09J61l8j65J29j2j00K23j26K0NP0l26K21J75k89
$$ 55 -121 -8 145 51 -72 -31 23 -86 75 37 -128 1 -11 -111 112 -14 6 11 81 -245 -24 151 -138
2481a38P4L56j44j30P2j66j32L95k20m7K52l29OL32j29j24J50J5k32J61Q3l55
$$ -138 -64 292 148 18 90 -76 -208 187 -33 -80 172 -157 -151 181 52 -72 78 93 -139 22 105 -250
2503b50K99L9k30L19j77j02NL08l89K12M4Or9J18j51j4J37j86K6P4j02J13N1N
$$ -250 49 88 -142 177 0 -102 -97 211 -178 34 78 84 -15 103 -48 -62 75 -111 -85 -11 -113 0 51 56
2527E6k0J57L9k49n6j3O8J63k11j3m3L06k52L6J10p0r7L01l60NJ58j84K5K39j24
$$ 56 36 193 232 -17 -73 -86 -18 145 -66 -79 -122 184 -68 -32 78 8 -89 212 -148 -143 15 -169 -144 95 -29
2552b9NJ39j75j38M19j58k61J92J04l68L04O9J9k3m2j45K7J91k70K7M9M3N7m9
$$ -29 -24 115 -60 -198 221 63 -198 -6 98 -270 34 103 122 99 57 -88 -61 130 -140 -113 -64 -21 36 -13
2576a3r2oJ93j33M0J92k35p9J14j27K17K2J8L7N9k40Q3J57k54j44K47j28r1J35
$$ -13 -105 -111 82 -51 -11 181 -54 -133 -19 -146 71 93 111 148 207 -33 50 207 -47 -191 56 -72 -163 -28
2600b8J52k36M1J76j90MK66r1q3Lkj1M7K7k24M50l69k32L22m9k01K59N2m1K7Q0
$$ -28 124 -112 -71 105 -85 -81 185 94 11 14 12 1 48 75 -149 301 -68 -300 22 -27 -228 31 83 42 69 149
2626A49k13R3j28M5Mo1J17M2j6j92K77m5j40n1L99k15m9rq6j3J63J18m25K21J77
$$ 149 -64 29 -99 -54 -50 -111 6 48 32 -160 117 72 -68 -119 280 65 16 7 -79 -92 71 189 -236 -15 162
2651A62k57K25k1M3n6J37k73j25K20n7jJ05k32J29L5m2O1P9j73J41O6j87M0O0
$$ 162 -95 130 109 152 96 233 -40 -165 55 -2 -3 102 -130 -1 34 -8 53 132 -41 100 166 -21 19 79
2675G9j72M1O0o4n7K59o9j23J29j22k05L28j72n1R5J03r9K13j15l57J92K23r3
$$ 79 -93 -52 8 -56 -113 146 77 -46 83 -39 -244 84 -88 -139 -44 59 -40 173 58 -299 -107 116 23
2698B3p8J20j93l7L08k14jR0l7P7M8j30K8J30j16r5R6Ok22K07K58l99K10K6o1
$$ 23 -55 65 -128 -165 143 -71 -72 18 -19 58 106 -24 4 134 18 -77 19 25 -197 10 268 -131 79 105 44
2723D4j08M5N7j37J02p8J06J28k68J4J69p2%J84j60q0K06J1k97J37RJ2O4l2j50
$$ 44 -64 -19 38 -99 3 -75 31 159 -109 -95 74 2 2 186 26 -54 152 163 -134 3 12 24 88 56 -94
2748i4j3L1r8L25J7l98L3L17j52R4p5R3j73J75k29J33J07j52r8L98k41j61R8Q9
$$ -94 -107 -76 -174 151 168 -230 -197 120 -32 62 -13 80 -93 82 -147 -14 93 -59 -157 241 0 -161 -63 26
2772B6n6K1Q6j53R5k6m3q9NJ94m3j8MJ47l0j21Q4J09l34J19K19q2j98K21L7l36
$$ 26 -30 -9 77 -76 19 -7 -50 -139 -134 60 17 -1 3 150 120 -1 83 192 -142 -23 196 114 -84 137 174 -162
2798a62K76o2M6j33oO7J0L0k10K07o5M0M7j41j17J08K70k93K13p3k51K54jj6j97
$$ -162 114 52 98 -35 -41 26 36 66 -144 63 -2 38 85 -56 -173 -65 205 -88 125 52 -199 55 54 38 -159
2823a59J88k44J72J39p2J5K4o0j39J90q9j14K51M3j39K2k5o2J84o8q2L5Qo4K14
$$ -159 29 -215 -43 96 24 39 63 3 -136 54 -35 -149 102 145 6 28 3 -59 125 57 -25 10 18 -46 168
2848A68k56K4R6J70k00j58L58p6j20J61j28Q9j95Q7K7Q7jk02K35k80k0J6P7J16
$$ 168 -88 -64 32 202 2 -156 202 126 6 167 39 128 -67 20 47 134 133 -69 166 -114 -134 -118 -41 75
2872G5j93J6K24j09K22j71j59N2j80L00R6k73K3K27k48J85J10j71o1J81j91M5
$$ 75 -118 -102 122 13 235 64 -95 -43 -223 77 173 -100 -77 150 -98 87 197 26 -35 146 -45 0
2894@M5q6q1K74j40j92N0J49k44L07r6m8j7J13j9M6K0l3j98K55j29%O1M6k23L05
$$ 0 45 -41 -122 152 12 -180 -130 19 -225 82 -14 -62 -79 34 15 61 81 48 -150 105 -24 -24 37 83 -140 165
2920A65q2k20J15m9M8J7L1o7Q5k98J72L5K14j10j25J7k7L2P6k03O5J61j87J27
$$ 165 83 -137 -22 -71 -23 -6 25 -42 43 -255 -83 -48 166 56 -69 -52 -79 -47 29 -174 -109 52 -135 -8
2944hP6n6J40n3j20JJ9m2r2O1j06J60n4j26K15j1L7pk5J01j26J46j67j44L16k15
$$ -8 68 12 152 99 -21 -20 -1 -43 -135 -74 -180 -20 -74 -200 15 4 41 34 9 110 -16 130 -37 -181 135 -80
2970h0N1L5J72k65K22j00j88J21K9k6J20n5p6J19j19J49j36R9r6j6J69j10J8K7
$$ -80 -29 6 178 -87 135 35 -153 -32 -3 -29 91 36 -40 79 -40 109 -27 72 -24 -40 129 19 37 64
2994F4j45n1K18l2Nk59J53J66l23K02j16O6k1n2K60%lk22O8O2k09J33j5J7J34
$$ 64 -81 -132 86 54 59 -200 -47 119 -204 -2 -118 -52 -73 -125 135 135 132 -90 -22 40 -169 -36 -51 -34 100
3019A00L2l34J43J27j98J53L3k5r8P3J23l0j1j3o0K21j66J6k8J12j89K46j83r3
$$ 100 132 -202 -59 68 -130 23 56 31 -67 6 129 99 88 75 15 236 70 86 58 170 -19 227 44 -49
3043d9K05j95K2O5j13J11L5j71j01K26k28J88M7j6l01J95L8l8Ljo9J09J65j59
$$ -49 156 -39 -17 48 -65 46 81 -90 -191 35 -193 -5 42 26 -275 -80 -42 -80 -77 -78 -147 -38 127 -32
3067c2J49m4k56J68r3j3J28J8J19JO4k63P2j7J67k07J32p0n6j35L1N4R7j3K6m
$$ -32 117 73 -183 -15 -108 -121 7 25 144 145 209 -54 18 1 168 -39 93 23 -33 -168 -137 -83 14 1 27 23
3093B3J14j90M9N1rr2J18k9j76J37j39K7J68j95K56J66r6j85L8pm2Q4M2q2q1M
$$ 23 137 -53 -4 47 38 -54 64 35 -141 -4 -143 -116 52 -143 113 279 183 -2 36 29 -13 71 113 31 -50 -46
3119d6j5J54O3j45N6o9l7Q7j04oJ00j07J03O4j50K2l9K9K9r8N6K2J7N0l5q7jJ6
$$ -46 -61 93 156 11 67 -2 -39 48 -56 -62 38 -69 34 98 -52 -30 -69 -40 -11 -109 -53 -31 -14 36 1 -86 -87 -71
3147g1k2J52J1j40K21q5j87J17O1q1J87k45k03M20p5jj15k4K4L0K55l80J50p2
$$ -71 -93 59 70 -70 151 66 -121 -4 57 -24 163 -82 -285 135 60 59 -56 -80 -56 -26 229 -151 -1 -73
3171g3J25m5m1K2l8P2J5J7J08k56K7J73j08J70j87J00o0l2L3K0m2m6q6J79J74
$$ -73 52 7 -34 -12 -50 22 37 54 162 -94 -67 106 -2 168 -19 81 21 -11 22 42 0 -46 -132 47 221
3196B21k28K2O5l3J15o5k39J41Pr7N5o1mJM0J87j67P8J19j27J4j00K6J99Nk54
$$ 221 -7 15 80 47 162 97 -142 -1 6 -91 -36 -97 -101 -100 -60 127 -40 38 157 30 44 -56 -30 169 174 -80
3222h0J32O4k08K08l2k76K10l3l7jJ89j45J53j60m5j07L29j06p2J26m6j01l4q
$$ -80 52 116 -92 116 84 -192 18 -15 -52 -53 136 -9 144 -16 -61 -168 161 55 -17 109 63 -38 -72 -80
3246h0J17N5k22O1J42J3k41J41N4j24Q1m2r9K20p7p2l1N6M2p7P3k7j02J48n3N
$$ -80 37 92 -130 -69 73 86 -155 -14 40 -84 -3 -45 -144 76 -1 -73 -104 -48 -6 -83 -10 -37 -139 9 -44 -39
3272c9J09r8j79K14P9k8KJ25j75q7J22l4j1P0k0j59K31l2j18l6n5J60j40M8N4
$$ -39 70 -28 -207 7 86 58 60 185 10 -77 45 11 0 70 50 -109 122 90 -28 -64 -119 41 -99 -51 3
3297CK9P8l4N1q8j48O3P1n3m5K5J4J50j57J37j52M3O5k27J62K1P5n9j32J66J03
$$ 3 32 110 76 127 39 -109 -46 25 -28 -73 -48 -34 116 -41 96 -56 -13 52 -175 -13 8 83 24 -108 58 161
3323A61j30R1r5J3n9Jm6NJ34P2r9o1J72j46Jj36K68k11M8j02k9J70Jp0M8k64K67
$$ 161 31 122 27 40 -19 -18 -64 -59 75 147 48 -13 159 13 14 -122 146 -65 -17 -119 -148 22 23 -47 1 -263 4
3350DnQ5j78J14L5j7K3m3J04n6r3L1qK2m1j24R1R8m1o0pQ1J55j95P2j89J37l3
$$ 4 -1 84 -94 20 55 38 61 18 122 66 -27 4 -4 18 -23 -147 -56 42 1 -59 -66 15 170 -25 47 -142 -5 -38
3378c8N8j46J55O8j81P9J0m7J10k07K95o7k1j30J7q5J99j00mJ96j27j0j71J51
$$ -38 20 -126 29 97 -84 -5 5 -42 68 -139 156 89 68 -62 -45 -130 69 -31 -35 161 34 24 -147 4
3402DoL8k12M13j01k43K10O6j97j13K16j96J48k06R4Jl2K37j59J57n0j65K23j10
$$ 4 -2 36 -176 237 136 -107 103 169 -28 -141 75 -121 27 -179 -85 -84 -116 121 -38 119 69 -96 127 17
3426A7m8M5k6k22O8J70o3m9Q4l1j9K59j96K7p8l0p9J06J9M8j8k2M4N1l8L0n9j8
$$ 17 -31 14 -12 -234 -166 4 -59 -108 -24 -55 -74 185 -11 16 -62 -92 -171 -65 -46 2 -16 -38 6 57 19 49 -10 -28
3454b8n6J1j35J76J39K4l44K86K5q5%j7n4kK4jl8L8J37m2J07K6k14J33j65J17
$$ -28 -84 -73 -208 -32 107 131 -213 73 98 13 13 -4 -58 -60 -36 -37 -75 -37 100 58 165 191 -23 110 -55 62
3480F2j56J1L1J16J00k53L14l16n3K20J35j80M7r5r9J91k09J49n8R2o5J26j00
$$ 62 -94 -83 -52 64 164 -89 225 -91 -144 76 211 31 78 -17 -116 75 -134 15 -43 49 -16 110 10
3503A0q3J71k06P7N3n7L5k2o2K28k21J43KN3N9j01m4J2q9QN0J7N8k47R4J36j40
$$ 10 -73 98 -108 -31 22 -35 0 -22 -84 144 -77 66 68 121 180 79 35 47 -42 -34 16 33 91 -156 -62 74 -66
3530f6K33p1J04j67p2J83j61l2Q2l0o8Q4L2j32LR1n0J24j03nn2K52j87j13J33
$$ -66 167 96 200 33 -39 144 -17 -49 33 3 -65 19 51 -81 -78 13 -37 87 -16 -21 -73 179 -8 -121 12
3555A2K13k43Q0K2j59N0j10K64j02m3m7J19O3j33M5N4p3q4J27q4q2J57J9j08J79
$$ 12 225 -18 62 84 -75 -25 -135 129 27 -16 -63 56 119 -14 31 85 12 -72 55 -29 -111 46 65 -43 136
3580A36j22o5R9N5j60j12J54n1J08%K0n4q9j01J33R5K5j79jJ70j4N7j16j22K20
$$ 136 14 -51 48 103 -57 -169 -15 -66 42 42 62 8 -81 -182 -49 46 71 -108 -109 61 47 104 -12 -134 86
3605H6j58RJ52j03K3J5j45J48p0j31O7QK4J91k3L4j55n0N0j85K24J7o2j19K17
$$ 86 -72 -63 89 -14 9 24 -121 27 -43 -174 -107 -99 -75 116 93 127 -28 -78 -28 -213 11 28 -34 -153 64
3630F4n2k3L8Q5r7M5j58NK41j61j56J72J12k08j0K8P7K6J2p7O5r6QNJ7M4o7j12
$$ 64 12 -11 27 112 15 60 -98 -93 148 -13 -169 3 115 -93 -103 -75 2 28 40 -37 28 -68 -60 -55 -38 6 -61 -173
3658a73J49J74j96Pl0O7j76L11j36J09k25K2J48j66K08j83K79k19R7K9j08J46
$$ -173 -24 150 -46 -39 -69 -2 -178 133 -3 106 -119 -97 51 -115 93 -90 189 -30 67 96 -12 134
3680A34k34K17k3j67K2o7K14j51O0k2J0Ol3J86k94N8N2j5J07j37O4j92J89J19
$$ 134 -100 117 94 -73 -51 -118 96 -55 5 -17 -7 -1 -34 152 -142 -84 -32 -47 60 -77 -13 -205 -16 103
3704A03qk04K32n3j38J51j96p4K34J17j28J9J34l58J56q3j48L61k10O3J1J01j17
$$ 103 95 -109 123 70 -68 83 -113 -187 47 164 36 55 189 -169 -13 -96 -244 117 -93 -30 -19 82 -35
3727c5j17K13j03J63j41j06M5J99j11j39O7l8J11K81k30l8R9j1j85j02J07L9K7
$$ -35 -152 61 -42 121 -20 -126 -81 118 7 -132 -65 -103 8 289 59 21 120 109 -76 -178 -71 -32 -5
3750eR4k09J20K93k45oJ04L0n3m6p6n1Q1j60p7K33j59K02m5N5j9Kl0J20j22O4
$$ -5 89 -120 0 293 48 42 146 176 123 77 1 -50 31 -129 -206 27 -132 70 25 80 61 63 33 153 31 95
3776I5j73J47Q4j53n0J88k23QK20q0j64M3q0K42o6j28J47j20N1j05O1Q4K4jn7
$$ 95 -78 69 153 0 -50 138 -85 -77 143 63 -101 -58 -138 104 38 -90 57 -63 -12 -117 -56 28 52 51 -6
3801fp3N9L6mO3j58L3J78M9j15l7J61k76O4P3j35J86j55k9K15k7m7k70L05j23
$$ -6 -79 -20 16 12 75 -83 -50 128 177 62 25 186 -90 -26 47 -88 98 -57 -86 129 102 55 -215 90 -33
3826c3o4Q8k1n4J86j47o3R0N9Oq4O0K3M6J4r2M8l0R9j14J6q3K3P1j51L7J03k8
$$ -33 -97 -9 -30 -84 102 -45 -108 -18 41 47 -37 23 46 92 106 14 62 32 131 17 33 -50 -27 44 -107 -70 33 5
3854El3J42pk86O6J64j79l0J35j88R4J54k77K02K50j91J92j34j06K3l2J1l0M5
$$ 5 -28 114 107 -179 -113 51 -128 -158 -23 -211 -117 37 -240 -38 212 21 213 79 -27 -4 -36 -25 -55 -10
3878a0k5N6M0q0J7O6l00J54N5J30j08n5J52j78J23l8Q7O4k53P5J1PO4N3r5J02
$$ -10 -35 21 61 -19 -2 64 -236 -82 -27 103 -5 -60 92 -86 37 -1 86 150 -103 -28 -17 -10 54 107 12 114
3904A14k80J38p9J73o8P6o7J36k6j06n8n4J36o4M7krq3q7K18O2l62J48J56p3R0
$$ 114 -166 -28 -107 66 -2 74 7 143 117 11 -47 -101 35 -29 18 16 7 -76 -163 55 117 -245 -97 59 -14 76
3930G6j26L2J38k58J77J5j33Q5N3P8n0j54J58m4j73Q0J61j56J95j89N6J01q7j
$$ 76 -50 -18 120 -138 39 54 -79 6 59 137 87 -67 91 47 -126 -46 115 -41 154 -35 21 122 35 34
3954C4L0N8q6m8J25j37j5R3j21J28o9K74j97l2j5q4J31j5n8ln7M1KP2J3O3k19
$$ 34 64 122 36 -12 113 -24 -39 54 -67 61 -8 266 69 37 22 -62 69 54 -4 -7 -64 -23 -21 51 64 127 -92
3981i2N1K7q7O6PP1j78K77j10j47K5L2J51LJp9q9K0Q2j14P8L5j1j66J5K0J60n8
$$ -92 -41 -14 -101 -35 -28 43 -135 142 32 -115 -90 -58 93 96 97 18 -71 -51 31 -83 -5 30 19 -147 -132 -112 48 -10
4009a0Q0N2j19m9J27k39j32J76J13J4J8j15J63j45P0J15L5j61P3K8%m4j66J38
$$ -10 70 122 3 -46 81 -158 -290 -114 -1 13 31 -84 79 -66 4 119 154 -7 66 94 94 50 -116 22
4033B2j35j1kJ0K07N5j9r8L7j5j75K12q0JO7j01K7L3M6l1j30M3Q3J34n5j74J19
$$ 22 -113 -124 -126 -116 91 146 127 29 66 51 -124 88 8 9 76 -25 2 35 81 50 -80 -37 46 180 125 -49 70
4060G0kk5Q8j23m1Rk9N2p5J49r0lj40N7P2MLl2M3K6m0J57j03p7Q6m5J8K8kN0j59
$$ 70 68 43 131 8 -33 -24 -53 -1 -76 73 -17 -20 -160 -103 -31 -27 -24 -56 -13 13 -27 130 27 -50 36 -9 9 37 35 85 -74
4091g4N7l6j2j4J24j58m6K26p8J04o6j3J02j13o1P9J74k04M8p9J60q9j88J49k6
$$ -74 -17 -53 -65 -79 45 -113 -159 67 -11 93 27 14 116 3 -58 21 195 -9 39 -40 120 31 -157 -8 -34
4116c4n0J63k72J75J4M0r4r5N5J19m6P4N6j46J09L8j32Q6J25l05J01N2O4j27Q1
$$ -34 -84 79 -193 -18 -4 36 -58 -153 -98 21 -25 49 105 -41 68 106 -26 60 185 -120 -19 33 97 -30 51
4141E1q6J93k96L33j26j42J46j90kR0q8J77r5j4Rn1J86q6J7r4J85j27n0M5P9k05
$$ 51 -35 158 -138 195 69 -73 73 -117 -119 -29 -117 60 -35 -49 -40 -91 95 9 26 -68 117 -10 -60 -15 64 -141
4167a41J51m0L8mn6J20P2j89J31j04j74L02k82J53P9o7j30K30o8m9o8J36P3J50
$$ -141 10 -30 8 4 -52 68 140 -49 82 -22 -196 106 -176 -23 56 -11 -141 89 21 -28 -96 40 113 263
4191B63k96k4j1P4k20J77kJ68LJ1J5k95P4K4L4n2P2r1M5j1O2Jn9J56p0Q3j24M5
$$ 263 -33 -57 -68 6 -214 -37 -39 129 132 143 158 -137 -63 -39 -5 -57 15 -76 -31 -42 20 21 -38 118 48 131 7 52
4219E2M4k39Q6O9L6j07J41j53K09k36k8K18J12l45J99o3nO7r2K8j73L69N5l10
$$ 52 96 -143 -57 12 48 -59 82 -71 138 -98 -126 92 204 -141 58 -5 -10 57 -35 -7 -180 189 244 -66
4243f6J53k6j95J42L7p1l3J8R1M5r1RJ16j40M2j31K01r8o6J63j59J58j01m4m8
$$ -66 87 61 -134 8 45 -26 -59 -41 50 95 4 13 129 -11 31 -100 101 3 -63 100 -59 99 -2 -46 -94
4268i4L11l23M9L9N6j38PP1J4q7R3R2l7n0M3p4J14q0P3n0J03J64m65K53L0r3m1
$$ -94 217 -106 -57 -18 38 -100 -93 -22 -8 -95 -2 90 53 3 46 -28 86 6 79 29 132 296 -169 84 114 21 -20
4295b0r5O0P2rK6m9J16j03j9J71l64K81kq6J48k32J54j16JJ97p2j54J89j04M3
$$ -20 -115 -55 17 8 34 -15 101 -2 -21 150 -214 67 65 -21 127 -105 49 -67 -66 131 59 -95 94 -10 33
4320C3o4M9LO4j87jJ29J29r2j47N6J22j90L8J39j14j17Q6J74K1j25l0p0P2Q6q4
$$ 33 -31 18 21 85 -102 -103 26 155 63 -84 -28 94 -96 -58 81 -33 -150 -64 110 131 6 -24 -94 -22 64 -20
4346b0Q9j28o9J22n5p0J12P0p4J17l1J5j79K62l4j67K2Q7Oj0n8N6l0q9L4j30J19
$$ -20 69 -59 -128 -6 -61 -131 -19 51 -23 94 63 78 -101 161 127 -40 -18 69 75 65 7 63 33 -56 -22 -152 -33
4373c3J37j60J25q4J3L5J11k60J14J36j17L8j27J32n2j57M9J33QM5k04J17J25
$$ -33 104 -56 69 -15 -2 33 144 -116 -2 134 17 55 -72 60 8 -149 -100 33 41 86 -118 -1 124
4396A24J3j96LQ6Q4r0l5p8J43M8j9k28J77r9R1j14nM4P9j96K28j06M0l0r6J20
$$ 124 137 -59 -56 30 114 24 -11 -89 54 102 83 -145 32 -67 24 -90 -95 -51 28 -168 60 -46 -6 -36 -132 -12
4422a2j61J42r9R9j7r5J45l5j2R2J28k29KO6j1j12J68j74L5R7P7r2r5j7LJ41O5
$$ -12 -173 -31 -130 -31 -48 -143 2 -33 -45 47 175 -54 -52 14 3 -109 59 -115 -80 17 94 2 -93 -110 -107 34 99
4449I9j28j5m2R1m4J40k06J39R9j32P7j46J4m8Q6J11p9j76K5J41J89j54lr2k9
$$ 99 -29 -44 -86 5 -39 101 -105 34 133 1 78 -68 -54 -102 -16 95 16 -160 -135 6 195 41 38 -54 -83
4474h3j7J27Lj99K74j06j0P9J3M6k53K83k7o3l8j47oR0m9L6J71j03R6l3m9j19
$$ -83 -100 27 30 -169 105 -1 -11 68 81 127 -126 157 130 67 29 -118 -124 -34 -83 -47 124 21 117 84 35 -84
4500h4J35r7o7J99J0k34R4J08l8j2j9om1R2j17K55j85L2o6k2O3J17k10O3J11j84
$$ -84 51 -46 -113 86 96 -138 -44 64 26 14 -5 -11 -52 40 -77 178 -7 25 -41 -63 0 117 -93 -30 81 -103
4526a03K01Kk35J73j38P7Q7j26N1k34L49m1M0l6Q1K0j80n0J87j40M6oP0p8j51
$$ -103 98 100 -135 38 -100 -23 64 -62 -11 -245 104 63 103 67 148 168 -12 -62 125 -15 31 25 95 17 -134
4551a34M24k46oRj15J60n5P5j96K84k76J76k03l7J25j0J20m6n6j6r3K14j05J4
$$ -134 290 44 38 47 -68 92 37 112 -84 200 -76 100 -103 -140 -15 -25 95 49 -7 -23 -116 98 -7 7
4575Gj35J38K4l3J62q7J15l33J68j9j38kJ37K8l7l6J8M7oPk7N8q3J82j59j44J86
$$ 7 -128 10 34 1 163 76 191 -142 26 7 -131 -133 4 32 -5 -41 -23 24 18 25 -2 56 -27 155 -4 -148 38
4602C8J6m7O8j64J37o2N8q4J30j07K20j36l6lk5J97j56K14j77m6J1j20J10N8j73
$$ 38 54 7 75 -89 48 -14 44 -40 90 -17 203 67 31 28 3 200 44 258 81 35 46 -74 36 94 -79
4627g9J52j28L1K10l3k08J10M6m4K58l81J9lMR3k8R3o0j13J06k5j38J2N8Q7j49
$$ -79 73 -55 -24 186 153 -55 55 101 57 315 -66 -47 -50 -46 47 19 112 52 -61 45 20 -118 -106 -48 39 -110
4653a10L3l1J91n0k01Q9J5K8k6j7J26j25RKK30q4r4J21j56K2j9L1J01r0mQ4M1
$$ -110 -77 -108 83 33 -168 -79 -64 -36 -62 -79 47 -78 -69 -67 163 79 -15 106 -50 -28 -47 -16 85 -5 -9 75 116
4680A16k1j13P7kJ79k34j5q2J99k64J02m2o9J52O4j10Lj5k1O6j66J93Q3p8J54
$$ 116 95 -18 59 57 236 2 -13 -95 104 -160 -58 -100 -169 -17 47 -63 -60 -75 -96 -30 -196 -3 80 2 156
4705A56k18J35L2k02N8N3n5L3j8J63j03m0J63k70J65Q2j38l9J48p8Jj75J35J97
$$ 156 -62 73 105 -97 -39 14 -41 -8 -26 137 34 -6 157 -113 52 134 -4 -43 105 27 28 -147 -12 185
4729A85l8k06J40K6j56J78o7N6k7n6k4L2m3j59L33j56j15R2n0J6L3r5J62j07k9
$$ 185 147 -59 81 107 -49 129 62 118 91 35 11 43 0 -159 174 18 -97 -5 -55 -39 -6 -101 61 -46 -75
4754g5O8J8O5j19P2Pq7J57j81J74J9l28L79q8O3o7QOr5p2J74j07o4J79j59K24
$$ -75 -7 11 76 -43 29 36 -51 106 -75 99 118 -210 169 81 144 77 85 91 -4 -76 98 -9 -73 106 -53 171
4780A71k01L6Q5k55K88j71Q8nK2P7k27J8K9K5R8j42J73m1N7k63J18L3J8O9l1J91
$$ 171 -30 6 91 -164 124 -47 41 36 58 135 -92 -74 -45 -20 78 -64 109 68 125 -138 -20 13 31 100 69 260
4806B60m49J69lo0J66k31L5K29k33J60J18k80J19j97K24MJ35p9J02q1j72M1q7
$$ 260 -189 -20 -23 -83 83 -148 -113 116 -117 43 161 -119 0 -197 27 31 166 87 189 108 -64 -23 -110
4829a10J68j48J57N6j38l0O5j4MJ22k06q3J50O5j66J20l2k7j0J07k42K48j79j6
$$ -110 58 -90 67 123 -15 -45 20 6 10 132 -74 -157 -7 58 -108 12 -20 -47 -57 50 -192 56 -123 -139
4853a39L21j82L5J21q6m6m2L0J08p7O9j39o4J80j42N6n9l4J02M2Jj03J24Q5m5
$$ -139 182 0 35 156 70 24 -18 12 120 43 112 -27 -91 89 -53 3 -56 -90 12 54 55 -48 76 161 116
4878A16j64mo4L52k88r3MQ0J7J64j81N5L6P4p3p0Q0q0J27k3pj25L6K37j39o6j47
$$ 116 -48 -52 -116 236 -52 -145 -141 -61 -44 120 -61 -6 30 104 31 -39 41 -39 88 65 58 -67 -31 206 67 1 -146
4905a46J05l9J18l7R1k55M8M5K0J41j53N0p4K00J34l07%K16m06K41m8K9q6J44
$$ -146 -41 -80 38 1 92 -163 -115 -70 -50 91 -62 -12 -86 114 248 -59 -59 157 -249 -8 -56 -27 -113 31
4929C1j10Q2O3r8Q2L2r6J5P9l7p4L1j22O3P3J63j79P9j39JN8P8j59M8J8j95K40
$$ 31 -79 3 66 -32 50 82 -14 1 80 43 -31 0 -122 -59 14 177 -2 77 -62 -61 -3 75 -84 -36 -18 -213 27
4956B7j82K99j61K42k66k5K6qR9j04o5k2J86j76J25M8l7J3m0L2O2Q0%j75R5J21
$$ 27 -155 144 -17 225 -41 -66 -40 -48 51 -53 -118 -140 46 -130 -5 43 6 19 -21 11 73 153 153 -22 73 194
4982A94j37r3J28J04k13j43o6J11J21j8m8R6mj29Q3p5J18o7N2J33K9m9p5n0K8
$$ 194 57 -36 92 196 -17 -160 -226 -115 6 -12 -60 36 32 -97 -14 -89 29 -38 14 147 176 127 52 2 30
5007C0J46j70nR0n6k35K90Q3j53j60O6J81m0N6l5Q5j36P8q6j70K23l3q6J68j93
$$ 30 176 6 1 91 35 -200 90 173 20 -140 -74 107 67 123 88 173 37 115 29 -141 82 49 -37 131 -62
5032f2J10k72L50o6Lj01k9O5o5M0m1J89l9j61M5J46r9m0q1J65m6m8J08j02J1l4
$$ -62 48 -224 126 60 63 -38 -67 -2 -67 -27 -68 121 82 -79 -34 112 13 -27 -108 57 11 -37 71 -31 -20 -54
5058e4O8l4J01j18J43j74K53n4k5j29j5o9L9K15r8j5N4j47K24j69K0J03l67K11
$$ -54 14 -20 81 -37 106 -68 185 131 106 -23 -38 -107 -68 147 49 34 88 -59 165 -4 16 119 -248 -37
5082c7L7j60J19R7p3j28J31L2J32j53J21j25q1%J17j8q4K8r0J28K4m1KO0P5j48
$$ -37 0 -160 -41 56 -17 -145 -14 18 150 -3 118 -7 -88 -88 29 11 -73 -45 -135 -7 17 -24 -22 38 113 -35
5108c5K0q1J56J99k73l1Q7J4j00J1J73r0k9j1J88j95Lj25K66p5k59J34Q2M0M5
$$ -35 -15 -96 60 259 -14 -45 42 56 -44 -33 140 50 21 10 198 3 6 -119 147 72 -187 -53 29 69 114
5133A14j95n9K51j50j8K3J64j22Mj3o3N3j4j33J06l7m4J60pm2R3j32k4j3O4O2
$$ 114 -81 -140 111 -39 -57 -34 130 8 12 -1 -64 -11 -25 -158 -52 -89 -133 27 20 -22 71 -61 -85 -98 -34 28
5159B8On1j23J41Q4j10N5j5O8K7q5Po2N8j1l7MJL7j7q9M7Ok1J79k04K5M6N9K9
$$ 28 34 -17 -140 1 85 -25 30 15 83 110 25 32 -30 28 17 -20 -16 -15 22 5 -84 -37 -31 -52 127 -77 -52 -6 53 82
5189H2j10J0nk07K99j12P8p4j10M6J67l7o4p1J05J91j92K9j14O3k8N6L5j5j44
$$ 82 -28 -18 -23 -230 69 -43 35 -39 -149 -103 64 27 -37 -108 -3 188 -4 25 -89 -26 -54 2 37 22 -122
5214a22j06K25R8r6J12j43J24l0K7q7o4J16J01j59p2P2N5J3K1k89L39j4k70J43
$$ -122 -228 -3 95 -1 111 -32 92 62 89 2 -62 54 155 -4 -76 -4 51 64 85 -204 135 121 -149 -6
5238fkJ32k7or7m0P7%L1Q1o0k02K14j75kK59k30N1j57J38J7N0J6M8j54K09Ok23
$$ -6 -8 124 97 91 -6 -46 31 31 62 143 83 -119 95 -80 -82 177 -53 -2 -159 -21 -4 46 62 110 -44 165 171 -52
5266e2J34j63k2nJ07l7Nk8Q3L4k38N0L6LP1q3k1J9K4K92l11L41j44j56M4P0j09
$$ -52 82 -81 -103 -108 -1 -38 -33 -61 22 56 -182 -132 -96 -93 -22 -105 -126 -107 -83 209 -102 239 95 -61 -17 53 -56
5293e6J06k1N6p0n5K6K4M6P7k14O9lP7M4k05ol0N6J7R1l7j25L05k00M6p6J47j04
$$ -56 50 29 85 15 -40 -14 10 56 133 -81 -12 -15 62 106 -99 -105 -135 -79 -62 29 -8 -133 172 -28 18 -58 89 -15
5321a5l3O1k9m1J31K3j29J3J33j00N9PO6p8J0p7M7L8j56J40Jo6R8m8q8J41p8Q8
$$ -15 -48 13 -16 -57 74 97 -32 -19 114 14 73 80 146 68 78 1 48 86 -70 70 71 5 103 55 -33 108 30 118
5349A18j88K8q8J69Q9j64O5J08m1r9J61j79J6r9N3l7Q4j42K32J1n3j8J5r1J10
$$ 118 -70 -42 -130 39 128 -36 29 137 96 -3 158 -21 -5 -104 -51 -88 -4 -146 86 97 44 26 41 -50 60
5374F0m8rj1N5m0Q3r0j02R1j42K12R9j16l6l7K10j75m3l4P2K8j08L66k94J3Q9
$$ 60 12 3 -8 47 7 90 0 -102 -11 -153 59 158 42 6 -31 179 4 -39 -73 -1 27 -81 285 -9 4 93
5400I3j29l9J94j52J51j9j13j16J47L5j13l6J63r1q3J46o2j39L03j75q8O4O3L8
$$ 93 -36 -75 119 -33 118 99 -14 -130 17 52 -61 -97 66 -25 -108 38 -24 -163 140 -35 -123 -59 4 42
5424D2J53j80p0J4KP5j14n4J69j30K68k19J48K5j74m0K13j77m5J50j28L6J1J16
$$ 42 195 15 -55 -41 -39 36 -78 -132 37 -93 175 -44 104 129 -45 -85 128 -49 -94 56 -72 -36 -25 91
5448I1p6L2q1n2J56n5P3m1K3qp2L8kN8j22J36j65k9J75j53J24l0J38k82M6K03
$$ 91 15 47 -34 -86 70 15 88 47 70 62 -10 28 26 84 -38 98 -67 -96 79 -74 50 20 158 -124 -78 125
5474A25j31Q6p7M9R7k24M9J26j97J70J9L3j56J70j5J00j44j06q4J82j41QJ30R7
$$ 125 -6 80 3 52 149 -75 -26 100 -97 73 92 125 -31 139 124 224 80 -26 -110 72 -69 -61 69 166
5498A66j50JJ42k03k1O0O2k05L21k29J28j70J60j4k6K6q0nJ43j70O8J1J10r4O0
$$ 166 16 17 159 -44 -65 -5 57 -148 173 -56 72 -98 62 48 22 48 -32 -37 106 -64 4 15 125 31 91
5523I1j59m1J77q6r0K10m0ppj61J8J45j51Mm5L75k56j92K87q1MJ00k7K9j17M3
$$ 91 -68 -109 68 -18 -108 102 62 55 48 -113 -95 50 -101 -97 -142 233 -23 -215 72 -9 -5 95 68 97 -20 23
5549B3j33J2M8p2r4K52R6o6O4m0R8k17p0K8P7J64l37oJ01q1M8K30m1L0k12K31
$$ 23 -110 -98 -50 -122 -216 36 132 66 130 90 188 -29 -99 -71 6 170 -167 -173 -72 -153 -105 125 84 114 -98 133
5575A33m1K0r6q1M0J01j74J32k28J44k5J07P1jn4j73K26k37K79j73L3jL3m0l1
$$ 133 92 112 16 -65 -25 76 -98 34 -194 -50 -75 32 103 102 48 -125 101 -136 143 -30 3 2 35 -5 -36
5600c6JL1o0Q5p7l0K83j37p0m4J9j8J7P6j21O5Om8L7k3J35p1r7K07l09J97o4P0
$$ -36 -35 -4 -64 21 -56 -86 197 60 -10 -54 -35 -53 -36 40 -81 -16 -10 -58 -21 -44 91 20 -77 130 -179 18 -46 24
5628B4j06J27m8o5K01pL1k15J90j33o1J20j03o4O4j26K28q6L7K01k57j3j97L98
$$ 24 -82 45 -3 -68 133 126 157 -58 132 -1 -62 58 -45 -109 -45 -171 57 -29 8 209 -48 -61 -258 140
5652A40k37K0P4l6j7j42J84m9L7j36K50m2j06o8J49K3j32J8J82j0q0k1l2J3M2
$$ 140 -97 -77 -3 -39 -56 -198 -14 -63 -26 -162 88 46 -60 -128 21 44 -88 -70 112 102 22 1 -31 -18 24
5677B4m5O6J12j96J13o1j02J02R2QR7l02J70j03n9P0O0QJ25p0j2O9k07L9J26j53
$$ 24 -21 45 157 -39 74 13 -89 13 105 113 210 -92 78 -25 -84 -14 46 54 179 109 97 166 -41 -2 124 -29
5703b9j0p6J34j15K5K2J00J5o6j68K22j77J34J51r7l1M4j8J9P0j69J00j7k3M1
$$ -29 -39 -115 19 -96 -71 -49 51 66 0 -168 54 -123 11 162 65 34 78 60 79 149 -20 80 63 40 81
5728H1q7K13j99K5j29J74j10R4r4m6M5L3J2J28k9n7j36M1K53j11rk24L9J3p2L97
$$ 81 -6 207 8 33 -96 78 -32 62 -32 -78 -33 0 12 140 111 54 -82 -41 212 101 92 -132 -93 -80 -152 245
5754B45p5j72op0M0koR8L2m7j87J76j24J66J8k8r5m1J78l8Or3l4KK2m0Q0k3j58
$$ 245 170 -2 -8 -78 -38 -40 -46 52 84 37 -150 26 -98 68 86 58 -37 -78 100 62 68 -25 -59 -57 -35 -75 5 -18 -176
5783a76J45R3r2l9J43n8k23L79p3j05o0O6k0oJ29O9j85j16L9M0O0m8J23MN9k01
$$ -176 -31 62 -30 -69 74 16 -207 172 99 -6 -66 0 -20 -26 103 172 -13 -129 -90 -50 10 -38 85 89 148 -53
5809e3r1m8J99j39%J49K79m82K72k00jK11r2J8lj2M2M8l2j84K63j16o6JK3K09
$$ -53 -144 -192 7 -132 -132 17 296 -186 86 -114 -115 96 4 22 19 7 49 97 65 -119 144 28 -38 -37 -14 195
5835A95k89M0N3k01K32J56k08J03J86k76J35j71rj03J39Jk6J77l48L08pj90J00
$$ 195 -94 -54 -1 -202 30 186 -22 81 267 -9 126 -45 -54 -157 -18 -17 -43 134 -214 94 87 -103 -3
5858ck8n3J67q1J27j92R2k3N9l9J05j13K46k98J9J26p4j4o6K22j51k76J48N2K
$$ -3 -31 -84 83 2 129 -63 29 6 65 26 131 18 264 -34 -15 111 37 23 -43 179 28 -248 -100 -48 -46
5883d6K62k77R4Q4k12J59l6k5k1l6QM5qK2j46J90j18J30k66J94J05k5P3o6m3M9
$$ -46 216 -61 33 117 -95 64 28 3 -18 -54 -46 -1 -9 13 -133 57 -61 69 -197 -3 102 77 150 84 41 90
5909I0j46k1J81j79J03J36k59J55K3k7r6M5J00m2L5mk8n2P1n3Q0k5Q7j47N8J7
$$ 90 -56 -77 104 -75 28 164 -95 60 83 56 -40 5 105 63 98 94 66 14 85 32 112 87 174 27 85 102
5935A02q8LN3j35J5oK68j96R2j75J12Q5j98L4O9j23L3P2Q9k53J92L2l5r9j28J4
$$ 102 14 17 70 -65 -50 -56 212 16 108 -67 45 130 -68 -34 35 -88 -55 17 106 -147 45 77 42 -57 -185 -171
5961a71K49j94J39J00q9r9R6j26k8K40k45J54q5L16m11K82J4j99Q9j36J00K02
$$ -171 78 -116 23 123 34 -65 31 -95 -123 117 -128 26 -59 257 -154 128 142 -57 32 -104 -4 198
5983A98k27R2N3j68K10k16J36j19R4k4j17K85k95J74l8j19R7K6l1lR5j42pJ09
$$ 198 -29 63 116 -52 158 -58 78 -41 53 29 -88 197 -98 76 38 -81 16 42 11 8 103 -39 -46 63
6007F3l2j73J34K0O4o7n6L9Q6k4l2k22K66J16m37M18j74k5R8q5Ro0L8J68k67Q5
$$ 63 31 -142 -8 12 76 9 -47 -8 78 54 22 -200 66 182 -255 163 -11 -36 62 -23 -14 -74 -36 132 -135 -50
6033e0J28j89O7J58j57J5k02J81l0J46r4J96q0j35J32o7j21K56k04m3n0J03R2
$$ -50 78 -111 -44 114 -43 -28 -230 -49 -79 67 -27 169 89 -46 86 19 -102 154 -50 -93 -143 -40 52
6056E2k7O9k4j00J42k27Q0J13L5j62J61j84Q5q3J61j1%J90l53J36P5k59R5K5j7
$$ 52 25 94 70 -30 112 -115 -35 78 113 -49 112 -72 13 -70 91 80 80 270 -83 53 128 -131 -36 -11 -28
6081b8K92k90r0L31l48K24m5q1J15pJ0k5j79J49M2j17J96k44Q5p8J8J26o2m9J36
$$ -28 264 -26 -116 215 -133 91 46 -35 80 73 83 58 -121 28 70 -47 149 -95 -10 -88 -70 56 -6 -55 81
6106H1j3j12P4o4RO5N8j46N4O6j08p1J11j01J77oj10r9R9P1j29J1J30o6J50k67
$$ 81 68 -44 30 -34 -25 40 98 -48 6 72 -36 -107 4 -97 80 74 -36 -135 -36 35 -94 -83 47 -19 131 -136
6132a36k3J80J3j14L6J59j17J52l0j51j27J38p8L5lN2N6l7r1N5P5M2p2n0P0k0
$$ -136 -159 21 34 -80 -44 115 -2 150 120 -31 -158 -20 -98 -63 -66 -14 42 5 -86 -31 44 86 14 -36 34 14
6158A4kL9M5l8j12R1l2J8k23K66K8J0N7mj25J86j90L4K57l26J45j4j20Q2j15m4
$$ 14 12 51 96 58 -54 37 5 23 -200 66 94 104 161 157 32 218 28 62 319 -7 138 124 4 86 -29 -73
6184g3j33L48j29n8q3K01NP2j16j16J03J9j97K88m5j62J96j89J52Q0j50j52K05
$$ -73 -206 142 13 -45 -128 73 78 150 34 -82 21 40 -157 131 86 -76 120 -69 83 163 13 -139 66
6207F6K0m8Q3Rm9j06J9Q9j66K68k45J31r3j10J27Q5O0j47K3NN3N2j32Q6r8P3p1
$$ 66 86 38 121 130 81 -25 -6 83 -83 185 -60 71 -22 -132 -5 80 140 -7 16 21 74 126 -6 80 -18 55 -16
6234a6J4pJ95k03k2L0j37J44j87K35o5R6o2l8J24q2o1P7j93K70N8o1j17J9J1J23
$$ -16 -2 -9 186 -17 -39 -9 -146 -2 -189 46 -19 77 15 -23 101 19 -42 35 -158 112 170 109 -8 11 22 145
6260A45n4k28J78J5j0q2q3Q0mN5K9j28K5J32m4N2k03P0J10J00k22K47k99N8J9
$$ 145 91 -137 41 56 46 -36 -119 -39 -43 12 41 -87 -62 70 26 78 -125 -55 55 155 -67 180 -119 -61 -42
6285d2J9K58l68K44k49J02P1l3j06J06j17Q0J8N4q4MK19k56LQ6o7K0j10K52k29
$$ -42 -23 235 -133 111 -138 -36 35 2 -104 2 -115 -35 -17 37 -47 -43 176 -80 -77 9 -58 -38 -148 104 -125
6310a25L0j32L92j82N3M8m6r3p3j3Q1J94j92Q2Q1o1Q2lp0O2j40M4N4K6M8j29j41
$$ -125 -95 -227 165 -17 36 84 38 -55 -128 -141 -60 134 -58 24 105 44 126 123 53 115 -25 19 73 99 147 18 -123
6337a23K92k09O9R7j37j2J01j70J26m2j44L61l12J12M3j41LN6n8J57j50j70K36
$$ -123 169 -40 29 126 -11 -23 78 -92 34 -8 -152 209 -103 9 52 -89 -86 -30 -88 69 -81 -251 -15
6360a5lJ1k4Q5O0j34Q5kl7j10M7J2J28q5k22K00J74j06j65J01m2K47j88p1J0j11
$$ -15 -18 -7 -31 54 114 -20 65 63 26 -84 -37 -25 103 18 -204 -4 170 64 -101 0 -42 205 17 -54 -44 -155
6386a55J79J23k27K9j10L22q5j82K06j3k52J57J43k81L0K64j46n9K08k69J22k2
$$ -155 24 147 -80 -51 -161 161 76 -106 100 87 -165 -8 135 -146 -116 148 2 -57 151 -118 4 -18
6408a8j25J58j42R9N8r0K57q4l3j72kJ1j7J78j30Q8J22j55L1n0R8p9q5R7k06K89
$$ -18 -143 15 -127 -28 30 -60 197 113 80 -92 -94 -83 -100 78 -52 36 158 3 34 -16 82 3 -82 15 -191 98
6434I8j68j5K5J12Q9k08M2r4Q5l7P8j16K56k03K0J55Q1j18j0p0j32R4QK46k63
$$ 98 -70 -85 -60 52 141 -67 -25 -119 -34 -71 7 -109 147 -56 -36 119 200 82 72 2 -130 -36 -28 218 -45
6459d5n8K85j47n0k07J45J08jk0j15K26j96N3mj37K3J32j12J51J2p5Nk6J99j19
$$ -45 -103 182 35 -15 -222 -77 31 30 10 -105 121 -75 -22 -26 -163 -140 -8 -120 31 43 -32 -27 -53 146 27
6484B7j58Q4N1N4l13P3M5J27N8l4K51k38j90L86j84n1n5J46r3N0o1R1M1j74J36
$$ 27 -131 -47 4 58 -255 -182 -137 -10 48 14 265 27 -163 223 39 -12 -67 79 -14 36 -25 66 107 -67 69
6509F9j21q1P0n4M6J92j65J70o9j90K43j61L0j9R1j02J44j03p8pJ34j27nJ09M8
$$ 69 -52 -133 -63 -117 -71 121 -44 126 57 -133 110 -51 -21 -40 51 -51 93 -10 -88 -95 39 -88 -93 16 64
6534F4l1J02k22L35l46J14K31j26j89J69n6Mj63K64p1j23k0n4J24N8j24k7J38
$$ 64 33 135 -87 248 -98 16 247 121 -68 101 45 49 -114 150 79 -44 -64 -118 6 64 -60 -87 51
6557E1k6J19k18J40k60L33j85K11n2p2L8M6l5j87K08j02P0j59O8J0k3N9q2J15
$$ 51 25 144 -74 66 -194 139 -46 165 113 41 79 125 90 -97 111 9 79 -80 -12 -2 -25 34 -48 67
6581F7R0j39j46K61k14N7l3L74k85m4N2p3J60k92J76jn5K5j12P3J34j30J03j33
$$ 67 157 18 -128 133 -81 -24 -57 317 32 -12 40 -33 127 -165 11 10 -45 -20 -132 -59 75 -55 48 -85
6605h5N6J93k16K21k08J5O7p9J0P5J10j16mJ2J44j17mJ64k86QM3O8r7q3J24j0
$$ -85 -29 164 -52 169 -39 -24 43 -36 -26 49 159 43 39 51 195 78 74 238 -48 -40 3 71 -26 -109 15 5
6631EJ02r8j65L79j78j02Q4k3K6oO0j47J84k51J36l1P0r7K62k65J24Mm4oj49J8
$$ 5 107 9 -156 223 45 -57 27 4 30 24 84 -63 121 -130 6 -25 45 -52 210 -55 69 73 29 23 -126 -108
6657a08J10P1q9j15L03j19R8j07j00k3N1QqJ55k8M8k30J22j39P7n1P4m1J59l53
$$ -108 2 73 -16 -131 172 53 151 44 -56 -79 -28 -20 -28 127 99 147 -83 39 -100 -23 -74 0 -41 118 -235
6682b35K62r8J04O5k0j46J7J56r4J5j53K58j81j4K46k46P0J21Mk51K18m0K9j71
$$ -235 27 -71 33 98 78 -68 -51 105 11 26 -127 131 -50 -64 182 -64 6 127 131 -120 98 58 87 -84
6706h4J76j05n5J58j46J34J09k11J8J18o7K41l47o3O7k7R2Jr2O9m3J97j29j48
$$ -84 92 -13 -68 90 -56 78 187 -24 -6 112 45 286 -61 -124 -57 -84 8 9 -83 -14 -57 140 11 -137
6730a37J28J18Kj87o5J92m7rj07M5J63k08J83m2J3j05N7m5K0J8J2n6J50p6j91
$$ -137 -9 109 111 -76 -141 51 4 -5 -112 -67 96 -112 71 29 42 -63 -6 -51 -31 -13 -1 -57 93 17 -174
6755a74K92rn3j22r0j4K44j39K31j45n7m5Nj30L58Kj59N8j50k9Q7Q3q3l3K0J39
$$ -174 118 109 56 -66 -156 -170 74 -65 166 21 -36 -81 -76 -206 152 154 -5 53 -97 -126 -39 44 -39 -72 -52 87
6781H7l40J26K35j46P6J12j29pR8k04K18k22J67j13J7P0J28j42K82k70j8j28J32
$$ 87 -253 -127 108 -38 38 150 21 14 112 -92 126 -96 71 -42 -25 45 173 31 313 43 25 -103 29
6804B9J02j33NN3j17OJ45k06o6K26q2N7m1p5J71o7K8J25m4j81O6k6J20j36K59
$$ 29 131 -2 3 56 -61 -55 90 -116 -182 44 -38 19 -22 -97 74 7 35 160 116 -65 1 -25 95 -41 218
6829B18j87k1O0j40J8K40j54m4j19L2J19r6J48j87O7R8j09Ork7O1J01j76n7J52
$$ 218 31 10 70 -70 -52 188 34 -10 -129 -97 22 -74 74 -113 -46 52 -57 -51 -60 -87 -26 75 -101 -158 -6
6854fN9q9N4J21o8k82J31P4j7J38k37J93j53n1J76M5l30K45J10k46K21j93J56
$$ -6 53 -36 18 139 71 -211 -80 -6 -23 115 -122 71 -82 -133 43 88 -242 3 113 -133 88 -105 51
6877E1q0J11q2RL3n2j3J05Q4j97k8J58p2L9q4Q9n6k10J57P3J5j43J30m9n5N1J12
$$ 51 -29 82 0 9 42 -10 -23 82 166 -31 -59 99 27 66 -18 71 15 -195 -38 35 50 -93 37 -12 -67 -16 96
6904I6kk6j26J71j31J8O0k04J07J21q2j9P6m8j19J36j43J7J63Q3k87J06R8n4L
$$ 96 94 68 -58 113 -18 0 60 -144 -37 84 2 -17 59 11 -108 28 -115 -98 65 148 -139 -33 65 11 14
6929A4p9RJ62j94K3J60Mj73Q6N0o5j16R6j46R6O2Q0j8J9j08J4l6J53j17R8O0k02
$$ 14 -65 -56 106 -88 -65 95 99 -74 12 62 -3 -119 -23 -169 -73 -11 69 51 70 -38 -24 -60 93 -24 74 134 -68
6956f8m1J51L4q5Ro8J25n3p1J52j53p2J58Jj65J35o7K3N6R8K9o3j57J15j29J75
$$ -68 -109 42 76 -9 0 -68 57 4 -67 85 -68 -140 18 19 -146 -11 -78 -55 1 99 128 65 -92 23 -106 69
6982F9j54R6O1Q0k33Q4m3J17q3r5J94k91O6Q5KJ20r9J39M0k42J93j34J15R0j71
$$ 69 -85 11 72 152 -81 3 -40 77 -6 -101 93 -198 -132 -47 -45 75 -24 115 155 -87 106 -28 87 177 6
7007FO6k7k2j7q2K15k27R5N3Mm3m4p1N8o9O9j61K59j12j10K41K1m8k16J20K08
$$ 6 72 45 23 6 -76 139 -88 7 60 64 21 -23 -94 -36 -105 -36 -197 62 -50 -160 81 102 54 -162 -42 166
7033A66j26k64N31l37N8p9K35j55ql2R1j78K6Q1J24p5j95K47j94P1k3O3nR5MM1
$$ 166 40 -224 307 -30 28 -51 184 29 21 -11 80 -98 -72 9 133 58 -137 110 -84 -13 -36 27 22 117 121 162
7059A62j03r5k3J31q1O8l3J9j94J46J03j06R4j34P6j35jL2J0J29p9p2L2O5r6J02
$$ 162 59 -36 -59 72 -9 59 26 45 -149 -3 100 -6 88 -46 30 -105 -106 -74 -64 65 -14 -86 -54 11 -85 17
7085A7o5J28j46J05o6N0L6r5q4L35q1q5j8kP1k41K67j50k9oj40R3K95j31p8%J5
$$ 17 -48 80 -66 39 -27 23 59 -36 -120 215 134 49 31 29 100 -141 126 -24 -53 -59 -199 -106 189 58 -20 -20 -5
7112eJ9m9j23kM9K13k43J68L3j61J93j52P9k2r2K7J7j38J35P9Jq6O7j3n6J97L7
$$ -5 14 -35 -158 -160 -111 102 -141 27 60 -101 92 -60 19 -3 -95 -68 -51 -189 -54 25 26 -60 7 -6 -62 135 172
7139A72j05L7k13J55J0o8l4Q0q3K02k66LK77k09j10K73j03p1m6K55r2j62J26j18
$$ 172 67 104 -109 46 56 -12 -46 34 -49 153 -113 -110 167 -42 -152 121 18 -53 -99 156 64 -98 28 -90
7163i0J2R9On7%J58j61j07J28m7M6O7j46N0J49j65J82k2l8j68J1P1q4J00J16l33
$$ -90 -78 21 27 -30 -30 128 -33 -140 -12 -59 -13 54 -92 -42 107 -58 124 102 64 -104 -93 -22 -106 -6 110 -223
7189b23J35K9l1Q3l4Nm9j7J70k80K11l7J28k63J06J66n0K6K7j81p3Q2j06J91j38
$$ -223 -88 -59 -90 -7 -41 -36 -85 -102 68 -212 -1 -38 90 -173 -67 99 49 75 102 -79 -152 -70 -176 15 -123
7214a23J52j65J98q3Pk44K62J17k04J75j20J3L7Q2k9j37j1J24J84k23l8K28k52
$$ -123 29 -136 62 -21 -14 -258 4 121 -83 92 -28 -15 22 104 75 -62 -73 51 235 12 -26 202 -50
7237e0J0J5K35q1j88P8L1n6J09j60P2j86K62j43J64Pk64K11P8k62K13k37P3L0
$$ -50 -40 -25 210 129 -59 19 50 -6 103 -57 15 -171 91 -52 112 119 -145 66 144 -118 95 -142 -69 -39
7261c9j12L23k17M9q6L1M8J8r0J18M3j96O6P0m1l7R6J8L1j52J44j79k7K6Q0O2
$$ -39 -151 172 -45 4 -82 -51 -3 15 -75 43 86 -110 -44 26 -15 -52 44 62 93 -59 85 -94 -121 -95 -15 47
7287D7P2j0k23R4K04j91K17j94n6J29q5r9j8K23j13M2L8k9nk4J45k85M8M7m1p9
$$ 47 119 109 -114 -20 184 -7 210 16 -40 89 4 -95 -113 110 -3 39 77 48 43 19 164 -121 -73 -26 -67 -146
7313a46L1J42K8N8j0r3J37r9k1k30K40rn1N3j05M9l6r3K30o7jM6M0l57K44L3R2
$$ -146 -115 27 55 113 103 10 147 48 27 -203 37 28 -23 30 -75 -26 -62 -155 75 8 7 53 93 -264 -20 13 105
7340A05j26Q8j2r5P9J62r4J56l69L5J04n5p9J1M9j4l8K03k29L6J59j84O8p5n2
$$ 105 -21 67 55 -40 39 201 107 263 -106 -71 33 -22 -101 -90 -41 -55 -93 110 -119 -83 76 -108 -40 -115 -167
7365a67J86M3j58J55j02J15o5q1p1K06j39p3K72j76j21K39j52N7j81K20j30l6
$$ -167 19 62 -96 59 -43 72 7 -74 -145 61 -78 -151 121 -55 -176 63 -89 -32 -213 7 -123 -159
7387a59R2Ol5K93j54j26n8R1K7J89k07N8J9l0j01LN4Mk13J36K01n3n3j26k9K23
$$ -159 -67 -61 -96 197 43 -83 -141 -50 -23 166 -41 17 36 6 -95 -92 -38 -34 -247 -111 90 37 -16 -142 -171 52
7413E2j08P3K12j98j33J21k5p6P6M9k7J07p1j33P1p3J7n3J15J2nq0L1N8m1L4k0
$$ 52 -56 17 229 31 -102 19 -6 -82 -6 43 16 123 52 -81 -10 -83 -66 -119 -4 8 3 -77 -46 12 -29 5 -15
7440a5K73j74o0l4J71k35K53j01k6lNo2m8J12k6j02q4qK13j67N7l1O2K7l2q3j4
$$ -15 258 84 24 -10 161 -74 179 78 52 49 54 -8 -56 56 30 -72 -156 -164 49 -118 -61 -92 -30 -3 -35 -118 -132
7467a32N1J13M0N1j01q7J39j96J29%m7j36rK00N1M5j42p4LJ8M5j56K89l4Q0n6
$$ -132 -81 32 72 123 22 -65 74 -122 7 7 -40 -176 -185 15 66 111 -31 -105 -102 -84 -39 -195 94 60 140 84
7493H4j71J25l6j17K03l4n9pj2j81K15LJ01k04RJ63j08O0O9j11PJ7J26l26J33
$$ 84 -87 38 2 -115 88 54 -5 -12 -24 -205 10 13 114 -90 -81 82 -26 34 103 -8 -1 16 142 -184 -51
7518e1l7Q0k7M7J29m2L5q7q9J23o7LM0N4k55R7J01j6l8J19j01n8n0N8P0n0r7J40
$$ -51 -88 -8 -35 12 141 99 134 47 -42 81 14 17 57 111 -144 -47 54 38 0 119 18 -40 -90 -32 38 -12 -109 31
7546C1J15k66J00P5j92J01Q9r7M4M9j06J0o5J19j24Q5O8j58J50r0j6LJ44oL0j10
$$ 31 146 -120 -20 55 -137 -36 53 -44 0 49 -57 -47 -112 7 -117 -32 36 -122 28 -62 -78 -75 69 63 93 -17
7572a7J4k7j17K8K70j29n3P8j78R6q9J24j84J76j39J5J93j01O5k5j8O3o6p6K08
$$ -17 -3 -30 -147 -119 151 22 -31 47 -131 -35 -124 0 -184 -8 -147 -132 61 -40 25 0 -18 45 -21 -97 111
7597A11L1l5j20O9j97J75l0J27K0j66k3J7k3J03M1j11j28J05L0O0j41M7nQ8K4
$$ 111 142 107 -13 56 -141 34 4 131 151 -15 -38 -21 -44 59 100 -11 -139 -34 -4 56 -85 -38 -43 45 69
7622F9N8r5J3L2k1j71J12Q9j37J6J56o4J1j69Q1P0m8rj03O2J35O7k51Q9j22K61
$$ 69 127 32 45 77 56 -115 -3 86 -51 -35 121 57 68 -101 -20 50 2 -7 -110 -48 87 154 -97 -8 -130 131
7648A31p0k7O9l5q1m9P7Q4j42J20k09J01J11j29j40Q6J3J15o2K69j32k3j1j31
$$ 131 61 34 103 68 -13 -62 15 99 -43 77 -132 -31 80 -49 -189 -103 -90 25 -37 232 100 77 66 -65
7672f5J67p5j38K23j36r9J45JR5r1P8q2J8M4j76LQ8J3q2K3O0j30J0K26k59RJ88
$$ -65 102 27 -111 112 -24 -123 22 23 118 27 105 23 41 85 -91 -88 0 13 -69 -46 14 -116 -106 120 -139 -130 58
7699E8n5m8J6N0o3J91k10L2n0J4o0K56j30K0O4j44J58k7k4j39N7J30k93R1J65
$$ 58 3 -45 -29 21 -42 149 -61 -29 -79 -65 -125 131 1 21 85 -59 99 72 48 -91 -34 96 -197 -106 59
7724E9l12K43n5Ql9Q7J5K8j0j0MJ45k86m9L47j18j13J48j51J06q4%J35k1M2n0
$$ 59 -253 -10 -65 -57 -96 -9 6 34 24 14 18 163 -123 -172 175 57 -56 92 -59 47 -37 -37 98 77 119 69
7750F9No7r6P0q3L1q9R1J58j05K97k77j06J01n9j2K30j11QO1q7J07k05nj11K57
$$ 69 74 7 -89 -19 -102 -71 -160 -69 89 -16 281 4 -102 -1 -60 -72 158 47 55 116 29 136 -69 -74 -185 72
7776G2o7k4rnJ8q9J54K8j28R9n1J08n9K8M4M3j3j30Q3k0jj02P2r5J71o9j06O0
$$ 72 5 -19 -28 -33 -15 -104 50 78 -50 49 -2 106 47 75 119 162 149 19 102 82 81 -21 51 -44 127 58 -48 12
7804A2o7J68l10L45k12R9Q8k16J85J9o3J2q6J9jL9P0j90J72n6q4kJ89K6r9j50
$$ 12 -55 113 -197 148 -64 35 123 -93 92 111 48 60 -26 -7 -8 31 101 -89 83 27 -57 -59 130 156 57 -93
7830i3J07j33J62j34k6K00J2j62N8j10Q4Q7M4J5j50M8J6m0k2kn4K37k35Q3q3J28
$$ -93 14 -119 43 -91 -117 83 95 -67 -9 -119 -35 52 96 111 -39 9 25 -15 -37 -39 -93 144 -91 -8 -91 37
7856C7j07P0RP5J05k66J12n4K5L2J0n4O5l5j63K12n2k7N7J61m5j30p0j33K16j7
$$ 37 -70 0 9 84 189 -77 35 -19 6 38 48 -6 59 24 -139 73 21 -6 51 212 167 37 -33 -166 50 33
7882C3j41Ql4J69N7r2M7j25N0OJ06j06j09P1l5J14j19J38M4j75M9lm2K08r1k0
$$ 33 -108 -100 -134 35 92 0 47 -78 -28 -22 84 -22 -131 -60 -95 19 -100 38 82 -93 -44 -47 -89 119 28 8
7908HroLK2q3J58j37Rk8J59J3k04J08J12j93j3R0J5j04J3K06j92j12J72N7k03
$$ 8 -1 -7 -4 18 -65 93 -44 -35 -63 96 109 -95 13 125 -68 -81 9 24 -80 -67 139 -53 -165 7 64 -139
7934a39M1P5j6O6%kjL8j63J91o0r5j5M0J97k57M8P7K0l5j2j28K6J67m3m8k2J73
$$ -139 -98 -23 -39 27 27 25 24 62 -101 90 30 -65 -80 -40 157 -100 -52 25 45 10 -2 -130 -104 63 20 -28 -50 123
7962A23Pj8l90K67J1j81Q7RR6k23L51r0r9Q6Q5n2p9n9K16k89L5P0m4K09k17K48
$$ 123 130 112 -278 -11 0 -181 -94 -85 11 -212 139 49 -50 36 121 69 -10 -69 147 -142 -107 -37 -81 128 -89 159
7988A59p8N7j71Q3M6p0j60J89R3j91L5M1K6n4L7j76J69Qk8o5J38k04K5K55k77
$$ 159 81 138 -33 50 96 26 -134 55 148 -43 -8 33 59 5 42 -134 35 43 15 -50 88 -116 -91 164 -113
8013a13K58K6k51k8M9N6K32j47r2q0R6J12k16J6J28o5J3k1PK03k42l0Q5K7j26
$$ -113 145 171 -80 -108 -59 -3 229 82 -10 -90 6 118 -98 -82 46 -19 -6 -27 -20 183 -59 -89 -4 23 -103
8038a03O0J26p1j13m9J98r7J8j0K21j49K4J6j2P9k75J30o6mJ98q9n7j20L1J12
$$ -103 -43 83 12 -101 -150 48 -49 -31 -41 180 31 55 71 59 138 -137 -7 -73 -77 121 32 -25 -145 -114 -2
8063bl9K8o3J08K7j10J15N7q5l2j68K02j16J30N3l08J86j4K63k19J65j58K05J7
$$ -2 -41 -13 -76 32 59 -51 64 121 36 4 -164 38 -78 52 105 -203 -17 -31 232 13 178 20 225 242
8087B42l84M0M3M5R5nn7m1j0J16j98J57m2J62j39j69J21J07M1k05Q8p9M6J80j29
$$ 242 -142 -102 -59 -14 81 76 19 -22 -32 84 -114 43 1 163 24 -145 -24 83 124 -81 7 -72 -26 154 25
8112B5j00J5J88k59J18J11k72J19o1K02j2j14j5J39j10P2l3j15J05jj55J30q5
$$ 25 -75 -60 128 -131 -13 98 -174 -55 -116 86 74 -40 -55 84 -26 46 13 -102 3 2 -153 -23 -108
8135a08K0R5j24R6L5Q3j49K12k20k4L8J22l3j40J86j25l5QL6Q8q8j00j9K01j87
$$ -108 -88 7 -117 -21 14 97 -52 160 -60 -84 -46 76 43 -97 89 -36 -71 -63 -27 61 -27 -127 -146 55 -132
8160a32J43m3M4k3jn8Q6j40m7J22P4p6J09r7r6L36k64R1j42J17r5J29j20RJ29
$$ -132 11 -32 12 -11 -12 -70 16 -124 -171 -49 25 -51 58 -39 -135 201 -63 28 -114 3 -92 37 -83 -74 55
8185E5r9J53j21j72L19K
$$ 55 -44 109 -12 -184 135 137
8191A37
$$ Imaginary data points
##PAGE= N=2
##DATA TABLE= (X++(I..I)), XYDATA
0@%%%%%%%%%%%%%%%%%qJ6j6J6j6J6k4L2l2M0m8N4o2P1p9Q8j04J19j34J50j67J85
$$ 0 0 0 0 0 0 0 0 0 0 0 0 0 0 0 0 0 0 -8 8 -8 8 -8 8 -16 16 -16 24 -24 30 -32 39 -40 48 -56 63 -71 79 -88 97
39I7k06K30k56K84l14L48l84M23m67N15n68O24o86P59q38R25j024J136j263J412
$$ 97 -109 121 -135 149 -165 183 -201 222 -245 270 -298 326 -360 399 -439 486 -538 598 -665 747
59G47j587J792k043K359k769L318m102N325p506J2581m6589j8976R5785M0782
$$ 747 -840 952 -1091 1268 -1501 1817 -2285 3040 -4466 8115 -38474 -57450 38335 79117
73G9117J798m309J8668j6837l2301k0610j8576l6857l7845r899M1190N562l6503
$$ 79117 80915 76606 95274 78437 46136 25526 6950 -29907 -67752 -77651 -36461 -30899 -67402
86f7402K9709N3846j1472N764K5271j3753q987M377L27J5506k0482l3671L3058
$$ -67402 -37693 16153 4681 10445 35716 21963 12976 17353 17680 33186 12704 -20967 12091
99A2091K6247l6345j4989J3942r637j8688k56N735r639j2380J5842L1653J5776
$$ 12091 38338 1993 -12996 946 -8691 -27379 -27635 -21900 -31539 -43919 -28077 3576 19352
112A9352o965J000L4986J3999l2024k064P491m1724j9777J3386j8563j9635k543
$$ 19352 12387 13387 48373 62372 30348 28284 35775 -5949 -25726 -12340 -30903 -50538 -53081
125e3081M224L2941J4237j7127K7215L3938j2508L786K0135j7082k4494k164J237
$$ -53081 -48857 -15916 -1679 -18806 8409 42347 29839 33625 53760 36678 12184 10020 11257
138A1257j2362k5198j5425R116J1599p236n589K1047J4784q856J8410K6434j8991
$$ 11257 -1105 -26303 -41728 -32612 -21013 -28249 -33838 -12791 1993 -6863 11547 37981 18990
151A8990j0689K0707j513j0796q537j6285P976M309k5682N245J5548k3826j778
$$ 18990 8301 29008 27495 16699 8162 -8123 -147 4162 -21520 -16275 -727 -24553 -26331
164b6331K7131m317j3562P305J0910Q580R49l883Q128R122p220m721R051p480
$$ -26331 800 -3517 -17079 -9774 1136 9716 10665 6782 14910 24032 16812 12091 21142 13662
178A3662k5850P70J2298k0119j3800J3077J272K598J2673Q65J1585J2972j1030
$$ 13662 -12188 -11418 880 -19239 -33039 -19962 -18690 -16092 -3419 -2554 9031 22003 10973
191A0973Q662J5535k5296j3249J4017j1410j6059L672l089j427O805R38O548R564
$$ 10973 19635 35170 9874 -3375 10642 -768 -16827 -13155 -16244 -17671 -10866 -9928 -3380 6184
205F184m501n36J5129O20j6162K340J0060j0991n420P978p104m883O973o021M
$$ 6184 1683 1147 16276 16896 734 3074 13134 2143 -3277 4701 -2403 -7286 -313 -6334 -6330
220f330N839j3006K284J6953j1122m559J8419k768m736J2570j861n345M353o070
$$ -6330 -491 -13497 -11213 5740 -5382 -9941 8478 5710 974 13544 11683 6338 10691 4621
234D621m331M297q866r583P744J115q947M386P885m667J803J0595k715r92P382
$$ 4621 290 4587 -4279 -13862 -6118 -5003 -13950 -9564 -1679 -6346 -4543 6052 3337 2345 9727
249I727m494K89Q212j0951l808J1470j0178q803J0731o605r212R655k130m483
$$ 9727 5233 5522 13734 2783 -1025 10445 267 -8536 2195 -4410 -13622 -3967 -6097 -10580
263a0580R637j117j521J0976n73n634P915L77r640K401K714r212j512N259m581
$$ -10580 -943 -2060 -3581 7395 6822 1188 9103 9480 -160 2241 4955 -4257 -5769 -510 -5091
278e091m53P054m278j42R449n896l511J0003o281o721J0264l880p176J0018j581
$$ -5091 -5544 1510 -2768 -2910 6539 643 -2868 7135 854 -5867 4397 517 -6659 3359 1778
293A778o018Q876k129o491P391k068p674O180R71p144N137M609m915L245N445
$$ 1778 -4240 4636 2507 -3984 3407 1339 -6335 -155 816 -6328 -1191 3418 -1497 1748 7193
308G193m871j76M961o313l929N333n915m712P779l690m233J0277j356m652J0046
$$ 7193 2322 2146 7107 794 -3135 2198 -3717 -8429 -650 -4340 -8573 1704 348 -4304 5742
323E742j036o549Q313j181q200O679np908N441J530p144M076K674p020K221L911
$$ 5742 4706 -1843 6470 5289 -2911 3768 3763 -4145 1296 2826 -4318 -242 2432 -4588 -2367 1544
339A544o427L63O098m475j043P967l068k856P889k270n094O854k686o936P133
$$ 1544 -4883 -4520 1578 -2897 -3940 4027 959 -1897 5992 3722 -1372 5482 2796 -4140 2993
354B993j871p533P687L42p370O870K032p504N038K296p313L459K947n987K861
$$ 2993 1122 -6411 1276 1618 -5752 1118 3150 -4354 684 2980 -4333 -874 2073 -3914 -1053
369a053M295n205J598N670m805j382O205m034m490N827k531n085O328r40n260
$$ -1053 3242 -1963 -365 5305 500 -882 5323 1289 -3201 2626 95 -4990 1338 398 -4862
384d862O860L33o163O307Q72p725N446J559p980M292L504o466L114M748n568K581
$$ -4862 1998 2331 -3832 2475 3347 -4378 1068 2627 -5353 -1061 2443 -4023 -909 3839 -1729 852
400H52M559n814K80M670n456j822N325l932l073O597j678m419N999j64n397M839
$$ 852 5411 -403 -123 4547 -909 -2731 2594 -1338 -4411 2186 508 -3911 2088 1924 -3473 1366
416A366K58o192M951J284o631M928L477o581M189M329o732K440L956o465Q11L643
$$ 1366 1624 -4568 383 1667 -4964 -36 3441 -3140 1049 5378 -1354 1086 5042 -1423 -612 3031
432C031n440p3M463m432o75N627l143l040N725j200m535M910m11m323M760R42
$$ 3031 -2409 -2482 1981 -2451 -3126 2501 -642 -3682 2043 843 -3692 1218 807 -3516 1244 2186
448B186m587M912J637n704M112K495p597K396L407o907R04M119n159P58M694m050
$$ 2186 -2401 2511 4148 -1556 2556 5051 -2546 -150 3257 -3650 -2746 1373 -3786 -3028 1666 -2384
464b384R66M664m474p28O067l906l247N728j719l915N114N41m445L589R07m175
$$ -2384 -1418 3246 -1228 -1956 4111 205 -3042 2686 967 -2948 2166 2707 -1738 1851 2758 -1417
480a417L388k95n827L666K264o864K584N037n905J490N500m254lM185l826j82
$$ -1417 1971 1676 -4151 -485 1779 -5085 -2501 2536 -3369 -1879 3621 -633 -636 3549 -277 -459
496d59L681m612n95M880l746k297O270j617m492M921R19m847K415O97m013K829
$$ -459 3222 -1390 -1985 2895 -851 -3148 3122 1505 -2987 1934 2853 -1994 421 1118 -2895 -66
512f6J056m681L373K331n461L086M539o373M99N242m235p96M408l283n49M152
$$ -66 990 -3691 -318 2013 -3448 -362 4177 -2196 -1697 3545 -690 -1486 2922 -361 -910 3242
528C242l256q54M637l717k767N532j999m959M109L33l922L191J209l728K964J832
$$ 3242 -14 -868 3769 52 -2715 2817 818 -4141 -32 301 -3621 -430 779 -2949 15 1847
544A847l706L117J997n613K419M524n679k22M815l742q08L940l425j379L683l784
$$ 1847 -1859 1258 3255 -2358 61 4585 -1094 -1316 3499 -243 -1051 2889 -536 -1915 1768 -2016
560b016j131M585l337l052O083m44l791M521J140l564K781J217l468J942L11m218
$$ -2016 -3147 1438 -1899 -4951 1132 688 -3103 1418 2558 -1006 1775 2992 -476 1466 1777 -2441
576b441K776K099n540J291M727m258p12M667l009j564L570k332j153L318l031
$$ -2441 335 2434 -3106 -1815 2912 -1346 -2058 2609 -400 -1964 1606 -726 -1879 1439 -1592
591a592q11N305k639l083N751o16m725L950J166m505J690J257k912K216N39l383
$$ -1592 -2403 2902 263 -2820 2931 2315 -2410 1540 2706 -1799 -109 1148 -1764 452 991 -2392
607b392K658K349m703J758L714n373n74M864l087k286L949j678q20L650k183j115
$$ -2392 266 2615 -2088 -330 3384 -1989 -2563 2301 -786 -3072 877 -801 -1621 2029 -154 -1269
623a269M835k482k680M734j225m745M017Q86m339J840J530l239J732J432l610
$$ -1269 3566 1084 -1596 3138 1913 -2832 1185 2071 -2268 -428 1102 -2137 -405 1027 -2583
638b583J908J974m030J407M110m303r5M898k407j610L778k160j576L169j935k353
$$ -2583 -675 1299 -2731 -1324 2786 -1517 -1612 3286 879 -731 3047 887 -689 2480 545 -1808
654a808L456j877k983M369o71l910L610J119l768K374J386l230J893J548l242
$$ -1808 1648 -229 -3212 1157 486 -3424 186 1305 -2463 -89 1297 -1933 -40 1508 -1734
669a734J940K567m096J048L731l755o84L506k839j571L399k049j663L232j602
$$ -1734 206 2773 -1323 -275 3456 -299 -983 2523 -316 -1887 1512 -537 -2200 1032 -570
684e70j701L969j136l320M098L71m052K819J076l548J905J585l111J857J781l253
$$ -570 -2271 1698 562 -2758 1340 1711 -2341 478 1554 -1994 -89 1496 -1615 242 2023 -1230
700a230J833K347m188N80L433l626j250L725k144j932L410j185j804L028j286
$$ -1230 603 2950 -1238 -658 2775 -851 -2101 1624 -520 -2452 958 -227 -2031 997 -289
715b89j761L625j134l025L833J83l545L032J397l474J699J911l011R48J574l358
$$ -289 -2050 1575 441 -2584 1249 1432 -2113 919 2316 -1158 541 2452 -559 389 1963 -1395
731a395O70K185l702M58L055k818o86L467j537j483L421j162j729L051q15k210
$$ -1395 -725 1460 -2242 -1784 1271 -1547 -2233 1234 -303 -1786 1635 473 -1256 1795 980 -1230
747a230L110o88k739L225K14l733K310J282l740J720J290l154J147J989l073J122
$$ -1230 1880 1192 -1547 1678 1892 -1841 469 1751 -1989 -269 1021 -2133 -986 1003 -2070 -948
763i48K556k753L98K979k425p33L180j948j581K942j344j966K989p56k165K893
$$ -948 1608 -1145 -747 2232 -193 -926 2254 306 -1275 1667 323 -1643 1346 590 -1575 1318
779A318k49k943K389O83l274J726J327l134J617J709k784J191K211k935O64K391
$$ 1318 1069 -1874 515 1198 -2076 -350 977 -2157 -540 1169 -1615 -424 1787 -1148 -484 1907
795A907k558L9K781k503r38L102j460j585K691j103j791K679p23k598K664p2k769
$$ 1907 -651 -612 2169 -334 -1272 1830 370 -1215 1476 373 -1418 1261 538 -2060 604 532 -2237
812b237K252P38l007K364J262k839J617J847k724P72K193k942L51K538k621n05
$$ -2237 15 753 -2254 110 1372 -1467 150 1997 -727 45 2238 -704 -353 2185 -436 -941
828i41K741k086j116K565j495j466K785j142k022K771m15k258K694M59k601K576
$$ -941 1800 -286 -1402 1163 -332 -1798 987 -155 -2177 594 179 -2079 615 1074 -1527 1049
844A049O46k736J683J482l083J133J698l131P39K224k988L29K490k443m62K633
$$ 1049 1695 -1041 642 2124 -959 174 1872 -1259 -520 1704 -1284 -955 1535 -908 -1370 1263
860A263k004q39K512j169j522K831p80j715K787k70k379K471K97k814K164N98
$$ 1263 -741 -1580 932 -237 -1759 1072 292 -1423 1364 1094 -1285 1186 1483 -1331 833 1431
876A431k940J361J504k718Q63J986k809L59K459k667l5K465k130m88K776j568
$$ 1431 -1509 -148 1356 -1362 -499 1487 -1322 -963 1496 -1171 -1206 1259 -871 -1359 1417 -151
892a51j326L075j201j438K606r10j755K428k88k431J954N80k569J460Q70k561
$$ -151 -1477 1598 397 -1041 1565 655 -1100 1328 1040 -1391 563 1143 -1426 34 904 -1657
908a657J482J224k510Q74J716k368N57J933k179J95K533j906p15K616j299j395
$$ -1657 -175 1049 -1461 -587 1129 -1239 -682 1251 -928 -733 1800 -106 -821 1795 496 -899
924h99K340r05j728K412q55k040K125n0k428K245M70k337J542J215k707J378J509
$$ -899 1441 536 -1192 1220 365 -1675 450 400 -2028 217 687 -1650 -108 1107 -1600 -222 1287
941A287k217Q10J757k355J89K306k103k02K224j661j186K551j611j361K476q35
$$ 1287 -930 -120 1637 -718 -529 1777 -326 -528 1696 35 -1151 1400 -211 -1572 904 69
957F9j796K227l62j682K130J09k280K008N97k339J568J133k310R00J583k326Q37
$$ 69 -1727 500 138 -1544 586 695 -1585 423 1020 -1319 249 1382 -928 -28 1555 -771 66
974F6J536k143K62J734k029m88K157j608r00K250j200j344K480q09j346K219m68
$$ 66 1602 -541 -279 1455 -574 -1062 1095 -513 -1413 837 -363 -1707 773 -36 -1382 837 369
991C69j819K339K7k177K015M46k040J047J336k269P36J424k175K26J677k039j07
$$ 369 -1450 889 916 -1261 754 1200 -840 207 1543 -726 10 1434 -741 -515 1162 -877 -984
1008i84J946k076k45K451j681p37K653r74j488K317o23j559K126k65j985K126
$$ -984 962 -1114 -1359 1092 -589 -1326 1327 353 -1135 1182 559 -1000 1126 861 -1124 1002
1024A002j4k258J871O01k644J259J357k406P01J319j893K71J766j748J2J920j490
$$ 1002 988 -1270 601 1202 -1442 -183 1174 -1232 -531 788 -1105 -834 932 -816 -804 1116 -374
1041c74m76K436j503j104K407q90j472K055o83j357J550p7j712J835j8j986J507
$$ -374 -850 1586 83 -1021 1386 496 -976 1079 396 -961 589 512 -1200 635 617 -1369 138
1058A38O13k163J050J266j982P15J590j743J23J824j727j07J722j384n98J996
$$ 138 751 -1412 -362 904 -1078 -363 1227 -516 -393 1431 -296 -403 1319 -65 -663 1333
1074A333j300j007K069r07j361J739l60j426J642o3j889J633M28j892J553Q04
$$ 1333 33 -974 1095 188 -1173 566 206 -1220 422 359 -1530 103 531 -1361 192 996
1090I96j975J173J109j957Q06J259j793O8J578j607k10J647j446o05J916j015
$$ 996 -979 194 1303 -654 152 1411 -382 -314 1264 -343 -553 1094 -352 -957 959 -56
1106e6j137J918p33j242J620l2j632J546L71j738J508O31j767J227R24k157J010
$$ -56 -1193 725 -8 -1250 370 338 -1294 252 623 -1115 393 1024 -743 484 1408 -749 261
1123B61J059j989L50J166j427K8J217j314k37J625j244n55J981j104r87K045p09
$$ 261 1320 -669 -319 847 -580 -552 665 -649 -886 739 -505 -1060 921 -183 -1170 875 166
1140A66j209J825p1j422J461R3j538J256K01j797J394N34j973Q42J200j922M23
$$ 166 -1043 782 711 -711 750 843 -695 561 762 -1035 359 893 -1080 -238 962 -960 -537
1157e37J581j752l9J519j282k72J698j175m87J744p24j213K030n28j518J686k05
$$ -537 1044 -708 -747 772 -510 -782 916 -259 -746 998 274 -939 1091 563 -955 731 526
1174E26j370J299K51j796J313L08j595R88Q23j903Q87J246j882K60J525j232l35
$$ 526 -844 455 706 -1090 223 531 -1064 -76 747 -1156 -269 977 -905 -645 880 -352 -687
1191f87J625r55n08J681j081r06J843j008p00J445n43j273J487o1j525J338L58
$$ -687 938 -17 -525 1156 75 -831 1012 4 -696 749 206 -1067 420 359 -1166 172 530
1208E30j559R87N84j478Q39R78j680M45J396j566K36J317j273j24J509j141o81
$$ 530 -1029 -42 542 -936 -97 881 -799 -354 1042 -524 -288 1029 -244 -368 1141 0 -681
1225f81J724j179p03J650q31j160J626k76j174J196J45j358J316J78j394J201
$$ -681 1043 -136 -839 811 -20 -1180 446 170 -1004 192 337 -1021 295 473 -921 280
1241B80N84j685R79Q10j393L57J149j543K49J056j331p5J096p88n51J387p70p92
$$ 280 864 -821 158 968 -425 -68 1081 -462 -213 843 -488 -563 533 -255 -806 581 -189 -981
1259i81J555m88r79J474k64j006J187J37j349J056M55j402J025M22j400P14O71
$$ -981 574 86 -893 581 317 -689 498 635 -714 342 797 -605 420 842 -558 156 827
1276H27j572M51J209j519K6J372j420j74J315q17j85J242p40p88J536o43p03J242
$$ 827 -745 -294 915 -604 -578 794 -626 -800 515 -302 -487 755 15 -773 763 120 -583 659
1294F59j72j099J303j95j264J201J30j385R73N25j337L81Q29j137K37J035j312
$$ 659 487 -612 691 496 -768 433 563 -822 151 676 -661 -280 549 -588 -351 684 -628
1311f28K78J029r21k69J382r58l11J216n52p65J150j46j251J289j34j215J155
$$ -628 -350 679 -242 -511 871 -87 -398 818 266 -499 651 505 -746 543 409 -806 349
1328C49kj254J075L41j443J077L58j329O47Q36j156L55P93q02K0J025j098j59
$$ 349 347 -907 168 509 -934 143 501 -828 -181 655 -501 -146 647 -155 -135 890 -208 -367
1346c67J230p51m26R33m14j011J545n71j130J301k07j037J006L08j330J034L88
$$ -367 863 112 -314 619 205 -806 739 168 -962 339 132 -905 101 409 -921 113 501
1363E01j268R16N43j294O11P87j118J85P62q55m8J060j031k8Q72n98n26R95n49
$$ 501 -767 149 692 -602 9 796 -322 -137 625 -230 -278 782 -249 -277 595 -3 -529 466 -83
1382h3p00J086j78q19J138k50r18Q56M87j186R49L67j166M50O84j071L45O54j200
$$ -83 -783 303 125 -694 444 194 -724 132 619 -567 382 749 -417 33 717 -354 -9 645 -555
1401e55L35P75r21N8Q54r43k18J135q09m03J064l82o58J142k55q55J186j86p67
$$ -555 -220 555 -366 -308 546 -397 -615 520 -289 -692 372 -10 -668 474 219 -636 550 364 -403
1420d03R83j89q20P90K18j048L63Q32j387M42R43j198J85O37p75j59J139r20o2
$$ -403 580 391 -429 361 579 -469 -106 726 -661 -219 724 -474 -289 348 -427 -586 553 -367 -429
1439d29J018o14l55R27l50o49R40k08p25Q36p8q91Q94j9q62N48L87r30M55M28
$$ -429 589 -25 -380 547 197 -452 488 280 -445 391 313 -578 316 297 -565 -17 370 -560 -105 323
1459C23q73L30Q66j084O7R88p60k68J101q58j60J098o62m84R21l24o44Q60k37
$$ 323 -550 -220 646 -438 -371 617 -143 -411 690 -168 -328 770 108 -376 545 221 -423 437 200
1478B00q31P78Rr09R30J56j020Q73K63j001N99M03r10M61N27p59J17Q27q93j6
$$ 200 -631 147 156 -753 177 333 -687 186 449 -552 47 450 -460 1 528 -231 -114 713 -180 -196
1498a96P31o40j60Q04n81n19Q74k05q45P94J42r13R91O4q82O23J37p22M91M91
$$ -196 535 -105 -265 539 -42 -561 313 108 -737 57 199 -714 277 341 -541 82 219 -503 -12 479
1518D79q61M54M98q47J42P23q73K8O60n35j58M83m40j35P73m83m98R12l95l28
$$ 479 -382 72 570 -277 -135 588 -285 -257 403 -132 -290 193 -247 -382 391 -92 -590 322 -73 -401
1538d01O41n5m44N21O3o89N63J54q29M74L53n95K90L72q26K21N87p81J01M76l53
$$ -401 240 185 -259 262 325 -364 199 353 -476 -2 351 -244 46 418 -408 -187 400 -381 -280 196 -157
1559a57k57Q54m81l59P89l71n71Q83r0n59P06k4p37P67r6p55N69J70p05L91M92
$$ -157 -414 440 -41 -400 389 18 -553 330 240 -319 387 363 -374 393 297 -458 111 281 -424 -33 459
1580D59r31M52O04r81L62M27o81l8Q36n18k74Q25o60k19R59n13k63N96k73m97
$$ 459 -472 -20 584 -397 -35 392 -289 -327 509 -9 -283 542 -118 -337 622 109 -154 442 169 -328
1600c28P53k79o37N19J11o90M76L81q69M14L85n19K92M09o12K07L12n27O6O09
$$ -328 425 146 -491 28 139 -551 -75 306 -563 -149 236 -283 9 418 -194 13 325 -202 -136 473
1620D73o36o4P60n83j60M93k90k51N93k28l75O20k39o35P11L0o45M27M16p18L77
$$ 473 -163 -227 533 -50 -210 283 -7 -258 335 107 -268 352 113 -522 189 219 -426 1 417 -301 76
1641G6J83n78J99N11o51K53N02p71J65M39m59k31O84k59k80O37n51j14M16k13
$$ 76 259 -319 -120 391 -260 -7 495 -276 -111 328 -131 -362 322 63 -217 420 -131 -245 171 -42
1661d2j91N78j69p06P12P7o60M13K77m95L73J95o01J76M48p25K38L66n04J9N45
$$ -42 -233 345 176 -530 182 259 -401 12 289 -206 167 362 -239 -63 385 -340 -102 264 -240 -221 324
1682C24n97L7L87k36k63O30k30k14N04k26l69N10k5m38L72M6m10P6N72p94J97
$$ 324 -273 -236 151 -85 -348 282 52 -162 342 116 -253 257 232 -206 166 212 -198 -122 450 -344 -147
1703a47L75n45K31L05m49J53M33n53M3M77l26k82N79m14qM90k24l76M33j07k10
$$ -147 228 -317 -86 219 -230 -77 356 -197 -154 323 -3 -285 294 -120 -128 362 138 -238 195 88 -122
1724a22L21q9m24N39j55m85L91J24l97K50L48m76J43K60m67K38L71n57m3N15n46
$$ -122 199 110 -314 225 70 -415 -24 100 -297 -47 301 -175 -32 228 -239 -1 370 -187 -230 285 -261
1745b61J36N14k40m41P35n20k59N89j51m11K98J96o31N55J04n71N48J5l51J82
$$ -261 -125 389 149 -292 443 -77 -336 253 102 -309 -11 185 -446 109 213 -358 190 205 -146 36
1765C6L07n50J73L65m78J07L76m69m8M73m60M4L66k34l47N96l24rK22K3l15K44
$$ 36 343 -207 -34 331 -147 -40 336 -133 -181 292 -168 -124 242 8 -339 257 -67 -76 146 169 -146 98
1787I8M1m61M20R8k92K26M6l06J70L21n41N8L22m21J75J35j78j03M46l66k05M36
$$ 98 139 -322 98 196 -96 130 176 -130 40 361 -180 -122 200 -221 -46 89 -89 -192 254 -112 -317 119
1809A19j41j75M82m35n8N20j28k37Q9J66m33L33J67n78K82K35k79j2K10m21J57
$$ 119 -22 -197 285 -150 -208 312 184 -53 36 202 -231 102 269 -309 -27 208 -71 -83 127 -294 -137
1830a37L76m65P9M24l64k5L88k21k19L92k97k73O43k53k62N71k75j46N5Q8k38
$$ -137 239 -226 -147 277 -87 -112 276 55 -164 228 -69 -342 301 48 -214 357 82 -64 -9 79 -159
1851a59K85j8m65K35K55k45j07M87o14L72J10j04R3J82l43O5L84m28q8N17m42
$$ -159 126 108 -357 -122 133 -112 -219 268 -346 26 136 32 125 307 -36 29 413 -15 -103 414 -28
1872b8k02M85k73m78N88j8k35L24j8l63K17K44n38L29L26o03K30J65l55K45K80
$$ -28 -230 255 -18 -496 92 74 -161 163 145 -218 -1 243 -295 34 360 -243 -13 152 -203 42 322
1893C22l73j04N30m11j12M22n29P8K80j36j00M74l13m06M88o2k37L75q3l41J58
$$ 322 -51 -155 375 -36 -148 274 -255 -177 103 -33 -133 341 28 -378 110 48 -189 186 103 -238 -80
1914h0J59k02K27K63n02Q0K30k61K13j0l44K24M0j46J35K13l46j39L94k70k24
$$ -80 79 -123 104 367 -135 -55 175 -86 127 117 -227 -3 37 -109 26 239 -107 -246 148 -122 -346
1935c46N44p2l87M86j93j71K75j37Q1OK27n30L23M1l88L04R6m61K22J23j67n9
$$ -346 198 126 -261 225 32 -139 136 -1 80 86 313 -217 106 147 -241 63 159 -302 -80 43 -124 -183
1957a83L28k67n3L62k65n2L42j01k26J44J38l15K32J12l95L66Mm75L60L6l18J40
$$ -183 145 -122 -175 187 -78 -130 212 111 -115 29 167 -148 84 196 -199 167 171 -304 56 92 -226 -86
1979h6K84m74J11J82j07k3L69n25J00L99k28K8K30j63k02L62m3l51L15n1l25M23
$$ -86 198 -276 -165 17 -90 -113 256 -269 -169 230 2 30 260 97 -105 257 214 -137 178 127 -198 225
2001B25om43J61J97m75K47K63m57K20L84m10K1K28k57J03M08n12p7M02k13k4L27
$$ 225 219 -224 -63 134 -341 -94 169 -288 -68 316 -94 -73 155 -102 1 409 -103 -180 222 9 -15 312
2023C12m07j0M56m02j70L65k19p5P7K4k48L58J27m64K87K16l02%L08l10K27pl60
$$ 312 -95 -105 351 -51 -221 144 -75 -150 -73 -49 -297 61 188 -276 11 227 -75 -75 233 -77 150 143 -217
2046b17L03K10k73k67N19l74%J06r0j8M3rj59L38l4m01O43q0k51M6J89l17K37
$$ -217 86 296 23 -244 275 -99 -99 7 -83 -101 -58 -67 -226 112 78 -323 320 240 -11 35 224 -93 144
2069A44Rk43R8R3m57M08P4l10JL05k38o2L94l53j08M69k75m8K93n5l96M80k5k40
$$ 144 153 -90 8 101 -356 52 126 -184 -183 122 -116 -178 216 -137 -245 224 -51 -99 194 139 -257 223 198 -42
2093d2O9M5j93J89k8k16K90j83j7n2K72j86M4O9k39J29L83m66J62J56k18m9K79
$$ -42 27 72 -121 68 40 -176 114 -69 -86 -138 134 -52 -8 61 -178 -49 334 -132 30 186 -32 -81 198
2116A98o6l36L16j46k14N00k74k71M27k9k90K28j48j57J38L15n01K46K05k90J15
$$ 198 132 -204 112 -34 -248 252 -22 -293 134 105 -185 43 -105 -262 -124 191 -310 -64 141 -149 -34
2137c4J16j91J10J48m51K58K92k40j35L79k40l05M03j73l0M00j39m57M54o1m10
$$ -34 82 -109 1 149 -302 -44 248 8 -127 252 12 -293 110 -63 -93 307 168 -289 165 104 -306
2158c06L21J10l39K14K74m41K37K8l16Q1M05l98M3L27j15k11K88j63k15Q2m7j15
$$ -306 15 125 -214 0 274 -167 70 98 -218 -137 268 -130 -87 240 125 -86 202 39 -176 -94 -141 -256
2180b56K74L7k24K16M9k4J70q8k25K9J33k89K53J52m95L36J59m07J34K23l74K99
$$ -256 18 55 -169 47 96 72 242 154 -71 -42 91 -198 55 207 -288 48 207 -200 -66 157 -217 82
2202H2K6l9q9J98j88o5J75k01j66M26j59k51K43k6J00O7j31k2J67J28m79J80J47
$$ 82 108 69 -20 178 -10 -75 100 -101 -267 159 0 -251 -8 -34 66 133 2 -20 147 275 -204 -24 123
2225A23k23K33j9k86J6K44l06lK90r5j62M48l15l6K20j35l0K75j56l12K55Q6k59
$$ 123 -100 133 114 -172 -156 88 -218 -221 69 -26 -188 260 -55 -91 129 -6 -36 239 83 -229 26 112 -147
2248a47L09j87k80N04o2m11K79L7r1N7J29l43J46K71j27L4J5k72K68O5j84k30
$$ -147 162 -25 -305 199 137 -274 5 42 -49 8 137 -206 -60 211 84 118 133 -139 129 194 10 -220
2270b20M51k11j91L80J2k03J04M7l66K36k7j96K49Ok69J63K34k78J8M6j00R4L02
$$ -220 231 20 -171 209 221 18 122 169 -197 39 12 -184 65 71 -198 -35 199 -79 -61 -15 -115 -21 281
2293B81k13j02k3N5j22K20j32r5K09M6l49K22M1k48K13K12m44K20Q9r6N7R6l33
$$ 281 68 -34 -57 -2 -124 96 -36 -131 78 124 -225 -3 38 -210 3 215 -229 -9 80 -16 41 137 -196
2316a96K10K12m36K62K15l69q5M18l51R7O5j03q9J43jm8J89j13k54K53P4j50J06
$$ -196 14 226 -210 52 267 -102 -187 231 -120 -23 42 -61 -150 -7 -8 -56 133 20 -234 19 93 -57 49
2339D9M3k99K26J84j66j6K03l16K77j2k86p8L48m28J05M40l02m0L54l25m2J62
$$ 49 92 -207 19 203 37 21 224 -92 185 173 -113 -191 157 -271 -166 274 -28 -68 286 -39 -81 81
2361H1j45O1O4q4n7P0L3j15K62q4k72L40k01k25J54J57j79M9K78k07j04J31k87
$$ 81 -64 -3 61 -23 -80 -10 23 -92 170 86 -186 154 -47 -272 -118 39 -140 -91 187 -20 -124 7 -280
2384b80J95L34l01j6K03j18j10K30j56j02K33j21j26J61O8l99K62K15l16K82k08
$$ -280 -85 249 -52 -68 135 17 -93 137 -19 -121 112 -9 -135 26 94 -305 -43 172 -144 138 -70
2405g0p9J07J71k70J29K27m07Q1K95j54j40M04k85j24J16n2P9J30k27l6M50k31
$$ -70 -149 -42 129 -141 -12 215 -192 -111 184 30 -110 294 9 -115 1 -51 28 158 -69 -105 345 114
2427A14j93J67r8j50K59j21n0J34K5l20K00J45l43K72K09l22J52M0k08N3K19k85
$$ 114 -79 88 -10 -160 99 -22 -72 62 87 -233 -33 112 -231 41 250 -72 80 120 -88 -35 184 -101
2449a01J54N9l20K43q9O4j2Q3r2k14L90j54k4J60j24p1J68l1l28M10j26p1J07
$$ -101 53 112 -208 35 -54 10 -2 81 -11 -225 165 11 -13 147 23 -48 120 89 -239 171 45 -26 81
2472H1K52k73j60J39j12Q3l6kK4N3j36m0J83K2j85n0K29l9J6J47k50K12P0l55
$$ 81 333 60 -100 39 -73 10 -26 -28 -4 49 -87 -127 56 78 -107 -157 72 33 49 196 -54 158 228 -127
2496a27J44K27n82K43J90l02K45R5l60K85Q1l49L8K40j82j04M10j62r2K02k16
$$ -127 17 244 -338 -95 95 -207 38 133 -227 58 139 -210 -172 68 -114 -218 192 30 -62 140 -76
2517g6K4K53j51l41L60J15k64J16j08j57J54J38q1R9o7j50J29M2j26J11J49j44
$$ -76 -52 201 50 -291 69 184 -80 36 -72 -229 -75 63 -18 81 14 -136 -7 35 -91 20 169 25
2539B5k8K94m53J63J86k27JJ48j05k21L33j28r0K34j65O9j34J89n4J6K02l40K57
$$ 25 -3 291 -162 1 187 -40 -39 109 4 -217 116 -12 -102 132 -33 36 -98 91 37 53 255 -85 172
2562A72r5k54K11M8k66K28K2P8j86K24k40M4J37k25o2K76l05N1K95k03j01K0K16
$$ 172 77 -177 34 82 -184 44 66 144 -42 182 -58 -14 123 -102 -164 112 -193 -142 153 -50 -151 -131 85
2585H5k63K12J21k10j9J01p6JN7n3PL4L4j10K91m03J06K28l23r6L22j69j27J70
$$ 85 -178 34 155 -55 -74 27 -49 -48 9 -44 -37 -3 31 -79 212 -191 -85 143 -180 -276 46 -123 -250 -80
2609h0R0o9J43Q3k01J38n5j3j34J73j24j6K31m01K85r2q3J13K5j59j08J62J18
$$ -80 10 -59 84 167 -34 104 49 36 -98 75 -49 -65 166 -235 50 -42 -125 -12 13 -146 -254 -92 26
2632B6j25K36j85k67J79J35k50L45q0q4j46K20m6M1k0j78L89r1r4%%k14K27Q8
$$ 26 -99 137 -48 -315 -136 -1 -251 94 14 -70 -216 4 -42 -1 -21 -199 190 99 5 5 5 -209 18 106
2656A06k38Q1J18K4r8N2q8L6K53m31mJ85m3L6N5J21l68L78k0o9J47k68j06J71
$$ 106 -132 -51 67 91 -7 45 -43 -7 246 -185 -189 -4 -47 -11 44 165 -203 175 155 86 233 -35 -141 30
2680C0j36j61L43M0j47NJ64j06o2J11k00K00j7j45P8J78j53k3l1n4o3O8J5j31
$$ 30 -106 -267 76 116 -31 -26 138 32 -30 81 -119 81 64 -81 -3 175 22 -1 -32 -86 -149 -81 -66 -197
2704a97K04J3j12M6J91k16J75J4j31J12P9k04J63Pk60j01L02j33pJ34j08M6K29
$$ -197 7 20 -92 -46 145 -71 104 118 -13 99 178 -26 137 144 -116 -217 85 -48 -55 79 -29 17 246
2727B46k41j26J50j06m7J57p7O1J85k2j47J53j14k14K42j28j68L97j60n9J02N2
$$ 246 5 -121 29 -77 -124 33 -44 17 202 180 33 186 72 -142 100 -28 -196 201 41 -18 84 136
2749A36k47K46k16P2r2J96n6j6pk4M0R7j24j96J99m8j92J08K07k37K63o4p5rL42
$$ 136 -111 135 -81 -9 -101 95 39 23 16 -8 32 129 5 -191 8 -40 -232 -124 83 -154 109 45 -30 -39 303
2774C03m37J96p4j85J40r8J55RJ46k66m1J12K2N1Q2k08O8J09k81K04K09p1k32
$$ 303 -134 62 -12 -197 -57 -155 0 9 155 -111 -152 -40 -18 33 115 -93 -25 84 -197 7 216 145 -87
2797h7P7Jm7k3Q6M3K3k18oK11j00l3qJ03p7P3Q8k32K65ml11P8K01o5j44J36p0
$$ -87 -10 -9 -56 -79 7 50 73 -145 -151 60 -40 -73 -81 22 -55 18 106 -126 139 135 -176 -98 103 38 -106 30 -40
2824d0J84k86K17j77J98o8j30K26n2j2j80L16k86M8J32n1j5J43k75J3J22P4j89
$$ -40 144 -142 75 -102 96 28 -102 124 72 60 -120 196 -90 -42 90 39 24 167 -108 -95 27 101 -88
2847h8J29m1mkr6kK3j08M8J24o1L9O8R2k47J2O4l8K14j38p7N3J44j23P2K8j46
$$ -88 41 0 -4 -6 -102 -104 -81 -189 -141 -17 -78 -39 29 121 -126 -114 -50 -88 126 -12 -89 -36 108 -15 57 85 -61
2874f1J08p9M2m6J48j39j21M3P7O7R6j80j57K62Rr0l5J30j36N7J23o8Nr9l2O0
$$ -61 47 -32 10 -36 112 -27 -148 -105 -28 39 135 -45 -202 60 69 -21 -56 74 -62 -5 118 50 55 -44 -76 -16
2900a6J18l55L14r3J45j29nO5or9O0jK4J5r4K60m23K44P4j7j7m3%j6J16l6j66
$$ -16 102 -253 61 -32 113 -16 -21 44 38 -61 -1 -2 22 37 -57 203 -220 24 98 81 64 21 21 5 121 85 -81
2927h1O2J82q5j60K81j43Q0O1l25L21j73q8J73k14M0J55L4j66L2J23r4r4j46J65
$$ -81 -19 163 78 -82 199 56 136 197 -128 193 20 -68 105 -109 -69 86 120 -46 -14 109 15 -79 -225 -60
2951f0lN7j7j8j6N2J45j69K4j37J28QJ53j41k6j70K48j30rK06J8k13j22K57p3
$$ -60 -63 -6 -23 -41 -57 -5 140 -29 -5 -142 -14 -6 147 6 -20 -190 58 -72 -81 125 143 -70 -192 65 -8
2976hj3N5PJ0q2n7L3N5J6j03K8J14k40R7J24N8M2q0k4j03J03n1M6j82J8L1J97
$$ -8 -21 34 41 51 -31 -88 -55 0 16 -87 -59 55 -185 -88 36 94 136 56 32 -71 32 -19 27 -155 -137 -106 91
3003I1r9p1J55r0Q2m5p3Qn8M6m5p5K85n8l6J1l4m3N3n5J87j06n3l7J68j49O5L0
$$ 91 -8 -79 76 -14 68 23 -50 -42 -100 -54 -99 -174 111 53 17 28 -6 -49 4 -51 136 30 -23 -60 108 -41 24 54
3031E4Q0j97J42j50p1J15J10j30J52j66J70p9Ql1J96j47j92J76j33k0P5J11j23
$$ 54 134 -63 79 -71 -142 -27 83 -47 105 -61 109 30 38 7 203 56 -136 40 -93 -113 -38 73 -50
3054e0J33M1k65O0R6L8m6m6j04R3J59j04j12K76j15K0l8nk6M3r0k0J27k9K0m0
$$ -50 83 124 -141 -81 15 53 7 -39 -143 -50 109 5 -107 169 54 74 36 31 5 48 -42 -62 65 36 56 16
3080A6l8r1K27j04l2N9M8N3n3j0j95K70q8j90K20j08o7O0j4N0j89L39K1k49j3
$$ 16 -22 -113 114 10 -22 37 85 138 85 75 -120 150 62 -128 92 -16 -83 -23 -37 13 -176 163 184 -65 -78
3105g8J17k4nJ0o7R5j68K2J37N8k34J90m9J26q0K0j81J63j68Q9L5Jj68J90ml12
$$ -78 39 15 10 20 -47 48 -120 -98 39 97 -137 53 4 130 50 70 -111 52 -116 -27 8 9 -159 31 27 -285
3131b85K16R7N5r0L52k90p1J4N3j15J78j71q4K89q0k58L75j03p0j24J1J6Q1J36
$$ -285 -69 28 83 -7 345 55 -16 -2 51 -64 114 -57 -141 148 68 -190 185 82 12 -112 -101 -85 -4 132
3155A32j53J52q9k31K72n9j93K23n5j8kR1L7J9lj50P0n3J35j50K0J0m3j5J90j32
$$ 132 -21 131 42 -189 83 24 -169 54 -1 -19 -21 70 107 126 123 -27 43 -10 125 -25 -5 5 -38 -53 137 5
3181EJ71j43j04R8L5Q4K7k63J05r8N5n1J16J61j45R5j22j62N4OJ35k25L08k03
$$ 5 176 33 -71 27 62 146 173 -90 15 -83 -28 -79 37 198 53 148 26 -136 -82 -76 59 -166 142 -61
3205f1J00O9j56J50J9l6k15J87p8P0M9j57j17J20R2k1%l5J49k35L5l2J48J26k96
$$ -61 39 108 -48 102 121 85 -130 57 -21 49 98 -59 -176 -56 36 15 15 -20 129 -106 -71 -103 45 171 -125
3230a25K75j2r1j5p3M2J7j22k8P8JJ62k19M8J28j24j9j17K12q8Q7M2rpP5j09r6
$$ -125 150 138 47 32 -41 1 18 -104 -132 -54 -53 109 -110 -62 66 -58 -77 -194 18 -70 17 59 50 43 118 9 -87
3257h7O4j07J26r7J09o4J35j04J14p8l03L43j6Q0J40k41K4j2j44Q6J50%p9r3j12
$$ -87 -23 -130 -4 -101 8 -56 79 -25 89 11 -292 51 35 115 255 14 38 26 -118 -32 118 118 39 -54 -166
3282a66J58P3j66M01l98J85Q7j37Q7j27K4M2m2j03K45j82j7J45j60R8L4K3p7j2
$$ -166 -8 65 -101 300 -98 87 174 37 124 -3 21 63 21 -82 163 -19 -36 109 -51 47 81 104 27 15
3306A5Q5q7k9R5r4j1K06m8q6o8j64P9q7J9K35j26n6J39j03J85l7m2j01k2J14m4
$$ 15 100 13 -16 79 -15 -26 180 132 46 -22 -186 -107 -194 -175 60 -66 -122 17 -86 99 62 20 -81 -103 11 -33
3332c3r5J42o4PK8l2j72K28J0N0P2j41k4o4R5j50O4K25j09n4J29k88L24j13oj66
$$ -33 -128 14 -50 -43 -15 -47 -219 9 19 69 141 0 -24 -88 7 -143 -79 146 37 -17 112 -176 148 35 29 -137
3358a37K70n0L6q3P3k46N8J08p6l5K38j35j2J09r7j09OJ55j19N3L0j19pN0J1j2
$$ -137 133 83 119 36 109 -137 -79 29 -47 -82 156 21 9 118 21 -88 -82 73 -46 7 37 -82 -89 -39 -28 -40
3384d0J06M8R3l23L9J51j7k51J96j54J71q0O6J97k18J02q1r3K43j86K2J21j55
$$ -40 66 114 207 -116 -77 74 57 -194 2 -152 19 -61 5 202 -16 86 5 -88 155 -31 -9 112 -43
3407d3P4n3m8J8J25j95K43m9k2l7K4l1l9j27L23k6r1l8rQJ06j02k86K29J30j34
$$ -43 31 -22 -70 -52 73 -122 121 72 50 13 37 6 -33 -160 163 137 46 8 -1 7 113 11 -275 -46 84 -50
3433e0K47k08j19L0L1j02J01P8j70J95j08k9J71J52m06K08r3j29K70r5R1r8L2
$$ -50 197 -11 -130 -100 -69 -171 -70 8 -162 33 -75 -104 67 219 -187 21 -72 -201 69 -26 65 -33 -1
3456aj31K14m6n7M0p4J1J18n8J26j56K14k51J87j5m8j29J02j54RJ85m9j58J23
$$ -1 -132 82 36 -21 19 -55 -44 74 16 142 -14 200 -51 136 121 73 -56 46 -108 -99 86 37 -121 2
3480Bj35K50j94j21J49J6N9l1j12K31j38k5J92k14L6J06j5j14J56j67q1J21n4
$$ 2 -133 117 -77 -198 -49 -33 26 -5 -117 114 -24 -49 143 -71 -35 71 56 -58 98 -69 -150 -29 -83
3503h3L6K20k23q7N1J18k1J44j79J4J25j91j3P5o1R3N1o9J1l6J00nl4J66k11Q3
$$ -83 -47 173 -50 -137 -86 32 11 155 -24 -10 115 -76 -89 -14 -75 18 69 0 11 -25 75 70 36 202 -9 74
3529G4J13n0k01n1L7K9l1j70R7J60L1L1Q1k20R2Kpj5l9J64j75K0J2J2k4R6j01
$$ 74 187 137 -64 -115 -78 -49 -80 -250 -153 7 38 69 150 -70 22 24 17 2 -37 127 -48 -28 -16 -4 -28 68 -33
3556c3K4J21j22R8q1o3M8o7J58r0J74n5k33J3Q7n2Q2k6M1L4m2P7j59J27K5j16
$$ -33 -9 112 -10 88 7 -56 -8 -75 83 -7 167 112 -121 -108 -21 -73 9 -17 24 58 16 93 -66 61 86 -30
3582c0J05K1N8k9j95J26o6J28k03J10m6j03K82P0l16L35l19kJ33j02j4J70j0p5
$$ -30 75 96 154 125 -70 56 -10 118 -85 25 -21 -124 158 228 -88 247 -72 -74 59 -43 -57 113 103 28
3606B8O7J8j53m2oJ02J24j02j34J78Kp7k3p6K07q9L2j28J78j60M6J34j48o6NN4
$$ 28 95 113 -40 -82 -88 14 138 36 -98 80 82 5 -18 -94 113 24 56 -72 106 -54 -8 126 -22 -88 -83 -29
3632b9K13k38R0P8j22q4L3mKj6J35N4k9rK1n0j21J29ko5q3J34k37J71p4J36o1
$$ -29 184 -54 36 114 -8 -92 -59 -63 -61 -77 58 112 83 74 95 45 -76 53 51 -14 -97 37 -200 -29 -103 33 -28
3659b8M3M6q9K9n2K20L3k78Q7p6J16j46J57j04j26J60j68R6K33M8l19P8M2k58
$$ -28 15 61 -28 1 -51 169 202 -76 11 -65 51 -95 62 -42 -168 -8 -176 -80 153 201 -118 -40 2 -256
3683b56J81J32l5K28k96n5J41q1J62k70R4k6M7%M9m0Rl5p4QJ20M6pN3lj40J03
$$ -256 -75 57 22 250 -46 -101 40 -41 121 -149 -55 -81 -34 -34 15 -25 -16 -51 -125 -117 3 49 42 95 92 -48 55
3710E5j48l3K6N1N7L4k4k5J67k76n1P4J19j73J10j5Nk4O3j21K38k48J58p0o9J78
$$ 55 -93 -126 -100 -49 8 42 18 -7 160 -116 -167 -93 26 -147 -37 -52 -47 -71 -8 -129 109 -139 19 -51 -120 58
3736E8l7j31J55Kj16K1l3J16L1j02L5j71QJ45R6k8l4J06j11Oo4mP3k34L66p0j31
$$ 58 21 -110 45 47 -69 -48 -81 35 66 -36 -1 -172 -164 -19 77 49 15 121 10 16 -48 -52 21 -213 153 83 -48
3763d8n6J19r5R1O6j70M8pj9p4R0L3J97j66J6k0j3M7l8pr7J12M6J54l8k19K21
$$ -48 -104 15 -80 11 77 -93 -45 -52 -71 -145 -55 -22 175 9 25 5 -8 39 1 -6 -103 9 55 209 171 -48 173
3790A73k24K94j66L5j72O0L0L1q9J13j94jK05k44J58L8p6J00M3k26J04j7M6j82
$$ 173 -51 243 77 112 -60 0 30 61 -28 85 -109 -110 95 -149 9 47 -29 71 114 -112 -8 -25 21 -161
3814a61K28r5rK9j1l7N6j87K28J5j07K1L17j59j17Om3j00J09lMJ32o8r8J79m7
$$ -161 67 -28 -37 -8 -19 -56 0 -187 41 56 -51 -30 287 128 11 17 -26 -126 -17 -20 -16 116 48 -50 129 82
3840H2j10O3k3jO3J7j51m2J57j7k5K2j75Jk2J81n8j63K34j4o0nQ7j7K4k5j18L0
$$ 82 -28 35 12 11 74 91 -60 -102 55 38 13 35 -140 -139 -161 20 -38 -201 33 19 -41 -46 41 24 48 23 -95 -65
3868f5R7j01K34j65l7J98j81m6J15j00j47K59J19l41J41nj95J51kN9L4K2M9j30
$$ -65 32 -69 165 0 -37 161 -20 -66 49 -51 -198 61 180 -161 -20 -25 -220 -69 -71 -12 22 44 93 -37
3892c7%LJ34j05L2N2j11ojOKJ1R7j63p9J21l8J92l62J44J59R9j76N7o6q8K75k38
$$ -37 -37 -34 100 -5 27 79 -32 -38 -39 -33 -31 -20 77 -86 -165 -44 -82 110 -252 -108 51 150 -26 31 -35 -123 152 -86
3920h6K15l93J61J42j40P3J3r9O9L3p7K19J17k15k45L79n1j84J46j95P9L0j4J58
$$ -86 129 -264 -103 39 -101 -28 -15 -114 -45 -12 -89 130 247 32 -213 166 115 -69 77 -118 -39 -9 -23 135
3944A35j5r2J14L0J1k93j1L0J8J07L9q2k6On2J13J0k4r8J15j25M9M0m7J68j69
$$ 135 120 28 142 172 183 -110 -121 -91 -73 34 73 -9 -35 -29 -81 32 42 18 -80 35 -90 -41 -1 -48 120 -49
3970d9N3p9J03j87Q3R4k2R4o5j00R1L2P6j07Q8j12p6Q3J2l3MK39l37J17J71k34
$$ -49 4 -75 28 -159 -76 18 -4 90 25 -75 16 48 124 17 105 -7 -83 0 12 -21 -17 222 -115 2 173 -61
3996f1O5m5N2p5J44K7m7k9k47K32o7r9J08L7O2j42Q5j2j33Q7J88q5j96K50r0L5
$$ -61 4 -41 11 -64 80 107 60 31 -216 16 -51 -150 -42 -5 57 -85 0 -12 -145 -58 130 45 -151 99 9 44
4022D4JjJ5nj24O4J3Q8j58J26k85J16J77O2k75J66N9r9N5J6n4q8L15j71j60J52
$$ 44 45 44 59 54 -70 -6 7 95 -63 63 -222 -106 71 133 -142 24 83 -16 39 55 1 -87 228 57 -103 49
4048D9m5op8L3k3J0O5j08J20j99KK94j84N3k5R9j16K3K8R6q2N1Rj72k4l0P6J49
$$ 49 4 -2 -80 -47 -70 -60 5 -103 17 -182 -180 114 -70 -17 -42 57 -59 -36 -8 88 6 57 66 -106 -130 -160 -84 65
4076F5lK2j30R8j19N4M9P7j13k6l5L2M5j1l3LN7N5j45O7r5L6l7N1L6P9j45nn5
$$ 65 62 84 -46 52 -67 -13 36 113 0 -26 -61 -29 16 5 -28 -25 32 87 -58 9 -86 -50 -87 -36 0 79 -66 -71 -126
4105a26R8o9O9j4J72p7N0m3j75J01N7j59J67j00J66k27n0R5m6K13J24l00J69j78
$$ -126 -28 -97 -28 -42 130 53 103 60 -115 -14 43 -116 51 -49 117 -110 -160 -65 -111 102 226 -74 95 -83
$$ [...]
8191a28
##END NTUPLES=NMR FID
##END=
