##TITLE=1H_BAU-j-4.1FNO
 CDCl3, 8 sc, 
 4.7.2019
##JCAMPDX= 6.0         $$ Bruker NMR JCAMP-DX V2.0
##DATA TYPE= NMR FID
##DATA CLASS= NTUPLES
##ORIGIN= UXNMR, Bruker Analytische Messtechnik GmbH
##OWNER= root
$$ XWIN-NMR		Version 3.5
$$ Thu Jul  4 16:10:24 2019 Russian Standard Time (UT+4h)  she@DPX200
##.OBSERVE FREQUENCY= 200.13155
##.OBSERVE NUCLEUS= ^1H
##.DELAY= (6, 6)
##.ACQUISITION MODE= SIMULTANEOUS
##.ACQUISITION SCHEME= undefined
##.AVERAGES= 8
##.DIGITISER RES= 18
##SPECTROMETER/DATA SYSTEM= spect
##.PULSE SEQUENCE= zg30
##.SOLVENT NAME= Pyr
##.SHIFT REFERENCE= (INTERNAL, Pyr, 0, 15.7039)
##AUDIT TRAIL= $$ (NUMBER, WHEN, WHO, WHERE, WHAT)
$$ ##TITLE= Audit trail, XWIN-NMR		Version 3.5
$$ ##JCAMPDX= 5.01
$$ ##ORIGIN= Bruker BioSpin GmbH
$$ ##OWNER= she
$$ F:/spectra/data/she/nmr/H-F/1/audita.txt
$$ ##AUDIT TRAIL=  $$ (NUMBER, WHEN, WHO, WHERE, WHAT)
(   1,<2019-07-04 16:09:17.53 +0400>,<she>,<DPX200>,
      <created by zg, POWCHK disabled, PULCHK disabled
       configuration hash MD5:
       00 E9 B6 7A A2 85 ED C7 34 08 36 98 17 FE 4E 26
       data hash MD5: 16K
       4E 76 98 2C 40 3F 85 0F 36 1B 23 75 A0 54 0A B5>)
$$ ##END=
$$ 
$$ hash MD5
$$ 0A 66 94 FC 1C FA 24 DD 10 E2 97 1D 8E 2E E4 90
##$RELAX= 
##$RELAX= 
##$RELAX= 
##$RELAX= 
##$RELAX= 
##$RELAX= 
$$ Bruker specific parameters
$$ --------------------------
##$DU= <F:/spectra>
##$EXPNO= 1
##$NAME= <H-F>
##$PROCNO= 1
##$TYPE= <nmr>
##$USER= <she>
##$AMP= (0..31)
100 100 100 100 100 100 100 100 100 100 100 100 100 100 100 100 100 100 
100 100 100 100 100 100 100 100 100 100 100 100 100 100 
##$AQSEQ= 0
##$AQ_mod= 1
##$AUNM= <au_zg>
##$AUTOPOS= <>
##$BF1= 200.13
##$BF2= 200.13
##$BF3= 200.13
##$BF4= 200.13
##$BF5= 200.13
##$BF6= 200.13
##$BF7= 200.13
##$BF8= 200.13
##$BYTORDA= 1
##$CFDGTYP= 0
##$CFRGTYP= 5
##$CHEMSTR= <none>
##$CNST= (0..31)
1 1 145 1 1 1 1 1 1 1 1 1 1 1 1 1 1 1 1 1 1 1 1 1 1 1 1 1 1 1 1 1 
##$CPDPRG= <>
##$CPDPRG1= <>
##$CPDPRG2= <>
##$CPDPRG3= <>
##$CPDPRG4= <mlev>
##$CPDPRG5= <mlev>
##$CPDPRG6= <mlev>
##$CPDPRG7= <mlev>
##$CPDPRG8= <mlev>
##$CPDPRGB= <>
##$CPDPRGT= <>
##$D= (0..31)
0 1.2 0 0 0 0 0 0 0 0 0 0.03 0 0 0 0 0 0 0 0 0 0 0 0 0 0 0 0 0 0 0 0 
##$DATE= 1562242156
##$DBL= (0..7)
120 120 120 120 120 120 120 120 
##$DBP= (0..7)
150 150 150 150 150 150 150 150 
##$DBP07= 0
##$DBPNAM0= <>
##$DBPNAM1= <>
##$DBPNAM2= <>
##$DBPNAM3= <>
##$DBPNAM4= <>
##$DBPNAM5= <>
##$DBPNAM6= <>
##$DBPNAM7= <>
##$DBPOAL= (0..7)
0.5 0.5 0.5 0.5 0.5 0.5 0.5 0.5 
##$DBPOFFS= (0..7)
0 0 0 0 0 0 0 0 
##$DE= 6
##$DECBNUC= <off>
##$DECIM= 24
##$DECNUC= <off>
##$DECSTAT= 4
##$DIGMOD= 1
##$DIGTYP= 9
##$DL= (0..7)
0 120 120 120 120 120 120 120 
##$DP= (0..7)
150 150 150 150 150 150 150 150 
##$DP07= 0
##$DPNAME0= <>
##$DPNAME1= <>
##$DPNAME2= <>
##$DPNAME3= <>
##$DPNAME4= <>
##$DPNAME5= <>
##$DPNAME6= <>
##$DPNAME7= <>
##$DPOAL= (0..7)
0.5 0.5 0.5 0.5 0.5 0.5 0.5 0.5 
##$DPOFFS= (0..7)
0 0 0 0 0 0 0 0 
##$DQDMODE= 0
##$DR= 18
##$DS= 0
##$DSLIST= <SSSSSSSSSSSSSSS>
##$DSPFIRM= 0
$$ [...]
##$SUBNAM2= <"">
##$SUBNAM3= <"">
##$SUBNAM4= <"">
##$SUBNAM5= <"">
##$SUBNAM6= <"">
##$SUBNAM7= <"">
##$SUBNAM8= <"">
##$SUBNAM9= <"">
##$SW= 24.9336996594482
##$SWIBOX= (0..15)
0 0 2 0 0 0 0 0 0 0 0 0 0 0 0 0 
##$SW_h= 4990.01996007984
##$TD= 16384
##$TD0= 1
##$TE= 0
##$TE2= 300
##$TE3= 300
##$TEG= 300
##$TL= (0..7)
0 120 120 120 120 120 120 120 
##$TP= (0..7)
150 150 150 150 150 150 150 150 
##$TP07= 0
##$TPNAME0= <>
##$TPNAME1= <>
##$TPNAME2= <>
##$TPNAME3= <>
##$TPNAME4= <>
##$TPNAME5= <>
##$TPNAME6= <>
##$TPNAME7= <>
##$TPOAL= (0..7)
0.5 0.5 0.5 0.5 0.5 0.5 0.5 0.5 
##$TPOFFS= (0..7)
0 0 0 0 0 0 0 0 
##$TUNHIN= 0
##$TUNHOUT= 0
##$TUNXOUT= 0
##$USERA1= <user>
##$USERA2= <user>
##$USERA3= <user>
##$USERA4= <user>
##$USERA5= <user>
##$V9= 5
##$VALIST= <valist>
##$VCLIST= <CCCCCCCCCCCCCCC>
##$VD= 0
##$VDLIST= <DDDDDDDDDDDDDDD>
##$VPLIST= <PPPPPPPPPPPPPPP>
##$VTLIST= <TTTTTTTTTTTTTTT>
##$WBST= 1024
##$WBSW= 4
##$XGAIN= (0..3)
0 0 0 0 
##$XL= 0
##$YL= 0
##$YMAX_a= 135374
##$YMIN_a= -173410
##$ZGOPTNS= <>
##$ZL1= 120
##$ZL2= 120
##$ZL3= 120
##$ZL4= 120
##$ABSF1= 10
##$ABSF2= 0
##$ABSG= 5
##$ABSL= 3
##$ALPHA= 0
##$AQORDER= 0
##$ASSFAC= 0
##$ASSFACI= 0
##$ASSFACX= 0
##$ASSWID= 0
##$AUNMP= <proc_1d>
##$AZFE= 0.1
##$AZFW= 0.1
##$BCFW= 1
##$BC_mod= 2
##$BYTORDP= 1
##$COROFFS= 0
##$CY= 11.3945322036743
##$DATMOD= 1
##$DC= 2
##$DFILT= <>
##$DTYPP= 0
##$F1P= 18.9103706918063
##$F2P= -1.10871071338519
##$FCOR= 0.5
##$FTSIZE= 0
##$FT_mod= 4
##$GAMMA= 1
##$GB= 0.15
##$INTBC= 1
##$INTSCL= 1
##$ISEN= 128
##$LB= 0.24
##$LEV0= 0
##$LPBIN= 0
##$MAXI= 10000
##$MC2= 0
##$MEAN= 0
##$ME_mod= 0
##$MI= 1.114404
##$NCOEF= 0
##$NC_proc= 0
##$NLEV= 6
##$NOISF1= 3.799351
##$NOISF2= 2.8
##$NSP= 1
##$NTH_PI= 0
##$NZP= 0
##$OFFSET= 15.70392
##$PC= 1
##$PHC0= -8499.707
##$PHC1= 16.60096
##$PH_mod= 1
##$PKNL= yes
##$PPARMOD= 0
##$PSCAL= 0
##$PSIGN= 0
##$REVERSE= no
##$SF= 200.130013532006
##$SI= 16384
##$SIGF1= 3
##$SIGF2= 2
##$SINO= 400
##$SIOLD= 16384
##$SREGLST= <1H.CDCl3>
##$SSB= 0
##$STSI= 0
##$STSR= 0
##$SW_p= 3612.71676300578
##$SYMM= 0
##$S_DEV= 0
##$TDeff= 0
##$TDoff= 0
##$TI= <>
##$TILT= no
##$TM1= 0
##$TM2= 0
##$TOPLEV= 0
##$USERP1= <user>
##$USERP2= <user>
##$USERP3= <user>
##$USERP4= <user>
##$USERP5= <user>
##$WDW= 1
##$XDIM= 8192
##$YMAX_p= 0
##$YMIN_p= 0
$$ End of Bruker specific parameters
$$ ---------------------------------
##NTUPLES= NMR FID
##VAR_NAME=  TIME,          FID/REAL,        FID/IMAG
##SYMBOL=    X,             R,               I
##VAR_TYPE=  INDEPENDENT,   DEPENDENT,       DEPENDENT
##VAR_FORM=  AFFN,          ASDF,            ASDF
##VAR_DIM=   8192,          8192,            8192
##UNITS=     SECONDS,       ARBITRARY UNITS, ARBITRARY UNITS
##FACTOR=    0.0002004,     1,               1
##FIRST=     0,             0,               0
##LAST=      1.6414764,     0,               0
##MIN=       0,             -173410,         0
##MAX=       1.6414764,     135374,          0
$$ Real data points
##PAGE= N=1
##DATA TABLE= (X++(R..R)), XYDATA
$$ [...]
1906B0k2q8K24l69M71j25k63L68m1M56o88J21l11N17k34o6rOj13J76j09R0j21
1929a10J77L83m84o7M48l82l52N20k88M4O2J17J35Nl2k45R1mm4j33M3K39l3p9
1953A1l03N62j5K2l84R0L00l72j8M7L7J00j0m4k9O4l6j44J69P4j4m2M4k58L18
1978A69L1l39Q5P5Q8j34L6o3O7k44K09j21R2Q8k56L64k87J76J27Oj22j29J43M0
2002A01J01M9q4k27K7k85K96j32k9J33m6J29k91L00R7j09K7p1l2o5P6K62k22j45
2026a40m2M60p1o45J94L20k47K10l03N78J3n06L14j77l27M40k92L74k16J4k8o6
2048a43P8R1RJ91k93J18j48K31j63L25l57Jn1J36k63O54k18k56k8m1j33K70o5
2071e5K7k96q3K25l8J36K9P3m4j38J43k47K32r9Q7M4J46j23K31m43J5J53j17L94
$$ plain form
1906 20 -2 -90 134 -235 236 111 -152 216 175 631 -57 64 -247 270 36 -30 -39 -33 -146 30 -79 11 -110
1929 -110 67 450 -34 -101 347 -35 -387 133 -155 -111 -49 68 203 208 176 -69 22 18 -26 -159 -116 123 90 11
1953 11 -292 270 255 277 -107 -17 283 -89 -107 -60 -23 77 67 23 -6 58 22 -122 47 121 107 65 109 -149 169
1978 169 200 -139 -54 21 109 -25 11 -52 15 -229 -20 -141 -49 39 -217 147 -140 36 163 169 47 -82 61 101
2002 101 202 251 167 -60 -33 -318 -22 -154 -183 -50 -96 33 -258 42 139 30 57 -14 -46 -111 -35 227 5 -140
2026 -140 -182 278 207 -438 -244 76 -171 39 -264 314 327 -179 135 -42 -369 71 -221 153 -63 -49 -77 -143
2048 -143 -65 26 35 226 -67 51 -97 134 -29 296 -61 -60 -111 25 -238 416 198 -58 -86 -127 -260 10 -55
2071 -55 -28 -324 -407 -182 -220 -84 -55 18 -26 -164 -21 -268 -36 -135 -48 -4 142 19 250 -193 -178 -25 -142 252
2095B52j57l22j07L23q0L8J96k31L81k83j21R8K7q9J83K6K2j06R6J19l33K44k34
2118e8L56q8ll83J73Q7K69m59K42k25j75R6J96K32Q6r1m69J30L98l43K10j6%l48
2142a83P1N0J65l7p5j00J72l5R6p6J8K94k93n8j41J37j57J73j15j42K42l4J43
2165A15l67Q7j11J69N0m1P8k77J19K22m0k7J53l50K04j59K63J42l66L42m43K9
2187b08J48M18p6r8l16J93J00O5j37m5l3N4j69P0j74K65l74L51R8o2N9j24J29
2210A34k43O4K93k22m03K79l8J27L64o17J63NK06k57j50L40o7l4J19k47M9L07
2232A72l11nJ41k3j18J7J88K28j99j21k97O06j49J48l42k38K93J15k8J19oj86
2254DJ11m18O12J58m00j93K9J54j11J55j40J86R7j22k16J80qj71N8l3m0K00k98
$$ plain form
2095 252 95 -227 -334 -11 -91 -53 143 -88 293 10 -111 -13 14 -75 108 134 156 50 146 265 -68 176 -58
2118 -58 298 210 207 -176 -3 84 353 -106 136 -89 -264 -168 28 260 346 255 -214 -84 314 -29 181 165 165 -183
2142 -183 -112 -62 103 66 -9 -109 63 28 124 48 66 360 67 9 -132 5 -152 21 -94 -236 6 -28 115
2165 115 -252 -165 -276 -107 -57 -98 -20 -297 -178 44 4 -23 130 -220 -16 -175 88 230 -136 206 -237 -208
2187 -208 -60 358 282 184 -132 61 161 226 89 44 11 65 -104 -34 -208 57 -317 34 132 70 129 5 134
2210 134 -109 -45 248 26 -377 -98 -136 -9 355 -262 -99 -94 112 -145 -295 45 -22 -56 63 -184 -135 172
2232 172 -139 -144 -3 -26 -144 -127 61 289 90 -31 -328 278 129 277 -65 -303 -10 105 77 196 190 4
2254 4 115 -303 309 467 67 -126 -97 57 -54 101 -39 147 244 122 -94 86 78 -93 -35 -68 -108 92 -206
2277b06J65N2j69K74K4L49k87k04J81l85K59k36M9K2L29j85Rn3L2K80k19j40J0
2300d9k94O95l52j84K84Jn2J36j33q2M30k20j87j05K36k31J24lk65M11L1k61j8
2323h8K17k09p8K37K65k77j26M0M2j14j25K18m4J50k83L60k5k95L57o4n8PR9l66
2347a60K08k61J41l0L32l02M6%m8K76J57r23N38m2L92k60j20J50k52L41l39o8
2369b24O24o21M64l78J38K37k17o0k24J48J07J36j19j1J38j49k6L8l1j25J20J44
2391A09k97P3k7j30P0M99l6m77J77l9j9L90j71l11L15P2J70l88m5K12n1Q5j8J39
2415C02j71o8j89O4k97K55J54m16O06k39K5j75k46M12N7k15o6q1M75m70L80N2
2437A49j11j56r0O0K0M3J45K81n09n6j36N00m5L8j02O8R4k25K01j50K1J27k65
$$ plain form
2277 -206 -41 11 -158 116 140 489 202 -2 179 -206 53 -183 -134 -112 217 32 41 -12 20 300 81 -59 -49
2300 -49 -343 352 0 -184 100 101 49 185 52 -30 400 180 -7 -112 124 -107 17 14 -251 160 191 -70 -88
2323 -88 129 -80 -158 79 344 67 -59 -19 23 -91 -216 2 -42 108 -175 185 160 -135 222 158 100 107 206 -160
2347 -160 48 -213 -72 -102 230 -72 -26 -26 -74 202 359 -564 -26 -68 324 64 -56 94 -158 183 -156 -224
2369 -224 400 -221 243 -135 3 240 23 -37 -261 -113 -6 130 11 0 138 -11 -37 1 -30 -155 -35 109
2391 109 -188 -115 -142 -272 -202 297 261 -216 -39 -78 -97 293 122 -189 126 198 368 -20 -65 147 96 181 163 302
2415 302 131 63 -126 -62 -359 -104 50 -366 240 1 26 -149 -395 17 74 -141 -207 -288 187 -283 97 149
2437 149 38 -118 -208 -148 -128 -85 60 341 -168 -224 -360 140 95 133 31 99 193 -32 169 19 40 167 -98
2460i8L40p1p0j14j27P8k80O05k84K76k86k60R3oN30l10O8J91k18J42l23K77J47
2483C00k07j81j35P0J56J71r9J2J22n08P0J93J38j0J07j07k67M43k55N3l8k64
2505b36O7j3J56J36l96J50l6O6L72j80k9R3P4n0j01k06K92k69R6K33Om04L56m12
2529b35J91J45l71J27J18J56l4J3m43L37J48k70RK52k6n7j5K19l55k65M14R5k04
2552e1J9P0k86N37o39K44J46j02k18M87m72J29K28N1k4j1j84J12O2j88j94L49
2574F5n1J8j75jJ26k38M02n56N00j76N0K5om5n2J63O5m3j3q4N1K3O0n0O2k55M78
2601C43j81j46j16L33j39j98R7l4J9j00J05J29J10j04j22J13p2J41m1J29l43K35
2623A58j82L6l8K00n13J33M94k21p0j06J6o5J8q9L3P6K23k07K11K3n7N1k25j54
$$ plain form
2460 -98 242 171 101 -13 -140 -62 -342 263 -21 255 -31 -291 -198 -204 326 16 84 275 57 199 -124 153 300
2483 300 93 -88 -223 -153 3 174 75 87 209 -299 -229 -36 102 92 199 92 -175 268 13 66 28 -236
2505 -236 -169 -182 -26 110 -286 -136 -172 -106 266 86 57 150 224 174 73 -133 159 -110 -14 219 225 -179 177 -235
2529 -235 -44 101 -270 -143 -25 131 97 110 -333 4 152 -118 -109 143 117 60 45 264 -91 -356 58 153 -51
2552 -51 -32 38 -248 289 -350 -106 40 -62 -280 207 -265 -136 92 143 119 108 -76 36 98 -90 -284 65
2574 65 14 32 -143 -144 -18 -256 146 -410 90 -86 -36 -11 -17 -62 -114 49 114 71 58 -26 25 48 108 58 120 -135 343
2601 343 162 16 -100 233 94 -104 -7 -41 -22 -122 -17 112 222 118 -4 109 37 178 137 266 -77 158
2623 158 -24 12 -26 174 -339 -206 288 67 -3 -109 -93 -158 -140 -229 -196 -120 103 -104 107 130 73 124 -101 -255
2647b55L43k38J45j12L40k53j49K78l12J67J27m9J78j27O4k57Q7q6q6K56p0K38
2669B29m12L92k74j41K70k10L8R1j46j2J14K07k28P8Q2j94j2K37L9m5k44k53N04
2692A10l82K03J97k14lJ9N0k68O70k34k4k57N8N0J03J04j54J19l06L25j88K21
2714A99j22JoL53p73L71J48j78K1nK2J1k8J87j37j47K13j89K48j99j1j18J83j42
2738i8J64k03K05k00P1k14L77J81l33J20N6m3k23L13m28L12j47K28k89k3K20K1
2760F7o0L11k80l7N5J8k81L2q4L09k15J64k47K02J69j67K35M6n45L20Q2Qnj13
2784a6q9J95q2J15l56L39r1L6r1PK87k78L3K55r6J26m27O4L56l03J44l46K26R9
2808A07n3J60k70K29k27K0P8k57K60J15k58L95j57j02K37j63o7J49j08k77M07
$$ plain form
2647 -255 88 -150 -5 -117 223 -30 -179 99 -213 -46 81 32 210 83 147 -110 -23 -109 -195 61 -9 229
2669 229 -183 209 -65 -206 64 -146 -108 -17 -163 -175 -61 146 -82 -4 78 -116 -128 109 148 103 -141 -394 110
2692 110 -272 -69 128 -86 -89 -70 -20 -288 382 148 124 -133 -75 -25 78 182 28 147 -159 166 -22 199
2714 199 77 78 72 425 -348 23 171 -7 14 9 31 42 14 201 64 -83 130 -59 189 -10 -21 -139 44 -98
2738 -98 66 -137 68 -132 -61 -275 102 283 -50 70 126 83 -140 173 -255 57 -90 138 -151 -174 46 67
2760 67 7 318 38 1 56 74 -207 -175 -259 50 -165 -1 -248 -46 123 -44 191 237 -308 12 94 102 97 -16
2784 -16 -105 90 8 123 -233 106 15 51 -40 -33 254 -24 9 264 168 294 -133 -69 287 -16 128 -218 8 107
2808 107 54 214 -56 173 -54 -34 44 -213 47 162 -96 299 142 40 277 114 47 196 88 -189 218
2829B18j60J49j12j66m8L28n50L92%l8J06L5Rj45L6l7m6J12k47J78K69n4k80r4
2853a45j45K61J10rLl32J37k30M66k89j14J56J26K9P9l70L18k1k62J35L42j82
2875F3q5n5J9L10Kl27k48K44k41N45k01l31J08J87l11J89p9J63p5r6J83J56O7
2898A87k15N8J73j78k00J14J04j63L71j43P1Rj78pOJ9j7m13K14K39LL5k26N4N34
2923D51l06j11k13J81j04K99j52J77k37j47j0J7J14M1J07j67J94p0j17J82k83
2944a54J55P5jJ03j49q7J40l83K83Pl5M74o9k76p1J36K42k1m15m0p4O6R4n6L36
2969B80l66J9K33p3lk1j35l41M81l43L99m29M72l48k24L31k81O86l32o7K01m6
2991I3k51ON3Q4k08L89m8l24n4K87K70m82J86L2J45k27Ll61L95q8j1J57J79o31
$$ plain form
2829 218 58 207 95 -71 -119 209 -341 51 51 13 119 154 163 18 54 17 -29 83 -164 14 283 229 -51 -145
2853 -145 -290 -29 81 72 75 -257 -120 -350 116 -173 -287 -131 -5 24 103 -267 51 30 -232 -97 245 63
2875 63 -22 -77 -58 252 254 -73 -321 -77 -318 227 26 -305 -197 -10 -321 -132 -211 -48 -123 -219 -36 120 187
2898 187 -28 30 203 25 -175 -61 43 -120 251 108 179 188 10 3 9 28 11 -402 -188 51 54 89 -137 -83 451
2923 451 145 34 -179 2 -102 197 45 222 -15 -162 -172 -155 -41 0 107 -60 134 64 -53 129 -154
2944 -154 1 76 75 178 29 -58 82 -301 -18 -11 -46 428 359 83 12 148 390 369 -46 -86 -160 -94 0 -56 280
2969 280 -86 -67 166 93 90 69 -66 -407 74 -269 130 -299 173 -175 -399 -68 -349 337 5 -62 139 93
2991 93 -158 -152 -99 -15 -223 166 118 -206 -260 27 297 -185 1 33 178 -49 -46 -407 -12 -100 -111 46 225 -406
3015d06O04k55L2J65l36K52J84k03J87m34L27r5o6p5j10K70r3L6j70L19j71k10
3037b48M23k8k24L55l63Q7r9j7J50J94k96J4q3kP0P5J38J4L00m01l82L61j91K65
3061A12m5J35l32J09j81k17O58m87M7K14r1QL41m16O8r1J91P7k11j36K92k17K87
3084A15l18J23J44L46l24N3j55J64l41K65j05K13j84k48J40K3K13m37M37M8n1
3105A21Mj81N5Pj5O7j05K08j77J08o0K87n62L1J6L08j01J21J3l09J74k06J02K5
3129f9O7L72k04j62K64l13J90j39N6k40L69p5j74j60L03J84k65k18J57L7J99k92
3151a13N0J66n6m24Q5L85j56k2J52J3o4M0j74m7q9N51m43j82M50j63q1J56r2P0
3175A2n2L09j41j31j28K25j08l5k60K24j24l7N08k86q3K3j13K31J06l0J53k72
$$ plain form
3015 -406 198 -57 -25 140 -196 56 240 37 224 -210 117 22 -44 -119 -229 41 -52 -16 -186 133 -38 -248
3037 -248 175 147 -77 278 -85 2 -97 -114 36 230 -66 -52 -135 -137 -67 8 146 160 460 59 -323 38 -153 112
3061 112 67 202 -130 -21 -202 -419 239 -248 -201 13 -78 -70 271 -145 -77 -168 23 100 -111 -247 45 -172 115
3084 115 -203 -80 64 410 86 139 -16 148 -193 72 -33 180 -4 -252 -112 -89 124 -313 124 172 121
3105 121 125 -56 -1 6 -9 58 -47 161 -16 92 32 319 -243 -212 -196 112 11 132 145 -164 10 -196 -94 -69
3129 -69 -2 370 166 4 268 -45 145 6 62 -178 191 116 -58 -218 85 269 4 -214 -57 -20 179 -113
3151 -113 -63 103 47 -377 -292 93 -63 -85 67 80 16 56 -118 -165 -254 297 -146 -328 122 -41 -122 34 -58 12
3175 12 -40 269 128 -3 -131 94 -14 -49 -309 -85 -209 -246 262 -24 -107 -84 -197 34 140 110 263 -9
3197iN0M4j21M74k77m10K06K57l14M49m03R1K25J49k29j24m4M1K61j17l99M99
3219B99k77L7J22k04L31l67N32m57q2j24K76j59J97k00K17r9K2k82R6l8j75L23
3241a2j34Q4J05k03J69j0l5P8O4k15r5M86m37p0L57j28K41j49J45k51j13M6M9
3264b8R6j6J37j59R4n12K82L22m32K67k94L42r4k25K91J2m34M04J30m04j6NJ65
3287f7K70q0m51J20L00J00k03J21rm42L81K00l16j15Q0O3K81j15l40N07k71r7
3309h3M9r9K05J13J66l81K74k65K30j67J1o0J3N4l06M50k96J41j39j33K60N9k90
3332a94K06J25K32n42n2M15k89l1J4O1k73K56L94l10j03J43m25P11o46K09J78
3353G9J27l07J66M2K28k64k13K53k36K28k25J70M5m04K22K70Km26K28k9J83l2
$$ plain form
3197 -9 41 85 -36 438 161 -249 -43 214 -100 349 -54 37 262 411 182 58 14 55 316 199 -200 299
3219 299 22 59 181 -23 308 -59 473 16 -66 -190 86 -73 124 -76 141 42 64 -218 -122 -160 -335 -12
3241 -12 -146 -62 43 -160 9 -1 -36 42 106 -109 -204 282 -155 -225 132 4 245 96 241 -10 -123 -77 -28
3264 -28 68 52 189 30 124 -388 -106 216 -216 51 -243 99 5 -220 71 83 -351 53 183 -221 -237 -232 -67
3287 -67 203 123 -328 -208 92 192 -11 110 101 -341 40 240 -76 -191 -111 -48 233 118 -222 285 14 -83
3309 -83 -34 -133 72 185 351 -30 244 -21 209 42 53 -7 6 60 -246 204 -92 49 -90 -223 37 96 -194
3332 -194 12 137 369 -173 -225 190 -99 -130 -116 -55 -328 -72 322 12 -91 52 -373 338 -308 -99 79
3353 79 206 -101 65 107 335 71 -142 111 -125 103 -122 48 93 -311 -89 181 183 -243 -15 -44 139 107
3375A07l02K98m64L71j03N6j3L16k07j73N1j7O9j52L44k12o1J69m54K24J54k8
3397b7N2p4J70j46j39K40j58K46k50n5J54j27J96k64N08m55L8K50j75r6P0L00
3419B58o86M08M4J14j00L54j10j55j25n3J38J36j70k60j5K47r5O1L61k03k16J32
3441F5l4o6O4n7k8K79k89L6r3j30L41j90J95L7r1kj63J32O3p9Q4J00j20J10K05
3466C69l61l4j93J38KpJ23k91J11J58R3k14k62L26j97L49j31J03M7q1K4j2j10
3489e0J54J34j08k76L20l32L58j89M4J7n3j08k00P4K54R9j13Q5l51K17j28J02
3511e0N8J91p3l46K3K87j38j73R2K91k52J65k16K32m25K01L38k12M9P4k72M8M6
3534f2jJ87r3K5m7j57K25j11j2J22l4Qk00j79L34M7j78L14j74k76N8M83j66Q7
$$ plain form
3375 107 -195 103 -361 10 -93 -37 -50 266 59 -114 -63 -80 -11 -163 181 -31 -92 77 -377 -153 1 -27
3397 -27 25 -49 121 -25 -164 76 -82 164 -86 -141 13 -114 82 -182 326 -129 -91 159 -16 -112 -42 258
3419 258 -428 -20 24 138 38 392 282 127 2 -51 87 223 53 -207 -222 25 -70 -9 352 149 -67 65
3441 65 31 -35 29 -28 -56 223 -66 -30 -123 -253 88 -102 93 130 39 37 -126 6 69 -10 74 174 54 164 369
3466 369 8 -26 -219 -81 -79 -86 37 -254 -143 15 108 -106 -368 -42 -239 110 -21 82 129 48 72 60 -50
3489 -50 104 238 130 -146 174 -158 200 11 55 72 19 -89 -289 -215 39 138 25 110 -241 -24 -152 -50
3511 -50 8 199 126 -220 -197 90 -48 -221 -129 162 -90 75 -141 91 -334 -133 205 -7 42 116 -156 -108 -62
3534 -62 -63 124 31 56 9 -148 77 -34 -46 76 42 50 -150 -329 5 52 -126 188 14 -262 -204 279 113 200
3558B00n00J98K94l04P6PK82l00l1K57m6J69l15p2M6L06m02L73J19l51J4l0%m0
3582e0K90o0j37J03J72n10J94k0j3n6j35K63mj73NK27j04j25J44J55j46j38J30
3605A2K42n83L60j65J46R1j21J47j55k5L08J05l88R0j2O0J71M7n20J05R5Q5l23
3628b28K73O2m4j63J66k65J67K69l9k06K34k82l8J97K6J07j84M9J55k88j22N0
3650a04j67K65q3n0Rq5L98P8k30j53P1K8J20J2j49Q4k8n6k7J21q1J59k76K90q0
3675F6j59n0K19k27j02K17J34J14l80M3L08j71J6k3Ml22L89k73QJ61p3rK24n1
3699F3j26o1Q7p3K16m24K29K49k57r1j07J80J56k24J81j42m0K23j85p5L54j44
3721a1J46J1n40P33k96N5P7j38j76M8J51m4j2r4k8J32l2J23k2l03L49j07j51J26
$$ plain form
3558 200 -300 -102 192 -112 -36 -29 253 -47 -78 179 133 302 -13 -85 -39 267 -135 238 357 6 20 -10 -10 -50
3582 -50 240 180 43 146 318 -192 2 -18 -31 -87 -222 41 37 -136 -131 96 -8 -133 11 166 20 -118 12
3605 12 254 -329 31 -134 12 103 -18 129 -26 -51 257 362 -26 64 52 112 283 330 -190 -85 10 95 -228
3628 -228 45 107 63 -100 66 -199 -32 237 198 -8 226 -56 -94 103 129 236 52 101 256 -32 -154 -104
3650 -104 -271 -6 -89 -139 -130 -215 183 261 31 -122 -51 -23 97 109 -40 44 16 -40 -67 54 -27 132 -144 146 66
3675 66 -93 -143 76 -151 -253 -36 98 212 -168 -125 183 12 28 5 9 -313 76 -197 -189 -28 -101 -110 114 63
3699 63 -63 -124 -37 -110 106 -318 -89 160 -97 -188 -295 -115 41 -183 -2 -144 -184 39 -146 -221 133 -11
3721 -11 135 146 -394 339 43 98 175 37 -139 -91 60 16 4 -90 -118 14 -18 105 83 -220 129 22 -129 -3
3745cj30j49N19j3l80J0L51o1j95k43M84j78k34K03o8K92M7n28K84l8k11J88j18
3768a71L61j93j96J95l89M43j32J70j78J86k50L90j53k5L57m06J81K23k80l35
3788b02J08P0J31n4n5j97K51j70K80k57J79j63r4K16m7K40m14K78j54K06l12K23
3810F3j8R1k45J9O0J56j58p5M90o55M88j56n0k7k4J19n16M90l3L3p2J22p9l8j9
3835c4K4M08k79j05j05o3N4rJ97J95j19j95j28R4J62r0r3N7p0p0J45n8n1k4l5
3860a92L97j40j15K23k38k2R2m4J77k0j4o8K1j72J30Po5K96k20k14K56p8J39j27
3884Ik38k57N54p1j19m7R7J01k56M20R9o32L97m21K19N82n82L20p5p0K01o4m1
3907A26N7K5j34K4j16R9L2k0k5k40k1K32l1J78m79Q5K87P3j21J53j83L15l09P3
$$ plain form
3745 -3 -133 -282 237 224 -156 -146 205 144 -51 -294 190 12 -222 -19 -87 205 252 -276 8 -30 -241 -53 -171
3768 -171 190 -3 -199 -4 -393 50 -82 88 -90 96 -154 236 83 58 415 9 190 413 133 -202
3788 -202 -94 -24 107 53 -2 -199 52 -118 162 -95 84 -79 -173 43 -4 236 -178 100 -54 152 -160 63
3810 63 45 136 -109 -90 -30 126 -32 -107 383 -272 216 60 10 -17 -41 78 -438 52 19 52 -20 102 23 -15 -34
3835 -34 -10 398 119 14 -91 -154 -100 -109 88 283 164 -31 -159 -65 97 7 -86 -29 -99 -169 -24 -82 -133 -157 -192
3860 -192 205 65 -50 173 -65 -87 5 -39 138 118 104 36 57 -115 15 22 -43 253 33 -181 75 -3 136 9
3884 9 -229 -486 68 -3 -122 -169 -72 29 -227 193 292 -340 57 -364 -145 437 -145 175 100 30 231 167 126
3907 126 183 208 74 98 -18 81 113 93 68 -172 -193 39 8 186 -293 -208 79 152 31 184 1 316 7 80
3931H0r8k3J71lj87N7j40J77l13L2K34K73l47K11j92J25J80l96L15j94j84L13
3953I1Rk3J57k03j20l09N44J46j53Mm5j25L86k74p9l51L34j87k7J51J50j21O1
3976A6o7m7M30m07m9Q5j13L45j01M30l27ok17k6p0J36j19j84M71j70k6q1j71M53
4000A85N8n65J52O0kj76M61o6r4q4j15J86l0j08O3Q7K03k74l5J81j09O0J39Pl39
4025a55K97n0m05J60K60K52l10m7n4j91J91J96m1j52j02K11j77K48O6k09J03j18
4047b7J81r6J09l1j3k71k1r5m2K53n1J13K20j81m40M46j25K43l69J97q2O4p3L31
4071B40m23L21k72J33K9j62L88O5j97k81j27M91l70N7K99k31k38KJ33J08l2j48
4093b15J22J45lj43l8K63O8L4n55J40J96L8J09k58R6J65j4j95J65J26l43L14l54
$$ plain form
3931 80 -18 -41 130 127 -60 -3 -143 34 -279 -247 -13 260 -87 124 -68 57 237 -159 156 -38 -222 91
3953 91 100 77 234 31 -89 -398 146 292 139 143 98 -27 359 85 6 -345 -11 -198 -225 -74 76 -45 16
3976 16 -51 -98 332 -75 -124 -39 -152 193 92 522 195 189 -28 -54 -124 12 -107 -291 180 10 -16 -97 -268 185
4000 185 243 -322 -170 -110 -112 -288 173 107 13 -71 -186 0 -30 -138 -75 12 215 -59 -94 87 -22 38 177 184 -155
4025 -155 142 92 -313 -153 107 359 49 2 -52 -243 -52 144 103 -49 -151 60 -117 131 197 -12 91 -27
4047 -27 154 58 167 136 123 -148 -169 -264 -306 -53 -104 9 229 48 -392 54 -71 172 -197 0 -82 -18 -91 240
4071 240 -183 138 -134 -1 28 -134 254 319 122 -159 -286 205 -165 -108 191 -40 -278 -276 -143 -35 -67 -215
4093 -215 -93 52 49 -94 -132 131 199 233 -322 -182 14 52 161 -97 -1 164 150 -45 120 246 -97 217 -137
4116a37M48K7k40J87M7l83N6J30k41J10Lj93L42K18l55L20n16M62j61j57J13Q9
4138A69l72K43Q5j18N3K07k09j1P2j25k77K46J9M8R8Pk37J55J29q3j14L13l31
4161c3j10K46j26k68K16L72l37J45k13L55l95L2O6p3K79j10O9N8k94J51L1J14
4183A75m41O21l18k32J73o1O7j43L49l48j51K53l32L12K70m90M08J9Q1j89o3J87
4205A47m9j80L6O4j79J66M2J16j91j55K45k43Q5N9J95l63K76j97K7K98l49K55
4227A05k6k96K43P2m07L19j17R6J24j65J02q6R6o2J71m5j85R3j3K18k90J50j33
4250c6M11n70J26R1p3N6JK89k05K10k48k85J86P9J5j0j60j0mK69r9l0j45J75k4
4275In8L76k56j42J07J96k36o4j18L89l39L95j07k03p4K29j15Q4R3k69K26o3K0
$$ plain form
4116 -137 311 338 98 285 332 -51 5 135 -106 4 7 -186 156 374 19 339 -177 285 124 -33 80 169
4138 169 -203 40 125 7 60 267 58 47 119 -6 -283 -37 -18 30 128 135 -102 53 182 99 -15 298 -33
4161 -33 -143 103 -23 -291 -75 297 -40 105 -108 247 -148 -116 -50 -123 156 46 115 173 -121 30 61 175
4183 175 -266 355 37 -195 -22 -83 -16 -159 190 -158 -309 -56 -388 -76 194 -296 112 131 212 23 -40 147
4205 147 98 -82 -46 18 -161 5 47 163 -28 -183 62 -181 -96 -37 158 -205 71 -126 -99 199 -150 105
4227 105 79 -217 26 98 -309 10 -107 -11 113 -52 50 -36 60 -2 169 124 -61 32 19 237 -53 97 -36
4250 -36 375 -195 -69 22 -51 5 6 295 90 300 52 -233 -47 32 47 37 -123 -133 -137 132 33 3 -142 33 9
4275 9 -49 327 71 -71 36 232 -4 -68 -186 203 -136 259 152 -51 -125 104 -11 73 166 -103 123 60 80
4298H0J74n70L07k94L65N2k74K08M1k58J09K40j62k03M16l98L81K4m23J61J88
4319A64j31J25n0j60o7O8k42J49L83n05N85l28J90pk14J03J83l6j76M4l48J37
4341a33K86k92K10j21P0k06M3K06k31Kj28L66L2j49L67j90P3l06j8p5L13k43J09
4364a5J40J09l20j0J14J10n75N90J6Qr6k29M2J59jj14o8J68j04j5L17k87K98l12
4388g5O0J13j36j97L67K2j95N7J56j24J19k09M2K00J0L6m1k24r3Q9J69r2K32M8
4412C34k29l79K6J10K37J15k87j23l9L48j5m7k13K36n9nJ6k31K83k61K71L7p8
4435D7l9J29j26l9j11K01Q3j53n2Kj53L10L6o0k17L60j49R7l34J60j9J12j57m18
4459d90M14K48Q4k47P1l5j63p9J81J37J79l70K53k56K29N2j12j09j72K38Q3k29
$$ plain form
4298 80 254 -316 -9 -303 62 114 -160 48 89 -169 -60 180 18 -185 231 -167 214 238 -185 -24 164
4319 164 33 158 108 -52 -119 -51 -293 -144 239 -266 319 -9 181 174 -40 63 246 210 34 78 -270 -133
4341 -133 153 -139 71 -50 20 -186 -143 63 -168 -166 -294 72 104 -45 322 132 205 -101 -119 -194 119 -124 -15
4364 -15 125 234 -86 -96 18 128 -447 143 159 167 71 -158 -116 43 42 -72 -140 28 -76 -91 226 -61 237 -75
4388 -75 -15 98 -38 -235 132 154 -41 16 172 48 167 -42 0 200 210 246 205 -19 -112 -23 146 54 286 334
4412 334 105 -274 -248 -138 99 214 -73 -196 -235 113 98 51 -162 74 15 10 26 -205 78 -183 88 125 47
4435 47 8 137 11 -28 -139 62 145 -8 -60 -58 -211 99 135 75 -142 218 69 166 -168 -8 -27 85 -72 -490
4459 -490 -76 172 256 9 80 45 -118 -197 -16 121 300 -70 183 -73 156 208 96 -13 -185 53 136 -93
4481i3j57M50p1l15J75J78L6p1J92m87J42k93K94J97l76J4J92n2J42n0j38J11
4503B0j50K62L8o2J13l11J45Q5j09R1k48j30M55k92k78O22r3k78R2n7k39J21K01
4526bJ10l3j03K49k38L5k44P3K6K27j32o8n5K7K01j99J67l49K64J95j98K1K30
4549B04j62L2k05K84k26J51r4J38M7k45J34K6J03j0Q6l23q6j26L21n9j11J54k10
4572a77J87M04n73J8K69J12k97p8L12k27j18J58m2l88K59L35j53M5k84L77k84
4593a45P5o0L16k83K60k39L8J81j30M5J06k40K51k41O6k52J68j02K95O7p4kL7
4616A37J85k27k16o6K85J64o20K43K14J16j60k56K76p5J62o0j70M4L6L5l01Q2
4638a72J40R8q0m0J04N8j02j90J72J21q4l01L16j18K42k45K99l11O5J1j00R8j05
$$ plain form
4481 -93 -250 200 129 -186 -11 167 203 132 324 -163 -21 -314 -20 177 -199 -185 7 -45 97 47 -91 20
4503 20 -130 132 170 108 221 -90 55 140 31 122 -126 -256 199 -93 -371 251 158 -120 -28 -85 -324 -203 -2
4526 -2 108 75 -28 221 -17 18 -226 -153 -127 100 -32 -100 -155 -128 73 -126 41 -308 -44 151 -47 -26 204
4549 204 42 74 -131 153 -73 78 -16 122 169 -76 58 84 187 177 263 -60 -146 -272 49 -10 -121 33 -177
4572 -177 10 414 -159 -141 128 240 -57 -135 177 -50 -168 -10 -52 -440 -181 154 1 46 -238 139 -145
4593 -145 -70 -130 186 -97 163 -76 -38 143 13 58 164 -76 175 -66 0 -252 -84 -186 109 176 102 100 137
4616 137 322 95 -121 -187 98 262 -358 -115 99 215 55 -201 75 0 162 102 -68 -24 12 47 -254 -172
4638 -172 -32 66 -14 -54 50 108 6 -184 -12 109 25 -276 40 -78 164 -81 218 -93 -28 -17 -117 -19 -124
4661a24l9L39j17r3J62j76L9M30o69K35K02m01N21n22L47j36j54j95J20M4J03
4682h4N0J50j70K6n4k61L50l88L34L12k82nn1O1L1j13p8P1o6L80lk34m4R0M9%
4708G1j92J08k04J47K9N1p5J79j50L29m18J80k20K5P0K03o5J9J38l65m4J77r2
4731i9K10J98q9j43j36r8J1L78j09L8l0k02J62k72L89j30k26K82j4k91q0M64l26
4754a13N8K2J31j8J61n6k10q4M3L32k21j44k28N49l77J23j06M1J5M53n93L68k7
4777A19o4R5j81J12J23j15j16M13m22K37j72m5O5q2j5o4K49j80Mk6j96M7Q9J36
4801A1k09K42k88L3O9J60l8k22N73k23j33J01m3m0J06j44j21Q5J36N6l5J7l0o2
4825AP8j07M45p00K14m9L42k96K17k85Q7J07J29m05K41J37j96q2K87m2m0k09K3
$$ plain form
4661 -124 -163 176 59 -34 128 -48 -9 421 -248 -13 189 -212 309 -213 134 -2 -156 -351 -231 -187 -84
4682 -84 -34 116 -54 -28 -82 -343 7 -381 -47 265 -17 -22 -73 -12 19 -94 -172 -101 -167 213 210 -24 -68 22 71 71
4708 71 -121 -13 -217 -70 -41 10 -65 114 -36 293 -125 55 -165 -140 -70 133 68 87 225 -140 -184 -7 -99
4731 -99 111 309 220 77 -59 -157 -146 232 123 161 131 -71 91 -181 208 78 -148 134 120 -171 -251 213 -113
4754 -113 -55 -33 98 80 241 185 -25 -109 -66 266 45 -99 -327 222 -155 -32 -138 -97 -82 371 -222 146 119
4777 119 55 150 -31 81 204 89 -27 386 -36 201 29 -16 49 -33 -48 -112 137 -43 -39 -65 -261 -214 -125 11
4801 11 -198 44 -244 -211 -142 18 -20 -242 331 108 -25 76 33 -7 99 -45 -166 -81 55 111 76 93 63 1
4825 1 79 -28 417 -283 -69 -118 224 -72 145 -140 -53 54 183 -222 19 156 -40 -122 165 123 83 -126 -103
4848a03J09Q9p7j38K12N2j21J54k15J17J9k8j12p1m1nk2K94K47j76k05l6l4NJ04
4873A8m02O62j35j43j36L34o8k98K01M01o8l71l6J78j01O7j0l12K1j3Q7k29M12
4896E9j14k46N01k17j22O34l58l07L54j53mj32N4N9j92L05k66J60m9Q7Lk01K9
4919a16K01Q3l26M3RK89j61p4K75n59N13k8j98K3J38j93K35J00k73J59j34l31
4941c25J37J47L5J27M4J3k22K04j24Pl03O8K40N6j41m9j04K83l22L40o3n2j43
4964a47p2M06k6j11J49k99J08j72J68k06L2J82q0J57Q1j87j15K8L45j57K76m7
4986C13l63P7j42O4K77l67J29J40Nj85J05L9J6L1l46rK47K7m6k55P6K67k1Rl0
5011E8n3J11j59k80K41J4J25m6M6k72J06J17j34m3JJ97K7j90K04Q6q7o8j06K02
$$ plain form
4848 -103 6 95 18 -120 92 144 23 177 -38 79 98 70 -42 -113 -154 -159 -181 113 360 184 -21 -57 -91 -86 18
4873 18 -384 278 143 0 -136 198 130 -168 33 434 366 -5 -41 137 36 103 93 -219 -198 -211 -124 -353 59
4896 59 -55 -301 200 -17 -139 495 137 -170 184 31 27 -105 -51 8 -184 121 -145 15 -34 53 56 -145 -116
4919 -116 85 168 -158 -115 -106 183 22 -52 223 -336 177 149 -49 -26 112 -81 154 254 -19 140 6 -325
4941 -325 -188 -41 -6 121 165 178 -44 160 36 43 -260 -192 48 104 -37 -86 -190 93 -229 111 48 -4 -147
4964 -147 -219 187 161 50 199 -100 8 -164 4 -202 -170 12 -68 89 170 -17 -132 -104 241 84 360 313
4986 313 -50 27 -115 -51 226 -141 -12 128 133 -52 53 92 108 139 -207 -216 31 58 12 -243 -167 100 79 88 58
5011 58 5 116 -43 -323 -82 -68 57 11 57 -215 -109 8 -126 -169 -168 29 56 -134 70 156 69 1 -105 97
5035I7p2l9M2Q7j94MJ51j8j4j36n3J51J80j4r7r8n8J71k32j6j33K20K06k00q8
5060a53K27J56q9l67K62j22K90l03K42j48j50L96m38R5L46j43j2J06j82j57n7
5081b01L54k34J74O1j57L66l45J3R3k98M71k29j28k85L08j41J50q1j13J07m1J0
5103a46K51j28K17J14k91q3r8KL89j77n3K2RM3k02J13j05O2q3L22j08J1l9np6
5128c9J92k98j31M11l57r4M16%n1J55m24L13k82L53O8m8j23p7k27K09N7J79k83
5151h1K57k62lJ82j73J93r4K54k75M41l91J5o0mO6L81j60j05k96r4L10o0j03j20
5175a82J51N6M1K05P8m8k58r0J9K96K9m50NJ24mO6j07K14j58J72m96M91q5k13
5199a44R2K04q9K3o7p6j8K36l72K79o6PL4k05J85k7P5j63K07l1j06K84l45j89
$$ plain form
5035 97 25 -14 28 115 -79 -75 76 58 44 -92 -145 6 186 172 75 -23 -81 90 -142 -158 -291 -71 135 -65 -153
5060 -153 74 230 141 -226 36 -86 204 -99 143 -5 -155 241 -197 -102 244 101 89 195 13 -144 -201
5081 -201 153 -81 93 154 -3 363 18 31 124 -174 297 68 -60 -345 -37 -178 -28 -109 -222 -115 -156 -146
5103 -146 105 -23 194 308 17 -66 -164 -162 227 50 -3 19 28 71 -131 -18 -123 -61 -144 178 70 81 42 37 -39
5128 -39 153 -145 -276 135 -222 -316 100 100 49 204 -220 93 -189 164 232 184 61 -16 -243 -34 23 202 -81
5151 -81 176 -86 -89 93 -80 113 19 273 -2 439 48 63 3 -1 65 446 286 181 -115 -209 101 41 -62 -182
5175 -182 -31 25 66 271 349 301 43 -47 -28 268 297 -153 -148 -24 -28 38 -69 145 -13 159 -337 154 69 -144
5199 -144 -52 152 63 86 19 -57 -75 161 -211 68 2 9 43 -162 23 -4 71 -92 115 84 -22 262 -83 -272
5223b72K20m2R5k6M4k9L63l80J81j43j18K35j22m4M5N6l31K56l3K07l01q6K78
5246E3j3m6kL24j60k47K07j32O4n9k24K51L34l55L4O3J44j92P5j43K11j54l07
5269b74J64j54N2N47l27O2K01l37J45j96J79k37L20n32O28k42L9J65K08o94K74
5290ik26L38J93k00j51q3M12m41Q1K47l7k19k75L53Kl58L90j5j02P2K40o6R2j55
5314H3k24K53mp5J07k64K41K8k65M43l7l19k92M85q5O0j72RJ58j46j14J10N1J43
5338A74j78P3k0j56j1m0K21o15J27L73k3J59j07K9J50q1n7o3l08K95L70l22K3
5361A3R8j97Q8J56J6n5o8m70M09K57j98k24K63l75L09o5j68L30P7l26M2r2k02
5384c82J63m9N0L24MNk36J6J88k4Q2l25n5N38n42j03L69L10l24k18L11R5l88O1
$$ plain form
5223 -272 -52 -94 1 -25 19 -10 353 -27 154 11 -107 128 6 -38 7 63 -268 -12 -45 162 -139 -225 53
5246 53 40 -6 -8 316 156 -91 116 -16 48 -11 -235 16 350 -5 29 92 236 44 119 -24 187 33 -274
5269 -274 -110 -264 -212 335 8 70 271 -66 79 -117 62 -175 145 -387 241 -1 38 203 411 -283 -9
5290 -9 -235 103 296 96 -55 -138 274 -167 -86 161 124 -95 -370 -17 -15 -373 17 2 -100 -28 212 146 238 83
5314 83 -141 112 108 33 140 -124 117 145 -120 323 286 -33 -325 160 75 135 -37 -28 130 -16 -130 -20 31 174
5338 174 -4 69 49 -107 -118 -158 63 -552 -425 -52 -75 84 -23 6 156 75 18 -45 -353 -58 312 -10 13
5361 13 111 -86 2 158 174 119 51 -419 -10 247 49 -175 88 -287 22 -43 -211 119 196 -130 -88 -180 -382
5384 -382 -219 -268 -218 106 110 115 -121 -105 83 59 141 -184 -239 299 -243 -346 23 333 9 -209 102 197 -191 -130
5408a30m6L33P4j42mr4J18k40L0m1O6K76J1n52M99P8n3m2j8j09p1K50k96O9k87
5433c21K54L62o13L98J0l68N07l42j67J48L07l60R2P4m9P4J26r8k41L43p1K9N9
5456A53l32K55k5L36l34J29k78K47l09J69q1Q6l1J74k40j8K37l25R1J09o0k02
5478b49N49n20L74K2j43K5j31N2J15q4J2j58j4J28J21j24L25l82j44L76j22L1
5500E9j62J00j27j20L62m86J75J79R0N1r6k13L01k71J65J38m5p7J81j80j4m1K57
5523B26k98K07j35j2M3J64P9k35J06k16j01j90N64J71m93M5J9J92j44K44j63k21
5545a48oJ50k9j01Q5K99j16q2M5l8qk59M15r2K13m61K38J27l96J02K10j45%L2
5569C5K01L8m13J98m16J40J46J91k60J97n7K27j01j18K47j55j32q1L51j26j2r8
$$ plain form
5408 -130 -176 157 231 89 85 -9 109 -131 -101 -142 -76 200 211 -341 158 236 183 141 123 14 -57 193 -103 -34 -321
5433 -321 -67 295 -318 80 90 -278 229 -113 -280 -132 175 -185 -93 -19 -68 6 132 34 -207 136 65 94 153
5456 153 -179 76 51 387 53 182 -96 151 -158 11 -70 16 -15 159 -81 -99 138 -187 -96 13 -47 -249
5478 -249 300 -220 154 176 33 58 -73 -21 94 10 22 -136 -150 -22 99 -25 300 -82 -226 150 28 59
5500 59 -103 -3 -130 -250 112 -374 -199 -20 70 121 25 -188 113 -158 7 145 100 23 204 24 10 -31 226
5523 226 -72 135 0 -12 31 195 274 39 145 -71 -172 -362 202 373 -120 -75 -56 136 -8 236 73 -148
5545 -148 -154 -4 -33 -134 -49 250 134 52 97 59 51 -208 207 115 328 -133 105 232 -164 -62 148 3 3 35
5569 35 236 274 -139 59 -357 -217 -71 120 -140 57 0 227 126 8 255 100 -32 -113 238 112 100 2
5591BJ06p4J12p4Ok79J70L16l41LM17j46k31j66Q9K98m20K22R7l03J63L3n4K15
5615A61k58J24j37K13j96L74j93Q3j21r2P8M5k42K0J57m5J31k8j27j43J68K42
5637B14m21M6%J98M6n8J58l19J60m2j62K32j52j0K34m2Q3rj29L2j46J84j07L4
5661B4P6l37O2L0K57J6k67r4L23N8j3j65o5J1o4K58J35m80L75l39m1M36l50O2
5685i2mj01K51j97K57j08o5J95j93k31K42m9j47K02j6J03O6j9J2J81o25L82K19
5708B63j96J66j96m3J52K3k09nK49r6J21o5m8Q2k74K32l98L04n0jN6r7p7k16J19
5733b04K13k6K74p6j50q2J93k57j86K36J49O8k38J55k93L47J39l19J93k35j1K9
5755h1J93K1j4m17M28j26j19M87k75j5j23J48l18N14k77j36o8K36j10J70j57l
$$ plain form
5591 2 108 34 146 72 78 -201 -31 285 -56 -53 364 218 -13 -179 -90 208 -212 10 107 -196 -33 0 -54 161
5615 161 -97 27 -110 103 -93 281 88 171 50 -42 36 81 -161 -141 16 -29 102 74 -53 -196 -28 214
5637 214 -207 -161 -161 37 83 25 183 -136 24 -18 -180 52 -100 -110 124 82 165 156 27 59 -87 97 -10 24
5661 24 100 -237 -175 -145 112 128 -139 -233 90 148 135 -30 -95 -84 -148 110 245 -235 140 -199 -240 196 -154 -92
5685 -92 -96 -197 54 -143 114 6 -59 136 -57 -288 -46 -95 -242 -40 -56 47 113 94 106 287 -338 44 263
5708 263 67 233 37 -6 146 169 -40 -45 204 108 229 164 116 198 -76 156 -242 62 12 11 67 -30 -107 -323 -204
5733 -204 9 -17 257 181 31 -51 142 -115 -301 -65 84 152 -86 69 -224 123 262 -57 136 -99 -110 -81
5755 -81 112 133 119 -298 130 4 -115 372 97 82 -41 107 -211 303 26 -110 -178 58 -52 118 -39 -42
5777d2K77j63j38M0k49K53J89l49J47j64M23J2m49J90J68j59j48J05k63M34j91
5798g7K98j77l59J98Q4k48M75k69n1L03k16q4K88j72l13O80l41J2j51K24j80j0
5820h6J71j6k83K48J96k83m5r3R4k24N23j3l08K6l7J71j58j55L5M86k84J79m01
5843b57J15l0J53l00M21J24m55K17N2j01J08J91k17P6m0K4l35Q7L00j00J85J4
5865B32k12q6j06j97K82O5k52L93k6m4k85K78J41k37N0r3k15M04j78n1K29j44
5887e2K00l90L15j49Q6j1k11o6K91o8J07J27k38J77l69K36J05J36k22k10L00k
5909I2l17L06r9J44m38K99J21j12L25m29j14N7J58Q1o1K42k67n9P7j12N6K82m7
5932A85k40J08j45J95m57K42J17J3M7Q4j74K28J06r1k94O0j52J03J53j19J49n2
$$ plain form
5777 -42 235 72 -66 -26 -275 -22 167 -182 -35 -199 224 236 -213 -23 145 -14 -162 -57 -320 114 -77
5798 -77 221 44 -315 -117 -33 -281 194 -75 -126 177 -39 -123 165 -7 -320 360 19 31 -120 104 -76 -86
5820 -86 85 69 -214 34 230 -53 -98 -191 -97 -321 202 189 -119 -93 -130 41 -117 -272 -237 249 -35 144 -257
5843 -257 -142 -172 -19 -319 102 226 -229 -12 40 -61 47 238 21 97 57 81 -254 -167 133 33 218 232
5865 232 20 -66 -172 -369 -87 -22 -274 119 93 49 -236 42 183 -54 -4 -97 -312 92 -86 -137 92 -52
5887 -52 148 -242 73 -76 10 -1 -212 -278 13 -55 52 179 -59 118 -251 -15 90 226 4 -206 94 92
5909 92 -225 81 -18 126 -312 -13 108 -4 321 -108 -222 -165 -7 74 13 255 -12 -71 6 -106 -50 232 185
5932 185 -55 53 -92 103 -354 -112 5 18 65 149 -25 203 309 218 -76 -16 -168 -65 88 -31 118 66
5954F6p7Ml5Q8j6J80mL7p8k82p0K89j70L10k81J44J04n7m03K55P4j62k52K45p5
5979a66K84k13K56k95J66m27K91j49N18n20M66m17Q0K7l8K02n7J13k10R4l12M11
6001A04j06j35j82M00K99j91k96P4p5J75k21p9L02j16k8n5M3J26j40j39R7n1K27
6024C3K61r3j56j91J25J40k49L09m05L54j63L2k20J66J58j51Q8K41n9j88j16J97
6046A13j70J32K9k57K89J12l53K90j91K84n01J45J03k05L02p7k00K88k25K79l64
6067a77K73QJ32n6k45L05m17M24jl85K6K05M3q8l47J85O6J92j78j6J28k22N1l1
6091a25M45l21J20J5l49J50j42P8J4m9o3K49j48J36j39O4j48N6PN8j97J23J97
6114C1l04Q8L08l84K54K50l28Q4n9Q4m7R5RJ90l27J1o3L21l00L6J75j18j61J60
$$ plain form
5954 66 -11 -7 -42 46 30 210 206 243 165 -117 -187 102 -68 242 -39 105 209 152 -251 4 78 -84 -336 -91 -166
5979 -166 118 -95 161 -134 32 -395 -104 -253 265 -255 211 -206 -126 -99 -137 65 8 121 -89 5 -307 104
6001 104 -2 -137 -319 81 380 189 -107 -33 -108 67 -154 -233 69 -47 -75 -130 -87 39 -101 -240 -143 -194 33
6024 33 294 201 45 -146 -21 119 -130 179 -226 128 -35 -3 -223 -57 101 -50 38 279 220 32 -84 113
6046 113 -57 75 104 -153 136 248 -105 185 -6 278 -223 -78 25 -180 122 45 -155 133 -92 187 -177
6067 -177 96 104 236 180 -65 240 -177 247 246 -139 -113 92 135 47 -300 -115 -49 143 -35 -51 77 -145 -94 -125
6091 -125 320 -1 119 134 -215 -65 -207 -129 -115 -164 -227 22 -126 10 -129 -65 -213 -157 -150 -92 -289 -166 31
6114 31 -273 -185 123 -261 -7 243 -85 -1 -60 24 -23 72 81 271 -56 -45 -108 213 -87 -51 124 6 -155 5
6138E%j39r4N91m30n2J57J32k15m9L10q4K5n17M12N9l5j19k9J43k45l9M69k89
6162c3n3j38M35j49J5m49L66o7J16J9r3n1k91O87m73P2K83J10k98J51k79J36J01
6185A17K51k29r7L7k69j00p1O31l47l7K08k76K44M9J36l46K62m77J16M8J68J45
6207A63r8r0O1oj75J33j27L07k13j06J47k7K7j62J98L2k21K20k88J33M89m63L30
6230B64k59l4N7j16J91k44K87Q3n02L58n1j60M2K51k94K01j63K1j16L82l33K30
6252I5j06l71L90j9K5P6k57L71M1n36M38j32O2J42k99j8j52L3lJ85J4K17PKl36
6277a31K60j61m5O3J14j95J14J93o8l00R7o5j9J28J73k5l19K62l21J94J35k64
6299a80J30N02m77L47j77j45j00L62n22K58J84j74J30k06P7J92l07J00K40N5k14
$$ plain form
6138 5 5 -134 -228 363 -67 -119 38 170 -45 -94 216 132 157 -360 52 111 76 -43 -72 71 -174 -213 256 -33
6162 -33 -86 -224 211 62 77 -372 -6 -73 43 62 -31 -82 -373 314 -159 -87 196 306 8 159 -120 16 117
6185 117 368 139 42 79 -190 -290 -361 270 -77 -114 94 -182 62 111 247 -99 163 -314 -198 -150 18 163
6207 163 65 -25 36 30 -145 -12 -139 168 -45 -151 -4 -31 -4 -166 32 64 -157 63 -225 -92 397 -66 264
6230 264 5 -29 28 -88 103 -141 146 229 -273 85 34 -126 -84 167 -127 74 -89 -68 -184 198 -135 95
6252 95 -11 -382 8 -11 14 90 -167 204 245 -291 147 15 77 219 -80 -98 -250 -217 -220 -35 -21 196 203 205 -131
6277 -131 129 -32 -77 -14 100 -95 19 212 144 -156 -59 -124 -143 -15 158 133 -186 76 -245 -51 84 -180
6299 -180 -50 452 -25 322 145 0 -100 262 -260 -2 182 8 138 -68 9 201 -106 -6 234 289 75
6320G5k89K28K3r2m2L12J27n73J28J73R9k26J57k1j6j03k22R3J39O5J76j47l52
6343b88K06K92k40j30J98O3P3O6j88J02j57l5L1n4J98j3n02M12p1K7k59L51k63
6366a81jJ84n7k49K83l6J0N2Q0l16J87J83L43m87R4m35K8J52K2oL11j75K21J7
6390B24k33M4L62l11K2J41m44M95n15K50M9j43J08k38K66j17q4n9n6L67o9o4N9
6413E4K02j02j57P3J10k19o2j73L94k5r8j19J32q1j56J49m3l0q7L64n1j18J90
6436A47j98N9m2M1n1K23L6l41m8J05kJ95j06Q3j33J37K40k28J29o54K35K18l7
6459HM75o07j43L96j45q7lJ36J03j16j47J79J78o0m53N12l78M12l00K6m1k43N22
6482B24k94J9m9K20L4j25K10l1k37J51j35K36n72M13k28K63k38m9K45k25J48l06
$$ plain form
6320 75 -214 14 37 -55 -97 215 342 -231 -103 70 169 -57 100 79 63 -40 -262 -169 -30 35 211 64 -288
6343 -288 -82 210 -30 -160 38 101 174 240 52 154 -3 -38 -7 -61 137 124 -378 34 -37 -10 -269 82 -181
6366 -181 -182 2 -55 -304 -21 -57 -47 5 85 -231 -44 139 482 -5 89 -346 -318 -166 -144 -150 161 -14 207 224
6390 224 -9 35 397 86 108 249 -195 300 -215 35 84 -59 49 -189 77 -40 -124 -183 -239 128 59 -5 54
6413 54 256 154 -3 70 180 -39 -101 -274 120 95 -3 -122 10 -71 -227 -78 -121 -151 -238 126 75 -43 147
6436 147 -51 8 -34 7 -44 179 215 -126 -174 -69 -71 124 18 101 -32 105 345 117 246 -408 -173 45 8
6459 8 483 -124 -267 129 -16 -103 -106 30 133 17 -130 49 227 167 -286 226 -152 260 -40 -14 -55 -298 224
6482 224 -70 -51 -100 120 154 29 239 208 -29 122 -13 223 -349 64 -164 99 -139 -188 57 -168 -20 -326
6504c26K13J57j84K98k17P6m16K58L20Qn05L85n0j23R3kj4K54k86L20k97r0j01
6527b29K91j6M3L5l57L88k14J61p8K37n41J38K32J84l92L59o38K81K1J30j31K31
6549A35J9m49L85L%j59j20K69J0m9K53l39o9L15m29L00k75K54Q4K37k64l60Q8
6572a61J49j85J80J0k8k14P9L02q9r8M1Q8n2l0%K01l6k06lJ52j95J08j21L20l23
6597a11k04J0J11K39P4L5k18L12k40o5J47kJ13l98L1K8J06M13m73L85m12N9L93
6620C33l24l42J84M2q0j06J26M9O2J59n54N18K71n48K42Q9l13O3J05J11l75K41
6642d7J28r4K29k37J73k45L09l78J48j00J39Pl37K69L53n34J01j00J56J31L0M5
6664A46j32M6l1J50l77K31k05J14j36K18n7k10L34r8m40K57p1k6M07N1m01L51
$$ plain form
6504 -326 -113 44 -140 158 -59 17 -399 -141 179 187 -318 67 17 -106 -13 -15 -29 225 -61 259 -38 -128 -229
6527 -229 62 46 89 124 -233 155 -59 102 24 261 -280 -142 90 274 -118 241 -397 -116 -95 35 -96 135
6549 135 154 -295 90 93 93 -66 -186 83 93 44 297 -42 -111 204 -225 75 -200 54 138 375 111 -249 -161
6572 -161 -12 -197 -17 -7 -35 -249 -170 132 43 -55 -14 74 22 -8 -8 193 157 -49 -52 100 -95 13 -108 212 -111
6597 -111 -315 -305 -194 45 119 154 -64 248 8 -57 90 88 201 -197 -166 -138 -32 381 -92 293 -119 -60 333
6620 333 9 -333 -149 -107 -187 -293 -167 -118 -56 103 -451 67 338 -210 32 121 -192 -129 -24 87 -288 -47
6642 -47 81 -13 216 -21 152 -93 216 -162 -14 -114 25 32 -305 -36 317 -217 -116 -216 -60 71 101 146
6664 146 14 60 29 179 -198 33 -172 -58 -194 24 -33 -243 91 -7 -447 -190 -261 -287 120 171 -230 121
6686A21M4j96l10M03p0L4j87J1p6K23J41k04J51l41J65J79j57o4J62N3M1J1l02
6709a68K26k17K24j43l1j8O9K44j60J57l25K34m3k66k7j5M49m02O36l59k3J56
6731A98j0n15J74K67n1q7n8m0qL41k3l97K29P1k2J95j08l11R4L84l6Jn11J34J24
6756C5N2l41L66q9k60L00oP8m05K49R8pK88n48j9K55K95o21L13k21K02rK3J81
6780B09j56p8J40j77k98L97j16L49Kn41M19J78j57j98M7O8k12L14l41J04j00J33
6802a4p5j72J85J72o1j74K38l17L65k33K87l06L55j36p2L5l22K39mJ92j07k74
6824a99K40J67k45j13J18j97M86j07k61KL48k93r7K09K5j91qJ87Q5l4L1l45J82
6847a0J0o7L1N1k40l4M85j29J70l59K50m09L99m18L99P0k52J84k68j6L93k50J9
$$ plain form
6686 121 165 -31 -341 62 -8 26 -161 -150 -226 -3 138 -66 85 -256 -91 88 -69 -133 29 82 123 134 -168
6709 -168 58 -159 65 -78 -109 -127 -58 186 26 183 -142 92 49 -217 -244 -259 190 -212 424 65 42 198
6731 198 188 -327 -153 114 63 -24 -82 -122 -130 211 188 -209 20 91 69 264 156 -155 -61 323 287 288 -223 -89 35
6756 35 87 -254 112 23 -237 63 57 135 -270 -21 77 70 358 -190 -209 46 341 -280 33 -188 14 5 28 209
6780 209 53 -25 115 -62 -360 37 -79 270 272 -269 150 328 171 -27 20 88 -124 190 -151 -47 -147 -14
6802 -14 -89 -261 -76 96 35 -139 99 -218 147 -86 201 -105 250 114 42 77 -245 -6 -10 182 75 -199
6824 -199 41 208 -37 -150 -32 -229 257 150 -111 -109 239 -54 -151 58 83 -108 -116 71 156 122 153 -192 -10
6847 -10 0 -67 -36 15 -225 -259 226 97 267 -92 158 -251 148 -270 129 199 -53 131 -137 -153 240 -10 9
6870IK37k95J8o5K62j58j22K31j25k14O7QL5K22mk8k48N99k79J26l33J49K7j66
6894d7J64n7j54J54J09j1j87l35K92J39j20j45K61p4j7m5O7j81L68l20k18K76
6916h1J9j7k19J69l3Q9J28M5Q1Or6m0P3l2k11K24j70j53L00j75J28j59R2J18k62
6941a76k2n0K67l8P0Q9r2o1k13p0L61p2J5J16k08L18l2k85k40M21J14J26l91P6
6965B3M00n40J35p5O2N5P8j73k6n2K23l7k75K58k14L6j77K43L50n41K46K30K4
6988B53j99j07kk8J22j83J60l3o7K79m97M60j38Rk24J45k99K34L80l65L28k43
7010a5J87k98K0M68m35j63M84n94N03k61R0M0R4k71N3K25rp1K39l67j16k5J9K32
7034B9o3M5J79l44K97l5o4j16K86l96k5J36k11L44k01O7Mj07K40J30j97j35j47
$$ plain form
6870 9 246 -49 -31 -96 166 8 -114 117 -8 -222 -155 -147 -112 110 106 78 -170 429 150 276 -57 92 119 -47
6894 -47 117 60 -94 60 169 158 -29 -364 -72 67 -53 -198 63 -11 -28 -73 -6 -187 181 -139 -357 -81
6916 -81 -62 -79 -298 -129 -162 -73 55 100 181 187 91 51 124 92 -119 105 -65 -218 82 -93 35 -124 -32 86 -176
6941 -176 -198 -248 19 -19 51 140 48 -13 -226 -296 65 -7 8 124 -84 234 202 -83 -323 98 212 338 -53 23
6965 23 423 -117 18 -57 5 60 138 -35 -61 -113 110 73 -202 56 -158 -122 -299 -56 294 -247 -1 229 253
6988 253 54 -53 -55 -83 39 -144 16 -17 -84 195 -302 158 20 29 -195 -50 -349 -115 265 -100 228 -15
7010 -15 172 -126 -106 362 -73 -236 248 -346 157 -104 -14 26 120 -151 -98 127 118 47 286 -81 -197 -222 -203 29
7034 29 -34 11 190 -154 143 108 44 -72 214 -182 -207 -71 -282 62 -139 -72 -68 -175 65 195 -2 -137 -284
7057b84L95J29n28M74P0j10P6j82J9l81K38J15j95L56k61j35J96N7J48m13L7L07
7079A28l01K34l7J31m6N9q9p7K4j5M0k45L42q9K74l91Mm40L73N9k26M23l30K09
7103A4L6M0J95j60j05J45k97k23O22n04K96nm22N71j66m0j05j97P1K42K0k35q0
7126b87L50j43K1J21k60J94k25J41J59m17K85k03L04n7K8o6L47n30K14J08n4q3
7148e3k76L34r2L43J63m31QO1M2K5j67J36J33j73k05r7L63o4JP7l87L37r5m4K8
7173c3R2q6K65Oj14k90M19n55M29Q0l36J78l21N13l37k40J77O5K67l61J42m3K75
7196A92J39m12M8n2k4K8j2j50Q5K71K43l71K46p6l41N1K19r8K36K7m8m12K15j52
7220a48R9j02M4p0K75l10LJ29J72k08J11j01J60o3J86q2j14J54l27J12q4K81q6
$$ plain form
7057 -284 111 240 -288 186 256 146 222 40 59 -322 -84 31 -164 192 -69 -204 -8 49 197 -216 -179 128
7079 128 -173 61 24 155 109 168 79 2 26 11 51 -194 148 59 333 -58 -54 -494 -121 -62 -288 135 -195 14
7103 14 50 90 285 125 20 165 -132 -355 267 -237 59 54 -368 203 37 -3 -108 -305 -234 8 28 -207 -287
7126 -287 63 -80 -59 62 -198 -4 -229 -88 71 -346 -61 -264 40 -17 11 -55 292 -238 -24 84 30 -53
7148 -53 -329 5 -87 256 419 -12 -4 57 99 124 -43 93 226 53 -152 -249 114 50 51 128 -259 78 -17 -61 -33
7173 -33 59 -27 238 244 130 -160 259 -296 133 213 -123 55 -266 247 -90 -330 -153 -88 179 -182 -40 -83 192
7196 192 331 -81 -33 -85 -109 -81 -93 -243 -158 113 356 -15 231 155 -186 -135 84 -14 222 249 201 -211 4 -148
7220 -148 -49 -151 -107 -177 98 -212 -209 -80 92 -116 -5 -106 54 -9 177 95 -19 135 -192 -80 -164 117 31
7243C1L2Jko6j51K47Nj52k23K77o3J86j38j99M66n15L17k03K42k04J25o3J44j25
7267c1k86L60k04M69k20j96k97M41k20j44M35J61k61k13k8J60N8PK00j36j3j32
7289i0J33j82J04P4n7q8K77k52j23j33L92J27l94K68j06J87K0j94o9P7K9J9K3
7312D2O7j25Mj35O0J6j62K82J99m09J02l7J55K82l20J37J4Ll57O5J16j45K71j46
7336b1rp1J49j78P8L55k79K39n94J54K58k04m5L92k35o5K19m77K04j0j9r0M25
7359A76l29J70L4n9M8R7m94L99j67J72K20m53K63j08j06r4K87n4k20K36o8k0J43
7382G3J48k34J64j24k62L17k38K82k4rm0k08l8J94j39K30o2K6Ol4k49L18k27J21
7406iK13j82K43Nn11K11j5K02Q1j78J96l59P1q2j06K82N0k30P8n0K0L28k52J06
$$ plain form
7243 31 63 64 62 -4 -155 92 97 -55 -278 -1 -64 122 -16 -215 251 -264 53 -150 92 -112 13 -50 94 -31
7267 -31 -317 43 -161 308 88 -108 -405 36 -184 -328 107 268 7 -206 -234 -74 -16 -9 191 55 42 -90
7289 -90 43 -139 -35 39 -18 -106 171 -81 -204 -337 55 182 -212 56 -50 137 157 -37 -106 -29 0 19 42
7312 42 109 -16 -12 -147 -87 -71 -233 49 248 -161 -59 -96 59 341 21 158 172 175 -182 -117 -1 -146 125 -21
7336 -21 -30 -101 48 -130 -52 303 24 263 -331 -177 81 -123 -168 224 -11 -76 143 -334 -130 -140 -159 -249 176
7359 176 -153 17 51 -8 40 137 -357 42 -125 47 267 -186 77 -31 -137 -231 56 2 -218 18 -50 -70 73
7382 73 221 -13 151 27 -235 82 -156 126 102 93 53 -155 -193 1 -138 92 30 56 62 28 -221 97 -130 -9
7406 -9 204 22 265 270 -241 -30 -45 157 238 60 256 -103 -32 -114 -220 62 112 -118 -40 -90 -70 258 6 112
7430A12m8j02J6p8K12q2J73l52K27k96J24N9J86k83Jj05K66n5j50L12k78Q4K2
7453c5j31J45J45J40j32l6M03o88O1n1Q0J26j52N9J74k8j91o6K43l5q0j44K06
7476A3J51k06j55L45l68K79j37Q3K21l58J17L9j11j93L27K8j46J74j03k11O8K36
7498I3K4k58%K85J33m00J9K4J59j75N0L82l86Q0J6j20k31L67r3J02k85J02K05
7521I3r7k69L01K0k62J32L2j71L41m4m2J31J10l79r6R3J19j42M1L61k00n5J27
7544A44k18J40k96K09L51k60L2p3K22l45J42l4j80m2J20j46K58k50K8P0R0L1l58
7567c65O16Q3m72J71L1K20k69k35O7K74jJ5p0r2o1J80k0j89L50m22J92on9n6q8
7592b06L34l01J84l65N83k55k03J58J69Pk49p6N2L5J35R6k86J77P7K25j58l3j28
$$ plain form
7430 112 64 -38 -22 -100 112 30 203 -149 78 -218 -94 -35 151 -132 -131 -236 30 -25 -175 137 -141 -57 -35
7453 -35 -166 -21 124 264 132 96 499 -189 -128 -179 -99 27 -125 -66 108 80 -111 -177 66 31 -49 -193 13
7476 13 164 -42 -197 148 -220 59 -78 5 226 -132 -15 24 -87 -280 47 75 -71 103 0 -211 -143 93
7498 93 117 -141 -141 144 277 -123 -104 -80 79 -96 -46 336 -50 30 46 -74 -305 62 -31 71 -214 -112 93
7521 93 -4 -273 28 48 -214 -82 -50 -221 120 76 34 165 275 -104 -200 -107 12 -130 -89 272 72 17 144
7544 144 -74 66 -230 -21 330 70 102 29 251 -94 48 14 -166 -208 -88 -234 24 -226 -198 -128 -38 -7 -365
7567 -365 251 334 -138 33 64 284 15 -220 -153 121 120 135 65 -27 -88 92 72 -117 233 -189 3 -3 -62 -118 -206
7592 -206 128 -173 11 -354 229 -26 -229 -71 98 105 -144 -220 -168 -133 2 98 -188 -11 66 291 133 100 -28
7615b8j7J05p3j23J18K8j72J33k8K0L06m67L38r8m77J58L26p2n5L60l56r9K08
7638C5Qj31l3m9K95j97J3j04K03M8n5m1M6J07l39M57l10J42j82J42r6P9j3k3O
7663HJ30P6l62L29m36K20k3l7Q8J07q9K3lJ70l24j3K4n1J54p9M9J36k86K17Q6
7688A14R1j64Nj99J09j17K83l38K18K4j38J33l59K11J59L2j04J96m22K71p4k41
7710c10L88J70j21k21P9J66j7j15j66N86m84K25j45J16j10J96l60L16j12k57k0
7731a96j14K03j59K77lm6J3j12K51j47P0k03J67j68J55M4R4l8M1l20o0K41J83
7754A73j9k47q9O7J42j19M4M8m2n3M18k81l4k5J49J38k53N1j85M3L05l41%P4K49
7779B13k61L06j69k1J7l3j68J29mR6J9R2l22j12N9K44j29j58K65l17Q1L5r5L56
$$ plain form
7615 -28 -45 60 -13 -136 -18 10 -162 -29 -57 -37 269 -198 140 42 -435 -277 49 -23 -78 282 -74 -173 35
7638 35 43 -88 -121 -170 125 -72 -59 -163 40 88 33 -8 38 145 -194 263 -47 95 -87 55 -41 38 25 2 8
7663 8 138 214 -148 181 -255 -35 -58 -95 -7 100 11 34 31 201 -123 -136 -112 -163 -9 -88 -39 97 -189 28 114
7688 114 205 41 46 -153 -44 -161 122 -216 2 26 -112 21 -338 -127 32 64 -40 156 -266 5 -69 -310
7710 -310 78 248 127 -94 -15 151 134 19 -147 439 -45 180 35 151 41 237 -123 193 81 -176 -196
7731 -196 -310 -107 -266 11 8 -38 -25 -137 114 -33 37 -166 1 -167 -12 32 126 88 129 -191 -251 -10 173
7754 173 154 -93 -182 -115 27 -92 -48 0 -42 -95 323 42 8 -17 132 270 17 68 -117 -74 231 -110 -110 -36 213
7779 213 -48 258 89 68 85 52 -116 13 9 105 124 216 -106 -218 -159 85 -44 -202 63 -254 -173 -138 -233 123
7803A23j9j58J36k59j00J10K58j78q0K10j84K09j20k79M51j45q2L6Jr4K68j93
7825h9L25j33j32K12j90j68J52k9J12j09L20l68R9j21kq9j4J45L02k42l5j87L07
7848F6Q2j61j5J10L5k80P9k18J53K32K06j97k49K29m2p5J27n0M43n30k1J07L32
7871C63j41m41M54q1l76M19k93L09k21M4PJ4M5j41K15Qj37j09J66l02M02k66J01
7894C9R3O8j58L6j01o5L2L17j12j96j39J44Q8l20K94L8P0j0R1k77n4N6K82l5j45
7919C6j41K70k43kq3j20L14j93K73k22J64j35L30l48o8R5K69n11N56k20K24Q4
7941C29l39J10n6l46J29K89k77J96k42L07m8k8k3j29J80J13l48J02j7Q0j55j26
7963b99M37N4j00J48l67M12n00j25K09L48j54j28r1J21J31L49l50k24K10l96P06
$$ plain form
7803 123 104 -54 82 -177 -277 -167 91 -87 -167 43 -141 68 -52 -331 120 -25 -107 -71 -70 -164 104 -89
7825 -89 236 103 -29 183 -7 -175 -23 -52 60 -49 271 -97 2 -119 -121 -210 -224 -79 223 -19 -54 -241 66
7848 66 148 -13 -28 82 117 -163 -84 -302 -149 83 289 92 -157 72 30 -45 82 32 475 -55 -76 31 363
7871 363 222 -219 235 154 -222 197 -96 213 -8 36 43 57 102 -39 176 184 47 -62 104 -198 204 -62 39
7894 39 132 200 42 78 -23 -88 -56 261 149 -47 -186 -42 46 -274 20 58 128 118 209 -68 -122 -66 216 181 36
7919 36 -105 165 -78 -80 -163 -283 31 -162 111 -111 53 -82 248 -100 -168 -73 196 -315 241 21 245 329
7941 329 -10 100 44 -302 -173 116 -161 35 -207 100 52 24 1 -128 52 165 -183 -81 -98 -18 -173 -299
7963 -299 138 192 92 240 -127 285 -215 -340 -131 217 63 -65 -156 -35 96 445 95 -129 81 -315 391
7984C91p90L39k22P3K21O4l0R9k06J2K15k12m3Q1n1J63R7J63k16l38L68k16J85
8007A47j18j61L0p9L16j05j91L89l38K41j88r4J14l81N53l09l9L23n4n2M6j50
8029a00K85l54O2o6Q0K13j11N9j26L5o5L86k51j69J24p5L30k80l13M42k44L18
8051A80j24j19P9p5J2K66l11J46R8m96L58q6N0L02q6j40J91J79p22K24J08j9k11
8074a96K60J13J5k4l44K93k26j53N22l85J53k23K07L08k92K89l36j22K71j55j12
8095a37O4J27m2j34p5L09m10N77l30N7j35L10l12j61L98l21M2J24k0J55p2J21
8117A35k50J42K5N4j31j43J69j52P5J14o9J13O0mo01L03j24K4K40J21n0J77k26
8140BO3nj74K21j6k50K84r6n0J69k03L11m18K66L6j4j44j92L75J2k53L17n2j05
$$ plain form
7984 391 -399 -60 -282 -209 12 76 46 145 -61 -49 166 -46 -89 -8 -59 104 201 364 148 -190 178 -38 147
8007 147 29 -132 -102 -181 135 30 -161 228 -110 131 -57 -151 -37 -418 135 -174 -213 110 56 4 50 -100
8029 -100 185 -169 -107 -173 -93 120 9 68 -58 -23 -88 298 47 -122 2 -73 257 -23 -336 106 -138 180
8051 180 56 -63 16 -59 -47 219 -92 54 152 -344 14 -72 -22 280 194 54 245 424 -298 -74 34 15 -196
8074 -196 64 177 192 168 -176 117 -109 -262 260 -125 28 -195 12 320 28 317 -19 -141 130 -25 -137
8095 -137 -73 54 12 -122 -197 112 -298 279 -51 6 -129 181 -131 -292 106 -215 -173 -49 -69 86 14 135
8117 135 -115 27 52 106 -25 -168 1 -151 -76 38 -31 82 142 138 -463 -160 -284 -260 -20 101 51 228 2
8140 2 65 60 -114 107 91 -159 125 29 -21 148 -55 256 -162 104 140 126 -18 -210 165 177 -76 241 189 84
8164H4j29J3J10l34N68n35j44M56j37M4P0j11O0L0J58n69L09J71j62Rn8O9j55
8187a83L1K78k69J58
$$ plain form
8164 84 -45 -32 78 -256 312 -223 -367 89 -48 -4 66 -45 15 45 203 -366 -57 114 -48 -39 -97 -28 -183
8187 -183 -152 126 -143 15
8191A5
$$ Imaginary data points
##PAGE= N=2
##DATA TABLE= (X++(I..I)), XYDATA
0@%%%%%%%%%Mj2J6j6J6j9K7l2M0m8N5o4P3q6R9j12J27j47J69j91K16k42K71l06
33a62L41l80M24m72N25n80O43p13P88q72R66j072J189j319J469j642J843k078
51a102K362k714L155l730M518n667P503j0901J9234p5259j10809J68731Q5062
64H0383q9706l9012J07075j1198j44254o356J73036N0577j17218l7060Q3354k0427
76B9194j02195M2899J49126p957j39219k4368Q3543j4241o9240N7722J03350n8978
88D9636j35319R249R7722q846n6110N0134O0646q3294j03190N7049J06267k1862
100B2082n9950M0393L6119q1529n5554R2814R0323n2062o6080M0314K7940o5901
112c1091j8067R9999N1558q3454o0335N0618K7651n2820k38Q1745Q689r6258l9026
$$ plain form
0 0 0 0 0 0 0 0 0 0 0 4 -8 8 -8 8 -11 16 -16 24 -24 31 -33 40 -46 53 -59 68 -79 90 -101 115 -127 144 -162
33 -162 179 -201 223 -249 276 -304 339 -374 414 -458 508 -564 625 -694 775 -867 976 -1102
51 -1102 1260 -1454 1701 -2029 2489 -3178 4325 -6576 12658 -62601 -173410 -4679 80383
64 80383 -9323 -48335 58740 47542 -96712 -103068 69968 120545 3327 -33733 49621 29194
76 29194 -73001 -30102 119024 111067 -28152 -52520 31023 16782 -52458 5264 108614 49636
88 49636 -85683 -76434 21288 12442 -43668 6466 67112 -16182 -119372 -62323 43944 22082
100 22082 -37868 2525 38644 -42885 -98439 -5625 84698 32636 -33444 6870 34810 -31091
112 -31091 -49158 50841 102399 18945 -41390 9228 36879 -15941 -16179 65566 74255 -22003 -61029
125f1029O5497K6173m8236J189N8176j6933q6297p749P6810J8452n1939j500M5655
138A8269k2147o4078K0041P6516J898n6435J954M2344j8645m3391L3679O3572
150E3577j7703n7468J1041M1882j7906l2838L5121M3972l4277n0804K1249L8220
162C4066k1458k7599L0593K5672m0976l8050L0645L1923k6119k4038K8250J5478
174A8387l9221k2483L6340K4646k9427j7765K8489J0859l3772r789L8146J6780
186B1190l0707j1815K9245O955k9846k290L6470P579l2153o180K8521J946k8505
199i590L070L2056j686l2926j008K7071l197k6331P294K7323r590l0474N015K5081
213A2108o961k2186J0458K2184j3774k5473J1484K2896r218j8099J2754J7116
$$ plain form
125 -61029 4468 30641 -17595 -16406 41770 24837 -61460 -69209 7601 26053 -25886 -27386 18269
138 18269 -3878 -67956 -47915 28601 30499 -25936 -23982 18362 -283 -43674 -9995 53577
150 53577 35874 -21594 -10553 31329 13423 -19415 15706 59678 25401 -25403 -4154 34066
162 34066 12608 -14991 15602 41274 298 -37752 -7107 24816 -1303 -25341 2909 18387
174 18387 -20834 -43317 -6977 17669 -11758 -29523 -1034 9825 -23947 -33736 4410 21190
186 21190 -9517 -21332 7913 14868 -14978 -17268 19202 26781 -5372 -11552 16969 18915 -9590
199 -9590 -6520 25536 23850 -9076 -10084 16987 13790 -12541 -5247 22076 12486 -17988 -12973 12108
213 12108 5147 -17039 -6581 15603 1829 -23644 -12160 10736 1518 -16581 -3827 13289
225A3289j6489j8095J5980K0068j2547j4243J3686J1951j6636j1855J8315J4729
237A8153j4879j2163J3438P767j5951o759J8502Q557j7378r399J3504M856j4274
250f026k557J6833K875j7774n267J3940K762j2421P19J4475k323j5856RJ3916
264C305L66j0440K988J0845m307j3118M252J3389k050r116L634Q427o449r283
278g557O833J0654m200q853M531N919o786n917P587P142o642o793M446L786n834
293a684l381P098M372p589n488N070K555m738j106O184R82o919k568N615K179
308E82m104J36N246o76n869K10N524J100l355J027L727j576m421J399N135l6k711
325A338N31K017k064k474J985L461j027k712k79P62j527j319K057J813j872k235
$$ plain form
225 13289 -3200 -21295 -5315 14753 2206 -12037 1649 13600 -3036 -14891 3424 18153
237 18153 3274 -8889 4549 12316 -3635 -10394 8108 16665 -713 -10112 3392 8248 -6026
250 -6026 -8583 8250 11125 -6649 -11916 2024 4786 -7635 -6916 7559 5236 -10620 -10611 3305
264 3305 3671 -6769 -3781 7064 2757 -10361 -6109 7280 5230 -3886 -252 8175 1726 -7557
278 -7557 -724 9930 5730 -3123 1408 7327 541 -5376 2211 9353 2711 -4082 364 4150 -1684
293 -1684 -5065 2033 6405 -1184 -6672 -1602 953 -3785 -4891 1293 2275 -4644 -7212 -1597 582
308 582 -3522 -3386 1860 1184 -4685 -4475 1049 2149 -1206 -179 3548 1972 -2449 -1050 4085 4049 1338
325 1338 1869 3886 1822 -652 1333 4794 3767 1055 776 1538 11 -1308 749 2562 690 -1545
341a545k42Q52r33l62J761N26j991j208M53O85kP12J113N3j198j027J027J185
359a41N93Q0N00k89j118J67J215M71O59p15K76r54n68J40J024M15M9r04r50m41
379d91K42L1N45L37k72j105o98O26N69j57M32m5m48r49k54J006J068J1j33J61
399D76m13p32N23R03Q28p48m23J66n28n71R45Q83n39n15n81J13m13K76N51K69
419D70n62p68J56pp28P03J044k11n21r49N36L34K81M35N72o53n34o0N17K02J53
440D10O16J09n39p49M13N27o3J10J79l91j074j73Q00J20r2j49J56o42p71L83J016
461A96q3k01k29K2l12n43L97R12j07p63L93K48o59j90J375K12l79q30M67Q7p59
482g46L9J170N15j301l24P20K2l75J43J131k69j316j24Q75J85m43J90J100l95
$$ plain form
341 -1545 -1787 -935 -1868 -2230 -469 57 -1934 -3142 -2689 -2004 -2006 -1294 -181 -128 -1326 -2353 -1326 -141
359 -141 452 532 1032 743 -375 -208 1007 1478 2137 1422 1698 744 176 316 1340 1755 1804 900 -50 -491
379 -491 -249 -218 327 664 392 -713 -1411 -785 -216 -373 59 14 -434 -1383 -1637 -631 437 448 315 476
399 476 63 -669 -146 757 1585 837 414 580 52 -519 426 1309 770 255 -326 -213 -626 -350 201 470
419 470 -92 -860 -704 -711 -1439 -736 308 97 -424 -1373 -837 -503 -222 213 785 132 -402 -462 55 257 410
440 410 1026 1135 596 -153 260 787 724 834 1013 622 -452 -625 175 295 203 54 210 -432 -1203 -820 196
461 196 113 -88 -317 -295 -607 -1150 -753 159 52 -711 -318 -70 -729 -919 456 668 289 -541 -74 13 -746
482 -746 -707 463 978 -323 -647 73 95 -280 -137 994 725 -591 -715 160 345 -98 92 1192 797
501G97j469K07J176J02m17l4P46m13j489O29J353j51j274L21O49p13r14P02J217
520A025j028q27K60R05j121q12J220J053j001j285O93Q92q92m74J567O43j137
537c19j268J274R01o64m22J475K24j476q10J787P00j293J64R95j76j784K9J982
555A319K2j421l84J329m09j440L0J765K51k040J42J201l46j453P41J551o12j608
573a362K36J737p91q47P18J598p16j835Q64J371p19j139Q60J565j141j616R47
590b70J464r23j227J047J055j289j318J791R27j585j188J408J417k282r18K004
606A13J260j895j163J881N71j395p67K308N87k034n55K205k36j909K59K114K55
623A599k249k39K014j69j818L74K282n32k702M02J953l32j963R48J853q98k428
$$ plain form
501 797 -672 -465 711 813 396 362 1108 695 -794 -165 1188 1037 -237 84 733 20 -894 -192 1025
520 1025 -3 -830 -570 335 -786 -1598 -378 675 -326 -1611 -918 -26 -918 -1392 175 818 -319
537 -319 -1587 -313 588 -76 -498 977 1201 -275 -1085 702 1402 109 273 1268 1092 -692 -663 1319
555 1319 1341 -80 -464 865 456 -984 -954 811 1062 -978 -836 365 19 -1434 -693 858 246 -1362
573 -1362 -1126 611 -180 -1027 -309 1289 573 -1262 -398 973 254 -885 -25 1540 399 -1217 -270
590 -270 1194 271 -956 91 1146 -143 -1461 330 1257 -328 -1516 -108 1309 -973 -1891 113
606 113 1373 -522 -1685 196 767 -628 -1395 913 1500 -534 -1089 1116 880 -1029 -770 1344 1599
623 1599 -650 -889 1125 956 -862 -488 1794 1262 -1440 -1038 915 583 -1380 -432 1421 523 -1905
640a905L03K522m88k055J223J583j248k098J346K081j102j370J200J177j710r08
656a449J417K074j524j721J549R99j704j139K224J552k574j066J841P50j689l27
672g87J858P07k419o63K037M93j835k37K117k64k422q7K375K00k251N10J919q23
690D28k194N56K590o8k677O09K260j196j722J232J972q20k151K51K251j120j567
707a366J287J726j369j955J432J500j504q13J381R89j718j391J956J142j352q30
723h85J315M49j485n72J941N78j777l30J173L85j474L3J920j9j549p22J744M5
741G70j641L20J717j29j994J31J676j81j472K66J820p29j915M30J688k8j452N11
759b12J014p98q23L21J410m88j607J075Q41q56p51R76J183j166r05Q07Q56j072
$$ plain form
640 -1905 -1602 920 432 -1623 -400 1183 -65 -2163 -817 1264 162 -1208 -8 1169 -541 -1449
656 -1449 -32 2042 518 -1203 346 1345 -359 -1498 726 2278 -296 -1362 479 1229 -460 -787
672 -787 1071 1778 -641 -1304 733 1226 -609 -846 1271 1007 -1415 -1502 873 1073 -1178 -668 1251 428
690 428 -1766 -1210 1380 1312 -1365 -756 1504 308 -1414 -182 1790 970 -1181 -930 1321 201 -1366
707 -1366 -79 1647 278 -1677 -245 1255 -249 -1062 319 1308 -410 -1801 155 1297 -55 -885
723 -885 430 879 -606 -1178 763 1341 -436 -766 407 792 -682 -649 1271 1252 -297 -1019 725 770
741 770 -871 -551 1166 1037 -957 -826 850 669 -803 -537 1283 554 -1361 -931 757 729 -723 -212
759 -212 802 4 -819 -498 912 424 -1183 -108 733 -123 -874 102 1285 119 -786 21 877 -195
777a95m61O48J018r17j010J116N72j056j81O33O25r74q72J476O88j341m29R23
795B63K41j069o0J088J31r92j68J465k73j164K5Q39P2q58k23J213j33j074K41
814d36Q39o5j209O76N39j11o30L69K13K22r97K88O78m63q19J053L68o67p18O81
834a89J036o57r07Q98N05n12p06M14R63j007j43N80L30n87j95N06J82p96j43O08
854A80L82p53l18Q36o3n35k46P91K86j079M8N83K76r73M30N12K50j072L5R02k96
875A76n75K60N53j92p94J91P56q0p81M45N82k82m61j44R44q70P6L58J76j5p45
896d22K61O43l62m95P22J27p35j63O31lk39k62N94q8r3m52L58J62k07l43M04J63
918B01q3l30O28k03m25n7J77M02k86l90L89O6n09L55J64m8l10J19J70J04k68K84
$$ plain form
777 -195 -656 -8 1010 93 -917 199 771 -285 -466 167 792 -182 -1054 422 1110 -231 -660 263
795 263 504 -565 -625 463 594 -398 -566 899 626 -538 -513 326 398 -460 -683 530 397 -677 -436
814 -436 403 338 -871 -195 344 233 -397 -28 185 407 -590 -302 376 -87 -906 147 515 -152 -870 -189
834 -189 847 190 -717 181 686 174 -532 -118 845 -162 -305 275 605 18 -177 329 511 -285 -428 180
854 180 562 -191 -509 327 264 -271 -517 274 560 -519 -471 112 388 -585 -155 357 607 -465 -430 472 176
875 176 -399 -139 414 222 -572 -381 375 295 -486 -41 541 259 -202 -346 598 -272 -196 162 338 323 -422
896 -422 -161 482 120 -375 347 474 -261 -424 207 204 -35 -297 297 209 116 -336 22 184 -23 -366 38 201
918 201 118 -212 416 213 -212 -269 -92 310 24 -366 23 89 -420 -65 99 51 -259 -140 30 134 -134 150
940A50K25r9o19K49J88j77l9qK26J22k60N8K98j53m09K24r2J90m15L01L57j36
962A81o91M80J26j40J79k33K06l64L97q4n8q3l36O83R9l23k2j84K16j56NJ47M6
985I1n6j80K86Q0k87j18L32p6j06m7N78n79j69K88J01nk71M9K38J38l1l50J87
1008I3J23n68r1M70K28m44j05J9L82l85K45J36J90l86m5L68j01j94j21L74k69
1029h1K54l19L59l03J80m88M98l00M06j19L09m69o0P0M1k30j00L03K3K23l68K95
1051A24Q9k56Q9R2k67K40l64J07J96r8J75l08K5K50k4N7K09k70j75o3J58p4J65
1074G7k85%K18M2k06J22R7l8K14k51j12J52p5k13L93k8j3q6J24k37J11K13k75
1097e6J89k47m2K27P1j64N3k21lM73m25pK69q1N5j31L6R4k08K05k89K26L8N5j19
$$ plain form
940 150 375 276 -343 -94 94 -83 -122 -130 96 218 -42 16 314 161 -248 -24 -116 74 -341 -40 317 181
962 181 -510 -30 96 -44 135 -98 108 -256 141 57 -1 -84 -420 263 362 39 17 -167 49 -107 -102 45 91
985 91 35 -145 141 221 -66 -184 148 72 -34 -81 497 -82 -251 37 138 133 -138 -89 149 287 256 -94 93
1008 93 216 -352 -443 27 255 -189 -294 -275 107 -278 -33 103 293 -93 -138 230 129 -65 -186 188 -81
1029 -81 173 -146 213 -90 90 -398 100 -200 206 87 396 -73 -133 -63 -22 -252 -352 -49 -26 197 -171 124
1051 124 213 -43 46 138 -129 111 -253 -146 50 -48 127 -181 -156 94 70 127 336 66 -109 -172 -14 -88 77
1074 77 -208 -208 10 52 -154 -32 65 27 241 -10 -122 30 -45 -258 135 107 94 8 132 -105 6 219 -56
1097 -56 133 -114 -156 71 142 -22 31 -190 -193 280 -145 -152 117 36 91 -40 -4 90 -118 87 -202 24 62 117 -2
1122bk1j31K94j33N0J76O1k2o16M91l37K89j14J01j61n1J25J91j03j4j48j82K41
1145a6k79J93R7p6K9N0j25l8L57j07k33J96O4q6q8l24L16oJ27J01N3m44K63L08
1169C32j02k73K48l62m2K40j39m4M23m34J41J32j72J10k78m4K83k41L37J00j52
1190F3k34q8J50K11j35K90j71J15j03O7l1n00L42l6K52k47l5J95j04k07k0L56
1212A30q4l54O8R9K67Q9j81j02K21r4O3P5j33m4J4M4j37O7N0j59J28K17p4j68
1236BK5J32J78m50K53k68L15J84o03L19j14qR5j18J45k72J74k27J44J23RJ85l69
1259a46J32k7J59j83j33M1LJ11K06k0l55N04l61j74k3K48j30K32j97K67m46L51
1281E9k35L02k54M4K42k11P9q4K12l03L00k38N1J88r4l45J28p2M22Ql22Q6J39
$$ plain form
1122 -2 -23 -154 140 7 57 233 294 272 -344 147 -190 99 -15 86 -75 -126 -1 190 87 73 -75 -257 -16
1145 -16 -295 -102 -5 -81 -52 -2 -127 -165 192 85 -148 48 112 26 -62 -386 -70 -76 51 152 205 -239 24 332
1169 332 230 -43 205 -157 -199 41 -98 -142 281 -153 -12 120 -52 58 -220 -264 19 -222 115 215 63
1190 63 -171 -259 -109 102 -33 257 86 201 98 165 134 -366 -24 -60 192 -55 -90 105 1 -206 -226 130
1212 130 46 -308 -240 -141 126 215 34 -68 153 59 122 197 64 20 34 78 -59 8 58 -101 27 244 170 2
1236 2 27 159 337 -113 140 -128 187 371 -232 87 -27 -35 60 -58 87 -185 -11 -238 -94 29 38 223 -146
1259 -146 -14 -41 118 -65 -198 -157 -154 -43 163 143 -212 292 -69 -243 -266 -18 -148 84 -113 154 -292 59
1281 59 -176 126 -128 -84 158 -53 26 -58 154 -149 151 -87 -36 152 58 -287 -159 -231 191 199 -123 -37 102
1304A02J26l77l08M47p9J29J00j65K37l37K23m4r1J08k98L20n5j4q8L54m17J04
1326b3j9%k18N44n6k97M48l82K65n1n15M33j27K9j79M2rn2J43p4J29P5k50K07
1350F3r8j89K53Q6j69M8pj76M8J10o8K40j15Q7J88qj31k70K38P9m4p0k47J87O3
1375I8k34k01l3L53j03j20L55k45J65k57P2K20k24J20o8K32n91N05k3K27l37L6
1397e3K6j53Kk9J61J1k8j2k4L32k06m3J35j78j02J61k3K93n03J64K62l05n1Q5
1421g8J36K24n31r1L01n1J54j63K78k47J23j40L96m7l85L07j27ok21KO7j11P3
1444a37J73l5k91J16j5L16k43L4L13n47K51k5L48k89o1n9J95p4r6K30j76M0P7
1467D5j99N1J17o9J33J63pl43J21L4k14L86k39Q5j32j59M14k79P7j81l9L61k51
$$ plain form
1304 102 228 -149 -457 -10 -89 40 140 -25 212 -125 98 54 -37 71 -227 93 38 24 -64 290 -127 -23
1326 -23 -42 -42 -260 284 228 -69 379 -3 262 211 -304 129 2 31 -148 -106 -115 -167 -24 -98 31 106 -144 63
1350 63 -35 -224 29 115 -54 -6 -13 -189 -141 -31 -99 141 26 113 301 293 162 -108 130 209 165 95 -152 35 98
1375 98 -136 -337 -370 -17 -120 -240 115 -130 35 -222 -150 70 -154 -34 -102 130 -461 44 21 248 -89 -53
1397 -53 -27 -180 -178 -207 -46 -35 -63 -75 -99 233 27 -16 119 -59 -161 0 -23 270 -233 -69 193 -112 -163 -78
1421 -78 58 282 -249 -340 -39 -90 64 -99 179 -68 55 -85 311 264 -121 186 59 53 -168 -166 -99 -210 -137
1444 -137 36 1 -290 -174 -189 127 -116 -82 231 -316 -65 -90 258 -31 -92 -151 44 -30 -126 104 -72 -32 45
1467 45 -154 -103 14 -55 78 241 234 -109 12 46 -168 218 -21 64 -68 -227 187 -92 -15 -196 -235 126 -125
1490a25O3K75J1k05j34J99k2k60J78j64L45J74m48Q0n8l04K08K86n0m53L24M6
1512c4J67J32n45K06J62N2L1j43J00j09l16K41J05p3j88M34l96J90j01l3K21r9
1534Dr6M62p26L13j41J68R5l80L89o34N56j16j64J21J21P5J10k04M9P3l5m6M09
1557D03n58J36j67J03J12K66l42Q3j52J9j80L55Q0m54L02n5J32J0m9R0J28k32
1579C0J64j38j95N00k18No7j97LQM50k54m9j50P4K18Q1o04M66j6k15R9J10K4j01
1604B8o2J43M7k18O9m9K66l73L58l53J66m9K49j41J7J67m36K61N0l99k0K13j5
1627h1K6J12m4J74l5n9k99L19j84N7N9R6l70K81j73K05k33L7J0K46l65J23L5J58
1651I5j4j98J16%j71K71k58J2L99k21n3J3J92o7J63j29j18P8j96K54l38J45p8
$$ plain form
1490 -125 -62 213 224 19 -115 84 62 -198 -20 -184 161 335 -113 -33 -91 -395 -187 99 49 -404 -80 -34
1512 -34 133 265 -280 -74 88 140 171 28 128 19 -297 -56 49 -24 -212 222 -174 16 -85 -118 103 4
1534 4 -92 370 -356 -43 -184 -16 79 -301 88 -546 10 -106 -270 -149 -28 47 157 -47 2 75 40 -6 403
1557 403 -155 -19 -186 -83 29 295 -47 36 -116 -97 -277 78 158 -296 6 -49 83 93 44 134 262 30
1579 30 194 56 -139 361 143 148 81 -116 -113 -105 345 91 42 -108 -34 184 265 -339 127 111 -104 -5 105 129 28
1604 28 -34 109 156 -62 7 -42 224 -149 209 -144 22 -27 222 81 98 265 -171 90 140 -259 -279 -66 -81
1627 -81 -55 57 13 187 152 93 -206 113 -71 -14 45 141 -229 52 -121 84 -149 -112 -102 144 -221 -98 -63 95
1651 95 81 -117 -1 -1 -172 99 -159 -147 252 31 -22 -9 183 116 279 150 32 110 -86 168 -170 -25 -103
1674a03p4L38O6m74J72J57k79K95j23M6n7j58K64j60J28p8P1J00l3j87K27r3K07
1697B52l00L4R3l20K57L44l32k15L3K82j50k27K9N28k88J34j13J47k92J41N6j22
1719b9J27r6j12J37K90l64K39j68J4J39j08J15j49m4m0K28j17k42M10m55K15J03
1741I3r2j12O9j70k99N75l33L83j39J42l71K61j28J03J4j48K5J04k04J16K13k36
1763a34K84j73L18k25l3J44k84kJ37k61J51l2N67m02l92p0M22J40k20k0J07N5
1785G7J33j77j36J71j40m1K98j42Q6q5Rj2N3K63l17J70m37M84k42m30J77M74j32
1808A04j55j18L73j74K3L7l7j15P4p1j51K79P2l33L58nk74q5J47k79L32k78K23
1831e3j1R6M4l3k63J83j62P5P1K1L6J41k82O4k0P5%L6J43l11M02l27J34Q4j22
$$ plain form
1674 -103 -177 161 227 -247 -75 82 -197 98 -25 21 -36 -194 70 -90 38 -40 31 131 98 -89 138 45 252
1697 252 -48 -14 79 -241 16 360 28 -187 -154 128 -22 -249 -220 308 20 154 41 188 -104 37 93 -29
1719 -29 98 2 -110 27 317 -47 192 24 38 177 69 184 35 -9 -49 179 62 -180 230 -225 -10 93
1741 93 1 -111 -42 -212 -511 64 -269 114 -25 117 -254 7 -121 -18 -4 -152 -127 -23 -227 -111 102 -134
1763 -134 150 -23 295 70 37 181 -103 -105 32 -229 -78 -110 457 55 -337 -407 15 155 -65 -85 22 77
1785 77 210 33 -103 68 -72 -113 185 43 129 44 53 41 94 357 40 210 -227 257 15 -415 -238 236 104
1808 104 -51 -169 204 30 53 90 53 -62 12 -59 -210 69 141 -192 166 161 -113 -198 -51 -330 2 -276 -53
1831 -53 -64 32 76 43 -220 -37 -199 -124 -53 -32 4 145 -137 -73 -93 -18 -18 18 161 -150 252 -75 59 143 21
1856B1j11K0K03p9r0k9O9k22K63k51J9K0K9lJ98k71J68L27m98K50%J06j40n2K16
1881A63q6l47J48k07M92M4k63P7n5L19m43Q3k58O14J20n61J69j00J62rm15K01
1903a52L23M1k84J60m3l76L74k75K13r6R3J02j48J55j38J28J49l26M40M6o66K77
1925cj9K66k74J17j69M18l52J06j14j1k47J86L41l15j75j9M97l14q9n1O6LR9Q3
1949C0r7K94r0L4l47o7L41M1j3l21j7k5J16M91k86j67mj00M55l64K07J5j9R4m61
1974b60L47j37r7J7k76N11J59m70L16l9J36l51K00m5l38M20M1k10k7J60jJ07l47
1997a84J95l3%M8j35M9K7J29k70L66j0j82M0l36K30K4O5k49L30j26j36k0J59k30
2021b49K64k94P4M58k62J66n4l8j38n4J06J52J00q9l02M61j29l7l04R0j02K63
$$ plain form
1856 21 -90 -70 133 54 -36 -65 4 -218 45 -206 -187 -167 -138 -141 57 -214 -46 281 -217 33 33 139 -1 -53 163
1881 163 77 -270 -122 -329 163 207 -56 21 -34 285 -158 -75 -333 281 401 -160 9 -91 71 62 -353 -152
1903 -152 171 212 -72 88 45 -331 43 -232 -19 -115 -22 80 -68 87 -51 77 226 -100 340 386 -280 -3
1925 -3 -22 244 -30 87 -82 336 -16 90 -24 -35 -282 -96 245 -70 -245 -264 233 -81 -170 -221 -155 -152 -53 30
1949 30 -67 227 137 171 -176 -243 98 139 126 -195 -212 -237 -121 370 84 -83 -87 -187 268 -96 111 126 107 201 -260
1974 -260 87 -50 -147 -130 -406 105 264 -206 110 71 207 -144 56 11 -327 93 134 -76 -103 57 56 163 -184
1997 -184 11 -22 -22 26 -109 -60 -33 96 -174 192 182 0 40 -296 -66 -42 23 -226 104 -22 -158 -178 -19 -249
2021 -249 15 -279 -205 253 -9 157 103 65 -73 -127 -21 131 231 142 -160 301 172 135 -169 -79 -181 82
2043H2k14L69l38K20j89M4K9j29J01J0O8P1p0K00k52n2J70k05K1m8J37j29K25
2066A21n8M3l11L09j96J62k90M4j57M25K58p6k01r4o6O6M58k19J3o1k09j23L03
2089A41l17L05m57O5M03k12J32m84M28L27o17K90k36L4LK00k27N29k91o2R1J34
2111A79k93K04k73k8M45J14n82K78K36k56J18k99o4K55k76J05P0K10k27L5j26
2132a75q9J49J57k2o2R1R7j39Q1j18J93k85K56p9j62J56J72j43k9K60n28K43k11
2155a87J60J17Pj22ml89K83P4J09j2M3k07KK12j61Q5P2J0mqn2j1j72K15j48j01
2181a89K25k11J8L66k64l60M41mK44o5l08J55J52p5q3k28N2r3J00j28L51p2j02
2204g8J88m48N57j00l40J72K32k28J72m06L02Q9K79l05j05J03J9J9l06L66k99
$$ plain form
2043 82 -132 237 -101 119 -70 -26 3 -126 -25 -15 53 124 54 254 2 -50 120 -85 -64 -112 25 -104 121
2066 121 63 106 -205 104 -92 70 -220 -176 -333 92 350 274 73 -21 -87 -21 437 218 231 170 -39 -162 141
2089 141 -176 129 -328 -263 140 -72 60 -424 4 331 -286 4 -232 -198 -195 5 -222 307 16 -46 45 179
2111 179 -114 90 -183 -211 234 348 -234 44 280 24 142 -157 -221 34 -242 -137 -67 143 -84 -49 -175
2132 -175 -264 -115 42 20 -42 49 146 7 88 -30 163 -122 134 55 -107 49 221 78 49 309 -219 24 -187
2155 -187 -27 90 97 -25 -29 -418 -135 -61 48 36 79 -128 -126 86 -75 10 82 92 88 80 28 17 -155 60 -88 -189
2181 -189 36 -175 -157 209 -55 -415 26 22 266 201 -107 48 200 125 42 -186 -134 -227 -127 -255 96 24 -78
2204 -78 110 -338 219 119 -221 -49 183 -45 127 -279 23 112 391 86 -19 84 103 122 -184 182 -117
2225a17J71j70K04k16Q0j42J04j08J76n8J20K7O8l4J37r7k30R4K50m93L05N0m10
2248b89N09k66k0K64k17O0J85l58J07J02j42MOj4J3Rl4j23J11K84m09J83l34K46
2272a23K91j70k06l4K38p8J22j33j16J1K12n1j3K73j86l92L29J71J21j72r4%K44
2295B44j08n6n6N5j87J05L17k14j72j31K08J93k2l89J31n7j71J27K64Q8k65K06
2317A10r3o5l35L21k42J06M24k17k9j30J75j24j82n9K26K26o8j04J01RM3j22j12
2340a41J21j7J82j29M3j33K58j61j95N11m35j6J45j9J65l28N86m88K7J50j45j55
2362a74r4L27j98K97N9J14l59P8Q6k85q3M04m6m05L01J63j18l63K71K23j45K0
2384G3l37J94O6R0J57j31n8Kk6P8r0j80o0J50q5N4J56rR0k07n0K05n02L77j89
$$ plain form
2225 -117 54 -116 88 -128 -48 -190 -86 -194 -18 -76 44 71 139 105 242 145 -85 9 259 -234 71 121 -289
2248 -289 220 -46 -66 198 -19 41 226 -132 -25 77 -65 -61 -55 -69 -56 -47 -81 -204 -93 191 -218 -35 -369 -123
2272 -123 168 -2 -208 -242 -4 -82 40 -93 -209 -198 14 -37 -50 223 37 -355 -26 145 266 94 0 0 244
2295 244 136 80 24 79 -108 -3 314 100 -72 -203 5 198 176 -213 -82 -139 -310 -183 81 169 -96 110
2317 110 17 -48 -383 -62 -304 -198 226 9 -20 -150 25 -99 -281 -340 -114 112 44 -60 41 50 93 -29 -141
2340 -141 -20 -37 145 16 59 -74 184 23 -172 339 -96 -112 33 14 179 -149 437 -51 -24 126 -19 -174
2362 -174 -268 59 -139 158 217 331 -28 50 136 -149 -232 172 126 -279 22 185 67 -296 -25 198 53 73
2384 73 -264 -70 -4 86 243 112 54 56 30 108 18 -162 -222 -72 -157 -103 53 44 134 -73 -123 82 -420 -43 -232
2409b32n7J03J88p7k04L89k11L77n66K82M4L11j83q7n3L1r5O4J48l30K99k33j47
2432b39J31M95m65N1O4J24j03K7j41n5K03l33M31l09M96k89j92K39j63J63k44
2453a09M2q2qPK30K8j93L19N5k87j39Q8jk42M63l77K41J69j56j15p2J02J1m8P6
2478BK66n72L08J2k50K68Q7n9J37l15M71k32l85J45l5L49p1J97n8n7m41K43j73
2501a63L03K49k78J01j76j86P6m1J69O0k23K44k68J24K04k24j33R1O6L31q0O4
2523C10j09l24O4j5M78m61J78K1j00p7K93m3j09j13L2J95l28J33o5K41k70K8o2
2546a03r0M23o8l18L60k03k27L66j63N73n77O7j47k7k1J73k24K16P4k15L10j76
2568CK39k55j47L06r4oN6j66J46l42J74Q4J18n9r3O9j19N4p1P9J59M6n13K52J0
$$ plain form
2409 -232 -289 -186 2 -75 -279 110 -101 276 -290 -8 36 347 164 77 24 55 -40 24 172 -158 141 -92 -239
2432 -239 -108 387 -78 -27 37 161 58 85 -56 -111 92 -241 190 -119 377 88 -104 135 -28 135 -109
2453 -109 -67 -149 -157 -150 80 108 -85 234 289 2 -137 -49 -50 -292 171 -206 35 204 48 -67 -139 -37 -26 -74 2
2478 2 268 -304 4 16 -234 34 121 62 199 -116 355 123 -262 -117 -152 197 126 323 265 208 -233 10 -163
2501 -163 140 389 111 212 36 -150 -74 -115 54 114 -109 135 -133 -9 195 -29 -162 -71 -5 326 246 310
2523 310 201 -123 -59 -74 404 -57 121 142 42 -35 258 215 106 -7 25 220 -108 25 -40 201 -69 -41 -103
2546 -103 -193 230 162 -156 204 1 -226 140 -23 550 -27 40 -107 -134 -155 18 -206 10 84 -131 179 3
2568 3 242 -13 -160 146 52 46 102 -64 82 -260 -86 -2 116 57 -36 33 -86 -32 -103 -24 135 181 -332 -80 -70
2593g0K36k04J21k16K73j02M8l1j89N73m27M8J00J39k51j6p4k5R9j34pJ6J59j61
2617i5L67l25j71O8J75j7Mm3j7l0O3O1P5m1Q8j75J9l0p0L45l77k3J46J00J59l28
2643g2j06M86j32j92J00r5J45q9k01J81k56J91q7J91l5Nj99J65j2J38m25K21J76
2666I8J2l44K88j57j29J31P0l6l3j34J6K74M2N7k36m5J32J68r9j20p2K00q1j9
2690a7M9R1k39KK06j38J09n0K19l7j92M04n47J10J94l39N54n60O4K5J5J98j55
2713c4qN0o5J2J66j88k8N4J52N7l41J60J89l06J47J36n63J75O19m99L54k76J8
2736a9K25j74j02M8k0J53j46k12M1k9K32J02m7m3M6k84Q7R2K1M8m2k9K15j46K8
2761D5k43K8K86k85p4K4N8L64l46J24K40l43J21l51O37m6m46M72k0k68j65r5L99
$$ plain form
2593 -70 166 -38 83 -133 140 38 86 55 -134 439 12 60 160 299 48 32 -42 -67 32 -102 -109 -93 66 -95
2617 -95 272 -53 -224 -156 19 2 6 -37 -54 -84 -21 40 115 74 162 -13 6 -24 -94 251 -126 -149 -3 97 256 -72
2643 -72 -178 308 176 -16 84 -11 134 45 -156 25 -231 -40 -127 64 29 34 -165 0 -12 126 -299 -78 98
2666 98 110 -234 54 -103 -232 -101 -31 -67 -100 -234 -218 56 98 155 -81 -126 6 174 75 -45 -117 83 2 -17
2690 -17 32 123 -116 -114 92 -46 63 13 232 195 3 407 -140 -30 164 -175 379 -181 -117 -92 -77 121 -34
2713 -34 -42 8 -57 -45 121 -67 -95 -41 111 168 -173 -13 176 -130 17 153 -410 -235 384 -115 239 -37 -19
2736 -19 206 32 -70 -22 -42 111 -35 -247 -206 -235 -3 99 52 9 55 -229 -142 -50 -29 19 -23 -52 163 17 45
2761 45 -198 -170 116 -169 -243 -219 -161 203 -143 -19 221 -122 -1 -352 285 239 -207 265 245 -23 -188 -283 116
2784A16j43Q3j13J41j93k6K81%k6J4M3m69J36J77q1m9L2N3J37l51J75K93n00K78
2808Hm5k24P5K54K4o0j28O3j13m8J09M7r1L09l19L24r0J0L7m7k96J52K42n56L44
2833a9L0j21j25J54J60j01J62j14j22j40J86K38n85O38j63k54K17k20J23k86K38
2854a04K74p2j35M8O1q5p3J19M0k90K13R8M0n9k9K53o37O46p5l80K50j59J58P3
2878A75k59P2J15J94m69J38J47k93O8O2j59n8L67R3j44m4k15K09K54m15j4M8J0
2901a18R1k41J95Jm7O0j60M1K40J07j08j66J2L27k5k67o5K27m67K83N25j24l33
2924a2n4P6k8k67L52K7k67M3K30j5L2J0j83K09J9r0L5j6p7J14n2N1j23J16J34
2949B64j93j66K4J68n6k18K16j3k4j81K62j8j39J5R0K08k54L09j53m12M28q2J10
$$ plain form
2784 116 -27 56 -57 84 -109 -135 146 146 120 134 177 -292 -156 21 -60 -109 -77 -24 113 -238 -63 230 -270 8
2808 8 -37 -261 -186 68 92 32 -96 -33 -146 -194 -85 -38 -129 180 -139 185 95 105 142 95 -201 -49 193 -363 -19
2833 -19 11 -110 -235 -81 79 -22 140 26 -96 -236 -50 188 -397 241 78 -176 41 -179 -56 -342 -104
2854 -104 170 98 -37 11 72 -13 -86 33 73 -217 -4 94 134 75 46 299 -338 308 233 -147 103 -56 102 175
2878 175 -84 -12 103 297 -172 -34 113 -180 -112 -50 -209 -267 100 193 49 5 -210 -1 253 -162 -176 -128 -118
2901 -118 -27 -268 -73 -72 -119 -59 -219 -178 62 169 61 -105 -93 234 209 -58 -123 104 -363 -80 445 321 -12
2924 -12 -66 10 -18 -285 67 94 -173 -130 100 85 117 127 -56 153 172 82 117 101 24 138 86 137 14 130 264
2949 264 71 -95 -71 97 41 -177 39 26 2 -179 83 65 -74 -59 31 239 -15 294 141 -271 157 75 185
2972A85n3k62L43k69J74j0p6l56M63j13K58n5k90N4k01K75l6L8l59p8J64R5K89
2995A80k04J63oK0J97n88K18K8N8l04N99l24J01n8k71K1J79j05K61j75J67p5k05
3018a23r4J65J00m7m1K38N5j67l38M31k15J44o8n4J75j26J97k32L83n00O8j88
3040b37R0J07M8k41L50r9K07m80K48N5J06k47L70j84K36m54o6N9J46P3j6R4j52
3063A3K81l61R0j33J32Jj90J32P4k7m8N5M0k02M68j76k41j51L9J22O2M55l59k11
3087a35K11j57R0k25N0k5L55k17j51L84j03J20j53K7r8J31l19J73K27L2J13j13
3109B17l78R3K59q2n1l7k55K02lO5L0j59o6R3J09m0j90L07L8l06J12J13j51K83
3133B03J9j56K1j80J42j84q2O57l63k21K41k69P6j10J93K9kP1l58L31J11o55K92
$$ plain form
2972 185 132 -130 213 -56 118 108 32 -324 139 26 284 229 -61 -7 -208 67 31 69 -290 -368 -204 -109 180
2995 180 -24 139 133 153 350 -238 -20 8 66 -238 361 37 138 80 -191 -170 9 -96 165 -10 157 82 -123
3018 -123 -217 -52 48 1 -40 198 253 86 -252 179 -36 108 40 -14 161 35 232 0 383 -117 -49 -237
3040 -237 -147 -40 8 -233 117 18 225 -255 -7 48 154 -93 277 93 329 -125 -191 -132 14 87 71 165 13
3063 13 294 -67 23 -110 22 23 -167 -35 39 12 -36 19 59 -143 325 149 -92 -243 -204 -82 -20 435 76 -135
3087 -135 76 -81 9 -216 -166 -191 164 -53 -204 180 77 197 44 71 -27 104 -215 -42 185 217 330 217
3109 217 -161 -68 191 109 58 21 -234 -32 -35 30 60 -99 -165 -72 37 -3 -193 114 152 -154 -42 71 -80 203
3133 203 222 66 87 -93 49 -135 -217 440 77 -144 97 -172 -96 -206 -13 16 14 85 -273 58 169 -486 -194
3156a94M98j13j94P5k3k52L21k91j25K75J29j78L8j62M15j89J0J40l75J79R8j51
3178f9r7L0P3J79J31l84m0L00k90K07j92K96j18J1N2o9j26L12k94L36j36RQ0k32
3202c1J93n37L33j3L0K54l28J14p2k27N73m86o6J30N7K10j57J41j42m2L22l57
3224a01M17j44j85O0N3k41J37N6k00J3P0r9K11L8q4R6k00N3N8n6P8J41m93J57
3248a65R2k3m8j2K98k95K77M9k24K65p8m21P7J70J27l41p2K45K4J53k04L64k97
3271c9J38j11m5r9J98J29l05J19J9j18J13J36N8o6n9j96J64J19k35J09l0m6K35
3294A88k10k28L31o2j77K75l6l0J9J12J11j04k62j00K92J6m56q2M24j4j87K55
3316G5j24jP6k76M03L1k41K25k09J43l45J43j0Qp8l9kK54K12lk90n5K05j58j14
$$ plain form
3156 -194 304 191 -3 72 49 -203 118 -173 -298 -23 106 -72 -34 -196 219 30 40 180 -195 -16 82 -69
3178 -69 -166 -136 -63 116 247 -137 -177 123 -167 40 -152 144 26 37 89 20 -106 206 -88 248 112 121 201 -31
3202 -31 162 -375 -42 -55 -25 229 -99 15 -57 -284 289 -197 -263 -133 -76 134 -23 118 -24 -66 256 -101
3224 -101 316 172 -13 47 100 -141 -4 52 -148 -135 -65 -164 47 85 1 97 -103 -50 8 -48 30 171 -322 -165
3248 -165 -73 -96 -144 -156 142 -153 124 173 -51 214 136 -285 -208 -38 89 -252 -324 -79 -55 98 -106 258 -39
3271 -39 99 -12 -57 -156 42 171 -134 -15 4 -114 -1 135 193 127 68 -128 36 155 -80 29 -1 -47 188
3294 188 -22 -250 81 19 -158 117 81 51 70 182 293 189 -73 -173 119 135 -321 -403 21 7 -180 75
3316 75 -49 -50 26 -250 153 184 -57 168 -41 102 -243 -100 -110 -102 -180 -219 -221 33 245 242 -48 -103 102 -56 -170
3341a70M7L39l32P7M59m63j31L12j28L0J24j04oL1k4k72R7LL63m20J78J60m85
3364c15M53k26J95k07J89P7Q5j33j94R5J29k29q3K9M02j5l32lj57K74J86k12J21
3387A29k16o9J93j20J9r2R4K79j05k35J68J8J06o3K22j41m3k59K21r0j53K93l12
3410a56n1L32O7J3k77L58l06j08K48L3k55jJ67N8k21k26L59m5j07J46Rj34K43
3433A46p6l6q2K31m10k2L40N9m1l42n7O74l28j7J39n4J16l47K01j06r1J20k04
3456a87L27o3o5J38j44J33k48q1M81l82K01j57rJ2J95J6k76K50P3J6k27L19r7
3479B25k96j9m8K83k55K49k24K46k1j24k28P6L93l31J81j6j65K2K2Q6K71j06n4
3502A67l13K02p1K70o0l97J32J32J10j39J56l17J65j7p1J83k5k90K46j74j46K94
$$ plain form
3341 -170 -123 216 -116 -39 420 -43 -174 138 10 40 164 60 54 85 61 -211 -114 -111 252 -168 10 170 -315
3364 -315 138 -88 107 -100 89 166 251 118 -76 19 148 -81 -164 -135 267 252 -80 -83 -240 34 220 8 129
3387 129 -87 -156 37 -83 -64 -156 -62 217 112 -123 45 63 169 106 328 187 144 -115 106 16 -137 156 -156
3410 -156 -207 125 192 205 -72 286 -20 -128 120 153 -102 -103 64 122 -99 -325 34 -11 -118 28 37 -97 146
3433 146 70 34 -48 183 -227 -249 91 150 109 -233 -290 384 56 39 178 124 240 -107 94 -12 -103 17 -187
3456 -187 140 77 12 150 6 139 -109 -190 291 -91 110 -47 -56 -44 151 167 -109 141 214 230 3 322 225
3479 225 -71 -90 -138 145 -110 139 -85 161 140 16 -212 -136 257 -74 107 91 -74 -52 -30 56 327 221 167
3502 167 -146 56 -15 255 195 -202 -70 62 172 33 189 -128 37 20 -51 132 107 -183 63 -111 -257 37
3524C7j24q6N0J0p8K38k4qo2J80J56k38j0j94L19l39K67j88K00k14K35k89N1L99
3548B88l24J18q4k6L7p9p8k2L4L8L03o2J5m50P4J47N83q26N25k77l6M87m21OJ51
3573A21k39L91l74j02K56J72l10Q2M4j02j06J89k44q1M80j38k49J31j48J33J57
3594F3m37L40K08J29k47J97j8l0n21K40Q1K79J41p20M43j78j91L0L50j11j51j78
3616b81M49j25q7l7J03j89K89l47K41r3K26j34L04l54j13J71p6O9j17J93k16l7
3638a61K69n0%n1Jp7Q7o6j02J30j3K2P3K4MN3j7k6k22L96k54O3j46O8M46n25j73
3665b47J85N3o3r5L0K01q7n5%J37j32P0j2j5L19m32J33Q1Q8l3j46o5J47j95L68
3690B35m79M83j19l46K34j55K06OK5j72j92J47j98K95P3j09l10N44q6KK6r5p5
$$ plain form
3524 37 -87 -173 -123 -113 -191 47 23 15 -47 133 289 51 41 -153 166 -173 94 -94 106 -108 127 -162 -111 288
3548 288 -36 82 -2 -28 9 -70 -148 -170 -136 -98 205 143 158 -292 -218 -71 512 -314 211 -66 -102 385 -36 -30 121
3573 121 -118 273 -101 -203 53 225 -85 -3 41 -61 -167 22 -222 -303 177 39 -210 -79 -227 -94 63
3594 63 -374 -34 174 303 56 253 235 205 -316 -76 5 284 425 -295 148 -30 -221 -191 159 48 -103 -281
3616 -281 168 43 -44 -81 22 -167 122 -225 16 -77 149 15 319 -35 -148 23 -53 16 -101 92 -124 -161
3638 -161 108 58 58 7 8 -69 18 -48 -150 -20 -33 -11 62 86 90 143 126 100 -122 274 20 83 -63 5 451 -74 -247
3665 -247 -62 -9 -72 -167 -137 64 -23 -78 -78 59 -73 -3 -15 -30 289 -143 -10 71 159 126 -20 -85 62 -133 235
3690 235 -244 239 120 -226 8 -147 59 65 90 -82 -274 -127 -325 -30 43 -66 -376 168 82 84 110 15 -60
3713f0j9%j38K76j32k4KJ32K01j89J9k07L36q6J50k41Jl0J4J79k14Q7o0K73k39
3738C1k1k61K12J85k14j47p9K52j27k00K64K4M6l36K24j4L55k46O7K1j15R4K9
3761D4OK63l39Q2J09k06k10K20K62m12K01n4N6k17J09P9J5m02L03J62Q7j3j77
3784c2k43L04J72k61m3j07K92j72k1L00N8q2R3j31p5R7o7o01Q21r1j45K14l4k35
3808A1J81K49k93l08Q7J58j65J14K6j50l33K16J71M7J49k52L4j4L03K12p37K46
3830d8N5m04K24K87k9o0J62k92L35k55J51k49J04n9k28J45K79k60K04k8p6M05
3852C63l50J9m72M79j77J55J86l86L95l52M4J05P8M2j73n1j72K78K16m37K58r3
3874d5L45m48J22K6l6J48j61k80m7Q53n57K73q1j93L5K4j40M64j01j00N6r3M3
$$ plain form
3713 -60 -79 -79 -217 59 -73 -97 -95 37 238 49 68 -139 197 111 261 20 21 -9 5 184 -30 57 -3 270 31
3738 31 10 -251 -39 146 -68 -215 -294 -42 -169 -369 -105 -81 -35 -371 -147 -161 194 -52 15 36 -79 15 44
3761 44 50 313 -26 56 165 -41 -251 -31 231 -181 20 -34 22 -195 -86 -7 8 -394 -91 71 158 145 -32
3784 -32 -275 29 201 -60 -103 -210 82 -90 -111 189 247 165 258 127 52 149 82 -519 302 211 66 280 246 11
3808 11 192 441 148 -160 -73 85 -80 34 60 -90 -423 -207 -36 11 160 -92 -58 -72 231 443 -294 -48
3830 -48 7 -397 -173 114 85 25 187 -105 230 -25 126 -123 -19 -78 -306 -161 118 -142 62 34 -42 363
3852 363 13 32 -440 39 -138 17 203 -183 212 -140 -96 9 87 129 -44 -95 -267 11 227 -210 48 -45
3874 -45 300 -148 -26 0 -36 112 -49 -329 -376 477 -80 193 112 -81 -46 -22 -162 302 201 101 157 64 107
3897A07K04m26M22k1l19K88r8l18J70k47L04k49K22r4K9Q6j31o4J00j64M02l36
3919a33k36P18m04J01o1p2K71K20l53j75J56J59r1j67J41p6K27q6k17P2J63k85
3941a28L11k69J81j83P3J03P1l85J47J33J23l49M46j72l16K52J25k38O6P5k3j05
3963f2n6L49k7k56R8r7m5J49r9P8p9M04m81o3J95m1J17lk05K13j47J19j79N1K92
3988B25n52M54L1l08o9K12m1N3K71o6p9q6k67L94j30k28k3L91k41k81N89k52J91
4011A88k35K32k06Pl0qk0K33m30M57j32m1M9m47N25k06J00n5P1k98L62J24L00
4034E40n20m7J49j78j52J84L28k26p9Q4k77QK68O5jk79L12j67l0j21j74N74l99
4057a38N9p7pk0J26m00O27K3OK97o95Q3j05J08J30L8L4j97K53j19j78J8L92k88
$$ plain form
3897 107 311 -115 307 286 -33 255 157 -161 9 -238 66 -183 39 -55 -26 60 -71 -135 -35 -199 203 -133
3919 -133 -369 349 -55 46 -15 -87 184 404 51 -124 32 191 100 -67 74 -2 225 139 -78 -6 157 -128
3941 -128 183 -86 95 -88 -15 88 159 -226 -79 54 177 -172 274 102 -214 38 163 -75 -9 66 43 -62
3963 -62 -118 231 204 -52 46 -51 -96 53 -46 32 -47 357 -124 -187 8 -33 84 81 -124 89 -58 61 -118 -67 225
3988 225 -327 127 158 -150 -219 -7 -48 5 276 210 131 45 -222 172 42 -186 -209 182 -59 -340 249 -3 188
4011 188 -47 185 -21 -14 -44 -52 -72 161 -269 188 56 15 64 -383 142 -64 36 -19 52 -246 116 240 540
4034 540 20 -27 122 -56 -208 -24 304 78 -1 83 -194 -186 82 147 146 -133 179 12 -18 -139 -313 261 -138
4057 -138 -79 -156 -163 -183 -57 -457 170 193 199 496 -199 -116 -221 -113 17 55 89 -108 145 26 -152 -134 258 -30
4081c0k24J87k23M52k02K58l77K64m05K84j1l13N05j73J98j33J24j82l3k26K69
4102IJ44n7k43K14l39K39J11O1R6j67Nl1L7j15K43l8m00M75q0q0P7o1K28l00p0
4127d2k50K87r3R7J05j17l3q2J9L99n34L69k31n7J7j7N7M1J86k00j38j41L21P3
4151C6Lk69L39k0M3j75J45j31j17L30k78Np5J21M2o7K6Q4j77K02l5j57L30k19
4175a4N3R7k49J59j12K3J25j20j17n3J85j42L55l15L44r3l67M4K06l6P1j21M11
4198C34l02m7m7J10Q0l17J67r3j22K10J57K5L3k37Q0J63l43K24Q1ON5k21j17K13
4222I2q0j82j2K85j07n0J77j00J50k0l68J72K51k42r4K70O6j93k13J34j6J40l
4245E7J44k07P1J08l55K27k59K19J50j45J83l86K86L32n15M22n53J52K1L3P9j20
$$ plain form
4081 -30 -254 -67 -290 162 -40 218 -159 105 -300 -16 -27 -340 165 -8 190 57 181 -1 -34 -260 9
4102 9 153 96 -147 67 -272 -33 78 139 235 68 73 42 79 -36 207 169 -231 244 164 84 161 100 328 28 -42
4127 -42 -292 -5 -98 -1 104 -13 -46 -128 -109 290 -244 125 -106 -163 -146 -163 -106 -65 121 -79 -217 -358 -37 36
4151 36 39 -230 109 89 132 -43 102 -29 -146 184 -94 -89 -164 -43 -1 -68 -42 42 -135 67 32 -125 205 -14
4175 -14 39 136 -113 46 -66 -43 82 -38 -155 -208 -23 -165 190 -125 219 126 -241 -197 9 -27 44 -77 334
4198 334 32 -15 -62 48 128 -189 -22 -115 -237 -27 130 155 188 -49 31 194 -149 75 156 162 217 -4 -121 92
4222 92 12 -170 -182 103 -4 -54 123 23 173 153 -215 -43 208 -34 -128 142 208 15 -198 -64 -80 60 57
4245 57 201 -6 65 173 -182 45 -214 5 155 10 193 -193 93 425 -90 332 -221 -69 -48 -15 64 -56
4267e6J72k86j27J41L3k56M99l24L05j1n7j1j61O24n50P4k44J13J39q7L41l21
4289e0K85j46J27m7l0l05L69k84K0j00N09j03j54J84m05N09m46k59M15P6j67m9
4311e1J61j5J95k38p0K3L2o8m7m3J09J16j05q9n4P4J02j06m0L41k10Q3o6J73k66
4336e9O8J25N0o16L91J66J62j48j08r4M3J06K4j65K9m0M39m30M7J34k16K15k86
4359a63N6K6j0M04l51J20j0j10J17j08J30l9j92L97j65q8km6L9m62L74J89k21
4382a15R5N4j05k4K20K08j54j72n3K26l94J31J85k06J02n6q1q9J61k5K61j43J67
4405A93j00j21j40L13l18O1J15J33l3j61j38J48K04j33j13J89n7M5j42K50j8l64
4427a87L92l42K41k45m1M29n42L75L7j2j97j4o6M30k20l14N16K4k27R6j18k41
$$ plain form
4267 -56 116 -170 -297 -156 -123 -379 120 -204 101 90 33 22 -139 485 -65 9 -235 -122 17 -70 271 -50
4289 -50 235 89 216 169 139 -166 203 -81 -61 -161 348 245 91 275 -130 379 -67 -326 89 165 -2 -51
4311 -51 110 95 290 52 -18 5 37 -31 -78 -121 -12 104 -1 -90 -144 -70 32 -74 -114 227 17 100 34 207 -59
4336 -59 9 134 184 -432 -41 125 287 139 31 -63 -20 86 110 -55 -26 -66 373 -57 -10 124 -92 123 -163
4359 -163 -107 -81 -91 313 -38 82 72 -38 79 -29 101 62 -130 267 102 14 12 -34 5 -457 -83 106 -115
4382 -115 -20 34 -71 -95 125 333 179 7 -46 180 -214 -83 102 -104 -2 -58 -139 -228 -67 -92 169 26 193
4405 193 93 -28 -168 145 -173 -112 3 136 103 -58 -196 -48 156 23 -90 99 42 87 -55 195 177 -187
4427 -187 205 -137 104 -141 -182 247 -295 80 117 105 -92 -106 -172 258 38 -276 240 264 37 133 15 -226
4449b26K86k4k46P8m9K09n9L7p4j35K45N5j12m9L3M3J61j65j6K77M2m57Q8m2j21
4474b21j39M04j41NJ70j90M5N0n0j38L01L1j28J8O1J65m94K45J9k45N4J93Q2k97
4498b00P0Q4J39j1K86j26k99K56j45q8L04l07k83K56K14R9m23q4M7j24J81L38
4520A84L6l74J8J83m8J33J4j98j53K22J07k81J10p6J79j11J22j28K82r6k81pJ45
4543a8k20M01k86k9L1L72l53J06K50k39j2k79L27j17M0M6j32J85j25PN9O3j83
4566a06J11j58K25n8k13L31k05J11q6k38N0J78K55k46O3K20l02n2J00N1J08j49
4588a0k66R7K21R1ok0r5J72j80q0L19j42q9q0M3r3M01j81k66J37l2J35K88j20
4612B44l27K27n4j18J00l66L55j77o3L84l89J36l6j13J05K5J88P8j93J60m06K75
$$ plain form
4449 -226 60 36 -210 -132 -181 28 -31 6 -68 -203 42 97 -15 -64 -31 12 173 8 -8 269 311 -146 -58 -100 -221
4474 -221 -360 44 -97 -92 78 -112 -67 -17 -67 -205 96 127 -1 17 78 243 -251 -6 13 -232 -178 15 97 -200
4498 -200 -130 -46 93 82 368 242 -57 199 54 -34 270 -37 -320 -64 150 249 -174 -258 -211 -335 -154 184
4520 184 220 -154 -136 47 -1 132 146 -52 -205 17 124 -157 -47 -123 56 -55 67 -61 221 125 -156 -163 -18
4543 -18 -238 163 -123 -152 -121 251 -102 4 254 15 3 -276 51 -66 -26 20 -112 73 -52 -45 14 77 -106
4566 -106 5 -153 72 14 -199 132 -73 38 -48 -286 -236 -58 197 -49 14 234 -68 -120 -20 31 139 -10
4588 -10 -276 -179 42 133 127 107 12 184 4 -76 243 101 12 -68 -25 -118 283 102 -164 -27 -59 76 364 244
4612 244 -83 144 90 -28 72 -294 61 -116 -179 205 -184 -48 -84 -197 -92 -67 121 199 6 166 -240 35
4634C5P8j13k04L06P9l76K03J89j05j25j8M4K37l61J30J36k34N3N9o5M6j65K88
4657A17M6J71k74k53M28m78J98j6J22J02j22%K07j32l44J84mL9m5K90l97J32R2
4680F3k34L88o4k09n7L6K60l13L67k15l02J68l0L1J57N4k03O5r6P6q2j02K55N4
4704F7k29O12m79K76q7j7O7J9l61P9K44j63l4k44jO76m22j64J45k28M99k80j05
4727a30M47l77K34j19r2k57L47p1M3q6KK26l84M23j28l50J64K31k66M9K94j78
4749B2k81R1Q8L59l82mK80J38j30j16j8J94j4j18L5o8K4p4j23M0K56k99k01M04
4773A03k60K69m10J53J46k27Q7L65r2k94O3R8j6L23k64j58K60r1o5k32N7L75j60
4796C0Q1j66n0N7K16p7J38q5k44P7J55J04m34L3K04J70k49J39k38R7J15o1J30
$$ plain form
4634 35 113 0 -204 102 181 -195 8 197 92 -33 -51 -7 230 -131 -1 135 -99 -46 13 -52 -6 -171 117
4657 117 163 334 60 -193 235 -243 -45 -61 61 163 41 41 248 116 -228 -44 -48 -9 -54 236 -161 -29 63
4680 63 -171 217 153 -56 -113 -77 183 -130 237 22 -280 -112 -142 -111 46 100 -103 -38 -134 -58 -140 -242 13 67
4704 67 -162 450 -29 247 160 143 210 229 -132 -53 191 28 -6 -250 -251 425 3 -161 -16 -244 255 -25 -130
4727 -130 317 -60 174 55 -37 -294 53 -18 25 -61 -59 167 -217 206 78 -272 -108 123 -143 -94 200 22
4749 22 -259 -168 -80 279 -103 -107 173 311 181 65 47 241 227 109 144 76 100 26 -97 -57 199 -100 -301 103
4773 103 -157 112 -298 -145 1 -226 -139 226 134 -160 -97 1 -15 308 44 -114 146 55 -10 -242 -185 190 30
4796 30 111 -55 -105 -48 168 91 229 144 -100 -23 132 236 -198 -165 39 209 -40 99 -139 -42 73 12 142
4819A42k32K69k75R9R3j15Q5l11J40R2K58L5m66Q5K12P6l69P4l7L15j02m0k41
4842b13L38k00O7K66k76O0l1R1l53L48j5K03n7l0n03M66k35K27M9r8j1m09M60
4865A44j47J41j77M5J32j25l43M68l69M43k16JJ06m3r9J50o1J64j71l8k66K25
4887c6o8p7L58L2o7k29J84M4r6j78L22l28N37m79J92k54l9J75M89m15J99k69J57
4910A54J35k22j13J95j38mJ66j74n3j22j66J00M57l00L35j18n0k47J21K18l2k8
4932A14k21n4M25k75J39j6k25M26j93l08K19K93k11P8j37J38p1JO9k61J79Pk08
4955i2J2J14J64k45J34J02q6j29j78K03J6P7j84M08k37o0j7Rk8j78L16r4j51N06
4979C82k51j39O6n2j92j08L56p6n0o7L74o80O13j93M2k27L02k26M3j28k2l7K35
$$ plain form
4819 142 -90 179 -96 3 96 -19 66 -245 -105 -13 245 280 -186 -101 111 187 -182 -108 -145 170 68 28 -213
4842 -213 125 -75 -8 258 -18 42 11 102 -251 97 82 285 228 198 -305 161 -74 153 202 104 93 -316 144
4865 144 -3 138 -39 6 138 13 -330 138 -231 212 -4 -3 103 60 -39 111 50 214 43 5 -261 -36
4887 -36 -104 -181 177 209 142 -87 97 141 45 -133 189 -139 398 -81 111 -143 -182 -7 482 67 266 -3 154
4910 154 289 67 -46 149 11 7 173 -1 -54 -176 -342 -242 215 -85 250 132 82 -165 -44 174 142 114
4932 114 -107 -161 264 -11 128 112 -113 313 120 -188 31 324 113 191 54 192 121 122 191 -70 109 116 -92
4955 -92 -80 34 198 -47 87 189 103 -26 -204 -1 15 92 -92 316 79 19 2 11 -17 -195 121 27 -124 382
4979 382 131 -8 58 6 -186 -294 62 -14 -64 -131 243 -437 176 -17 25 -202 100 -126 -83 -211 -233 -270 -35
5002c5J69j1k82M56k56L0m6k33K54p1K05k60M6J66j84K01j62K13j06R8J4k69K36
5025A73k16j91L9K38J52l25J6K25o5O0j78J10J15r4o8m6O6O4K1k09N8J12l88N45
5049B14l11L38m02j46M29j73J11J6j71l1L26l75L50j26jJ05l06K40j14j64K06
5070A5M10m47J62k11J38KK54l83j25J54r7N1k4K70m99M56pL4k59K29j90m70R00
5093C63j2l67L13l53oq0J49J51K64p32K96K7J9q4J06q4R8k8K70o24J75L53k25
5116a1k6J3K19o9k37K81p3J9J57m47K18k70K12R0o8o8j21M2J29j30K22J18j75
5139B5l36M48j18K41n7l31o4K9n5K35j22J93L7o0J4p7J93l05K07J01k56j12K11
5162D1K5K17l20l54K70K38j16R9j1Q8j20M5k1Q3J6j00j46MQ4j51J15k21J96l5
$$ plain form
5002 -35 134 123 -159 297 41 71 25 -208 46 -25 180 -80 -34 132 -52 149 -13 200 94 192 206 -63 173
5025 173 -43 -234 -195 43 195 -130 -114 111 46 106 -72 38 153 59 -9 -55 11 75 96 -113 -55 57 -331 214
5049 214 -97 241 -161 -307 122 -51 60 76 -95 -126 200 -175 175 49 48 153 -153 87 -27 -191 15
5070 15 425 -22 140 -71 67 69 323 -60 -185 -31 -128 -77 -101 169 -330 126 119 153 -106 123 -67 -537 363
5093 363 351 -16 297 -56 -62 -142 7 158 422 -310 -14 13 32 -52 54 -30 68 40 310 -314 -139 214 -11
5116 -11 -37 -24 195 126 -111 170 97 116 273 -174 44 -226 -14 76 8 -60 -181 -139 -10 -140 82 200 25
5139 25 -311 137 19 260 203 -128 -192 -163 -218 17 -105 88 125 65 79 2 195 -110 97 198 -58 -170 41
5162 41 66 283 -37 -391 -121 117 1 100 89 177 57 102 81 164 180 80 -66 -62 22 -129 -14 -235 -39 -74
5186g4K91l78M01l40k4K37o8M3M6k42L57j08k93M37n63J34K55l25J88J17j57K18
5208A52o0P1k8j98L86m81L05k49L60n3m40K34l21M17j62J7n4J49j0o4o4J10j25
5231a08L17k73j77K9K60j25J62J14j10m0M4k17k59M79J82j45K7k06J28j53M8j02
5253a25O27m24j31JQ7M5P4k19K08N5j85J7J09o5J7o7j07o6L66k75K2KL20j19k53
5278h6O4j03J5P8J59l8k77K68L7L6k30K47K7k15m9M2Q0k86J66J15Oj2l9j91Q1
5303a05O6m76J263o62l08K20r7k53L23K08l74l0J46J09O2k07j55M97k12j49M1
5324i3L2K30k92J35k2r5MM0l69M13j74K4L72m6L8l48O9J90k44K86l54K53l25M11
5348A35P0j71l71L34J69j85K74j47q6O1J9N6k6M7k07j07n5O0L9J05L3k98Q4k5
$$ plain form
5186 -74 217 -161 240 -100 -124 113 45 88 134 -108 249 141 -152 285 -278 -144 111 -214 -26 91 -66 152
5208 152 92 163 135 -63 323 -158 147 -102 258 205 -235 -1 -322 95 -67 -50 -104 45 35 -29 -93 17 -108
5231 -108 209 -64 -241 -212 48 -77 85 199 89 49 93 -124 -383 96 278 133 160 -46 82 -71 -23 -125
5253 -125 502 78 -53 -52 35 80 154 -65 143 198 13 30 139 74 91 24 -83 -149 217 -58 -36 -34 286 167 -86
5278 -86 -22 -125 -110 -32 127 89 -188 80 117 153 -77 170 197 -18 -67 -25 55 -231 -65 50 56 44 5 -186 -105
5303 -105 -39 -515 748 86 -222 -2 -99 -352 -29 179 -195 -225 -79 30 92 -115 -270 227 15 -134 -93
5324 -93 -61 169 -123 12 -10 -105 -101 -61 -430 -17 -191 -167 205 159 197 -151 -82 108 -136 150 -204 49 -276 135
5348 135 205 34 -337 -3 166 -19 255 108 22 83 102 158 132 179 -28 -135 -190 -130 -91 14 47 -251 -167 -192
5372a92K38o4j80K28J44o9J27l60K72K0k43R9j82K69k84K21OJ00Nj83nJ85k7j34
5396iK76j30m01J35J75q5K10j10M1P0m56K40K77l90n2L79j69k3J19j61J03n45
5418e06N90m4j35J76M1K64l62j23J57j01J87n8L1j94J06l3o7K23l12L84j57L0
5440I7l97K98L29k73J55j58J26j98k2J5o6J68k27J50K18o4o7o6J16p5J35k95j40
5463b41N07k96R2o7K48l10M61k90m2K96j81m2Q5P1m47k1p3m2M86k51JK38r5j95
5487a08r0J02R4q6J97l1P7M5j72j60J70P4J7N3J9m34L08J3k64L05k42rj32O1L61
5512A68k24L1L48m0m7k67K98n03J80K87k87j56j5N8J38JJ8j1J34N0l65Q0N6J09
5536D1K64k60L08l74l3J83j75L4k12L50k32R0O6p3Mj8J31j88K55j6j75Q1K63n22
$$ plain form
5372 -192 46 -18 -198 30 174 105 232 -128 144 164 -79 20 -162 107 -177 44 50 150 155 -28 -33 152 125 -9
5396 -9 267 137 -264 -129 46 -39 171 61 102 172 -284 -44 233 -157 -209 170 1 -22 97 -64 39 -506
5418 -506 84 40 -95 81 122 386 24 -99 58 -43 144 86 117 -77 29 -4 -71 152 -160 224 67 97
5440 97 -300 -2 327 54 209 51 177 -21 -43 -28 -94 74 -153 -3 215 151 84 18 134 59 194 -101 -241
5463 -241 266 -30 62 -5 243 -67 394 104 62 358 177 135 220 291 -156 -177 -250 -292 194 -57 -56 182 87 -108
5487 -108 -198 -96 -2 -88 109 78 155 200 28 -132 38 112 129 182 201 -233 75 88 -176 129 -113 -122 -254 -193 168
5512 168 -56 -25 323 283 236 -31 267 -236 -56 231 -56 -212 -227 -169 -31 -30 -12 -23 111 161 -204 -124 -68 41
5536 41 305 45 353 -21 -54 129 -46 -12 -224 126 -106 -16 50 -23 -19 -37 94 -94 161 145 -30 51 314 -208
5560b08K06Nl73N20l20J32o4K37m2o0K9k80J13J75L5L73n53P2O5l44L92j90J28
5583D8J7L2Q6j71k6J61K87j44l94r0P5mP1M3lK46l47K74l29L87k3k73L3n5L52
5608B53m21M47m23P9L00m57J68O4k9l02J57o6KJ26K16l4l86J07K69ml04J60J88
5631A10r2J58l89P04l63n8L2j40j15J67K1K3J3j32L9Q3q5J16k95QL52J09j66q3
5655A7m0j10L3K00l71L46k3k57K58M9jj25K31n1l4J17ok83K16k07M5J79l76J83
5679a0J4j87K65m7j63K28J94k33j67K81j20j63J07J09o3O4J21j72J55j31q8j35
5701a41J78j19j24P9o4K62k7p8J54l8k49m3K53r1j01Oq7J50N6N2K24j27Qm50O2
5726b55J42RJ27l9L5k51K41J14k8j66R2R0r6o5J24q0k0j06L9L71j09k04N9n8J13
$$ plain form
5560 -208 -2 3 -370 150 -170 -38 -102 135 93 33 62 -218 -105 70 105 478 -75 -3 62 -282 110 -80 48
5583 48 65 97 183 12 -14 147 434 290 -104 -194 -119 -123 -52 -9 -12 234 -113 161 -168 219 196 -77 -44 -99 253
5608 253 -168 279 -144 -65 235 -222 -54 10 -19 -321 -164 -230 -228 -102 114 80 -306 -199 70 66 -238 -78 110
5631 110 18 176 -213 491 128 70 102 -38 -153 14 35 58 71 -61 -22 61 -24 92 -203 -195 157 266 100 17
5655 17 -23 -133 -100 100 -271 75 52 -205 53 102 101 -24 207 156 122 239 233 -50 166 -41 4 183 -193 -10
5679 -10 4 -183 82 35 -128 100 294 61 -106 175 55 -108 -1 108 45 109 230 58 213 82 -6 -141
5701 -141 37 -82 -206 -127 -191 71 44 -34 120 82 -167 -210 43 -48 -149 -143 -230 -80 -24 28 252 125 133 -317 -255
5726 -255 -113 -104 23 -16 19 -232 9 123 95 -71 21 111 15 -50 74 -6 -26 -132 -93 278 169 -35 24 -34 79
5751G9l46J97m6j91L46K60n41K55J98o7j33m5L92n83K93J73j47j47k96M05m26
5772c70K00M20n21J87K04l2L56m00j5l07M33p3n6lO4J03j53j2n1k76J53K69l19
5795a99k33jN40n5j07rQ2J57l66k4J5J33NJ7q5M03k84J5j67L40L1l37J59l42L80
5820F8J0j65l6M90j64j85k18K58M8o6j94M09k04M6l93Q4N29l09J96j66L43j79
5842B02j77L20k58K04m61Q5%q4K27j38K44j47j05K59l74K20K4n7l1j56L19o5o
5865D5k8k71L10n7J23o7N6M1n10K61K06q9J8K8k25N5N8L3J1L23j63j82j46M12
5889B42k18k49M93j74j78j10L30K16l51K80l58L63l87K51j62J97k18J83j02j67
5909a19J79M3Q4J24p9J27l34lk5N5K35m36K47K4L4k06J30j99K23l52M84k61o9
$$ plain form
5751 79 -267 -70 -116 -307 39 299 -242 13 211 144 11 -34 358 -225 68 241 94 -53 -349 56 -370
5772 -370 -170 250 -271 -84 120 88 444 44 29 -278 155 82 26 23 87 190 37 25 -26 -302 -149 120 -199
5795 -199 -432 -433 107 52 -55 -64 18 175 -191 -215 -200 -67 -62 -45 -130 273 -11 4 -163 177 208 -129 30 -312 68
5820 68 78 -87 -123 367 203 18 -200 58 106 40 -154 255 51 97 -296 -212 317 8 204 38 381 202
5842 202 25 345 87 291 -170 -85 -85 -169 58 -80 164 17 -88 171 -203 17 41 -16 -47 -203 116 51 45
5865 45 17 -254 56 -1 122 55 111 152 -358 -97 109 20 38 66 -159 -104 -46 -13 -2 321 158 -24 -170 242
5889 242 24 -225 268 94 -84 -194 136 352 1 281 -77 286 -101 150 -12 185 -33 150 48 -119
5909 -119 60 103 187 311 232 359 25 22 -3 52 287 -149 98 122 156 -50 80 -119 104 -248 236 -25 -94
5932i4Q4o1j00P8J87J04l58J94o3J10l11L63j03j82K08P5O4r5J25k17q4l1r2K54
5956E5k65M36J28l45Q4L0L8k70j48L95J10k92N9lK30k34K67j9k30j59K57k04j77
5979b57L22j87J20J5L4O2j29M9k8k7j1J18k75L10k39j4j6p2R5l6L57r6j63J03
6003C5l39N25l54MJ69o6l7K70l7k49N1J24k3q6K0m0M2p2K13k15J30k0k81K5L45
6028A34Jrk77J6J51p3K64l06J66j90J42R4N0j08k76K47j64Qo1O4l1K80j63J87
6052A46k93O3L10l14P8j97M00j01k42N8K38R5l25J33k84P1j0ML79k69J20j16q1
6075a37l3K10n2L1j03M02m84j03L05o0P9n7k11K37J54l25K81O1k55K23l41P5j13
6098b16Q4j11L09L0j53j60L25L81q03K14K40j7Jj97K46k62L2r0J82q1M4n9l06
$$ plain form
5932 -94 -10 -71 -171 -93 94 198 -160 34 -29 81 -230 133 30 -152 56 131 195 100 225 8 -76 -107 -199 55
5956 55 -210 226 354 9 93 123 161 -109 -257 138 248 -44 15 12 242 8 275 256 26 -133 124 -80 -257
5979 -257 65 -122 -2 13 47 109 -20 29 1 -26 -37 81 -194 116 -123 -137 -153 -225 -130 -166 191 95 -68 35
6003 35 -304 221 -133 -129 40 -26 -63 207 170 -79 -28 96 73 -13 7 -33 9 -63 150 -65 65 45 -236 -211 134
6028 134 135 126 -151 -135 16 -57 207 -99 67 -123 19 113 163 55 -221 26 -138 -130 -191 -127 -158 122 -41 146
6052 146 -147 -84 226 -88 -10 -207 193 92 -150 -92 146 241 -84 49 -235 -164 -174 -170 209 -60 60 -56 -137
6075 -137 -170 40 -12 19 -84 318 -166 -269 36 -24 55 -2 -213 24 178 -147 134 195 -60 163 -178 -103 -216
6098 -216 -132 -243 66 96 -57 -217 108 489 -314 -100 140 123 124 -73 173 -89 -57 -147 35 -46 -2 -61 -367
6121c67K47J54K2k32L28l72K24l1J69k86J18j73K40O1KJ76k15J8m36N93k80K05
6143A65j70J90k6k92Q3q6J20q4k5K29J1K9k76J21P7jK7k79K85J30j1n05P1K3P6
6168a18q1L53k00j48L12j68j61K66r6L55l83k43M03j72N1p1J46M4j56j9K50k0
6190A44j93J49K1K4o5Q9l20L67j78O3j20K6n5P4nJj67J50j56M9q3J81j79j32L80
6215F5j02Qj2J2L42o5k30J0J56l60J72k2O4q8J05l72M32m2p7R4l25K83j7j10K14
6240A35l08J51p3J52J06k06l3k58K24L5j04J36j18Q1J37p5P2N6k8k23J62j76O3
$$ plain form
6121 -367 -120 34 56 -176 152 -220 4 -27 142 -144 -26 -199 41 102 104 280 65 83 -353 240 -40 165
6143 165 -5 185 159 -133 -50 -136 -16 -100 -125 104 115 144 -132 -11 66 65 92 -187 98 228 217 -288 -217 -194 -118
6168 -118 -199 154 -46 -194 118 -50 -211 55 -41 314 -69 -312 91 -81 -30 -101 45 89 -67 -86 164 144
6190 144 -49 100 121 145 80 169 -151 216 38 101 -19 7 -48 26 21 22 -145 5 -151 -102 -185 -4 -183 -315 65
6215 65 -37 -29 -41 -29 313 248 18 28 184 -176 -4 -26 38 -50 55 -317 115 73 -4 90 -235 48 31 -79 135
6240 135 -173 -22 -95 57 163 -43 -76 -334 -110 -75 -179 -43 -161 -80 57 -18 54 110 82 -141 21 -155 -92
$$ [...]
8191A16
##END NTUPLES=NMR FID
##END=
