##TITLE=1H_BAU-j-4.066
 DMSO, 8 sc, 
 4.7.2019
##JCAMPDX= 6.0         $$ Bruker NMR JCAMP-DX V2.0
##DATA TYPE= NMR FID
##DATA CLASS= NTUPLES
##ORIGIN= UXNMR, Bruker Analytische Messtechnik GmbH
##OWNER= root
$$ XWIN-NMR		Version 3.5
$$ Thu Jul  4 16:00:30 2019 Russian Standard Time (UT+4h)  she@DPX200
##.OBSERVE FREQUENCY= 200.13155
##.OBSERVE NUCLEUS= ^1H
##.DELAY= (6, 6)
##.ACQUISITION MODE= SIMULTANEOUS
##.ACQUISITION SCHEME= undefined
##.AVERAGES= 8
##.DIGITISER RES= 18
##SPECTROMETER/DATA SYSTEM= spect
##.PULSE SEQUENCE= zg30
##.SOLVENT NAME= Pyr
##.SHIFT REFERENCE= (INTERNAL, Pyr, 0, 15.7039)
##AUDIT TRAIL= $$ (NUMBER, WHEN, WHO, WHERE, WHAT)
$$ ##TITLE= Audit trail, XWIN-NMR		Version 3.5
$$ ##JCAMPDX= 5.01
$$ ##ORIGIN= Bruker BioSpin GmbH
$$ ##OWNER= she
$$ F:/spectra/data/she/nmr/H-F/1/audita.txt
$$ ##AUDIT TRAIL=  $$ (NUMBER, WHEN, WHO, WHERE, WHAT)
(   1,<2019-07-04 15:59:31.35 +0400>,<she>,<DPX200>,
      <created by zg, POWCHK disabled, PULCHK disabled
       configuration hash MD5:
       00 E9 B6 7A A2 85 ED C7 34 08 36 98 17 FE 4E 26
       data hash MD5: 16K
       8E F3 20 F5 07 0C 0E E0 D4 23 E8 0D FF 18 3A F8>)
$$ ##END=
$$ 
$$ hash MD5
$$ 24 53 D2 32 3D 7B 8B 36 3D 11 34 9F 53 52 2C F5
##$RELAX= 
##$RELAX= 
##$RELAX= 
##$RELAX= 
##$RELAX= 
##$RELAX= 
$$ Bruker specific parameters
$$ --------------------------
##$DU= <F:/spectra>
##$EXPNO= 1
##$NAME= <H-F>
##$PROCNO= 1
##$TYPE= <nmr>
##$USER= <she>
##$AMP= (0..31)
100 100 100 100 100 100 100 100 100 100 100 100 100 100 100 100 100 100 
100 100 100 100 100 100 100 100 100 100 100 100 100 100 
##$AQSEQ= 0
##$AQ_mod= 1
##$AUNM= <au_zg>
##$AUTOPOS= <>
##$BF1= 200.13
##$BF2= 200.13
##$BF3= 200.13
##$BF4= 200.13
##$BF5= 200.13
##$BF6= 200.13
##$BF7= 200.13
##$BF8= 200.13
##$BYTORDA= 1
##$CFDGTYP= 0
##$CFRGTYP= 5
##$CHEMSTR= <none>
##$CNST= (0..31)
1 1 145 1 1 1 1 1 1 1 1 1 1 1 1 1 1 1 1 1 1 1 1 1 1 1 1 1 1 1 1 1 
##$CPDPRG= <>
##$CPDPRG1= <>
##$CPDPRG2= <>
##$CPDPRG3= <>
##$CPDPRG4= <mlev>
##$CPDPRG5= <mlev>
##$CPDPRG6= <mlev>
##$CPDPRG7= <mlev>
##$CPDPRG8= <mlev>
##$CPDPRGB= <>
##$CPDPRGT= <>
##$D= (0..31)
0 1.2 0 0 0 0 0 0 0 0 0 0.03 0 0 0 0 0 0 0 0 0 0 0 0 0 0 0 0 0 0 0 0 
##$DATE= 1562241570
##$DBL= (0..7)
120 120 120 120 120 120 120 120 
##$DBP= (0..7)
150 150 150 150 150 150 150 150 
##$DBP07= 0
##$DBPNAM0= <>
##$DBPNAM1= <>
##$DBPNAM2= <>
##$DBPNAM3= <>
##$DBPNAM4= <>
##$DBPNAM5= <>
##$DBPNAM6= <>
##$DBPNAM7= <>
##$DBPOAL= (0..7)
0.5 0.5 0.5 0.5 0.5 0.5 0.5 0.5 
##$DBPOFFS= (0..7)
0 0 0 0 0 0 0 0 
##$DE= 6
##$DECBNUC= <off>
##$DECIM= 24
##$DECNUC= <off>
##$DECSTAT= 4
##$DIGMOD= 1
##$DIGTYP= 9
##$DL= (0..7)
0 120 120 120 120 120 120 120 
##$DP= (0..7)
150 150 150 150 150 150 150 150 
##$DP07= 0
##$DPNAME0= <>
##$DPNAME1= <>
##$DPNAME2= <>
##$DPNAME3= <>
##$DPNAME4= <>
##$DPNAME5= <>
##$DPNAME6= <>
##$DPNAME7= <>
##$DPOAL= (0..7)
0.5 0.5 0.5 0.5 0.5 0.5 0.5 0.5 
##$DPOFFS= (0..7)
0 0 0 0 0 0 0 0 
##$DQDMODE= 0
##$DR= 18
##$DS= 0
##$DSLIST= <SSSSSSSSSSSSSSS>
##$DSPFIRM= 0
$$ [...]
##$SUBNAM2= <"">
##$SUBNAM3= <"">
##$SUBNAM4= <"">
##$SUBNAM5= <"">
##$SUBNAM6= <"">
##$SUBNAM7= <"">
##$SUBNAM8= <"">
##$SUBNAM9= <"">
##$SW= 24.9336996594482
##$SWIBOX= (0..15)
0 0 2 0 0 0 0 0 0 0 0 0 0 0 0 0 
##$SW_h= 4990.01996007984
##$TD= 16384
##$TD0= 1
##$TE= 0
##$TE2= 300
##$TE3= 300
##$TEG= 300
##$TL= (0..7)
0 120 120 120 120 120 120 120 
##$TP= (0..7)
150 150 150 150 150 150 150 150 
##$TP07= 0
##$TPNAME0= <>
##$TPNAME1= <>
##$TPNAME2= <>
##$TPNAME3= <>
##$TPNAME4= <>
##$TPNAME5= <>
##$TPNAME6= <>
##$TPNAME7= <>
##$TPOAL= (0..7)
0.5 0.5 0.5 0.5 0.5 0.5 0.5 0.5 
##$TPOFFS= (0..7)
0 0 0 0 0 0 0 0 
##$TUNHIN= 0
##$TUNHOUT= 0
##$TUNXOUT= 0
##$USERA1= <user>
##$USERA2= <user>
##$USERA3= <user>
##$USERA4= <user>
##$USERA5= <user>
##$V9= 5
##$VALIST= <valist>
##$VCLIST= <CCCCCCCCCCCCCCC>
##$VD= 0
##$VDLIST= <DDDDDDDDDDDDDDD>
##$VPLIST= <PPPPPPPPPPPPPPP>
##$VTLIST= <TTTTTTTTTTTTTTT>
##$WBST= 1024
##$WBSW= 4
##$XGAIN= (0..3)
0 0 0 0 
##$XL= 0
##$YL= 0
##$YMAX_a= 167908
##$YMIN_a= -388517
##$ZGOPTNS= <>
##$ZL1= 120
##$ZL2= 120
##$ZL3= 120
##$ZL4= 120
##$ABSF1= 10
##$ABSF2= 0
##$ABSG= 5
##$ABSL= 3
##$ALPHA= 0
##$AQORDER= 0
##$ASSFAC= 0
##$ASSFACI= 0
##$ASSFACX= 0
##$ASSWID= 0
##$AUNMP= <proc_1d>
##$AZFE= 0.1
##$AZFW= 0.1
##$BCFW= 1
##$BC_mod= 2
##$BYTORDP= 1
##$COROFFS= 0
##$CY= 11.3945322036743
##$DATMOD= 1
##$DC= 2
##$DFILT= <>
##$DTYPP= 0
##$F1P= 18.9103706918063
##$F2P= -1.10871071338519
##$FCOR= 0.5
##$FTSIZE= 0
##$FT_mod= 4
##$GAMMA= 1
##$GB= 0.15
##$INTBC= 1
##$INTSCL= 1
##$ISEN= 128
##$LB= 0.24
##$LEV0= 0
##$LPBIN= 0
##$MAXI= 10000
##$MC2= 0
##$MEAN= 0
##$ME_mod= 0
##$MI= 1.114404
##$NCOEF= 0
##$NC_proc= 0
##$NLEV= 6
##$NOISF1= 3.799351
##$NOISF2= 2.8
##$NSP= 1
##$NTH_PI= 0
##$NZP= 0
##$OFFSET= 15.70392
##$PC= 1
##$PHC0= -8514.886
##$PHC1= 38.60096
##$PH_mod= 1
##$PKNL= yes
##$PPARMOD= 0
##$PSCAL= 0
##$PSIGN= 0
##$REVERSE= no
##$SF= 200.130013532006
##$SI= 16384
##$SIGF1= 3
##$SIGF2= 2
##$SINO= 400
##$SIOLD= 16384
##$SREGLST= <1H.CDCl3>
##$SSB= 0
##$STSI= 0
##$STSR= 0
##$SW_p= 3612.71676300578
##$SYMM= 0
##$S_DEV= 0
##$TDeff= 0
##$TDoff= 0
##$TI= <>
##$TILT= no
##$TM1= 0
##$TM2= 0
##$TOPLEV= 0
##$USERP1= <user>
##$USERP2= <user>
##$USERP3= <user>
##$USERP4= <user>
##$USERP5= <user>
##$WDW= 1
##$XDIM= 8192
##$YMAX_p= 0
##$YMIN_p= 0
$$ End of Bruker specific parameters
$$ ---------------------------------
##NTUPLES= NMR FID
##VAR_NAME=  TIME,          FID/REAL,        FID/IMAG
##SYMBOL=    X,             R,               I
##VAR_TYPE=  INDEPENDENT,   DEPENDENT,       DEPENDENT
##VAR_FORM=  AFFN,          ASDF,            ASDF
##VAR_DIM=   8192,          8192,            8192
##UNITS=     SECONDS,       ARBITRARY UNITS, ARBITRARY UNITS
##FACTOR=    0.0002004,     1,               1
##FIRST=     0,             0,               0
##LAST=      1.6414764,     0,               0
##MIN=       0,             -388517,         0
##MAX=       1.6414764,     167908,          0
$$ Real data points
##PAGE= N=1
##DATA TABLE= (X++(R..R)), XYDATA
$$ [...]
1882a12KL9K81p6r6q9OJ16j18J53m7M8k86q2M3J74J93L3j28l93J48J46K04q1o1
1907A7l4j59p5L03Jj0J22r1j63K04j63J76k52J36K73l10L31j45j00K1R0l56K22
1930C8J49j00l28J99m1j38J92j73J66K12j14n2J57k52j36J04K90j81k5J54l76
1951b55K18J54p3j67J68o0J76n5n1n2j7l4O9K13r5l20l0K18n4J47j94K21m14J78
1975a09J06PK67j06j66J97j48l29M48O0l12m2J28n8K30j04n4r8J05j4k53K78l8
1998eK83p10J95M0K0L53l55k0M81k24j52J13J0K8k23K84%l93L51pm5K13j73J57
2022B21j15j71K59J14n01J50M06n35J4L42J50m21J47l82K85j43K70k25N2p8M0
2043a21l1K19j65J8j27L06k32K24N3j86J06j29K75m8l95K49j28N5L5J32k66L15
$$ y = [-112, -110, -71, 210, 134, 38, -51, -45, 71, -47, 106, 59, 107, -179, -261, -218, -44, 149, 182, 54, -339, -191, -45, 159, 78, 17, -17, -176, -251, 52, 53, 43, 165, 74, -89, 115, -48, 128, -124, 12, 285, -25, 306, 161, 61, 82, 172, -184, 38, 187, 87, -241, -42, -83, -221, -29, -202, -36, 176, 62, 10, 167, -85, -221, -117, 173, -8, -33, 121, -255, -37, 117, 44, -123, 45, -15, 161, 106, 55, 3, -14, -48, 21, 234, 139, -181, -211, 7, -47, 100, -94, 127, -287, -109, -3, 4, 271, 165, -1, 196, 48, -281, 167, 227, -85, -127, 1, -57, 173, 69, 15, -83, 22, 8, -245, 33, -5, 278, -432, -237, -197, -177, 176, -179, -199, 282, 58, -94, 19, 29, 57, -166, 118, 118, -275, 76, 69, 24, 237, 64, 221, 106, -65, 194, 308, -193, -43, 363, -172, -158, 184, 334, -87, 60, -322, -37, -180, 90, -135, -83, -161, -121, -152, 67, -98, -80, -207, 99, -133, 91, 144, -42, 64, -65, 210, 162, -233, 16, -112, -57, -22, 110, -156, 159]
2065A59r8j37J94O0n12K90N8m9J18j91K98j2j31n7N5j02K7L83l49k13K43j80j54
2088c00L04j13J77j57J31J67l99K55o8K86j46m8l62J65j36M13j50j85L05p8k58
2109a97JJ52J00K38m42M52k59J18k53K14l5j15M0p2j70q8Q8J58j84M30k23k67
2131c14L52l9M7l6K6j05L67n57J64J61j87M17l56Qkr3n6K54k06Q6K67k56O8P6
2155H6o1L9K67j56k89J90k02R0j65J86J02k4o6k04J49M4L8RK51m01K33j97L08
2178B27j04j11r6J24q1k27J35K16L2K5l12L04j34l21M16q2q1j17R3J35k58M97
2200B80k8l04q2L2K18q5J57l41J00l8rN4q4P8o5K26K6m6k82K75j36N5J65j63K60
2225B63m10Q2k86N41j86j59J08J59r3k42K7P3K94j77l12L19m9K45r1j50m0J05
$$ y = [159, 61, -76, 118, 178, -334, -44, 14, -35, 83, -108, 190, 178, 47, -10, 45, -57, -30, 353, 4, -209, 34, -146, -300, 4, -109, 68, -89, 42, 209, -190, 65, -3, 283, 137, 89, -273, -108, -244, 169, 19, -166, 139, 61, -197, -196, -44, 56, 294, -148, 304, 45, 163, -90, 124, 89, -26, 14, -58, -228, -316, -228, -70, -254, 176, -47, -314, 38, -1, 46, 10, 36, -69, 298, -259, -95, 66, -121, 296, -60, -52, -54, -147, -203, 51, -155, -69, 198, -58, 10, 86, 25, 64, 331, 175, -114, 76, -126, -36, -201, -15, 87, 63, -3, -207, -58, -14, 24, 33, 284, -117, 116, -81, 227, 123, 12, -84, 40, -41, -268, -133, 83, 115, 140, -172, 132, -2, -323, 93, 11, -70, -187, -94, 41, -217, 280, 252, -52, -134, -102, 116, 31, 188, -153, -53, -91, -100, -46, -130, -52, -117, 109, 135, 89, -193, 82, -54, 1, 166, 3, 263, -147, -65, -351, 190, 4, -155, -47, 112, 19, -223, -196, -123, 171, -6, -318, 1, -48, 197, 106, -44, -84, 21]
2247B1j68M7J14J07j28j50M26k13N0J85k70k28L21r2l6n8J22j74J55j96J39o7
2269i3K80j89J06j44r5K64k41M28l40J91j58J38j90nK22l30K40k33K42r7K62l5
2291B23j84O1Q9k23K30l0n9j40Q8j80K3K09N1j76J9J47j3k72J42R1l03L79l02
2314a30j35n4M97j94Q6k26J23r0J36J54l15q3L01j78J55K33k46J48j73k7j54K95
2336A23k47J24K16j87k53M09j9p9j76J87k41O2K11j13q5L15j51k77L38m6k05J70
2358G6J12l69J10K03k22K14j01k84M43k75j26J45J80j53J28j85Q0k9J25J29k68
2379f7J47J5l26M93l30n1K09L0l49M64k54O1K7J20l50J36j34L09P2k09k60J34
2401a13M7K00J05j02k03J12k51L08k54R0J05o8j49O9K43j70J75m7K9l48M41n12
$$ y = [21, -147, -100, 14, 121, -7, -157, 269, 56, 106, 291, 21, -207, 114, 22, -14, -72, 50, -124, 31, -165, -26, -93, 187, -2, 104, -40, -135, 129, -112, 316, -24, 167, 9, 147, -43, -48, 174, -156, 84, -149, 93, -4, 258, 223, 39, 100, 189, -34, 196, 166, 107, -33, 55, -125, -102, 107, 158, -18, 1, 148, 135, -137, 5, 96, -207, 172, -130, -265, -319, 178, -16, 70, -156, -33, -123, 13, 167, -148, -231, 70, -108, 47, 280, 34, 182, 9, -18, -172, 123, -124, 0, 216, 29, -224, 185, 166, 87, -89, 98, -143, -81, 130, 17, -68, 247, 96, -181, 157, 111, -94, 76, 188, -181, -71, 132, -90, 124, 23, -261, 182, -93, -219, -74, 106, -47, 81, -104, -24, -53, 72, 201, -67, 80, 95, -231, 262, -68, -119, 90, 120, -229, 235, -19, 42, 69, 189, -161, -25, -159, 150, 222, 13, -247, -113, -66, 134, 239, 137, -66, 46, -205, 103, -151, -61, 44, -24, -173, -104, 139, -31, 144, 97, 126, -222, 219, -293]
2423b93N25k84K26j30K49k25k23N33p97L38J18Q8n21J81L53j13K6l95M16j39P0
2444CQ5k12K00j78J61N9n3K6k31J95m0p8M8p3L8j65J27R0P7j03J11L5j40j18p5
2469b11L15J36k58O9q0N7R6m1J8j04J68j80K74l2m01M3j28K95Q9k6j9O5k05q2
2493a42J1J89J2j30n7K22n1K6L1j57j17J76J03k62q1J64J00N3j37J05j8p0r1r0
2517b11M14m0l7j09j36j69M58Q3j50k27p0K20oQ2l12J73J38N0j11o3Q3k07K73
2540A26j11L03o8m59K63k83N86m30M1Qj22j08K98R0k53O8P9l19K93j97L67l77
2562b05J58l28K60O7O5K59k93N6j41M45k03q8p5j39M62k47j57K61k7n0M2j3J46
2585B55L3l49j54J14l3j61J20Q3J68k1j08q2J07J43l29K40j40L2j24M44j80J04
$$ y = [-293, 232, -52, 174, 44, 293, 68, -155, 378, -419, -81, 37, 125, -396, -215, 138, 25, 51, -344, 72, -67, 3, 88, -124, 76, -102, 59, 118, 65, 91, -140, 55, 15, -63, -15, -88, -50, -215, -88, 2, 79, -24, 87, 122, -18, -136, -211, 104, 240, -18, 51, -29, 28, 124, 83, 101, -3, 165, -15, 259, 227, -174, -131, -259, 36, 125, 99, 80, 145, -60, -142, -131, 58, 70, -60, -117, 105, 54, 80, 111, -46, -163, 13, 116, -146, -227, -63, 37, 90, -47, 58, 40, -30, -121, -211, 203, 163, 126, 17, -119, -288, 170, 253, 103, -124, -194, 26, 20, 102, -210, -37, 101, 151, 40, -23, 60, -147, 126, 15, 318, 250, -209, 54, -229, 357, -73, -32, -24, -146, -254, 44, 134, -119, -51, 28, -291, 2, -195, 172, -205, -47, -375, -115, -48, 17, 276, -17, 39, -102, 343, 140, 52, -23, -162, 300, 53, -104, 157, 130, 80, 122, 109, 255, 288, -61, -215, -101, -134, -295, -175, -92, 76, 55, -53, -135, -28, 115, -214, 26, -114, -82, -206, 238, 58, 162]
2607A62l56L5K71k56K54k78n1M77m67K61m3O0m5k45N41j43k37M39k58k22K74k63
2629i0q0K34K8Lm8l60N35k11R3k51j67K41L72j69m12K62L6m9j59K26j28K5K17
2652A48j37q5O7M19n52K42k60L55j59j06R5J20l07rJ97j42n7k25O48k66n9J68
2674I5O1N9q5l75J63J04k13J03j7J4j5J76j07K55k89p5K16j73K31k34K68k02J44
2697A04J51k11RL02j00k51p0J9mJ12R0l38J57R3l3R7J26p0m6j54j5p1P4J08k39
2722a60M3J77R6k04K28j37Q7rk5k56R3J73q4N7Rn9J19j58J45J11m93L18J09k95
2746a15J42j99J36N7L0J66k40K87k37k57N20m18J54l6Q2k38J83j31R3J02j61J43
2768F3l3J27l99L71m28M18j39m39K27K15j98N20k38R4k98K98o0j5k50J02j55L67
$$ y = [162, -194, -159, 112, -144, 110, -168, -219, 258, -209, 52, 9, 69, 24, -221, 320, 177, -60, 379, 121, -101, 173, -90, -170, 64, 92, 95, 47, -313, 222, 11, 104, -147, -314, -73, 299, 130, -282, -20, 16, -33, -192, 34, -94, -69, 148, 11, -74, -7, 412, -140, 102, -158, 197, 38, -68, 27, 147, -160, -169, 28, -114, -171, -396, 252, -14, -73, 95, 156, 215, 130, -245, -82, 22, -191, -88, -105, -91, -106, 70, -37, 218, -71, -146, 70, -103, 128, -106, 162, -40, 104, 255, 44, 53, 355, 255, 4, -66, -47, -51, 61, 151, -187, -30, 63, 30, 127, 253, 183, 137, -17, -32, -103, -29, 79, -160, -117, 60, 156, -48, 180, 43, 130, 121, 96, -160, -67, 106, 22, 79, 88, 29, 148, -10, 135, 246, -247, 71, 180, -115, 27, -172, -36, 21, 51, 217, -23, 264, 27, -230, 290, -128, 26, -10, 72, -166, 17, -114, -21, 81, -80, 63, 30, 157, -242, 129, -299, 119, -20, -459, -232, -17, -215, 305, 67, 161, -137, 161, 101, 86, -164, -62, -217, 150]
2790A50j94o2j24L45L9R4k54k4K15j70J75j92nJ41k42L11n54J12Q4J14j94L46
2812A11P5j60J09J01j89k50K29K80k84p8K47J86l36p4k23L57l6n7J50k16j18M13
2834B37j16Rj3k05L12l72M16l14J12m0P3k2k50J00O4J00j46J9K08k15k13J58j63
2857b61N64j88n2J08k67J39l04L80m3k81J42q1j51RN17l93K58j68M29m83J66j30
2879i0J45k71K27J17mj34m50M33p4J2J76J79k94R3j73L82j24k65l13J08K48o5
2901a37M59j75k20N7j5K95o78N10j37K31m4j71q1J07j03M18l91M10j88L1m73L35
2923D0k21R8M28j78l9J8l45J90j11M6N3k70N88m38N56m09J02j90J77j83J29M8
2945H9J24m73J58k35N29l85K10k66M41l00O8J63k0j85l2j09J02M15k49J05k40
$$ y = [150, -44, -106, -230, 115, 154, 248, -6, -30, 185, 15, 190, -2, -7, 134, -108, 203, -351, -239, -155, -41, -235, 111, 186, 26, 135, 236, 47, -203, 26, 306, 22, -56, 191, 377, 41, -33, -256, 101, 65, 8, 158, -58, -176, 237, 121, 130, 117, -88, 224, -148, 268, -46, 66, 26, 99, 77, -173, -73, -9, 91, -55, -36, 172, -43, -256, -98, -261, 303, 115, 63, 171, -96, 43, -261, 119, 76, -205, -63, -144, -295, -286, 231, -162, 96, -72, 357, -126, 40, -90, 55, -216, 11, 128, 124, -10, -460, -27, -101, -89, 87, 266, -28, 65, -108, 274, 150, -115, -428, -320, -72, -137, 322, 147, -73, -16, -31, 264, -414, 96, -41, 190, 146, -25, -106, 1, -102, 316, -75, 335, 147, 178, -295, 40, -181, -83, 345, 167, 128, 146, -199, -9, -120, -74, -21, -291, 297, -141, 415, 6, 108, -82, 95, -88, 41, 89, 213, -260, -102, -337, 192, -193, 17, -249, 192, -108, -40, 123, 103, -82, -114, -223, -121, 294, 45, 150, -90]
2966i0jr0k00L88R7J5k54K84j90lJ7J29J36j88Q5J3j23Q4k49J32On4p2L11k59
2991g6k56L38j3r3J95J7j58O8j0j20PK82L06l15j84q9J17P8J79m24J27O2k15J22
3015e5L58l76O1L07k93j66N00m32K91q8l53J89o8L67P3l79OK03j84l79M50J63
3037A95l11P6R2rq5J50j25k37J31R3l9j56K69J2r6K71l75M54k49n4n0L81M0n60
3061a82J03L17K2j15J23J69l04j70J81oj20JKP1R2j39J07j02n0j74K4L30j11P2
3085A41l33L58j21K20n07N59l72J42j7k96K31J08k4j22L1r0L91m35j26K02kL0
3107c2j24j17L05l47K23r5K09j79J87J96k90J77k74J92k28J00M51m96j65J13K67
3128G3j7J6l6J16N9j61k47L12L8p7n5k4J00j09o5k59m6J94K96k17Q7L57o06K91
$$ y = [-90, -91, -181, -381, 7, 104, 119, -135, 149, -41, -44, -27, 102, 238, 50, 135, 148, 25, 109, -140, -8, -2, -56, -128, 183, -76, -332, 6, -7, -100, 95, 112, -46, 22, 12, -108, -101, 181, 487, 172, -12, -101, 16, 94, 273, -151, -24, 38, -177, -55, 303, -73, -12, 295, 2, -164, 336, -96, 195, 107, -246, -57, -125, 242, 315, -64, -58, 145, -39, -418, 32, 195, -116, -40, 52, 43, -42, 108, -17, -254, -123, -30, -69, -225, 44, 56, -40, 231, -144, 310, 61, 7, -43, 338, 378, -182, -79, 238, 260, 145, 268, 437, 133, -37, 144, 138, 18, 19, 21, 92, 184, 45, 152, 50, 0, -174, -150, 180, 69, 141, -192, 166, 45, 265, -242, 317, -55, 87, 70, -226, 5, 113, 89, -33, -2, -92, 299, -136, -262, -60, -62, -32, -156, -273, 32, -315, -92, -187, 22, -157, 30, 226, -64, 113, -161, 31, -197, -97, 354, -142, -307, -194, 73, 56, 72, 36, 152, 211, 50, -197, 115, 153, 76, 21, -3, 97, -12, -77, -336, -382, -188, 108, -109, -22, 335, -271, 20]
3152B0K1J28j63J39k10J64k90L33k65K10k6j00r7q8K44N2KN6l51J6L38j41L3J93
3176B18r7l5k8R4m8l34L6P1J68j2J8P7k3r7j30J01j1j28M35j84N8l22K93j25L7
3201C2J44l90K87j23L9K64n06K93l5r8K11k3L7k26L6K58m43Q1P4M6l3K14j65j86
3225b12j64M20L3j42R1L12K7k28l08L29l96K75J12q7l2J76n9j75%J31N4l81J90
3248c4o1L05j65k29J14K32l54Q0J77J9r9K67l30j7K24Qk56k37K95K04l19j3M09
3271B20l21K49k96J52l4k44J80J46o7l1k28P6K69R8K00l12l2L5q0K61n54J84L06
3294A77l63J43J57K36l30R3k44k6J14j16M44k63J68l88K67k90L13L7l95K62l48
3315c52k5K98K20J60k97J01m22L91J77l02j09N7L25Jk49L15r5j25j75J56J18j63
$$ y = [20, 41, 169, 6, 145, -65, 99, -191, 142, -123, 87, 61, -39, -136, -224, 20, 72, 74, 130, -221, -205, 133, -8, 25, 218, 121, 86, 58, 152, 104, -230, -194, -123, 45, 33, 51, 128, 105, 8, -122, -21, -32, -160, 275, 91, 149, -173, 120, -5, 32, 176, -214, 73, -50, -11, 253, -253, 40, 5, -93, 118, 95, 132, -94, -58, 200, -243, -162, -88, -42, -75, 139, -26, -212, -376, 44, 77, -65, 26, 338, 365, 137, -171, 158, -238, 37, 149, 62, 30, 206, 147, -28, -28, 103, 157, -224, -34, -95, 210, 45, -184, -70, 162, -192, -112, 65, 84, -15, 252, -78, -95, 129, 137, -119, -356, -61, 143, -176, -189, 220, -101, 148, -148, 4, -30, -274, -94, 52, -15, -46, -274, -198, 71, 169, 369, 57, 25, 60, -20, 241, -313, -129, 177, -186, -43, 114, 350, 20, 113, -131, -157, -43, -159, 285, 22, 190, -198, 69, -221, 92, 129, -266, -4, -352, -377, -79, 141, 301, 4, 105, -317, 74, 251, -51, -160, -103, 222, 223, -26, 289, 194, 69, -106, 50, 168, 5]
3337En9Q6k52L45m6k6k4j14P4K7J08k27l7J1L99l95K63k43n0K61j54M9P1K0j86
3362i4O0j24L50j57l74N57l70K18q9K7n8j92J27k18N83j31j66N0J28k66N0L30
3384B41k82R6J67k92K10J65Q8n62Q4l84J99L05J57m7r2R2j54P1l70K40J55J16
3406B03k46j45K59J16j37j07p7K9K18j96R8K5r2K98j57K5lJ00j97n1Q9k54L74
3429A72l28m1L18n9J1p0o0L96k52k66M71l83j7K27j30J40j49k9j72L72o6r0k6
3452c1m1J92j17k44J04L70k50J61k9l96O3J74j57L27Ll72L38N1J72k17j87J47
3474F1O6j06O5m3j14J79l71J82L71m44M21k45K58k2k20k67L42j76K99k92j98K
3496b52J52J66J95j93j10R2q8pJ03J79k41lrO0j57J23j68J77J30n9j34n0J94Q9
$$ y = [5, -54, 32, -220, 125, 79, 53, 29, -85, -11, 16, 124, -103, -140, -129, 270, -125, 138, -105, -155, 106, -48, 1, 72, 92, -94, -34, -158, 192, 35, -339, 218, -152, 66, -23, 4, -54, -246, -119, -337, 246, 115, -51, -1, 127, -139, -89, 241, -41, 55, 222, -70, 140, 305, 393, -169, -85, -469, -270, 35, 192, 145, 53, 145, -9, 62, -308, -68, 87, 203, -43, -188, 71, 187, 50, -57, -134, -105, 113, -83, 15, 40, -52, 246, 89, 114, 111, 211, 14, -37, 52, -202, 172, -156, -197, 121, 62, 73, 3, -57, 339, 87, -179, 292, -91, -108, 119, -11, 129, -20, -49, -221, 151, 85, -5, -31, -72, 120, 3, -241, -137, 233, -17, 144, 115, -281, -218, -44, -201, 126, 129, -243, 95, 146, 318, 101, -86, 61, 127, 21, 86, 43, -71, 108, -263, -81, 290, -154, 267, 22, 280, 258, 38, -229, 113, -63, 236, -56, -254, -252, -100, 66, 261, 68, -42, 50, -38, -45, 58, 237, -4, -7, -16, 44, -113, 10, -158, 19, 149, 90, -44, -94, 100, 189]
3520A89j55J42q7k59pO6J67j33j0K56k34J86j78L49m16J25Jq3L02oj59j28l0j57
3544b59M51P8m15o2L47j21K6r6J5K15l26j90K93K54k06n5J79n1j67p9M93k5o17
3567c18j8K63Q6J40l19K95l24K06K04k04l2k4k72M35M7j61J62j56k85N18k50J07
3589A00L6j61L8J63k74R8M9P9r7j60N02l50r2K04r7L8j05M40k23Lj0l40K1K07
3613F9J08l15K87l10J51J9M8K49n95m8L46n1K00r3m5j39L16l46%K54k38N9K73
3636A99j20l43M97k03j36M1O2K91o37M34r7N9p2J00l88L12K37q4k54O4K70o95
3658d63M39m0J12L2o7l87K47J99k19K7O2K43j36k60K37J05k17nJ95j57k38K54
3680c7J24m63M25P7k68K11r1j19K76K6o5N4j76N2P9k35K1j60J78K48m2N9L3k47
$$ y = [189, 34, 176, 89, -170, -177, -111, 56, -77, -87, 169, -65, 121, -57, 292, -124, 1, 2, -81, 221, 215, 56, -72, -102, -259, 192, 270, -145, -207, 140, 19, 45, -51, -36, 179, -147, -337, -44, 210, 4, -51, 128, 77, -90, -169, 324, 299, -318, -336, -73, 13, 153, -166, 129, -195, 11, 215, 11, -21, -45, -317, 118, 165, 4, 166, 10, -275, 243, -7, 100, 136, -25, 13, 176, -98, 0, 49, 128, 31, -129, 373, 23, -69, 135, 38, 76, -29, 411, 188, 191, 181, -159, -138, 69, 177, -138, 149, -161, -10, 9, 57, 306, -289, -337, 9, -42, 158, 65, 20, -119, 197, -149, -149, 105, -133, -74, 199, 79, -264, 233, 30, -106, -65, -3, 288, -349, 85, -12, 47, -25, 75, -313, -1, 236, 152, -102, -38, 232, -463, -24, -64, 48, 80, 13, -374, -127, 72, -147, -120, -58, 185, 49, -211, 26, 131, -86, -91, 104, -53, -291, -37, 87, -376, 49, 126, -142, 69, -22, -141, 135, 161, 96, 150, -26, 26, 105, -130, -109, -269, -91, 157, 115, 174, 207, -40]
3704d0M1K03j00j2k50J36J91k69K5k54L65K9q2J34K4r6qL22m23R4n4Q1k23M94
3728C28l89k21K27k02J22Q8m0K54mn33J01L78n0L5l48K78K38k22q8R6J15p5M2
3751A30k22K48No9m24M60l01J69J52j38k04l4P1K02j18M76p51N80l11K7L48k92
3773Dl2L24n04J00R6J24k64k85K08R6M47l47J99j75q1J48N9o9k4j56L47k33R8
3796H0M9k21o5j21J94l3K75l4r0k25J48J34j81K45j63J16j55k92L08Q0Rj10J12
3819F0N7j25J51j65k81L18k79L73O7j95M1N1J80n59K36k1n8j9J62j86J84O5L6
3842I3n1J48l76K78n5J61j28j7p9j23R2N8j08K22M96l85k74j54n0M11k93M0K02
3865A08J46k06K32m32J78MJ61m18K28J24r1jk13L01J48l82r6L66m20J83j84o8
$$ y = [-40, 1, 204, 104, 92, -158, -22, 169, -100, -75, -329, 36, 65, -17, 117, 141, 45, 37, 359, -64, 30, -24, 57, -166, 328, -61, -282, -55, -257, -135, -47, -87, 167, 163, -370, -269, 109, 59, 94, -254, 24, 262, 40, -48, 48, 163, 88, 130, -92, 156, 161, 92, -332, 128, -173, -4, 148, 10, -194, -228, -157, 45, -73, 403, -348, 232, -79, -52, 296, 4, -28, 296, -208, -108, -12, 112, -152, -437, -229, -133, 314, -33, 166, -9, -90, 58, 117, 48, 24, -132, 215, -18, 80, 129, -92, -157, -278, -84, -117, 158, 124, 34, -191, -43, 91, -90, 155, -8, 108, -47, -339, -31, 49, 58, -52, 60, 117, -8, 143, -22, -303, 15, -264, 109, 176, -19, 22, 73, 253, -306, -70, -91, -149, -168, -6, -192, -8, 57, 93, 42, 190, -186, 92, 37, 198, 70, 53, -26, -149, -57, 1, -107, 115, 611, 226, -48, -202, -252, 159, -134, -94, 108, 254, 48, 280, -152, 26, 30, 191, -227, 1, 125, 34, 33, -180, 121, 269, -113, -209, 157, -263, -80, -264, -332]
3887c32L70N6l42K06N0J87j29k19p7L78j06m02J68o0M57M2j59m6J02l69K6J89
3909a0K88k18K0K05l61r9L62k34k6J20m09L01L0Q9j15OM42k82l29J78J69j68j33
3932a74N2OJ35l42J54J53kj2J40jr8m1J98k46J0K19j65L18k42R8m20R8R8J4L98
3957C48l77o5K99k07j8m05L63L32j18k77J63k8m6J91l40L39k59J18r7M41n61K60
3979E6j62o4K43Q3j65o9R7P4nl70K43j91J3K54j16P7p2L17l09K13l52J9L22O7
4003B03j82j2K6J06j59k8J87k34p3r0K52LJ56n2j44j49J03N2k55K85J42k96N32
4026C73j88n06M77j5k65n4J3K19J23k20J32J09k62Pk76M9O4O0J0L16l04N2R6j06
4050i6L08m46K40J24l53K82Q3l75K25j65L04Q8m64K08J71k81L67k37m54Q85k49
$$ y = [-332, 38, 94, -248, -42, 8, 195, 66, -153, -230, 148, 42, -360, -192, -252, 205, 247, 88, 42, 144, -225, -199, -10, 278, 60, 80, 285, -76, -175, 187, -47, -73, 47, -362, -61, -31, 58, -57, -51, 391, 109, -220, -42, 127, -41, -174, -122, -116, 19, -323, -169, -16, -18, -30, 110, 109, 11, -30, 168, -78, -68, 151, -14, 304, 62, 160, -260, -162, -64, -50, 348, -29, -94, 205, -2, -20, -425, -62, 270, 152, -125, 38, 10, -36, 155, -185, 154, -105, 13, -84, 357, -204, 56, -106, -170, 73, 156, -9, -78, 19, 93, 88, -282, -39, -230, -217, 37, -79, -2, -74, 243, -66, 147, -205, -186, 136, 203, 21, 9, 35, 141, -18, -46, 141, -93, -166, -256, -4, -1, 155, 103, -41, -190, -87, -35, -290, -5, 137, -159, 373, 185, -321, 156, 141, -124, -178, -165, 54, 177, -43, 89, 198, -64, -57, -333, -284, -220, -160, -150, 166, -138, -86, 10, -96, 212, -234, 6, 130, -223, 59, 142, -233, -8, -173, 131, 219, -245, -37, 134, -147, 220, -17, -471, 414, 165]
4071A65j98k19M04o8m8n5k0J57l9r5n4QK94k42l19L63k59M33k96M40m67L73j55
4094A03k20R0j3J33K75k24J10k91j5O2j04r9J69k08K99j3q6R6k21J54k04R5J49
4117C7q5M45n60j86L07n7J0K51m01L23j37M6j26K25J8R1K52l68K15m75j6L3n2
4140b10L35m19L86m3J47k73P9k32nJ35L9K85j17n6R0o21J70J02K88P2j41K5j86
4163a50O7r1L64k9j29l26M66k54KR6Q3oq3K7k21j85K42J36R8l18M22l88P8J6N0
4188c3q5L90k94m3o9J91Jj72K82m26j31M94j14j02J69L1O6J9P8j33j90M8j38k
4212a63L31q3j92j55K97R9n7j90L15l77L15l46J42L78l22J77k61J87K9j30p8K21
4234A37L8m06K12j25J38Q2K8j12m0J84K52m04nJ66m90P8ML74kk88P3J10k3K47
$$ y = [165, -33, -252, 152, 84, 36, -19, -39, 118, 79, -16, -70, -62, 232, -10, -329, 34, -225, 208, -88, 352, -115, 258, 103, -117, -27, -40, 93, 368, 144, 254, -37, -52, 10, -94, -193, -24, -232, 67, 54, -32, 64, -157, -3, -207, -112, 37, -48, 397, -163, -349, -42, -99, -89, 162, -239, 84, -53, -7, -133, 92, 110, 201, 453, 85, 300, -175, -191, -158, -210, 125, -294, 92, 49, 196, -77, 2, -230, -235, -100, -61, 224, 107, 51, 141, -480, -310, -208, 80, 152, 11, 36, -150, -83, -174, 190, 161, 32, -294, 172, -82, -80, 16, 99, 93, 10, 37, -184, -369, -127, 9, 107, -211, 211, -177, -99, -83, -33, -118, 272, -22, -65, -134, 57, 58, -114, 168, -258, -389, 105, -9, -111, 58, 89, 155, 174, 252, 119, -71, -23, -161, -163, 168, 85, -107, -262, 35, 134, 77, -113, 202, -175, 140, -206, -64, 314, -8, 169, -92, 95, 124, -6, -84, 137, 175, -231, -19, -144, -6, 76, 104, -8, -48, 136, 388, -16, -21, 145, -345, -267, -263, 111, 109, -179, -106, 4, -19, 228]
4258B28o6k31L2L63m73J56L3K35k34j94J75k20K98p1n9l5J84k64O2N5j28J63k40
4281b31J63Q2k91L28j36M41j29k82K6K65j52k83J03j28L47K3j6l36K60Q9j28J68
4303A83l0l84K04L17l39K31l93p3K74J28j48KJ53J4J13j58j70K18k41l3R3j58
4325a97K57l9NN2j13o8jQ1n6R1jr8k36N44j86k41Q6J10j50J24J31q3j5L10m04
4350i7J87P8j26j07L63k58O3j47J17j36j49Q9K5N58m06Q9k89J62L4j57K3j23J53
4373e4L08k56j99K25L4k83J58J14j3k62J99l01L78j53L55m26M13p1k61O7r9K7
4395a00l3M6J48l1J6l60M61j21L0o9k5j14R5KR6J67l79L57j35j0m44O52l9k09
4419Aq8R4l3p8P3K40j05l31L40l7j74J33k23J4K43j93L64k99L19J21m42J52K3
$$ y = [228, 162, -69, -37, 326, -147, 9, 42, 277, 43, -151, 24, -196, 102, 31, -28, -63, 121, -143, -81, -26, -154, 9, -231, -68, 14, -277, 51, -85, 356, 227, -55, -29, 236, 84, -199, -96, -224, 123, 146, 130, -206, 54, 143, 15, 183, 153, -231, -27, 290, -49, 182, -211, -284, -10, 118, -30, -28, 125, 139, 252, 94, -76, 142, -99, -132, -39, -197, 60, 21, 26, 78, -35, -103, -104, -23, -79, 12, 11, -87, -323, 221, 35, -206, -120, -10, -160, -36, 95, 12, -3, 307, -97, 90, 168, 42, -65, 298, 40, 103, -44, 73, -63, -212, -123, -98, 460, 54, 143, -146, 16, 50, -107, -84, -207, -54, 254, -2, -201, 24, 58, -225, -67, 47, 34, -228, -29, -330, 48, -105, 250, -176, 237, 166, -95, -28, -127, -100, -133, -87, 61, 30, 46, -314, 147, 26, 56, -13, -38, -152, -57, -55, 41, 208, -171, 186, 51, 41, -403, 249, 210, 1, -87, 7, -26, -104, -31, 209, 104, -227, 113, 76, -98, 35, -188, -174, 69, -124, 240, -59, 260, 381, -61, 91, 114]
4442A14k63J99J30k88J26j1L9j21j38P7L47M2m9n6l37oJ24N3l8j37M20j2j19k63
4466a67KJ47k68K31M4p1o8J14J90l30L33k23L05l36J1K18j0R3k39M3O3l9j73M98
4490C68o18J76j14P6M01l24j85M04k23Ro1M34k35n6j71k8Q3J7j63K58O9o4n0n9
4514e6L91n01n4J52j39J62j31L12j01J64m17M27n8k77J92p6L35k90m5j92O50l60
4536H8j47L4k63N8K78o5l4K49k70Q6l3L7J0J41k48L4r5J15k40O47n85J13M8J12
4560G0r3p9J1N4j37N7J13j60K68q1j14K31j79J35j09r2L52k15m5M4k32J55J68
4583A22k84K44n4j78M39l26j82J77J82l60K48p3Q8N5j38k76K50J98j98j6L3L08
4605B59k72J05k59K02M4l51L25o0R8k41R5M13l16J63j85j05J21K15m09K87J44
$$ y = [114, -149, 50, 180, -108, 18, 7, 46, -75, -213, -136, 211, 253, 204, 148, -189, -195, -71, -18, -56, -193, 227, 215, 96, -167, -165, -18, -286, -55, -11, -82, -150, -36, 154, -176, 157, -66, 239, -97, -86, 132, 122, 215, -24, 19, 82, 43, -130, 368, -250, -74, -188, -112, 289, -35, -220, 184, -39, -30, -91, 343, 108, 52, -119, -147, -64, -47, -210, 48, 117, 53, 3, -56, 335, -166, -220, -68, -207, -45, -176, 136, 35, 199, -218, 209, 151, -126, 66, -10, 325, 35, -10, -202, 448, 88, -59, -25, -288, -230, 48, -17, -51, 198, -72, 14, -19, 18, 28, 169, -79, -45, -140, -25, -265, 382, -203, -90, -42, 70, -23, -102, -91, -37, -174, -117, -4, -164, 104, 23, -91, 140, -39, 96, -13, -105, 247, 32, -13, 31, -201, -46, 122, -162, 82, 28, -150, 289, -37, -219, -42, 140, -220, 28, -45, 43, 98, -40, -316, -66, 132, -66, -82, -49, 259, -13, 92, -167, 35, 79, -272, 53, -7, 91, -150, -55, 358, 42, 205, 20, -85, 36, 251, -158, 129, 273]
4626B73m04K09k46L93j58l3Q8l94L38j48J95j01K33l64j1N86m84l86M37j87L99
4647B35k00j43nK71j77K76r8j53J61j25j78j06j4L98m04J17J74J42k87J17m2j04
4669a45L56M1p4j52N8j2j79J87Oo1k74o1M17Jj0m0j05J26j22O6j41J84K44j37
4693A73k32R5j89j12J77PK61j24j61K69j20j79J03m1P6j16m1K21J31j85K49l48
4715h6L5J57l28J56j63N57k06Jj38J64Qj54q7J2O1J57k52J31r8M25l45k68N01
4738B40l00L15k50k4kn9J66j10K99m09M73l59k72K34j04K92p8Q8k55J44o4m8J80
4761I7l60L08k29N4R8k67M27O6kk99J65J40k36p8J09P0j81K20k63K35j73O6Kj72
4785b03K84k10L43k14j02q2L86l01J78L13l77K53m21J84L01k56NK9K41m20J20
$$ y = [273, -131, 78, -168, 225, 67, 34, 122, -272, 66, -82, 113, 12, 245, -119, -130, 456, -28, -414, 23, -164, 235, 35, -108, -113, 158, -19, 257, 159, 6, 167, 42, -136, -242, -256, 142, -262, -145, 29, 171, -116, 1, -41, -145, 211, 252, 178, 26, 84, 72, -107, 80, 86, 25, -249, -310, 107, 108, 98, 58, -47, 79, -43, 23, -118, 66, 310, 173, -59, 36, -153, -265, -88, -81, 180, 56, -105, 164, 44, -135, -32, -73, 3, -113, -154, 67, 198, 13, 262, -86, -51, 106, -222, -66, -229, 328, 122, 123, -15, 149, 157, 3, -84, -72, -11, 146, -106, 25, -73, 352, 7, -261, 240, -60, 255, 5, -19, -21, -80, 86, -24, 275, -134, 339, -20, -292, -58, -162, 130, 52, 140, -115, 29, -35, -83, 97, -263, 45, -184, -130, -32, -299, 128, 194, 192, -107, 58, 198, -38, -116, -7, 63, -118, 102, -161, 74, -99, -33, -31, -203, 81, -129, 214, 0, -102, -184, 202, -99, 79, 392, 15, 268, -153, 31, 332, 76, 81, 110, 351, -69, 51]
4806E1k25R3m8J05k39J41L88r1j64j58k0J73j14j12K81m7j93K13j69lL3l34M67
4829B8K29m9l39J27K89q1k98J29J98k71J55n39M22K01k55O3j48k8K96J38k74P7
4851G0J25p3j67r1KN9l4n1K59O6k23j57M12k52j68J40J13J4m5J33r5J14l57j2
4875b18J86J17J16k68P5M8j91J17l05L39j50J91k23M62k52j65K27j55P8l84L56
4896AJ76pk36J68k47J13j12K05J02j41M3L5N8M5j17k42L76j43r2R1j63K21l96
4919b62K89l38K17J56j21K74lj42p3qJ28ol88M99k84J29l40N12Jk51j93j0J95
4942a9m7j18K56j52J50m3np1oM4p1M20k39k22R6J4J32p1K0j16r0L73k5l17J55
4967D8K7k99N08o1l62J20j16k8L48j60k32O7O9K35k79N1j73j1Q8K2M75n79J52
$$ y = [51, -174, -81, -129, -24, -263, -122, 266, 175, 11, -147, -167, 6, -108, -220, 61, 14, -179, 34, -135, -138, -105, -439, 28, 257, 208, -131, -4, 285, 204, -94, 35, 233, -38, 117, -422, 0, 201, -54, 9, -139, -167, 129, 267, -7, 70, 195, 122, -45, -136, -134, -75, -109, -160, 99, 165, -58, -215, 197, -55, -223, -83, 30, 44, -1, 132, 37, 151, -206, -218, -32, 85, 201, -67, 8, 56, -135, -18, -323, 16, -134, 57, -166, 296, 44, -121, 106, -49, 29, -355, 1, 177, 170, -66, 102, -145, -32, -144, 61, 163, 22, 65, 100, 158, 203, 86, -156, 220, 77, -15, 76, -87, 134, -262, 27, -311, -94, 62, -59, 215, 212, 70, -3, -11, 117, 111, -277, 222, -62, 67, -273, 239, 240, -11, -204, -214, -19, -66, -184, 72, -80, 70, 27, 22, -49, -55, -11, -82, 338, 99, -123, -27, -13, 119, 48, 68, -48, -138, 235, 210, -107, 48, 75, -224, 284, 223, -139, -19, -135, -163, 185, 25, -207, -140, -71, 164, -115, -64, -237, -248, -160, -138, 337, -242, -90]
4990i0J17o9J31j83L81l50K45k31R2J61J1l23j82r8M08J75l08L5R0k64L8J17J86
5013H9j64K31m3m5k6k1q9J92pl47K92L4M2j31j39m5M17n64J93K63l12K39M2j15
5037a4Pk4K9n1j07L33j21o1J80m08K95k36J4M89m11j5jK09J23j06n6j36J64j55
5061e9L2L83k59k23K20k20K59n5j6N7j52q9O9o3M16m61L32k73K93l43L06j98O2
5084A8L7o4R3K4o5j16K24m59J80J50o7L60l4k64J72o2J52o5l28J94NJ6q2k42M69
5109B46n25K75j74L31J8l03L64k84J42k29k3L27j70O9M22o70M2l9o0L82r1K8j28
5132e0R5K79n40L36n22L91l8J81K3l23K67K0m25M88j26r7L13l37J20O8rk41J19
5155hR5J08k25J4K05o2l63J21M43k29N1m42N46k28j11R6j7L19k59L0m80J34K29
$$ y = [-90, 27, -42, 89, -94, 287, -63, 182, -49, 43, 204, 215, -108, -290, -388, 20, 195, -113, -78, 12, -252, -214, -97, 89, -75, 156, 113, 68, 42, 21, -68, 124, 117, -230, 62, 96, 138, 7, -132, -177, 240, -324, -131, 132, -180, 59, 101, -14, -7, -31, -2, -53, -160, 173, 52, -9, 171, -237, 58, -178, -164, 325, -86, -101, -102, 107, 230, 124, 68, -68, 96, -59, -27, 356, 97, -126, 94, -126, 133, 78, 62, 119, -33, -122, -53, -116, 300, -161, 171, -102, 191, -152, 154, -44, 18, 55, -9, 84, 108, 43, -73, 151, -308, -128, 22, -45, 315, 281, 17, 189, 127, 279, 214, -114, 80, 85, 101, 19, -223, 246, -279, -4, -178, 153, 171, -132, 232, -52, 90, -139, -162, 165, -5, 64, 486, -184, -142, -181, -241, 141, 50, 78, -50, 45, 324, -216, 120, -402, -11, -49, 132, 155, -168, 99, 119, -306, 182, 56, -41, 272, -65, 55, 123, 114, -127, -8, 87, 195, -30, -16, 189, 127, -236, -115, 328, 99, 150, -292, 254, 26, -85, 11, -6, 313, 54, 84, -396, -262, -33]
5178c3j2J58k22j8q9Jk9J50L59j01q3q4N8j94J45L86l63k47j04K18N08l81j67
5201a44K89j62p8j65M02J44p4k64l10J94L70l69J37M4K27l28K05o0j7O9j58R2
5223D4L9K17k38r4k04J53L48k50O7l07L65k68mK42j8J1k55K05j40R2j80J23Q4
5246C2J55j86l17L76j58PO7Q0j26r2K57j56J80J70k87j31J02r2J46j19P7J01l49
5269b63j32M71k55q6K47j96L73P1l6l42K35k86J69j68J72m2k26K11K1L1K64K1
5291B54j39m64M23j79k8K14J13l34K35P5l0k52O7J9l77L61m3L0j20K44l3p9J5
5314b8k00L70R1J51k71j00J29j48J86l90N3O2L04l74L14j6o4o4n0K61n91M50r8
5337b3m9RL94m63j27O22m46j57J12K24J09j98K9J67m24M41k00j7J8K04j77k3j76
$$ y = [-33, -45, 113, -109, -127, -216, -215, -244, -94, 265, 164, 81, -3, 55, -139, 6, 392, 29, -218, -322, -104, 404, 23, -144, 145, -17, -95, -260, 142, 286, 212, -52, -362, -168, 202, -167, -30, 14, 241, -87, 118, 58, 41, 110, -48, 44, 83, 300, 62, -32, -236, -83, 265, 15, 82, -225, 140, -128, -132, 110, 92, 103, -152, 53, -87, 5, -175, -52, 32, 187, 1, -316, 60, -98, -91, -24, 56, -70, -162, 95, -61, 119, 289, 2, -129, -27, -119, 27, -92, -15, 86, -263, -395, 76, -179, -265, -18, -214, 159, 230, 194, -148, 87, -199, -30, -198, -26, -68, -294, -83, -62, -31, 233, 254, 115, -349, 74, -105, -133, 81, 194, -140, 95, 170, 140, -112, -45, -26, -403, -42, -85, -55, -175, 69, 36, -43, -28, -228, 142, 233, 384, 113, 13, 142, -6, 180, -210, -157, -95, 209, -165, 149, 133, 69, 5, -45, 216, -375, 75, -23, -72, -63, 331, -132, -259, 363, -83, -240, -128, 96, 205, 7, 36, 203, -221, 220, 20, 3, 21, 225, 48, 25, -151]
5360a51M69k73j53l8j29J57J95K33j91k45k92M62O6r8J14j56j38J66k05N28l68
5381d7L52k66j3j7l04K27K15m20K61Nk29L73J18k95r6K84n8j08k81L89K01l71
5403h0mn5r2N34j8m46K51j34J15j42L63l32o2m7K56r9J35m13K45lK5R3J49l95
5427a56L09J65l64j02J56L73n39K24N2Q1k55r8J16O3j25J72j88p9M89R0k12l26
5449a54K18k60J17J11l7J10j23J83k14K26o6m33Q5J42K29m04J32L90k69j25K84
5470A42k80J72p9p8J74J26k70M8N6J7j74J97k98J34J05o4LJ10m87K98L19k64K39
5493A46j59Lj15L5m7M13R5k12k16j16l9J14l7J05RJ01r4l4J85k11J3l32O51k49
5517Ij57J43q2J19MJ70l61K75j1qj30J54j65m2j31K62K60r6m27K32J7M2l5J49
$$ y = [-151, 318, 45, -108, -146, -275, -118, 77, 310, 119, -126, -418, 44, 110, 12, 126, -30, -168, -2, -207, 321, -47, 305, 39, 26, 9, -295, -68, 147, -273, -12, -7, -236, 137, 255, -40, -136, 148, 90, -18, -299, 90, 291, -80, -84, -139, -231, 303, 285, -161, 90, -44, 71, -71, 292, -40, -102, -149, 107, 8, 143, -270, -25, -28, -3, 90, 239, -156, 153, 318, -46, -148, 8, 381, -158, 66, 118, 199, -56, -154, -38, 25, -100, 72, -116, -195, 294, 384, 172, -154, 64, -196, -79, 32, -5, 105, -18, 165, -49, 177, 111, -322, -237, -95, 134, -270, -138, 252, -17, -142, 142, -138, 34, -45, -123, 51, 177, -93, -45, 11, 28, -146, 51, -247, -113, -8, -72, -69, 41, -446, -148, 171, -93, 146, -13, -10, -125, -90, -137, 276, 371, 159, -57, -173, -212, -98, -135, -30, -21, 80, -14, -48, 137, -74, -61, -393, 258, 9, -148, -5, -87, 32, 36, 206, -155, 120, 109, 101, -29, 125, -40, -82, -213, 49, 309, 213, -214, 18, 35, 77, 42, 191]
5541A91l59j0M3J29p0J34K18j13j98R6p9O0m3k15M26k83j39r8R0K48N9m1m3n93
5565e90Q19l30K4J40r0L1k21K89J1j24l51M72oj8k8J62k69K26O0k92L93l21Oj60
5589a67J68L3m1k25J0k6J28k7Q6j48J90m2j31J67p0J59j46N5j31J31J51k61M83
5612C46j73j64nn1m5J50j9j58k62L08O4M3l82N6N64m14K69k87L84m81M09J43k65
5635C0J24j43j9K77j30j95K46k82K47j37j12J13J04J41n3j91j12L91k96l0J4k73
5657b86K19J97k78R2q7L61k50R2j12L54l75R2j08K39J46l02K35m75K74R6j43j01
5679a20M7m7J26j03L08k53r0J62K06r3j85k3m4K09n6l8k82L18n2J38j80n7L35
5702B26j07K42q55L26J38P7o3J69L6j16K9k42K5K38m07L57m6k37L03k64P0N6r4
$$ y = [191, -168, -178, -135, -6, -76, 58, 276, 163, -35, 61, -18, 42, -1, -216, 210, -73, -212, -310, -220, 28, 87, 46, 3, -590, 229, -101, -77, 63, -27, 4, -217, 72, 83, -41, -392, 80, 74, 56, 28, 190, -79, 147, 207, -85, 308, -13, -7, -167, 1, 34, -7, -232, -222, -248, -120, -147, -61, -209, -19, -61, -192, -25, -95, 64, -82, -27, -158, -27, 124, -137, 346, 173, 9, 4, -47, -92, 58, 39, -119, -381, -73, -9, 34, -348, -292, 272, -142, 127, -160, 224, -257, 152, 295, 30, 154, 11, -8, 269, 139, -56, 190, -92, 155, 18, -94, 19, 123, 264, 211, 20, -92, 299, 3, -27, -13, -286, -67, 130, -148, -56, -143, 218, -32, 60, -52, 302, -73, 19, -89, 150, 296, -6, 229, -246, 28, 124, -19, -120, -73, -120, 6, -97, 211, -42, -132, 30, 236, 143, -42, -65, -109, 100, 44, 6, -276, 42, -10, 128, -52, -109, 226, 119, 361, -494, -168, -30, 47, -16, 153, 189, 73, 102, -140, -115, 123, -284, 73, 27, -210, 93, -171, -101, -45, -139]
5725a39K55o0j19N3q9QK08j29O4P7j76L7M6j39J56k85L90l95K29J02j63K05L5
5748A71l55K85jj78J35o3N36n60K8J97j20r1m8K42j29L6r3QR1j63J04K20j56l75
5772b79K04kR3l5o4R4j94P0N07m04L59l81k63L63o9J8N9k9j28M7J08%R0k65J21
5797B0j15L47l31J8P3O7L1r8P1j81K67j84J43j48o1l7N4Q8MJ29r6q9m7K5K92m19
5823a77M6L65l79L2R5K37j38K24j94Mj53j95J75L08n49L63R7l48M05j21l10L31
5845A18K8n9k87J01k92J98M08k09j23Nm5j0L82k94p0M55J17l53k79J60l73M10
5867a2K51k11O3j24j9J32j7k53L77q6m16K78P0k7J57K0j79j2J23j14N6j93J30
5890fj24K90o9j42p0r8J61RK73m05J91J80l30J16r5m9N14m54K49j29p3q9J08J88
$$ y = [-139, 116, 56, -63, -10, -99, -91, 117, -12, 52, 129, -47, -10, 36, -103, 53, -232, 158, -237, -8, 94, -69, 136, 171, -184, 101, 100, -78, 57, -6, 530, -30, -2, 195, 75, -16, -64, 178, 49, 85, -8, 0, 91, -72, 32, 252, 96, -279, -75, -77, 16, -19, -83, 11, -183, -113, 394, -10, 349, -32, -295, 68, -1, 17, 76, 47, -81, -34, 74, 74, 164, -101, 20, -95, 252, -79, -61, 12, 79, 110, 12, 83, -98, 169, -15, 128, -20, -81, -118, -64, 24, 28, 157, 61, -28, -75, -50, 242, -177, -131, 234, -145, -113, -18, 219, 81, 305, 111, 115, -38, -233, -58, 250, -299, 64, 161, -187, 218, 97, -213, 118, 146, 87, -200, -99, -391, -193, 215, 6, -117, -112, -157, -167, 215, -79, -149, 306, 423, 70, -209, -49, -422, -12, 239, 28, 91, -33, -52, 80, 63, -190, 187, 101, -315, -37, 33, 6, 163, 183, 4, -8, 115, 1, 57, -136, -6, -130, 160, 91, -51, -121, -219, -58, -49, 224, -181, 10, 190, -140, -24, -119, -168, 346, -108, 141, 12, -61, -150, -42, 146]
5914A46Rl22M52l42L8J55J33p3r2k3l6K40l79J58p2L18k69J16j70J97l86P6K17
5937I1q5K45o41N21m04J36M0l1J89k93J86J24p5k66J84QO0r9R9j03O5P6k91K30
5961c4J15O3j06m7K8j48K48k44Rq2J24J57O6p9j37m9J98N0j40k73M73k32j90N5
5985a75P1Q5J6J32m68L87p4lK03K1k06l2M69m12q7j85L30RJ54k89j29O7J01l9
6009e4l3M3QR3l0Mr8J58j64K17k37M9O5j58J64j1l0J67j76J66l56L45m22L74l98
6034c14L15K43m69L22k94K48j22j17LK03K07k57J10l01K86J28k43k8j35M20l80
6055a75K07k88J77K3p7j63O40m18J3L24r1j11k32J40Q1j29L20j96k33L75o2k35
6077a10L58k48J30j30q5j10L24O9k95j13J38K81P6k17r5J10l0j13qL3K58k41l7
$$ y = [146, 155, -167, 285, -57, -19, 136, 269, 196, 104, 81, 45, 285, -94, 64, -8, 310, 41, 157, -13, 184, -202, -126, 91, 6, 251, -390, 131, -273, -137, -97, -128, 61, -232, -46, 78, 3, -263, -79, -71, -11, -110, -11, -114, -49, 27, -264, -34, 81, 144, 38, -9, 19, -129, 119, -125, -116, -198, -74, 83, 149, 70, -67, -116, 82, 132, -8, -281, 192, -40, -230, -175, -104, -19, -3, 129, -339, 48, -26, -29, 174, 195, -11, -43, 426, 14, -73, -258, 72, 81, 235, -54, -183, -116, -15, -54, -87, -44, -36, 57, 27, 31, -67, 91, -73, 144, -93, -44, 21, -137, 27, 16, -14, 153, -23, 143, -213, 132, -290, 84, -314, 1, 244, -225, 97, -197, 51, -71, -188, -185, 18, 225, -32, 78, -223, 63, 191, -52, -80, -215, 205, -175, 32, -256, -79, -56, -133, -296, 344, -74, -61, 263, 172, 61, -171, -31, 50, -79, 241, 45, -188, 187, 125, -110, 248, 0, 130, 0, -85, -195, 129, 198, -97, -210, -72, 209, 285, 68, -27, 83, 53, -60, -68, -35, 223, -18, -55]
6100e5K88j74J09k47P8M9k9j05L01k30m8M2R2k72M4J54J68j41rQ6k0j72L77l87
6124a01j00Q3J45J5l78J45J27k33L79p8j79K73j09m9J06j36j49M26j96P2j6k17
6146a70J55q7K1J93nl36L18P1j54k38J71l7L7j25O3K14N7K58m31q7J08p6J51N5
6170A26kj97k9J00J45m36J85m3M43j84k66j37M08j48J69K44n49M98r9m42p2M65
6192A79l76L69j77l13L35J39j16l10O8L34n7k01K11j12O8j3qJ34k24j07J94L4
6214E1N9j40o7J33q7R9j48K7L81l65J57j78n2J99o8j1j04o4oL40l28J86n1K92
6238B55k6q9N7Kj83o2J23J53k74j26O8M0J33J11l37L01P1j32J3j3N8j71M1k82
6262b69J01L6O3J51j76j5k6KK68j35K18Jl55K4j87K81K26m59J97l4K02p0L7k73
$$ y = [-55, 233, 59, 168, -79, -1, 48, 19, -86, 215, -15, -63, -21, 71, -201, -157, -3, 165, 24, 15, 101, 81, -91, 286, -101, -201, -118, 27, 42, -336, -191, -64, -297, 82, 4, -175, 98, -11, -60, 46, -90, -239, 187, -9, 63, 47, -170, -15, -102, -81, 112, 107, -229, 89, 160, 6, -232, -61, -98, -61, -186, -123, 91, 148, 406, -25, -112, -4, -80, 71, 126, 124, -73, -102, -2, 143, -293, -108, -151, 292, 108, -158, -295, 113, -35, 134, 378, -171, 327, 228, -214, -286, 179, -197, 172, -5, -318, 17, 156, 40, -270, -202, 132, 75, -126, 85, -27, 41, 28, 20, 154, -70, -177, 17, 51, 110, -30, -97, 36, -51, 48, -100, -73, 308, -57, 100, -78, -130, 69, 1, -10, -114, -178, -184, 156, -172, 14, -37, 255, 229, 140, 197, 199, 16, -46, 77, 230, -44, -170, -102, -62, 71, 182, -155, 146, 217, 85, 98, 85, 143, -28, 13, -269, -168, -132, -69, 82, -94, -109, -135, -133, 135, 0, 218, 219, -136, -112, -299, -18, 208, -251, -54, -88, 114, 44, 81, -192]
6286a92K03j60L69l39J47K0K6p4Ok09J37J71J9O9j08N2o4j32j21K25j96J87j23
6309h7N54p60J60K43k30j13R7M2J85L6k9Pk23L48l00J18k18J2L15k4m87M94Rr5
6333E4L5j64K02O1M3p6k88o2L96j99k18K17O0l62K26j42L88l68M22l36m3L1J01
6356b2j0p4M18k27k04K10M5k30L89m46M16l10j34k21J21L00q2M3kJ93j40k30M34
6379B37j48M2m68o9J82K77J06j11J18l15J0r7M3L41j10j60L05L2K0j54r8J45k01
6402g3L91J0l06N3k06qK6J45j66J77N9P8j40n9mJ79j71M5r1J5L3j92J92J18j23
6427a8k4J00j70l14L33K15k10M9N4J7j35J54k11J13N5J06M9Kr2j12J1J92n02M61
6451A23p0K50l8l18m5k85K34K12Q8k09r1l2L93j69j17J29j79J94L1k48L1K51k65
$$ y = [-192, 11, -149, 220, -119, 28, 48, 74, 0, 6, -203, -66, 105, 124, 193, 85, 137, 73, -59, -180, 45, -151, 36, -87, 467, -293, -133, 110, -120, -233, -136, -94, 91, 127, 98, 105, -118, 230, -70, 48, -170, -158, 157, 133, -354, 140, 149, 54, 89, -75, 127, 188, 231, 155, -133, -195, 201, 2, -216, 1, 61, -301, -75, -217, 171, -197, 225, -111, -154, -123, -22, -32, -106, 312, 85, -119, 91, 136, -94, 295, -151, 265, -45, -179, -400, -279, 21, -61, -18, -20, 173, 33, -197, 237, 89, 131, -337, -406, -224, 53, 159, 48, 166, -149, -139, -236, -193, 148, 38, -122, 183, 215, 235, 81, -17, 128, -73, 318, 328, 22, 75, -131, -139, -113, 32, -134, 43, 102, 180, 40, -19, -23, 156, -15, 30, -61, -46, -13, -205, -13, 105, -18, -42, 58, -112, -426, -93, 122, -88, -39, 15, 32, -103, 51, -160, -47, 8, 114, 163, 165, 73, -39, -28, 164, -338, 123, 53, 303, 265, -53, -98, -383, -149, 63, 151, -58, -149, -181, 212, 43, -74, 55, -124, 70, 101, -147, -116, 135, -130]
6474a30K58r8K9l73O67l30J57P4l53J10ok29J52L5N7r8M41k73k6j10Q1k78k1L99
6498A35l68j33M43K5l29M30l97K25L1L5l03j32N46k55J81j82O4j53L75p0l11J98
6520E5k44L38l51L40P6j89m8L05j78k25K9J07r0J43lK13l44K01k91J53mp6K04
6543A21m5l3R7q8l78K38K1K75j76K1j04L36j08J11l87J91n4M3k87K36j33o7L73
6566B03K1jk46j63K74k60l4M81k06r5n0M1J68p5J79q9m7J61J34m95q8K54m6n8
6590c7j17L71q3l21kJ01O1o2j37K23m1R0m5l97K67J63o5Jp3K55K3P5j92j8J26
6615A66k37J7l1J78j41J77j05j57K1J17J56Q6k7k37N0J9J61k98p5K2K51k34J7
6638a04L6J16k69K03K8R2J70l15j24J65O1n6j55l9J50J16j10LK54j61jK1k3j33
$$ y = [-130, 128, 30, 59, -314, 353, 23, 180, 254, -99, 11, 5, -224, -72, -37, 20, -78, 363, 90, 64, -46, 35, -243, -264, 135, -233, -366, 77, 102, -227, 203, -194, 31, 62, 97, -206, -338, 208, -47, 134, -48, 16, -137, 238, 168, -143, 55, -189, 149, -202, 138, 214, 25, -23, 282, 104, -121, -92, 15, -75, 68, 65, 278, -66, 135, -156, -3, -7, -83, 121, 76, 43, 140, 52, -326, -88, -67, 208, 32, 53, -51, 285, 177, 288, -99, 92, 38, 81, -206, 30, -103, -170, 203, 224, 223, -23, -186, 88, -172, -206, 275, 69, -26, -76, -35, 133, 58, 237, 148, 101, 262, 396, -99, -187, 67, 21, -37, -154, 217, 134, -187, -189, -88, -27, -89, -226, -3, -44, 46, 1, -396, -129, 34, -31, -30, -103, 152, 175, 250, 58, 40, 166, -71, -54, -85, 93, -48, 129, 24, -133, -112, 5, 161, 247, 220, -17, 33, 52, 213, -85, -160, -138, 113, -121, -104, -68, 48, -221, -18, 10, 102, 272, -43, -167, -2, 59, 3, -152, -191, -41, 75, -35, -32, 222, 61, 60, 81, 58, -75]
6662g5L66l42L8o1k6J52NJ16p4l5k96k3J47pK26J39k71N51m19q6L4k92L5r4M41
6687A49k05K39l20JQK34k12P2L9J75j97j83j30J33L63j6j30j90K47j27j43J50
6709d3K50k09l25M24J2n84M67m6J34J13l68J92jR6k71R1J28r1K33j24l12K97l30
6732b67N8q3J58P0J00p2r9J58k1k92M2J91L9J80l01O18l84j94Q3k01K75j47J67
6755G8j97KJ89l01M46k3j23K16j60k49M41Q7j75k73RJ6o3L46l50p9J4Ro0K07n7
6780e0j80K76k11J40J24j85M6K16l55J55j00L92m2j45Qm7k97M5J91J19j24L46
6802C22k68K10q5l06O5Q4k33J43K96k64J9k3J76k01L20m08J45M3J67j5l52J35
6824c0j62l06O13qj6j9N3l9N3l64K27N6m25N02l45J15nN5j78K71j8J36n28K90
$$ y = [-75, 291, -51, -13, -74, -100, 52, 57, 173, 99, 64, -232, -255, -108, -115, 111, 250, -21, 530, 111, 25, 59, -233, -198, -292, 149, -56, 183, -137, -136, -128, 106, -106, -34, 5, 180, -17, -200, -330, -197, 166, 150, 20, -170, 77, -50, -193, -43, 207, -2, -327, 97, 109, -475, -8, -54, 80, 193, -175, 17, 16, 112, -159, -68, 60, -31, 202, 78, -234, 63, -267, -209, -292, -134, -64, 36, -36, -135, 23, 2, -290, -248, -57, -18, 162, -139, 479, 95, -99, -16, -217, 58, -89, 78, -119, -117, 72, -229, 217, 194, 71, 287, 127, -122, 319, 406, 231, -42, -33, -17, -80, 266, -84, -163, -149, -140, -200, 7, -50, -230, 46, -165, -25, 99, -86, -40, 176, -179, -24, -124, 268, 226, 81, 89, 42, -255, -210, -19, 100, -24, 322, 54, 264, 179, -127, -62, 22, -211, -68, 228, -36, -17, -40, 136, -65, 255, -153, -8, 35, 202, 187, -165, -30, -192, -498, 115, 107, 91, 72, 125, 86, 139, -225, 2, 58, -367, 135, -210, -95, -100, -45, -223, 48, 30, 166, -362, -72]
6848g2K63j24q1n1LK84l44J64L3l74K13L22j47r8J20o7k04K2K66j24L03j13k38
6871d4N4J10n4n3J06j75J7k9O7O7k74q2J94J76k9J8k27K71j92nnJ11N4O1K05m12
6897g0n7K07k22k92K17J18J72k37M32k41J66j91PK38k18j30K43j62K35o6j58K
6919gJ0l72M91l94m6Q2j32O88o6o0L20l32K12n94K70j84Q0K20K3l83P4N2k15J21
6943a42P9K01l13J66n0J73J8J13M3j25k37O9l8L72k30P7p7k29M26l70J27ok00
6966a53Q6J80k19j23K20j23K61l75K94k46L04o9j99K63n9K76K3m98J11L92l54
6987hR2K90m83J92K5J8k33J5K52k49K74m58R4J92p9M6J4M7L4L3p0J25k4J15p3
7012A81r7J7K9j47N5J40M6J03l20j65j29K18k84M05k36K78j50N7K72l70J16l1
$$ y = [-72, 191, 67, -14, -65, -62, 222, -122, 42, 75, -299, -86, 236, 89, -9, 111, 44, -160, -138, 128, 4, 307, 194, -44, 10, 120, 66, 13, 119, -56, -39, -68, -1, 66, -208, -290, -96, 80, 51, 69, -158, 113, -79, -84, -89, 22, 76, 137, 342, -70, -127, 80, -142, -434, -217, -99, 73, -164, 268, 27, 193, 2, 9, 247, 29, -101, 142, -20, 215, 149, -9, -7, 3, -369, 122, -272, -318, -236, -368, 320, 254, 194, 514, 182, 394, -200, 70, -114, -34, 186, 209, -174, -100, -48, -263, -142, -63, 138, -175, -9, -59, 114, 132, 245, 288, 163, -74, -5, -43, 329, 99, 176, 99, -130, 296, -74, 53, 47, -153, -67, 113, -106, -229, -9, -132, 129, -246, 48, -198, 106, 37, -162, 101, 42, 318, 341, -157, -46, 346, -8, 84, 374, -109, 83, 108, 126, -107, -92, 160, -89, 185, -273, -179, 13, -66, -20, -6, 41, 75, 108, 38, 163, 139, 254, 181, 84, 101, 130, -17, 38, 178, 224, 327, 7, -158, -287, -69, -353, 52, -184, 94, -56, 1, 273, -97, 19, -12]
7034a2O8k7K57m18Q2R3n3m2m1K2l3K3K10k2j20J77l31L80m8l38J8n7K74j57J12
7059A7k81L4j45J34M50q4k10J60k11K79K01l30j35L56n30K23J07n0k65J65R1m3
7081f7J57j59j71L16j9l34J98K38m8k76L7J74r9R9j03K58k26j26J49J01l8j83
7103a22R8NK5P7J27l12N7j20K74Q8m03o5K52J27K0k57K2K66Kj66K60j81Q8l33
7127a71L59J37k33r0j11J82k0Q2k0j50k1KL02m58J25K93j23r4m3J48k61J65m32
7150d32k5L91L83l35o5L06m23L46m15O00j93k81K74k70K9L81j18Qk31J16P8k92
7172a68J91J48k13J08p1k95N44k12m1O3L5K1j03Q5L3m10L42P1j66J81J75m12L89
7195B95m42M7o8K07n2J42j71l16L04M5J1m79K11K56K17m73L19j41J77L5k06oK09
$$ y = [-12, 56, 29, 286, -132, -50, 43, -10, -52, -93, -71, -104, -81, 129, 107, -13, 164, -167, 213, 165, -173, -155, -212, 62, -95, 17, -264, -230, -375, -241, 209, 125, -85, 75, -136, 143, 344, 14, -121, 235, -295, -72, 35, -15, -280, -115, -24, -67, 90, -69, -240, 76, 57, -277, -79, 159, 111, -165, -128, 46, -53, 46, -57, 201, -25, -151, -2, 99, 61, -122, -24, -19, 6, 83, 210, -102, -45, -165, 109, 197, -206, -271, -19, 108, 128, -129, -107, 159, 161, -5, 255, 74, 162, -171, 188, 325, 92, 2, -109, 73, 53, 135, 115, -35, -56, -54, 248, -210, -85, 208, 85, -9, -52, 96, -165, 0, -432, -457, -66, 317, -18, -83, 223, -200, 146, -269, 331, 138, -143, 131, -139, -110, 271, 153, 161, -70, 46, 124, -168, 23, 171, -42, 66, -5, -300, 244, 32, -9, 54, 89, 110, 7, 92, 125, -285, 57, 128, -38, 143, 318, -94, 295, -147, -100, -168, 39, -13, 129, -42, -358, -54, -9, 2, -477, -266, -10, 207, -266, 53, -88, 89, 124, -82, -88, 121]
7218A21K14m83J57k9m34N41o7j91J86O1K5l97M93m92L83j5m25k08J97N46l57J83
7240Il9j7J35j99J03k8O6j92L32j57j7k87L24M2L0q8J0j7J39p6j20L8K24l45K86
7265A56j37r4K96n71L61m9M3M4K03pl83L04J21j79j09k61L35J69o18J72J45J5
7287d4M54n88K67m36L67r5k99M10P3j29O9O0k12M48n10K01j42j17J32Q1j52K24
7309F2j44m3O8o3l0L70j50J58l05nj07R9J01l45M25l02L06k96K38J50k1J00l01
7332c5l78M00k35K29l5R7N8qQ9j21k48R1J57o9K39k77J86j2k3j84q6k9M24l25
7356i5K51l35j33L25J76Q4n08M73m27M28j95j85J0J14L39m4k75K15j87k31J24
7377g6p3L4J2N1L49l12p4J23j00M27n30K89J10j04k06P5%q2j37K08k6k9N9J49
$$ y = [121, 335, -148, 9, -20, -454, 87, 20, -171, 15, 76, 101, -296, 197, -295, 88, 73, -352, -560, -363, 183, -174, 9, -30, -47, 88, -111, -8, -36, 30, -162, 170, 13, -4, -291, 33, 75, 105, 17, 27, 10, 149, 73, -47, -9, 215, -130, 156, 19, -75, 221, -350, 11, -38, 5, 49, 252, 245, -138, 166, 287, 108, -1, -262, 73, 242, -376, -204, -59, -44, 410, -178, 89, -347, 20, -75, -374, 36, 109, -20, 49, 109, -103, 345, -165, 36, -106, -223, -91, -10, -162, 62, -82, -125, -57, -120, -150, 220, 70, 228, -77, -82, -189, -90, 11, -334, 91, -211, 95, -201, 37, 187, 166, 266, -35, -413, -13, -248, -19, -54, 43, 101, 93, 182, 61, -187, -96, 61, -8, 231, -46, 140, 128, 105, -79, -165, -194, 230, -95, 156, -179, -312, 13, 189, 273, -235, 238, -189, 239, 44, -141, -131, -17, 322, 278, 3, 218, 31, -200, -76, -149, -115, -103, -52, 297, -15, -89, 34, -66, 361, -169, 120, 230, 126, -80, -5, -5, -87, -224, -16, -42, -71, -12, 137]
7401A37j03k74J83k10J29j3j18K07J67j23M0j24j30K66P0k07K65J02j48j90l7
7422a11k01J73J11M1p1j88M45j41l8j91P9K5k03K82k4J53J75l83J8N7J10j16j12
7445a10J90k45J22M5J18j78J10O4m09M02j89J51k20l5J17j27j82J80J51J34J0
7466I9l49K46q8N08n30J55k67J51J75q6J3p9J42J23J49l98j4J31j28n7L00j06
7488I0P2j60R4l24N08k85N7j27J01r4J10k75J41J68j46M1R8J17j88L3P8K1l27
7511a97M36m51J58r0j47N02P6j49j20P2m4N3p6J60O3m10K90n4j65j73J66L12j91
7534B1M8p1L20l23j74K12K25k80j29L96l62J02K6K25j66j31O4J55m6l93N1L50
7556A20r5j6J67k45l7J53k15K33K18j73l16O4J8J12R9j86J70j44N1j30J71K27
$$ y = [137, 34, -240, -57, -267, -138, -151, -269, -62, 105, -18, 22, -102, -232, 34, 104, -103, 162, 264, 116, -74, -111, -312, -139, -28, 13, -58, -246, 199, 58, 20, -171, -92, -67, -270, 12, -12, 141, 316, -67, -49, 8, 118, 2, -110, 80, -165, -43, 2, 120, -58, 52, 116, -293, 109, -80, 71, -149, -184, -67, -194, -376, -196, -45, 89, 99, -250, -4, -92, 416, -114, 41, -226, -75, 100, 14, 27, -52, 90, 213, 362, -36, -50, 81, -47, -104, 196, 90, 162, 2, 96, -228, 280, -5, 52, -75, 26, -68, 42, -233, -92, 76, -70, -29, 69, 186, -2, 31, 109, 130, -197, 239, -212, -54, -144, -291, 211, 287, 138, 18, 90, 46, 99, 23, 183, 246, -164, 126, 72, -93, -266, -100, 212, 21, 69, -2, 318, -5, -179, 33, 258, -22, -151, 245, -117, -15, 11, 236, 70, -61, 3, 158, 112, -281, -230, 120, 25, 9, 176, -69, -106, 47, -168, 65, 283, 110, -206, -142, -124, -12, 87, -99, 71, -73, -22, -152, 19, 246]
7578B46j61k07M10j43j45J9k33N6K64M5k05LJ14j02J14k50nM30l19j79N03k33
7600B2k65N4j50L24j00J69Q9j83K30k90J66l50L58l86J22L22l75L21K01l25r7
7621a43K11M8k00K0j3j05L88k51K47j33l61P3j3M45k90k85N06l00J98l14L80J33
7643B41m76M52n2m1j47K53l99J98J41n4j56r9L8o2K05j03j52R4Q1j57l3L09k84
7666b03J06n5J92k14J46j47j51L90k92L64l64L70k89Q4J10Qj0m9J44l64L50k05
7688g9o8L1J51m5m8m8O0k6J45j6O5k06J55k9k1j14O5N8qR0q4K76l17N1J04J0m23
7715b71K04P5j76L89j17J64j69o7j19R0O2q5J83R5l39N4J10K55l56J74j34j97
7737a75L48k1p0r6J64l07L33m08O7L02j55J39r1N6L46n02L8J67L2j62L25o26L64
$$ y = [246, 85, -122, 288, 145, 0, 19, -214, -158, 106, 151, -54, -51, 63, -39, 75, -175, -180, 250, -69, -248, 255, 22, -243, -189, -339, -15, -115, 54, 143, -40, 190, -100, 66, -284, 74, -312, -190, 132, -243, 78, 279, -46, -143, 68, 116, -84, -64, -77, -182, 206, -45, 202, 69, -292, -219, -232, 213, -77, -362, 144, -156, 42, -272, 108, 241, -235, 217, 165, 124, -23, 230, -169, 29, 170, 116, -40, -139, -101, -163, 42, -61, -213, -119, -38, -195, -228, 81, -203, -97, -152, 40, -174, -28, -175, -326, 64, -228, 136, -228, 142, -147, -63, 47, 55, 45, -4, 140, -224, 126, -79, -147, -116, 35, -10, -58, -106, -46, -72, 73, 57, 122, -84, 71, 42, 21, -93, -28, 30, 22, 112, 28, 304, -13, 38, 142, 152, -271, -67, 8, -168, 221, 104, 268, 99, 32, -87, 3, 65, -20, 163, 258, -81, -27, 83, 338, -18, 156, 22, -175, 173, 152, 82, -14, 150, -157, 176, -232, -165, 137, -18, 121, 30, 86, 432, -70, -32, 135, 167, 5, 330, -296, 68]
7760F8j68nk55J46J82j51J83k56K43j74N1l1P1oJ01j56J26L59k59J1j91M96l83
7783Bl31M94j87j80K65k03O8K59N1l32P0Q0n5k1K11j71j66K41k46L20p1P6p5J5
7807A14k09K14P5l36K48J40k28p3J42j09N0n0l59N12q6l8RK02k46j36M89m40L09
7830A94p4k61J39j70K54j62j92K24R1k48M8K35K04j19j35l4l2L90k35O4Lo8l4
7853H2j33n2K05K20k70j9m0j90J23K0M2N3J14n2k59L43k54L1r7K52q4l1R9k3P7
7878A57j24k10N5K74jl16j14K00K38m00J96k71O57j72k81J97k71L28o77O37l21
7899b19K95p8K93q9k09J46l02J68J61l7J71q2k75j08j20L29j6l2J74k04o2K1K1
7922e4r6O2K14o9J22k19N0m7K68k12J5k17J29K22k17J4Qpr6kJ89j73N8J14j91
$$ y = [68, -100, -105, -360, -214, -32, -183, 0, -256, -13, -187, -136, -167, -96, -102, -1, -157, -31, 328, 69, 80, -111, 385, 2, -329, 165, -22, -202, 63, -140, -72, 187, 238, -94, -24, 56, 1, -20, 191, 20, -146, 95, -151, 169, 98, 174, 99, 114, -95, 119, 194, -142, 106, 246, 18, -55, 87, -22, 28, -22, -381, 131, 45, 7, 16, 218, -28, -164, 325, -115, 194, 120, -141, -2, -172, 82, -80, -272, -48, 43, -205, -157, 78, 282, 163, 28, -6, -38, 352, 117, 181, 184, 116, 82, -51, -103, 102, 322, 52, 33, -7, -197, -74, -54, -12, 41, 155, 103, -156, 187, -67, -36, -133, 119, 35, 4, 103, 80, 157, 33, -177, -122, 152, 151, -165, -279, -79, 159, -241, -45, -316, 341, 169, -112, 85, -186, 142, -535, 102, -219, 76, -2, 291, 202, -7, 139, -163, 5, 166, 129, 300, 218, -57, -165, -285, 44, 28, -4, 170, -34, -96, -75, -54, -150, -88, 126, 57, 179, -40, 10, -37, 231, 19, 34, -183, -54, 168, -49, -35, -27, -34, -130, -132, 57, -116, -58, 56, -135]
7947a35J43q2L29l43P9J06j98K52j66k44L81J56j71J22k44q8J35K40j49l83R7
7968a63N14k77r6k61N54l78Q0k9j41J01L0m04N16k5l07M35j23P9o8Q9n2k62M1
7991a47M5J63j75K04q1R3%p0OJ80k92K12l5j54J3J50P2l77m8RL10k9l74K75J5
8016c5j75o1L1K61l1L5lJ35j43k67M75l12M9J25N3j26l6K84k02p1k7K64n1J10
8040B82m34J92R6j9j15k75M01j84J63j02j6n7J2m4N8k04N34k38j07O5o7K56k52
8063e5K99j54pp7M8J23Pj76l07J95K36M7l97K86K1M6k97J75J25Pj69J37k55J56
8087A4J49l6r2r6M23n25K3K04j28j85N02j87Q3k77K89l25J99r9K66l14K84j14
8109E8K0k03J66M1M7k9q6K06k6k75j83O15l58j57J15N30m78J09j46m9R8o1j05
$$ y = [-135, 8, -74, 255, -88, -9, 97, -101, 151, -15, -259, 122, 278, 107, 229, -15, -103, 32, 272, 123, -260, -163, 351, 74, -22, -283, 271, -107, -27, -56, -197, -96, -66, -470, 46, 21, -286, 149, 26, 105, 37, 126, 74, -188, -147, -102, 61, -114, 90, 9, 102, 102, 32, 38, 218, -74, 138, 103, -51, -38, 112, 184, -193, -241, -232, 78, 49, -325, -50, -35, -210, -271, -240, 21, -10, 25, 22, 157, 14, -253, 222, -90, -41, 84, 137, 11, -25, 259, 57, -14, -41, 223, 172, 282, -152, 40, 136, 117, 2, -273, 128, -56, 107, 5, -11, -68, -56, -100, -42, -246, 288, 50, -57, 8, -59, 197, -55, 244, 90, 83, 6, 54, 177, 184, 8, -299, -104, 132, 179, -218, 68, 89, 135, -162, 13, 138, 145, -24, 113, -142, 14, 163, 127, 35, -61, 362, -163, -140, 64, -64, -249, 253, 66, 149, -128, 161, -164, 35, -64, 202, -112, 172, 58, 78, -125, 41, 82, 129, 100, 14, 220, 194, -81, -264, 351, -7, -164, -49, 481, 3, 112, -34, -83, 15, -46, -151]
8132a51j60M27k20j68L10r6q1O6J04K12j38m41N88k67N4k32R1J43j64N3N1r9K63
8155A45K37o18K72k33J49Q3O0r5j17M7K21k67j13O0Rj3lk7q9M05l41J33k32K39
8179h8Q1Jpl3L68k38k3r1J03n15M17j26
$$ y = [-151, -311, 116, -104, -272, 38, -58, -139, -73, 31, 243, 105, -336, 252, -15, 39, -193, -102, 41, -123, -70, -19, -118, 145, 382, -236, 36, -197, -48, 35, 95, 0, -117, -70, 151, -116, -229, -169, -160, -173, -176, -203, -292, 113, -228, -95, -327, -88, -7, -6, -13, -46, 322, 84, 61, -30, 73, -442, -25, -151]
8191a51
$$ Imaginary data points
##PAGE= N=2
##DATA TABLE= (X++(I..I)), XYDATA
0@%%%%%%oJ4j6J6j6K4l3M1m8N6p2Q8j04J20j41J65j90K19k53K91l29L72m25M82
30B55n42O08o81P62q50R49j057J173j302J444j599J769j958K168k402K665k962
47a560L301l689M139m671N311o096P085q378J0149j2732J6858k4494M3206j69014
61a40585k47932L90464J63042k26377r6554J64459n0016j36087J28772J67115
71A16301j36564j04144J46600M7069j71828L7488K32986m2379k64597K1465K33841
82A16238r30j65166J7580Q4520o3498l7198J11741J4299j29733L632J35696k8229
94E8952j31818N3107J35896p0751j44615N5409J25990m2545r5959J9383L3788
105c163l2725J3149N4494m4339p7095N5303R1286m8503p6501O0390P2376n8245
$$ y = [0, 0, 0, 0, 0, 0, 0, -6, 8, -8, 8, -8, 16, -17, 24, -24, 32, -40, 48, -56, 64, -77, 88, -102, 117, -136, 155, -174, 198, -227, 255, -287, 321, -360, 402, -448, 501, -556, 617, -685, 759, -840, 929, -1029, 1139, -1263, 1402, -1560, 1741, -1948, 2191, -2480, 2831, -3265, 3820, -4558, 5591, -7141, 9717, -14777, 28429, -140585, -388517, 1947, 164989, -61388, -157942, 6517, -43499, -179586, -50814, 116301, -20263, -124407, 22193, 69262, -102566, -65078, 167908, 125529, -139068, -117603, 116238, 115308, -49858, -32278, 52242, -11256, -48454, 63287, 77586, -52147, -48515, 87181, 58952, -72866, -19759, 116137, 45386, -99229, -43820, 82170, 39625, -56334, -36951, -3163, -35888, -22739, 31755, -12584, -89679, -34376, 56910, 8407, -68094, -7704, 64672, 6427]
117F427n9288O2633N7081m5388l9421K3771L598j7188K9908J9292o1589m0089
129f0253O4659M7874n7368m6220M5873L4888l6963j8937L3716J1715k1580K59
141b337P833j5100M428L3651q831n2659Q51N6842Q367n0866j3890L5513J1911
154A5713j8517k45R265q072m69J6221m270j9703J0887K3738j6862l1837J3500
167a0651L2388j0103l2479o46J8606K258l888Q87p421q076J5203J7004j2259j6125
181a5302J5623J7944j3174j4906J4198J6505j0206j5476L118Q084R83l13l053
194D025j0919l001J4201P080j3524j0907R569J0978n819q840L638O894j706o020
208d351j338L478L575o82m948m288K106O158L189m580o995K347J0569L760q737
$$ y = [6427, -52861, 9772, 66853, 21465, -17956, 5815, 9413, -7775, 22133, 41425, -20164, -60253, 4406, 52280, -5088, -51308, -5435, 29453, -7510, -26447, 7269, 18984, -2596, -2337, 5496, -9604, -5176, 28475, 19644, -33015, -32164, 24678, 33045, -17821, -31711, 3802, 15713, -2804, -3049, 6216, -1856, -2325, 13896, 9626, -10077, 810, 24548, 7686, -24151, -10651, 21737, 11634, -20845, -21491, -2885, -627, -4515, -3628, -11049, -19125, -3922, 13082, 823, -15302, 321, 18265, 5091, -9815, 4383, 20888, 10682, -4794, -1676, 6408, 7391, 7078, 4025, -6894, -9895, 4306, 11386, -2138, -13045, -3476, 7502, 1683, -7157, -3519, 3375, 1669, -4351, -5689, -2211, 1364, 682, -4266, -8554, -6448, -290, 2899, -1681, -8676, -6329, 4240, 8000, -737]
223g37m831Q714O629n650n297N841L429m924j924K080j984l175N167J370j1277
238f569l830J2892N052j3751o580J2435O151r312k647P768j1o016M478N704p676
253a912m155J0703L447j3220l800J4364L993j3696l767J1212L187q285K63N831
267D165l893k945P093K160j0514k095J2319J259j3684k041J2337J419j1414j659
281g493Q232M99n158J954K545m239K09P825o9r645N40J1349Q33j0773r98R243
297D854J406p435p93M130l83k091J800n38m291J651O062j891q284J632Q319m10
313C738p631p45N939J461l922j008J519J64O24J062k066k731K522M296k303m654
329c735J328N967l75m531j341L515K009r25k507o32J569K262m96l245j026L026
$$ y = [-737, -5568, 3146, 9775, 4125, -1172, 4669, 8098, 3174, 1250, 3330, 1346, -1829, 3338, 4708, -6569, -10399, 2493, 7545, -6206, -12786, -351, 5800, -3512, -6159, 1609, 1598, -4418, 60, 5764, -1912, -6067, 4636, 8083, -5137, -8937, 5427, 9420, -4276, -8043, 3169, 6356, -1929, -1666, 4165, 272, -2673, 4420, 6580, -3934, -6029, 6290, 7549, -6135, -8176, 4161, 5580, -5834, -7493, 739, 1238, -3920, -1966, 579, -3660, -3451, 4374, 4305, -5340, -4800, 6549, 7382, -3391, -4389, 4854, 6260, -1175, -1968, 2162, 1779, -312, 1488, 950, -3341, -1690, 4372, 2481, -5803, -4171, 4148, 3738, -3893, -4638, 1301, 2762, -1160, -2168, -649, -485, 139, 1201, -865, -3596, -1074, 3222, 919, -3735, -2407, 3560, 3185, -1346, -2687, 828, 2837, 1912, -595, -1227, 342, 2604, 2108, -1137, -2163, 863]
345H63K126k389l119O83L382P86k873k326J568L069J3l125j633K751K105j141
361G40k448j46K125J293j073j901l81J775J745r62l002M41L326P04l177j715K741
378H5K413j790k092M87J831O00l86j449r07J462K370j020l016O0L210J112l378
395d08j733K106J904j169j792J08P44Q51k9j409j007J091J990m43k965MK787R98
413A628k147j669J191K837j093j837K31J459J40Q0o94r80P61J553K94k123r53
430a322K457J325j905k074J329K148l36k266k12J027N07k28p34o67P1J376K70
447G66j923j060J856K010j849j818J347J946m47j485k34J426L56l44m75p73K91
464d10J332M23j424j429J488J931j513j545L26J700j50j378N6P11M23n25j68p27
$$ y = [863, 2989, 600, -2519, -1836, 1546, 2332, -541, -2867, -1299, 1770, 1783, -1342, -2975, -224, 1881, 740, -1708, -1854, 271, 1564, 491, -1410, -1791, -16, 1729, 767, -2235, -1794, 1532, 2236, -941, -2656, 85, 2498, 708, -1384, -897, 934, 1534, 1148, -301, -1208, 254, 2624, 1604, -1412, -1352, 1858, 2970, -408, -2141, -35, 1869, 700, -1092, -984, -240, 611, 582, -827, -1834, -743, 1247, 804, -2161, -2157, 630, 1628, -519, -2188, -997, 1840, 747, -1090, -859, 600, 740, 820, 126, -854, -93, 1460, 1754, -369, -1322, 1135, 2460, 555, -1519, -190, 1958, 1622, -644, -856, 171, 678, 450, -284, -951, -880, 496, 766, -1157, -2217, -361, 1649, -200, -2018, -671, 1275, 828, -657, -891, 535, 891, 547, 72, -701, -410, 922, 1345, -79, -1508, -20, 1911, 398, -1147, -821, 879, 729, -649, -593, 118, 541, 16, -152, -879]
482h79O1J242K04j116j385J727J379r40j442O21J238J66j301J28Q04p9J66l96
500A98k60k31O32M68p90j291J119J395p72j548L84J404m43j014J95O00j45oL31
519B26m43m70R19Q61q86j368J355J345j148j168Q37Q33l74p29K85J06k27K53M04
538F11l61q19J035M88j211p99J314N58j297n02J356p4j015K73P96p67n21J345
556D10N02j666k88J739Qj338j37J201j56n76N65Q15j233m91J590J54j325l19J661
575A116n86j382L03J846j056j280Q54J042j451l81J457M3j749L84J919r32j707
592a560J268J462j070j517J620J134j626p31J696O03k172K55K125p96j867J186
608A0J937j689k151K147J360j673j235J967O10k399J41K134r03j968J246K093
$$ y = [-879, -818, 424, 628, -488, -1873, -146, 1233, 293, -1149, -528, 710, 876, -425, -297, 507, 428, 594, 198, -62, -293, 339, 807, 17, -1274, -155, 1240, 468, -1080, -696, 708, 265, -749, -554, 46, -99, -105, 226, -217, -687, 232, 1093, 207, -1161, 194, 1539, 391, -777, 60, 893, 519, -210, 75, 181, -46, 207, 611, 250, -569, 466, 954, -257, -1056, 258, 816, -481, -983, 373, 299, -716, -443, 353, -414, -935, 410, 912, -754, -1042, 697, 705, -633, -770, 431, 275, -301, 264, 1079, -154, -645, 945, 1099, -226, -545, 1116, 530, -852, -549, 1297, 241, -1039, -185, 857, -594, -975, 482, 525, -1224, -840, 1079, 147, -1560, -292, 1170, 100, -1417, 203, 1337, -289, -1020, 676, 1279, -893, -638, 1487, 691, -1176, 10, 1947, 258, -1893, 254, 1614, -59, -1294, 673, 1283, -1116, -975, 1159, 256, -1712, -466, 1627]
624A627j700j877K154J445k480q82K058O24j811n7K233j327j300J378J969k096
640d2j443K167J206k506o81K120L15j909k94K032l25j748Q29J209j425j052K211
657F64Q28k392m50K013N65k040j38J895j56j409J97J530j114q51J047P41j462
674e32n22K113j16k042M21J743o4j817M44J093k23r18K64J052j009k12J044j54
692E65j453L41J601p70j341N47J082k29j163O84M78j52n63R35j89p95Q98J01m62
711A15p91J010N67o95p49M50O64l04j50m65n9M06N62o14J8j47K91L25q89j19J121
732E47k37o09r4L15K67K3l87j46L14j79L99l01k38PN93K5l39l23N11N27n21m03
754b49R0M98j87K2m17O9N19k78l58J95R2OR5m35P4L41L17k34m16p0N02K06m53
$$ y = [1627, -73, -1950, 204, 1649, -831, -1713, 345, 969, -842, -899, 1334, 7, -1293, 85, 2054, -42, -1485, 682, 1888, -618, -1299, 821, 1136, -773, -1067, 965, 640, -1108, -279, 930, -495, -1547, 664, 1492, -900, -1350, 663, 1228, -812, -950, 945, 789, -620, -423, 1107, -7, -858, 189, 930, -532, -1054, 1059, 943, -1099, -678, 1065, 1001, -816, -372, 721, 498, -420, -156, 896, -113, -325, 719, 565, -888, -547, 1054, 284, -1057, -510, 572, 343, -820, -136, 342, 190, -373, 562, 373, -422, 476, 577, 115, -676, 334, 901, 206, -543, -93, 571, 267, 117, -348, -407, -1, 561, -53, -35, -182, 109, 434, -455, -574, 547, 310, -299, -393, -78, 189, 212, -175, -321, -7, -186, 213, -88, -326, -319, 274, 299, -40, -363, 148, 675, 154, -249, -159, 339, 152, 174, -243, -174, 345, 67, -291, -96, -4, 2, 97, -338, -264, 77, 394, 160, -256, -326, 176, 382, -71]
777g1j94O71j3o16j19L79j62K0M69j89n28M62J34j45n11mP42m57l54Q5P37j84
799A52l59J54L67o01k8L37m31m36P66L94k96o10O20O02m25n28L56n2P4P9M29n53
821A1n61Q41j01j27o42O75M31j155L51K49K50o48M10N10q30J67J58M87n94l1M86
842C37j67k78k44R02j47o55J29N59m87k69M44L29r68J28P70j21l71k52O95r6o34
863c96J50O17m31n98P86O9m21J61K95j95m80M70L62k99p23P59L64n45p7K05K53
884C26m39m04P64j12o10L97L35j99l7j50L39j96n23O32N0j86l21N31j03l62J65
905a03J32j0R7m09M78k76k04N50k15j11k16M78J22k09n13N71O2l75J68L03k63
926E7j77L52m6k10k14N52k81m07N71m8l1j99j54Q4J62J66k22K30m28L68L0pk80
$$ y = [-71, -265, 406, 393, -223, -342, 37, -125, -105, 364, 175, -353, 109, 243, 98, -413, -417, 325, -132, -486, -401, 336, 152, -207, -53, 314, -287, -315, 22, -409, -845, -79, 315, 19, -591, 29, 631, 206, -322, 34, -18, 56, 135, 564, 11, -550, 291, 190, 63, -579, 96, 527, -628, -277, -28, 222, -426, -16, 494, -336, -169, -11, 476, -118, -149, 337, 170, -108, -352, 550, 403, -252, -123, 436, -51, -320, 124, 453, -515, -387, 383, 262, -109, -361, 334, 238, -396, -246, 371, -60, -658, 128, 197, -224, -63, 232, 37, -443, 27, 389, 90, -633, 126, 490, -55, -132, 73, 326, -113, -517, 247, 135, -475, -78, 257, 58, 21, -129, 210, 14, -509, 123, 173, -13, -334, 197, 94, -268, -103, 29, 19, 116, -293, 185, -91, -295, 255, 40, -71, -287, 191, 313, 104, -409, 162, 224, -151, 17, 320, 57, -120, 232, 186, -24, -238, 314, 33, -374, 197, 149, 118, -81, -235, -151, 11, 177, -45, 185, -243, 125, 155, 148, -132]
949a32N8J62j44J58j36L69m40J32K9j55J21K04O3l87K49k36K13l30KL10j03j15
971a08J79J77l61K33j33K60l32L7j49K73l5O5p1L5pj74M8N6j11K04j46J1L20l43
995g2J46J78k59J12m37L88j32K38k40J06P1K46k43p3J39l33k9rM66m9J77o03L77
1018A65l08J5J55K3j33j03M3J22J78j16mo0J09j27j81L35j42k28O0k7K45j23K53
1041A51k26q5n0N53k57k64K12K44l71K56j09N8o9M4o6M06l28o9k2j19K3L95j75
1064A32r6q4k14J59M6n6RK61j4k11j36R7J39k49Q5L12k05jQ8j8J3l07J88K62k20
1089b0J04Q0J12l17l05M71j31m82L84p2J50J96j36o8j83K56l17K52M8p8J90l04
1111a70j57Q0K75K51l55r3J08k4k8j33L25q1n3K34j2L0k72j21J27K47l62J76j5
$$ y = [-132, -74, 88, -56, 102, -34, 335, -105, 27, 56, -99, 22, 226, 289, -98, 151, -85, 128, -202, -200, 110, 7, -108, 71, 248, -113, 120, -13, 247, -85, -48, -197, 76, 41, 106, 35, 70, 63, -111, -63, -7, -118, 86, -60, -49, 271, -72, 74, 252, -7, 105, -332, 56, -76, 162, -78, 28, 99, 345, 102, 29, 168, -165, -194, -203, 263, 214, 391, -212, 165, -143, -128, 27, 50, -83, -186, -143, -21, 157, 41, 37, -23, 86, -41, -222, 113, -29, -257, -197, -224, 21, -102, 151, -75, -160, -210, 343, 86, -178, 34, 278, -93, 163, 54, 112, 43, 87, 21, 427, 99, 30, 8, -111, -88, 307, 132, 36, -48, -262, -103, -57, -113, -104, 157, 143, -68, -204, -107, 32, -217, -132, 180, -25, -26, 62, 44, 57, -250, -62, 200, -20, 84, 164, 276, -41, -346, 125, -6, -488, -104, -176, -26, 170, 34, -34, -217, 39, -278, -26, 22, -56, 134, -170, -327, -247, 28, 279, -76, -169, -61, -85, -113, -246, 79, -2, -55, 179, 167, 197, -75, -196, -69, 178, -184, -8, -23]
1134b3k84K02M4J68R8k52J72j84J18j93q8L4K6Or8J77P5J1K88l90K11K4l47L43
1158A38m50K34K24j65j85Q6L11mj75j9K1j43J56k8J09q2K22k23j27j85K43l9J5
1181f6n7L27j74M2oJ29j51l11K89J58j16J13p0o6M83m73MK11j13k90N62k71ml8
1205A12J27l12J73j02L25l99j8J62o1K08j47k64L47k81J64j52k45K53K04l00K72
1226F6j32J26J47l57M51m34N5o1l5K42q2J58k86O3J20j24J48J07j11j11K35j32
1248E3j30o7K5K75j3k85K26j70L85l73j57K60J29j41L69n98L89mk06j4j62L39
1270A30k21J07n0J21J92r4r7k62K04K66l31j6RJ76j39K4k45K25Rln5J89J5k94
1294a40K32R3k21J00j66P5lN2q1m1J63j8m6j29J12k23L03l32K26M1o4j69n7R1
$$ y = [-23, -307, -105, -61, 107, 205, -47, 125, -59, 59, -134, -222, -188, -162, -156, -254, -77, -2, 9, 297, -93, 118, 142, -205, 138, -312, -78, 146, -19, -204, -118, 193, 189, 14, -5, 16, -127, 29, 1, 110, 28, 250, 27, -100, -285, -42, -81, -66, -123, 204, 30, 72, 66, 195, 44, -267, 22, 180, 64, 177, 107, 41, 524, 51, 55, 266, 153, -137, 425, 154, 150, 112, 239, -73, 100, -2, 323, -76, -94, 68, 7, 215, 68, -196, 151, -130, 34, -118, -363, -110, 94, -206, 66, -66, 60, 207, -150, 301, -133, -78, -139, -174, 68, -14, 144, -142, -79, 41, -83, 65, 172, 61, -50, 185, 53, -77, -144, -119, 156, 143, -142, 84, -86, 299, -74, -231, 29, 158, 17, 386, -212, 177, 173, -33, -47, -209, 130, -91, 16, -34, 87, 279, 185, 88, -174, 30, 296, -35, -51, -42, 134, -5, 19, -226, -1, 8, 5, -50, 139, 154, -140, 92, 185, -36, 64, -102, -27, -30, 22, -59, -100, 63, 45, -1, -130, -18, -241, 62, -270, -44, -3, -67, -236, -293, -202]
1318b02L35k92m1J35K61j6k35J47j67l9L66l91j9K76l68j72L24J84K4j86L0L51
1340C05j97J93l66n7P0J49j12j10J17K22m05J53K5k56M87l10O7j9o0n7L80k16
1362CL0r0K49n09J30M23k46j03K2J76j14J14r8q7L42j47j14MN8j85J09KJ21m60
1386c70J44L75k13j15K94K72k79k0J72k60p4k58M85q3l06N28l02J13j03L32p9
1407B53p1k87K50m49M17j87J09l04K7J24K05k02K46J13l43j5q1K71p0K75l79J47
1429D9Pl21K40L9J0j73L8K52k3j8j25m5p9K06K4R7N9m46L41J86k80m3K13j65j32
1454h9nL00k81N6k1J0N3J13k00K73r5p0j75M10j82J26m99L10k2k86M10k94oK46
1478H2m9J00l08K4J84j03J87k3k28K76k57K05j56ok74N63j23ro9j20J07J12j33
$$ y = [-202, 133, -159, -200, -65, 196, 180, -55, 92, -75, -114, 252, -139, -158, 118, -250, -422, -98, 86, 110, -76, -46, 305, 108, 301, -65, -122, -52, 97, -15, -125, -8, 214, -191, -38, -13, -269, 218, -92, -25, -44, -104, -161, 219, 3, 33, -57, 192, -317, -187, 236, -10, -113, -91, 85, -29, 85, -13, -100, 242, 95, -19, -15, 43, -142, -33, -31, 90, -370, -226, 149, -64, -179, 115, 387, 108, 88, 260, 0, -74, -332, 153, 70, -236, 292, -10, 103, 0, 332, 253, 182, -105, 145, -304, 113, -74, 35, -269, -242, -118, 87, -115, 131, 244, -99, -114, -195, 76, 6, 281, -98, 49, 56, -265, -25, 14, 24, -149, -111, 141, 118, 100, -25, -70, -149, 57, 81, 178, 237, -209, 132, 318, 38, -5, 208, 43, -89, -94, 206, -75, -19, -40, -30, 23, 136, -64, 209, 114, 44, -131, 279, 97, 223, -276, 34, 12, -274, 136, -158, -164, 82, 33, 133, -175, -151, 33, -70, 117, 94, -134, 142, -115, 90, -66, -72, -346, 217, 94, 85, 16, -104, 3, 115, -18]
1501a8P8j57Q5L39n15K84j62l3j52K2L72r1o6L2K5M1L1l07K11k15J36J03k90L72
1525A25l4k60K11j84k74L07j33P1j05J57K09R3L3j52q1N9n0N4J12j41n9KJ1L75
1549C46n16Q1K30j52L22k37k32L03j41j36L9L35m76K95m68M47m8p9R2l7K40l49
1571a41J97m35K57J22K31k26j63J40O8j52qL65k20KK39j86J31k56k7n5K15l18
1593b20J51O1j30M52l97o4L34j31j50j04N05n47N22j52l94N14l44O5m3Qq8J59
1615GJ73j1q7J3m38L28j40k4K14J3r7k98L49q8Q7m4j12QM22j99R4j34JJ22M4L1
1641B34l81J49j13K74k43J7j4L01q1l31M03P9l51j0K55j08j13L2N3K53k63n03
1663d61O84o4Ql15J47J45L4j12l24J97k4J4M5J41j19J81m75L43Q1J4L6k21l9J78
$$ y = [-18, 60, -97, -12, 327, -188, 96, -66, -99, -251, -229, 143, 52, -14, 18, 43, 84, 115, -192, 19, -196, -60, 43, -247, 125, 91, -169, 42, -142, -416, -109, -242, -171, -276, -119, 90, 183, 216, 64, -17, 42, -8, 46, 158, 17, -42, -40, -29, 346, -170, -89, 141, -11, 311, 74, -158, 145, 4, -132, -93, 242, -234, 61, -407, 40, -8, -87, 5, -32, 208, -141, 56, -379, -122, 0, 231, 5, -158, -18, 50, -102, -110, 255, 35, 37, 276, 90, 221, -35, -62, -117, 98, -220, -69, -8, -138, 314, -83, -147, 187, 56, -94, -198, 307, -240, 282, 130, -264, 250, -94, -29, -72, -64, -152, 7, 180, 169, 82, 95, -343, -15, -155, -179, 35, 48, -49, -347, 2, -86, 1, -43, -155, -147, 275, 76, 170, 36, 37, 159, 203, 234, -147, 2, -111, 163, -80, -63, -77, 224, 143, -188, 215, 294, -57, -67, 188, 80, -33, -1, 52, 305, 42, -461, 223, 159, 167, -148, -1, 144, 178, 66, -258, -61, -85, -71, -26, 115, -4, 177, -298, 45, 126, 140, 176, -45, -84, 94]
1687I4m21L48j94K66p6N5k5J26O6k70Q9J26J37j97j9l6k51M26k25k16K44J68j03
1710A12m73L62n0J05J20k64J89k22J60k7R3q1K93r2j09j64j33K8O20n58K48l60
1732b03n7J53l3J93j92L5j5N19l60P9k95M83m75M88l61j63L87k21P4k78L49m50
1754c43M71j17K12m76L02p5J85k76kL23Q9j04l03K20j29k7J55PQj25j71L82l49
1777a43R2j01L0L62n02J13M15l96k0K69k94n8L00o3R1n4j2k20K65N6J35k31k2
1800A2L23m78m9K74r8o8j16p0L90j60J32l5P9l3r7l7Q9J32l53J55k03K95P3m51
1824b94L96P8k44j50n1K54J75j70k08K12k8L9k01J34O5Q5L61m99K20m2j47j04
1846a19J47J47k39P2L63q11M10lJ1k17L93Q2p03L84J17j5k66M0K5J93j53J46L0
$$ y = [94, -327, 21, -173, 93, 17, 72, 47, 173, 239, -31, 58, 184, 321, 124, 105, 69, -182, 244, 19, -197, 47, 215, 112, -361, 1, -49, 56, 176, -88, 101, -121, 39, 12, 105, 24, 317, 225, 116, -48, -181, -153, 467, -91, 157, -203, -260, -107, -140, 53, -139, -104, -119, 400, 40, 119, -176, 307, -168, 320, -41, -204, 183, -38, 36, -242, 107, -343, 128, 11, 223, -253, 49, -26, 159, -117, -119, 204, 293, 189, -114, 106, -23, -50, 105, 112, 120, -5, -176, 206, -143, -51, -152, -122, 240, -262, -149, 266, -130, -150, 119, -175, -233, 67, 4, 95, 41, 29, -191, 74, 130, 265, 34, 12, 335, -143, -192, 82, -16, -84, -200, -270, 120, -40, 92, 57, 136, 103, 6, -31, 58, 190, -163, -8, -211, 84, 157, -294, 102, 180, -64, -214, -265, -11, 164, -6, -214, -2, -30, 9, -192, -58, 7, 92, 453, -46, 174, 132, -15, -119, 28, 175, -64, 8, 371, -440, -30, -33, -22, -239, 154, 236, -467, -83, 34, 19, -247, -207, -182, 11, -142, 4, 34]
1869C4n9K55n45K78J92J91m22M7J40J33p4j91K55q4j4j63J36J20k74j34J84l1
1891b6m1J66J09j23j7j29J49P2j88J0j82Q4L39j07j00P9j94K18n1J68n8l27J96
1914D7N3j2j38o8K57J27j44R6m76K65j79j58K7J18J01O9j56L34q0L2l63Q6Q5J13
1938C6R6p7j44k69K37L33m05K70j44n9J36J4j5R5J1j78k3K13j00j07Q4j93J66
1961b3J16p8M2K28j07m73P8J45l8L31l49J15J68ll6k32J38J14j26k46J47p3K22
1984F0l00M12l5k82K01o8J41j50R8p3j7N4O8l08R0J90N8k28m3K76K9o65N24k87
2008b55M59p4j75N9r6J45J4K9k5p9Pk71J86J71n6l2P1j38MK6j7J11m76J83j12
2033c41K58j18Q8J51j78K97l57P4J76J81m83k49N99j80J5r2%R0J17n1j21L39j04
$$ y = [34, -25, 230, -315, -37, 155, 346, -76, -29, 111, 244, 170, -21, 234, 150, 136, -27, 109, 229, -45, -179, 5, -26, -67, 99, 208, 85, 68, -61, 88, 160, -28, -18, -200, -116, 223, 116, 16, 95, -99, 119, 68, 236, 178, -149, 47, 100, 88, -50, -118, 139, 266, 122, 218, -258, 7, -172, -330, -303, -185, -84, -15, -171, 163, 83, 115, -248, -162, -77, 36, 132, 55, -89, -358, -121, 212, -193, 77, -67, -126, 10, 24, 9, 104, 115, -63, -86, 127, 27, -80, 4, -189, -23, 93, 15, 57, 285, 178, -295, -217, -72, -110, 221, -128, -13, 155, 152, 116, -116, 22, 136, 10, -236, -89, -162, 60, -240, 172, 137, -145, 56, -12, 129, -21, 77, 4, -13, 41, 109, -199, -109, 81, 139, -89, -132, 144, 173, -492, 32, -255, 204, 130, -45, 14, -82, 63, 77, 106, 81, 2, 9, -262, -76, 95, 39, 7, 78, -60, -56, -30, -47, 64, -412, -229, -341, -83, -201, -113, 38, -140, 157, -200, -126, 50, 231, -252, -501, 98, -82, -67, -159, -159, -69, 48, -3, -124, 215, 111]
2056A11j83r6K98j92%J46k80L04j88J92l56N85m64j99L51L21l59N1j43L15j72
2077D2O9M0J44m55J77J01L0l48K39k35L00j69k8K96j45j19O0R7Q1m35K78J98j11
2100A07l04J77J02q9nj10K51j68K54k03K08j55K1K4l48O36m21K02j7n4j53k04
2122b49J12rN0j30J86m9j51L13m8k85L21J12l78K78Q2K2j91J37j82J12J19k81
2144a09l0l05O31K1k01K76l34k5J95K9r3o3j50kP6K73l86J45n5L81k05j84N8q6
2168a43k6J46K55k56O8j02J00j43K1q9J61j27J50k05K86M9j28r3O3kN3k53oL96
2192A75M1l94K84J06q9j67Q3j74K84r9j5k33j71K32j96L07k45K72J1k58N03l15
2214e8L3j04J52k14J41l3R3J64k42J78k04J72j57K48k64L43l82J75j02l5P4L6
$$ y = [111, -72, -168, 130, -62, -62, 84, -196, 108, -80, 112, -244, 341, -123, -322, 29, 350, -9, 42, -101, 214, 42, 111, 151, 295, -160, 17, 118, 148, -200, 39, -196, 104, -65, -93, 203, 58, -61, -1, 96, 177, -258, 20, 218, 107, -197, -20, 82, -7, -12, -122, 129, -39, 215, 12, 220, 65, 86, 110, -238, 398, -23, 179, 162, 108, -45, -249, -137, -146, -96, -226, -40, -89, -240, 73, 25, -260, 61, 173, -205, 73, 155, 177, -14, 123, -59, 53, 172, -109, -139, -444, 187, 208, 7, 283, -51, -76, 119, 148, 55, -8, -158, -160, -84, 189, -197, -52, -107, 274, 69, -115, -57, -143, -169, -23, 232, -24, 44, -58, 42, -101, -80, -169, -8, -135, 15, -190, 96, 145, 17, -76, -13, -15, 38, -215, -221, 175, 216, -178, 106, 212, 123, -44, 39, -135, 149, 50, 35, -198, -369, -137, -333, -26, -271, 1, 12, -246, 257, -58, -25, -129, 23, -191, -50, -83, 10, 174, -68, 110, -94, 78, -79, 169, -95, 248, -134, 41, -61, -96, -22, 14]
2236A4j61RK87k23J41o7j07M1n7K94O5j60l53rQ5J20L59j71j95J85K37n53L28
2259A09J01j94o5J30j40K47l2J0L8N6m13K07j45k2K03j49J35K20l93L04J06q14
2281e01L25J24J16rm08J45J59K59j02j45J22k38j15J85J42j12J15K49m28J27J74
2302A84l98L37k12J35m3R7k25K05n7k98L33Rj21L12L0l49K54k0l5j34L3j99K93
2325A31j73j30J21k93L12L04o08L63P1j93L32m49M83Rl42q1L41k68J70j92l1M
2347a19K79j48l2J01j3m23L06K13j71K49l71n1L29k66j37M50l5J73j88m5O2k45
2369h2L05l23m70L93k37M27p8j47J14Q3L8J6j48J75k31K6p1L52m48M24N8k40n1
2392a15K47n3J4r5J5J88k38J49k31LK55j16M1j02j19M17m50L28r2j87P5K54l47
$$ y = [14, -147, -138, 149, -74, 67, 0, -107, -66, -123, 171, 236, 76, -277, -286, -201, -81, 278, 107, -88, 97, 334, -219, 109, 210, 16, -49, 81, -59, 188, 156, 166, 204, 260, -153, 54, -91, -113, 90, -59, 76, 296, -97, 207, 313, -501, -176, -52, 64, 55, -353, -208, -49, 210, 108, -37, 85, -153, -268, -83, 59, -53, 62, 311, -117, 10, 184, -214, 123, -89, 46, 3, 100, -125, 80, 23, -275, 58, 67, -54, 258, 288, -61, 193, 173, 138, 4, 37, -162, 131, -42, -172, -51, -344, -32, 272, -336, 27, 98, -95, 237, -212, 271, 280, -62, -143, 198, -70, 100, -92, -123, -119, 160, 12, -20, 81, 68, -355, -49, 164, -7, 242, -129, -180, 149, -117, -254, 196, 161, 334, 146, 101, 163, -82, 223, -100, -570, -177, -414, 13, -65, -212, -98, -15, 23, 39, -109, 66, -165, -139, -210, 142, -306, 118, 176, -64, -115, 132, 79, 93, -2, 13, 201, -37, 112, -119, -116, 139, 23, 64, -38, -157, 260, -190, 138, 46, -141, -66, 188, -159]
2415a59L36J24l76R1K00l06L10N1n04o4L54k40J33j2K95l26j03L20m01L30N5k44
2437a36Q9O3J33j41J3J13j50J37O9K4k01M1j84j19O21j95m18K98r5L5j77R6J46
2460F2j38m31L84Q2O6j52J19j81J40M8L2Q4j20l61J58K62p2R2Rk27J3k01K45n3
2484a40L01k67j47K88R5n0j25J06j65J44k7J52j01J07r4j28K72p11N03Q5L3l8
2506I3j55k5K85j50oj76K30J66o74M16j12L32k34j4o1J91l13n3K45P1Kj0Q9Oq1
2531F2O1j5j3J02k1l53J80L0n2J04j37J5K3K1q6O7j15J74j08J91P0q9k09K07l3
2556G6k88J70k9K19q4k75j13M38k09J32n7J57m91L80P1j44J56n23M26k5J48j15
2578B0p7M83j97l9j11o4j67J56K29j22L5Ol22K7J93P7p8j33R5P7k37N4K36j75
$$ y = [-159, 177, 301, -75, 16, 216, -90, 220, 271, -233, -297, 57, -183, -50, -62, 233, -93, -196, 124, -277, 53, 108, -136, -47, 16, 149, 8, 21, 134, -16, 121, 190, 214, 13, 54, -130, -249, 372, 177, -241, 57, -38, -3, -180, -84, 62, -76, -507, -123, -41, 25, -127, -8, -189, -49, -1, 31, 115, -5, -366, -208, 54, -18, 74, 83, -144, -131, -332, -87, -140, 161, -106, -253, 35, 130, 80, -45, 61, -104, 40, 13, 165, 64, 171, 77, -51, 221, -490, 13, 98, 131, 93, -62, -87, 198, 48, 42, -134, 96, 262, -412, 4, -108, 224, -10, -24, -85, 106, -207, -260, -15, 56, 58, 48, 137, 143, 62, 123, 108, 95, 197, 176, -177, 3, 33, -19, 85, -52, -37, -14, 7, -79, -12, -127, 47, -61, 130, 200, 111, -98, 109, 76, -212, -42, -71, 148, 64, -211, -324, 114, -95, 37, -20, 137, -354, 26, 97, -47, 109, -414, 12, -13, 135, 20, -57, 426, 229, 190, 79, 15, -152, 4, 233, 111, 146, 152, -170, -143, 50, 127, 49, -84, 11, 88, -149, -95, 141, -34]
2602c4j31J6k5K29j80K46Pj34k88L22m1j60L59r1l46J60p6L23q0J07m07L77q9
2625F4K0j43kP8K08j03k8J4j98n2J3J32N0j49k9J47K4Q2l45J87n3L09j79n2OK26
2651B27n65J94K7L41l21J29k9q8M22m47J00j14J22J19L1j96k6L11j54k11L21j18
2673G5L0R8k18J43k22r5L9J7L06l27L35j59mJ80j35J58n1k47p0M43j17k19j43
2696a83Q1J21j1l88K09m9K62j18K12m61K15M9M5J43n9k17P7O4J8J21j06J0k96
2719b61K09k13K10L45J7k97Q5k70J58J78l02J47J50J70j17j47q6R3m27J02jp7
2741c34K17L0po1k0R0J26L1j34J28l20L99j44M5o3J99J47m56K10j44J00j47K11
2764A03l47RN7L02m51K52L20j93o0Lk05K53K70k57k65J80P6j75J37J1J86J42j68
$$ y = [-34, -165, -149, -174, 55, -125, 121, 128, -6, -294, 28, -13, -173, 186, 95, -251, -91, -167, 156, 76, 183, -224, 153, 64, 84, -59, -61, 17, 225, 122, 94, 108, -90, -142, -129, 3, 53, -96, -125, 22, 46, 128, -217, -30, -83, 226, 47, -5, 1, 227, -338, -144, -117, 224, -97, 32, 3, -85, 337, -110, -10, -124, -2, 117, 148, -48, -74, 237, 83, -128, 193, 75, 105, 203, -15, 128, -94, -189, -150, -133, 173, -154, 181, 22, 18, 198, 63, 221, 170, -77, -147, 296, 179, -40, -183, -102, 19, 8, -380, -171, -220, 42, -76, 136, -325, -110, -61, -16, 127, 68, -149, -72, -8, 10, 131, 25, 35, -261, -52, -265, -55, 290, 307, 10, 95, -175, -17, 161, -141, 6, 156, 326, 209, 62, -24, 69, -358, -256, -257, -334, -117, -87, -94, -155, -175, -85, 41, 72, -62, 66, -254, 145, 1, 46, -17, 182, 329, -127, 83, -61, 39, -108, 103, -244, -235, -178, 124, -327, -75, 245, 52, -8, -5, -210, 43, 313, 56, -209, -29, 47, -128, 9, 20, 206, 348, 180]
2787A80j16j72J77J28p6J20k82J2j25N3j76L53j65R2k51L46j47P2j04P2pj34L59
2810B09k28j76J81Q4J15P3l82J98o4j9J2J84k64R4K33m7p33O38K15j27k06k76
2832b86K26J5nL6o5K0k32M13j87o2J21J79j72j9K40m46R0K81j42j40K20j31L48
2855C02l97l9J66j85J17j69Q5M4l9jK2k2M18Qk61J36l77K55j05K30J12k52J56
2878B04m02P4K01r0J57l49K42n3j60l6N19m44L87l22j6K55j85N6k13K25l98O41
2900B93l57p9K44K12m98p9J14J20K6l29K09J11l5N3l7J07P3j30j06J61q3L1p3
2923e2K42k38l7J41J9j15J31j17o4L07j87J70j27J3j16J03j93K20p4O9k85O7p4
2946a97J27J56n3l30K07K3N3k81M87K20o20J97MN66l89p9j10Oj6j01q2L52n4m08
$$ y = [180, 64, -108, 69, 197, 121, 241, -41, -29, -154, -101, -277, 76, -89, 3, -248, 98, -49, 23, -81, -9, -16, -150, 209, -19, -195, -14, 70, 185, 258, -124, 74, 10, -9, 3, 187, -77, 17, 250, 203, -530, 108, 323, 196, -10, -286, -60, -45, -50, -14, -79, -59, -291, 122, -65, -127, -6, 173, 1, -18, 222, -224, -134, 147, 5, -135, 85, -46, 302, -95, -134, 32, -153, -36, -205, -120, -76, -115, -116, -94, -116, 302, 310, 49, 185, -192, 63, -42, 188, 300, 48, 204, -198, -124, 77, -13, 144, -205, 37, -16, -176, -212, 307, -137, 250, -72, -88, 167, -18, 38, -175, 50, -348, 293, -64, -143, 101, 313, -185, -264, -150, -30, -4, -333, -124, -13, -48, 5, -32, 75, 148, 18, -88, 73, -10, 21, -52, 190, -48, -85, 56, 75, -40, 91, -26, -90, 217, 30, 200, 73, 86, -30, 73, -120, 100, 26, 95, -190, -123, -197, -70, 86, 33, -297, -90, -67, -14, -295, 192, 412, -208, -11, -7, 559, 170, 91, -19, -13, -29, -130, -212, 140, 86, -322]
2970c22K48K13k28K36j53M05l23r2j57M56k66k76L70p0L45n13m7r2K24K06j14
2991E0q5J1n0R6R5j55J75m5k00j01L33p8k24M68l15k7K1or9L42l6j57k39J68M2
3016a6k01O11k33Kl74L29r1J26j6l16L9J98j97J69J17j52K18l51R7k71K65R1k50
3039b06J78K00q7J54j15l74K40j9K23j00q1N4k4Ko8n7J47k3J2j30J56L9n0K78
3063C49k08m41J68K94k61J59j15j51jJ19J54k06J90R8j07J19MJ4k57Q0k03N6K06
3086F0J03k63J64r0l48L34J15j11m01M77r6J41mj4m31J29pJ66pK47k46J22J14
3109A54r0J78j37q0J36k85J40N2j5j86K93l47K28K18m83M50l99J29k70N12m5k52
3131i9M21n08m5j65L75M4l52L46J59L8k02L60m99L86Kk64o8J35l7M5J22l49J68
$$ y = [-322, -74, 139, -89, 147, -6, 399, 76, -16, -173, 283, 17, -259, 111, 41, 386, -127, -174, -266, -42, 164, 50, -35, -24, -74, 22, 117, -38, 137, 92, -108, -209, 124, 46, -178, 290, -25, -52, -31, -37, -136, 206, 170, 13, -226, -58, -16, -217, 394, 161, 163, -211, 118, 27, 153, 137, -179, -140, 58, -139, 30, 147, -5, 213, -138, -41, -312, -47, 44, -206, -28, 172, 85, 239, 124, -250, -10, -29, 194, 94, 13, 67, 43, 45, -23, -80, 67, 44, 56, -74, 82, 121, 71, 349, 141, -300, -132, 162, -99, 60, -55, -206, -207, -88, 66, -140, 50, 148, 41, 160, 164, 178, -79, 1, -202, -146, 60, 163, -100, 64, -26, -374, -40, 75, -36, -437, 40, -56, 85, 81, 67, -364, -235, -242, -76, -83, 164, -82, 40, 154, 64, 242, 105, 25, 161, -124, 16, 68, 53, -133, 160, -187, 41, 259, -224, 226, -173, -44, -314, 198, 153, -99, 322, -186, -231, -396, -21, 23, -329, 17, 176, 214, 12, 372, -127, 259, 261, -3, -71, 64, 27, 72, 194, -155, 13]
3154A3k51j0J80J20k24J38M05l01O0l36k41M07J89j7m0k00J01L30j73r0l8J13
3176A35j85j22J14J28j59N0J74m4K35j69k01M9k8J18J0j87M5Nr5n4K36K3j60K54
3200A72K16k65K30m34R5K21n05R7L01l9Q5q7m6O0J25O2k64K16j37k10J04J16n8
3223E5k20K73m96K81R5r2j36J08O2L01k94m9P2J32j0n7k20J86P0j36M6k55K33
3246e1J8R0j89J17K64j89M8j90M5Q7n6k1k7n7J66J99k34lq7J04l6J65k37K68l56
3271a62k2j46M47O1j61Kq1j47K11K49k30K24l02Q0k24J89l47K32M0J24k84J93
3293e4J29o2j70j8P4M2L0j00J88J28o3j4j73j16K02j77M15k10j32K1J84k69J62
3316A7MP1o8J83k59j28J80j37Q5M8j99k05M86k15O9J32J18j84kq5K15jj42k40
$$ y = [13, -238, -248, -68, 52, -172, -34, 371, 70, 130, -206, -447, -40, 149, 132, 92, -108, -7, 323, 150, 60, 22, 135, -50, -172, -58, 70, -89, -39, 135, 91, 326, 157, -44, 5, -23, 95, 105, -82, -37, -32, -127, -181, 55, 78, -82, 172, 388, 123, 353, -81, 14, 235, -270, -173, 128, 89, 174, 87, 41, 101, 226, 288, 24, 240, 103, -107, -3, 113, 55, -165, 108, -388, -107, -12, -104, -240, -132, -70, 231, -63, -112, -40, 92, 82, 25, -195, -9, 61, -75, -29, -284, -51, -33, 57, -132, -15, 249, 60, 108, -82, -37, 50, -6, -27, -54, -111, 55, 254, 20, 17, -70, 34, -2, 163, -74, 194, -162, -184, -330, 117, 178, 17, 19, -62, -209, 2, 251, 21, 245, -57, 23, -201, -12, -359, -127, -87, 37, -247, -54, 75, 13, -157, -175, -101, -59, -29, -129, 59, 187, 124, 110, -63, -179, 23, -154, 261, 51, -81, -60, 124, -145, 17, 21, 92, 24, 207, -52, -180, 0, -137, -52, -4, -203, -408, 78, -137, -68, 64, 182, -2, -4, -89, 126, 125, -17, -257]
3340b57J39K37m66K25J73J76k18%k56M8L82l13J93Oj45J07J48j25J55k78M41j55
3362B17q8J79l63JJ70K10j25l70k03M18J3k13R7K16L52n47j34L04q5j96p6N4L58
3385A89n0j6j53L33n25K19P9j13K56j43k5jq8K17o9qk21J56J9KM1k1k23J95j47
3410i7j62K98M5k16k4K86j55K53m22K96N10p05r2j39K32K33p6J20j50k60J94J55
3432A24j40j33L20j35q4J8N5j76M8J23j12m6k19J74J63J02k70J57Kj70K3L9j5
3455a52L65l79O0J46R5R1l44J14o6J82k66j09L35L7l32J2M12k52L41j85j10J17
3477A12j91J99j54j86K67k24K57j62K63j87J41l2j47j23K89j36L2J27l08K94m1
3498I0j17j85J49j02K71j99J55L0l0n8Q8N7j32k96J39o3J34l4Lj08K66k60J27
$$ y = [-257, -118, 119, -347, -122, 51, 227, 9, 9, -247, -199, 183, -130, 63, 69, -76, 31, 179, 54, 209, -69, 372, 217, 129, 308, -55, -54, 116, 326, 201, -169, -372, 46, 59, -154, -57, 159, 511, -36, -170, 134, 49, -147, -223, -169, 189, 139, 123, -30, 303, -222, -3, 76, -37, 219, 76, 51, 50, -38, 179, 110, 102, -119, 37, 56, 58, 99, 78, -145, 50, -97, -259, 39, 84, -132, -156, 130, -25, 228, -194, 102, 612, -93, -185, -324, -92, 141, 65, 185, 35, -225, -31, 124, -16, -149, 171, 36, -48, -30, 25, -151, -103, 20, -92, -138, -357, -183, -20, 82, -188, -31, -29, -199, -176, -137, -152, 213, -166, -106, 40, 135, 226, -118, -4, -70, 112, -154, -263, 72, 109, -223, -211, 201, -51, 290, 105, -5, 112, -79, 120, -34, -220, 47, -177, 80, -82, 181, -6, 135, 103, -44, -167, 122, -14, 18, 145, -163, 131, 90, -27, -212, -63, -165, 106, -93, 62, 92, 62, 4, 92, 149, 17, -279, -140, -203, -69, -103, -100, -208, 58, -202, -75]
3521g5j82%M65R7n47Q2J29k13K93o5QJ11J67k17K44k44m61N11j36J52j5MQ9O7
3545B64k20K3k10L16o6j62Ql3n8j89J9J81M6J60L8l38L61m45M45j78j71k7L4j51
3569c53N53j5m3q7J01j4l38L31j3j31l6l2l6J49j74L79pl38J71j80J89q1J08R9
3593B02j89l8j44K76j50J54o6j67K25l8J30k58L61m23J97QM4o04L43P8l54N16
3615A03K05k81m8k30L26k21J68j25L15l0j69M6k05j5p5K13l31L44k28Q3Q3q0M31
3638B79m83j57K41N1J02p4n4L16mj23k79q5M00J7k07Q2j13k21M31q2J00j75K0
3661a8k72K95J94r0P7q2j33n8K6O6j18J83kk38K11J83n1k3K22o00J63J31J41k85
3685g8K54j84rJ2O0j8l43M11r8P8K94l63J46l61J62K28k60rO0m6Q1LJ31l02k32
$$ y = [-75, -257, -257, 208, 305, -242, -160, -31, -244, 49, -16, -8, 103, 270, 53, 297, 53, -408, 103, -33, 119, 104, 108, 197, 264, 44, 67, -143, 173, 107, -55, -47, -80, -138, -327, -308, -127, -81, 79, 117, -221, 140, -305, 140, -38, -209, -236, -202, -353, 200, 185, 142, 55, 156, 142, -196, 135, 122, -9, -45, -77, -113, 36, -138, 241, 234, -104, 67, -113, 76, -5, 103, 202, 13, -25, -169, 107, -43, 111, 45, -122, 103, 65, 195, -63, 298, -125, 72, 80, 124, -480, -137, -59, -413, 103, 308, 27, -21, -251, 75, -146, 22, -103, 212, 182, 13, 59, -146, -161, -236, -23, -354, -10, -238, -155, -72, -152, 279, -204, -361, -120, -69, 33, -41, -95, 221, 217, 94, -185, -270, 130, 147, -60, 22, -91, -312, 119, 37, 137, -38, -18, -290, 5, 199, 109, 186, 104, -29, -87, -61, 5, -113, 70, 68, -170, 41, 224, 173, 150, 372, -228, -65, 66, 207, -78, 176, -8, -17, -5, 55, 37, -306, 105, 7, 85, 379, 16, 162, -199, -37, 191, -69, -78, -18, -64, 17, 20, 151, -151, -383]
3710c83K12j96J19K18L8K7L05n54L00J04l16J62M0l07L03j13N7K8P0l63K12pQ0
3733C6r0L7L2nn6J20J10k20k34J71J81j92j26K72J30N8m83K8J59O6q6J4J36j81
3757a23j73L96p0p9j3K09j46j78K90M0k03j37j85L46J83M8o6J61j97o0j15J74
3779A02j04K58j57k6P2q1o8k05L80l42J46K9j89K83k21K99l29J11K24l22K01j56
3801i5J80j65k93L29K77k56rJ77J7k95N90p45K71J3l32J41M06k33N2q7J42j08
3823b3j60J62J4O1J89l37n2l7K75P0l8j37j39J58n2J22m20K90Q2j44J06k8N2K12
3847B26N1j97J28l40k50K73K98l59l3M4J5L52n46J64J93p5J24k32K06l0J5p6R6
3870D7k87M28j71M0J03j93p7k4L59j50j21mK25J50j45k31J16j90M50m9k65m1R2
$$ y = [-383, -171, -367, -248, -30, 8, 35, 340, -214, 86, 190, -126, 36, 76, -231, 72, -41, 16, 44, 114, -249, -37, -44, 36, -54, -17, 15, 10, -46, 74, 184, -36, -270, -99, 82, -110, -236, 36, 166, 224, -259, -231, -72, -6, -92, -78, 58, -123, -296, 100, 30, -49, -62, 147, 1, -177, 113, 153, -50, -187, -372, -26, 157, 205, 139, 300, 103, 43, -72, 102, -2, 256, 99, 73, 145, 64, -4, -209, 171, -171, -25, 4, -185, 98, -123, 176, -153, -42, 182, -140, 61, -95, 85, -80, -373, -44, 233, -23, -32, 145, 162, -133, 457, -288, -17, -4, -336, -195, 211, -22, 30, -57, 85, -23, -183, -21, -7, 54, 243, -94, -146, -183, 92, 162, 124, -13, -152, 6, -46, 76, -344, -54, 28, -116, -10, -38, 14, 226, 277, 80, 208, -132, -382, -109, 189, -170, -203, -159, -144, 208, -338, -174, 19, -56, 68, -164, 42, 12, 27, -49, 47, -240, 188, 17, 57, 160, -33, -110, -134, 225, 75, -46, -50, 175, 325, 180, -51, 65, -125, 325, 276, 11, -30, 62]
3893F2P9j50L09l77K28j14j33M7P3J13l87J03K58J7P2j64l08M35J5j13lk36J15
3916e9J51R1k84l5J30J38l05j15M21M5K02n96K95j68K55k4l59K54k21J75k55L60
3938I6l05K8N35n23K07m4j42K09J71j89p6k59M88m45K86l04K12J88j93L1j26j09
3960b64J69K14l10J74J77m32M08j64k30J22L71j38J53k25l0j44m0L51J4N2J8m00
3982a54j64L60l71N6N31k06r6j63K68k02J41K54m50L91q7o4k50K41j32J12n3N1
4004A3J19q5j40O0n4J7J35j10n8j89M49m38L18lP8j1k12J97P0m38M68j50o2P4
4028D8M0q2k27J72L08q2k57O8K03l46M56k04p9j26J06%K27k72J52o9k02K66k57
4051a57j8K32J17k88nK89j1r7P4k28J30k30M07m39K54N3k22K01J34m50J88J01
$$ y = [62, 141, -9, 300, -77, 151, 37, -96, -49, 24, 137, -250, -147, 111, 128, 200, 36, -272, 163, 178, 65, 62, -174, -59, 92, 183, -101, -136, -6, 132, -173, -288, 133, 178, 380, -216, 79, -89, 166, 142, -217, 37, -184, -9, -264, 96, -209, -181, 354, -169, 38, -6, -148, 61, 232, 43, -33, -292, 196, -249, 37, -267, -55, 133, -60, -29, -155, -264, -95, 119, -191, -17, 160, -272, 136, -28, -258, -136, 235, 97, 250, 25, -5, -149, -189, 162, 176, 228, 246, -154, -318, 42, -329, -273, 258, 52, -44, -207, 61, -141, 0, 254, -196, 195, 108, 44, -206, 35, -97, 15, -38, 13, 132, 47, -93, -33, -87, -70, 65, -45, -103, -292, 157, -281, 37, 34, 112, 101, -111, 86, 156, -282, 186, 36, -26, 48, 88, 6, -221, -49, 259, 177, -80, -12, 191, -155, 301, 97, 18, -108, -2, -2, 225, -47, 105, 36, -166, 100, -157, -175, 57, 174, -114, -119, 170, 159, 62, 136, -92, 38, -192, 215, -224, 30, 83, -139, 62, 196, -254, -66, 35]
4073C5oj08JP9n7J9j71R4K13l01J04L88l77j38K28J23qq8k02L03N8l04L23k89
4097h1nQ3j62J49m4K22p6J5l17N8L36L4Kj41J5R4k07L65m76M67o5k34J79m62K18
4122c3J31l3j55J46J81r1n30L20J77J48k55q6P1J33J66j92m33K50N3l8M59m40
4144e1N8k5j11N4J41R2p2O1J30q0p1k88L87j82K6p2o0m2k03J22J6J45O2Lk07j09
4170b76M20J09l97L4N8p0K30r5k13O5P3N2K9j32R6L74m73K78n2K09K4m14J37o7
4194aK33l88K93o5l70Q8K12p8J29QJ55P8k97J90j08j44j01J78N6J11ok50mj1m7
4219a39K3K96j54k22L08l01J79l3m1O5J6n4m6J55k14K28r3P9l6O2k25P8k7L08
4243B12n8j59P9L06m11j01L67k78L28k06Kj38K7o1K76l18J5L28j67j52N6L26j50
$$ y = [35, 29, -79, -78, 1, -56, -37, -208, -114, 99, -202, -98, 290, -87, -225, 3, 126, 118, 30, -172, 131, 189, -115, 208, -81, -86, -3, -165, -16, -60, 162, 86, 101, -216, -158, 178, 212, 214, 73, 88, 182, -25, 340, -136, 331, 266, 32, 211, -251, -33, 98, 65, -90, 56, 237, 146, -384, -64, 113, 261, 6, -80, -9, 124, 290, 98, -335, -85, -32, -70, 389, -51, 7, -18, -129, -75, 66, 158, 86, 147, 277, 197, 126, -162, 225, 43, 69, -3, -63, -105, -308, -186, -170, -25, 37, 40, -167, -276, 144, 253, -144, -110, -52, -122, 108, 13, -200, -135, -62, -10, 19, -113, -17, 357, -116, 162, 110, 319, 343, -71, 66, -1, 232, -156, 137, 72, -298, -210, 2, -76, 53, 61, 216, 294, -3, 187, 79, -65, -166, 12, 68, 179, 173, -77, -81, -92, -139, -116, 180, 26, -196, 112, -189, -10, -43, -84, -19, -3, -57, -103, 52, -162, 66, -27, 52, 16, 78, -147, -69, -96, 212, 154, -5, 74, 380, -31, -132, 235, -43, 285, 79, 81, -57, -30, -91, 185, -133, -118, 210, 43, -109, -53, 273, 123]
4266A23q1k36L1K9Q1j61L84%j17P5k83K59l72J24J40j58K05j57n6J60lK05l74
4289a82K95k67J84j22Q2p0jK96p2Kj21KP2j65J72K4K42l71j78K95j91KJ0J46K05
4314B89k27n4K25n93L31j38M4j14K88R7r7J70k55m3pJ17m8Q8k16k8J25J09k31
4337a68M84j50k02k38K17J52p6j2J35j59O6n4K4k0o6q4L49n31M30j36L6j4M2j67
4361a42OK14K81k77k28K63j95L58k81K48j16j57j58N93l96j53L90m0L1j46r3l3
4383c1j36p5P4j30L67N3m7J8k98L19m26N95k04k70O04j26m03K19j72R1k56L03
4405F9O6k16k6N0L04o8l64J59J33k01O8J00J7j97L38q7o3J57m93L26J12j61j53
4428a30p5L58k65K23l84K5M26k63M7L24j22P7l68K16k15L36k09k3p5k6J2J97R3
$$ y = [123, 42, -194, -163, -134, -53, -214, 170, 170, 53, 128, -155, 104, -268, -144, -4, -162, 43, -114, -170, -10, -13, 192, -182, 113, -154, 30, -92, -10, -80, -81, 215, 143, 145, 24, 26, 98, -67, 105, 129, 371, 0, -178, 117, -74, -72, -62, 84, 289, 62, 8, 233, -360, -29, -167, -123, -237, 51, 148, 51, 221, -34, -77, -84, 33, -15, 73, -143, -171, -46, 63, -168, 316, 166, -36, -274, -57, 95, 19, 7, 142, -17, 49, -5, 19, -1, -67, -151, 198, -333, 97, -39, -3, -17, 25, -142, -136, 78, 359, 82, -146, 117, -78, 280, -1, 247, 131, -26, -184, 409, 13, -140, 250, 210, 241, 95, 2, -31, -167, -242, -168, -298, 69, 122, 75, 93, -205, 114, -312, 283, 79, -191, 413, 287, -116, 103, -69, 22, -234, 69, 135, -81, -107, -57, 247, 179, -185, -26, 107, -94, -26, 74, 91, -106, 232, 145, 82, 239, -254, 72, 184, 23, -130, -205, 153, -112, 111, -273, -248, 178, -85, -38, 286, 164, 241, -127, 89, -126, 210, 1, -22, -97, -123, -111, 86, 179]
4451A79k77O3K18j46j11N3K93m16J21m6N5q1K45j41J01r8R8rn5J44j36j59NK9
4475g1J86Q0N7k93j73J32N0K15j56K60k91j30O7q7J95K03j92l52K35L3J12n1m9
4498b0j37M39l59J85k8l35j37M99j73L10mj03J4k59J4K82j79j64L74l25qM3r3
4521a64j90J35K15k96L08K93l06j36O8oL43m17K94J8l01L2j8K51l5P8j28J34k91
4544a19J86J07l07L24o6m09J4J25K28m69N63m8K6j18J45k43J70m5k89N8L14n6
4566I1n11M43l3m1J53l39N18l17P6j7J57k50Q3j05J52J08q2j13Q1k7q0J76l51
4589b28K80r4o2N2M8k88O66l50l7K7J47k39r6m0L36k72L32j83J8J46k3K5k04J52
4613A13l22K61k10o2L24J33l44O50o74j04Q0J28M6k46K46K75k33j65J50j46J01
$$ y = [179, -98, -35, 183, 37, -74, -21, 272, -144, -23, -69, -14, -95, 150, 9, 110, 12, 110, 101, 46, 190, 54, -105, -100, -71, 115, 195, 252, -41, -214, -82, -32, 183, 27, 287, -4, -134, -67, -154, 41, 244, 52, -300, -65, -32, 80, 29, -20, -157, 282, -77, 108, 80, -255, -392, 107, -66, 244, 240, 137, 151, -108, -94, 188, 9, -155, 219, -106, -114, -71, -164, -354, -219, -4, -300, 8, 301, -5, -141, -73, -79, 264, -153, 141, 159, -142, -110, -128, 123, 88, 166, 38, 172, -119, 67, 174, -133, 191, 125, -284, -270, -145, 83, -386, 177, 129, 155, 37, 182, -61, 109, 64, -225, -167, 147, 91, -420, 23, -10, -51, 102, -237, 281, -36, 40, 23, 180, -70, 13, -92, 60, 168, 86, -27, 54, 27, -53, 123, -228, 52, -42, -104, -52, -4, -292, 374, 24, -13, 14, 161, -78, -174, -214, 122, -150, 182, -1, 17, 163, 140, 165, -39, 113, -209, 52, -158, -220, 104, 237, -107, 543, -131, -235, -155, -27, 19, -227, 19, 294, 61, -104, 46, -100, 1]
4634Aj47J0j5M6q4m2J65m0K01l50M02k1l61L82k87n7J45J23J79l27l4L51k28n1
4658c9q8N5K36k48j18K00J78j09K50j37j17k05K56k25n3L7Rj82K94m7J28J38l66
4681a53M7J39l08K11J78j68K90j84j53J47O8k48K46k26J91k74P3K91m40P0M50
4702B47n59J72K35l34L66p8n1m4K53j02p0J94j18L2m3r7L9J18m28J60j93q8Q7
4725c02J86oJ16j25J30K45l35J01Q0p7m3Q2o0j80O5K20J52j79o3j81O0J20p1L81
4749C16n90J89J20M3k51J69l2L63o7j36r1n6K57m22J56R5j14o6q3R3J50j70l3
4772a60K05l48L17P7j27K40j11j32J04J87m87N4k34M75pm9j59K37P5j2k86J48
4794Gn0j72L50k17j41K85J23k49n8j20K1L41r8Q1p7J00R3j74j61J97j49K2J31
$$ y = [1, -146, -136, -151, -105, -189, -231, -66, -106, 95, -255, 147, 126, -235, 147, -140, -197, -52, 71, 250, -77, -111, 240, 12, -39, -127, -72, 164, -84, -202, -2, 176, 67, 317, 180, 63, -142, 114, -111, -164, -127, -118, -300, -6, -53, 75, 213, -153, -106, 33, -275, -64, 114, -54, 236, 52, -101, 46, 114, -134, 112, -114, 77, -197, -124, 167, -273, -203, 247, -312, -140, 95, -239, 127, 49, -2, -46, 207, 105, 35, 229, 111, 143, 100, 3, 42, 160, -268, -108, -301, -389, -302, -116, -122, -6, -131, -1, 244, -91, 10, 90, 13, -30, 52, -8, -188, -123, 97, 249, 70, 7, -174, -114, 6, -65, 316, -274, -85, 35, 78, -173, -4, -36, 327, 260, 124, 33, -23, 234, -188, -32, 63, -51, -117, -200, -107, 43, -127, -160, 45, -303, 14, 91, -36, 204, 93, -39, 65, 252, -235, -181, -415, 60, 53, 4, -155, 82, 157, 145, -141, 7, -43, -215, 135, -82, -223, 62, 185, -64, -122, -242, -221, 120, 22, 103, 26, 126, 219, 45, -116, 81, -68, -46, 85]
4817H5r4N8J07m2j78K7o2L4k58O0M05n1o7J46n80M56j63J13J00k43K01j95jqK60
4842A10m2K6Q3j35K56j69n6k45J40L01j36r2J49m49L64l04J07LK60j52k7M6N4
4865I2j01K3J76p4l57k4J69k44P07n20M9J96O3j16j14n0J9L37k20k66Q1K78J23
4888B27L4k19k4K79k05k42Q3P1J72j84J35k48L36m01N9Q9j54L93l98n5j27L31
4910d8QJ28k34Q2j24k3M24o3j86N4k32J48p9K07j97J51R8k46j12K95k16J42L11
4933B88l78J45J55k73k99N35j34J5l5p3L89k91j04K2K9k9J35nq2M4P9j83k24K24
4957e0pj9k47L24k39r4M34k87M12J39k47j60J38j5k72J30M21n29L02j98j9J86
4979A03j24j07L68l14Q3L5l43L69L4j91J78l15J78M3k19K60K29m21K97q1K7k65
$$ y = [85, -9, 49, 156, 114, -64, -37, -99, -65, -323, -263, 142, 91, 24, 170, -410, 46, -117, -4, 96, -147, 54, -141, -142, -150, 110, 68, 94, 177, 42, 298, 129, 73, -172, -32, 269, 133, 41, 190, -259, 105, -199, -92, -89, 171, 19, -8, 38, 92, -9, 14, 190, 116, -241, -265, -96, -340, 367, -153, -104, 92, 155, 39, -75, -125, -106, 231, 11, -255, -174, 104, 227, 261, 42, 18, 297, 92, -150, -67, 4, 176, -8, 127, -121, 215, -186, -127, -38, -192, 201, -197, -252, -379, -48, -40, 88, -146, -64, -188, -211, 213, 150, -36, 18, -214, -66, -145, 62, -135, 16, 114, -132, -244, 51, -165, -23, 288, -90, 55, 210, -63, -362, 173, 39, 54, 19, -54, 335, 44, -60, -38, -9, -38, 97, 92, 10, 54, 133, -50, -274, -50, -57, -76, -323, 1, -238, -332, 102, -185, 227, 366, 119, -41, 97, 82, -190, -60, 361, -168, 134, -64, -83, 103, -21, -128, 240, -74, 9, 44, -299, 70, 104, -87, 91, -224, -46, -3, -222, 38, 267, -154, 143, 62, 89, -176]
5001a76M11m30J54O8j67L34r9k9P9P5j29J22q5j09K30l26q7Ok15K00K03M73n14
5024a1j99M67k88lJ77k49N3K35l8j92L86j52p6k28J61k7p3J28l9m5k07K16M61
5047D57m51K93m27mL31J10q9j39p7o2K68k52j7J90Ok90J95n7o1K4k09J79m4L74
5071B48k16j50J39M6k07L15m20K37j10l3K2j34K57k00L39J56l98J06r0K94j51
5092E0j78L0K69l51L4K39j86rL01O3l94j33M28j33K51m63L32k95P4J98k6k20J11
5115hl4R9J43m33L70l16K43L9O8n02M07j9k02L04n68M62m5N6j53M8j3L4L0J2o3
5140d1j35J21J51n7M7k80J30J37q4JQ5l2k44m6J97l5K09p7J6N6k12l6J36l17K85
5165b5J30j91l98L43J46J84j01n2j72K68lk64N3J59j49N0n1j15K23o0j98K80k40
$$ y = [-176, 235, -195, -41, 27, -140, 194, 95, 66, 145, 220, 91, 213, 128, 19, 249, -77, -164, -158, -373, -173, 30, 503, -11, -210, 257, -31, -34, 143, -106, -53, 182, 144, -48, 338, 186, 110, -118, 43, 16, -57, 71, 32, -13, -220, -4, 457, 6, 299, -128, -132, 199, 309, 220, 81, 4, -58, 210, -42, -59, 131, 137, -153, 42, -15, -76, -52, -261, -82, -126, 248, 32, -118, 21, 67, -140, 175, -245, -8, -118, -151, -129, -263, -6, -206, 133, 289, -109, -3, -93, 201, 50, -128, -98, 171, -180, -146, 93, -93, -102, 199, 262, -132, -265, 163, 30, 281, -182, 150, -145, -71, 127, 101, -119, -8, -42, 57, 200, -233, 137, -179, 64, 103, 171, -331, 76, 57, -145, 159, -409, 53, 8, 64, -89, -41, -54, -20, 10, 22, -41, -176, -55, 96, 39, 86, -194, -64, 73, -11, -10, 75, 43, -201, -247, -50, -85, 124, 47, 63, 119, -93, -129, 7, -310, -25, 105, -86, -484, -141, 5, 189, 88, 36, -136, 132, 129, -135, -82, 77, -72, -22, -73, -188, 35, -25, -223, 57, -183]
5188a83l6L76j19k18L13J1j63K10n0k64K84k00K20r6O4K17j85k29k50J42R2j1
5210g5J64k03k04L75o3M00l86K15k82J29J86l05l01M17j74K17j40K4r9M47n01
5231a59J35O6n3J30j92NP6L3MJ20k40L84k45j96K69j87J20o7n1J78m7p5J08l5
5255H1M0p9k3m1M3R0Mj20j92J02K80k49k01L82j61R1o0O1R1j52r9j56K34j76P
5280b03K76j59J44k49J25K8j05M05m46L28j62p3j44J53L9n2j25J26M3N9J37l25
5302a80K04K0l04m7M99o9l99L42rn8j85L93j00j3j03k40J09L7J90l78K50j91J30
5325a02o6L30j48r1J28N7l0k31L20K8j8k20P0j9K06k62Ok75N80l71J76J71m24
5348a85J71o2J5N4J04l26M15l31J61K6J4j21J3j94K58j09K32j14K76j68l72L03
$$ y = [-183, -219, 157, 38, -180, 133, 144, -19, 191, 141, -123, 161, -39, 181, 85, 149, 366, 181, -48, -298, -156, -64, -75, 89, -114, -318, 57, -6, 394, 8, 223, -59, 70, 256, -49, -350, 67, -107, 110, -30, -6, -105, 342, -159, -24, 42, -11, 119, -73, -68, 8, 41, 45, 165, -75, 309, 64, -132, 137, -50, 70, 3, -48, 130, 83, 8, 116, 81, 121, 42, 19, -22, 21, 111, 115, -5, -197, -95, 185, -64, -265, 117, -44, 47, -13, 48, 139, -13, -112, -268, -34, -210, -203, 73, -86, 58, -191, -66, -38, -143, 262, -184, 144, -18, -91, -235, -82, -43, -95, -220, -94, -51, 8, 145, -180, 24, 44, -260, -307, 192, 123, -276, 66, 57, -1, -186, 207, 107, 94, -9, -249, -140, -103, 87, -291, -41, -232, -102, -168, 162, 14, -77, 51, 108, 78, -153, 167, 195, 177, -43, 27, 8, 214, -48, -42, -317, 263, -108, 68, 239, -185, -14, -76, -61, -7, 97, -229, 186, -145, 16, 42, 56, -65, -52, -246, 12, -97, 135, 21, 297, 129, -243, 60]
5370F0Q2r0pJ3J7O8r2K30K4m56R0K57m12R5J04k69L82k26K04k37L67j63l9j47
5394a45J94O1K76n15K12m6N3k37L45j43j39l9J43K61m15J48k41K89j54j7L7k13
5416b85L84r2J23o2j35J07j86J49K1K13k78j82J94j37M49j4m61J90K0R8j26j9
5438b9K64j80K4K49l98Pk01K17K11J1l91L70nl30Q7K48k88K51J0j16L2K9p5J51
5462A48K5k26j7j08j70K87Q7o5k79L32J9P0m1j75K5o6K09m7k7L24l58O5k00J49
5486c9M03l83j98J91P3k76Q2J66m4J71j14j70o8K20j8j70J93J90j74r1k0L08%
5509B32m05L57k32K20k87p7K28J25k00j36K1J92K01m89L57M9j73J85N9k89R4O7
5531I9J36k05K67j25j92l84J75J35K12l5j40J28k58K15l4J7l1q2o1M22k09K2N1
$$ y = [60, 142, 52, 45, 58, 75, 143, 51, 281, 305, -151, -61, 196, -216, -121, -17, -286, 96, -130, 74, -163, 204, 41, 2, -145, 49, 110, 386, -129, 83, 37, 90, -147, 198, 55, -84, -123, 20, 281, -134, 14, -227, 62, -92, -109, -72, -285, 99, 7, 130, 68, -67, 40, -146, 3, 24, 237, -41, -223, -29, -166, 283, 269, -192, -2, 18, 116, -10, -29, 235, 55, 79, 328, -70, -63, -264, -47, 164, 175, -216, 154, 149, -181, -94, 154, -134, 117, 127, 11, 43, 72, -3, 148, 173, -53, -70, -178, -348, -61, 26, -39, -318, 14, 33, 103, 62, -113, -88, -154, 55, 8, -19, 305, -53, 12, -188, -39, 364, -19, -217, -26, 47, -229, -147, 19, -25, 146, 32, -138, -206, 14, -4, -174, 19, 209, 35, -56, -76, 232, 232, -173, 184, -48, 172, -115, -192, 36, 161, -39, -175, -154, 38, 239, -250, 107, 156, -17, 168, 227, -62, 32, 99, 235, 30, 297, 172, -20, -404, -229, -94, 118, 83, -57, 71, -187, 28, -6, 11, -20, -102, -163, 259, 50, 72, 123]
5554A23k61j51M59j22J59p1K61l38M2l87K42K67l55L4J90Q8m58M10j18k47J77
5575e6m0J82k38L2j69J06O7J26K64m87M65k42j62K81j24L1j84J14M2J02M2O5k43
5598b6L1K8j53J80p8jl3N7J26O3j04j03j91J54K5k9K37m61K10m2N9k48J52j38
5622b85K48k46K37j52P6r6J91n4J20K08m13L68l85J74m1J05k62J33K38l25J71
5643A0rQ7o2j04N5K75n58M35j94O1P7Q0Km3l37L46j60l03L66N4j90J04O8qjl4
5669A7o1m7RR1O8j31k64L63J64k07k0L20j39m36J73r3L92k3K87m56K35m56j5K15
5693a4N4K34j76k48qK24l45K41R6K40j10k48K56l1l74L61k4j19k81K71j7l27M71
5716A26j43K1L32k11k16J06j99K78q5q2J84k26M20J7l92K40n99O59l78K40j79
$$ y = [123, -138, -289, 170, 48, 207, 136, 397, 59, 101, -286, -44, 223, -132, -98, 92, 180, -278, 132, 14, -233, -56, -96, 86, -152, -120, -289, -183, -116, 10, 274, -213, 252, 10, -152, 129, 5, 36, -148, -34, 8, 110, 152, 217, -26, 5, 33, -120, 60, -18, -19, -52, 5, 131, 194, 90, -13, -204, -50, -25, -54, 183, -278, -68, -110, -51, -299, -147, -285, -37, -283, -46, -198, -122, -218, -27, -81, 39, 247, -166, 202, -183, -9, -50, 55, -207, -74, 164, -161, 10, 1, 88, 26, -78, -23, 252, -306, 129, -65, -4, 73, 153, 155, 112, -225, 121, -39, -342, 24, 78, -112, -8, 60, 52, 51, 17, -44, -91, -82, 9, 77, -54, -318, 45, 209, 2, -18, 302, 163, -273, -100, -193, 199, 176, 463, 7, 242, -214, -229, -14, 40, 274, 98, -150, -158, 66, -279, -38, 58, 298, 188, -60, 196, 165, -209, 152, 128, 9, -272, -1, -18, -345, 126, -17, 4, 336, 125, -91, 15, -184, 94, 9, -73, 111, -115, 305, 322, -70, 170, -429, 230, -148, 92, -87]
5737h7K99l8k9J56m83J12L24l96K76N5k00M1k87N04j41j41J61l1k79K46j97J17
5759a8k3L2k5r0K29R7l33N1N0j61K38J1J99m18L29l17K75j94j27K28j23L8k9K11
5783A30l43J47O7K64k75M03j60k97O7J48k70J09L4q1J95o5j02koK47m08K14R4
5806A10j33j4j14J87K1l67K16K7k2O0K47l66J41P5p6K25l92R0O6j02R2o1J29P1
5830A10j46J23p6L9j68J87j95K0N78m89J09r7J02l37J85J99j50Q4q2J44j12J55
5852A83j88L6n3K0j06J63L2r9J8p2L08k34j84J55j5k47N85l93j9J37K1m2p6K17
5876A47j30O0l52J92qN5J6J80j23j3j59K97k15j2n2N4L7j50J22m9j63L1L29L07
5900D01k82l04J12J82n6K4l48M45k61K52k69QK79j29l94K53l18N86l08M42q4j81
$$ y = [-87, 212, 174, 145, 301, -182, -70, 254, -142, 134, 189, -11, 30, -257, 247, 106, -35, 126, 95, -184, 62, -135, -18, -41, -9, -34, -124, 105, 202, -131, -80, -30, -191, 47, 58, 257, -161, 168, -149, 126, -68, -195, 33, -90, -52, -81, 130, -213, -66, 1, 265, -10, 393, 233, -64, 3, 151, -119, -10, 24, -57, 138, 73, -29, -31, -37, 210, -198, 16, 110, -23, -37, -151, 36, 57, -310, -94, -67, -89, -29, 218, -148, -7, 68, -8, 217, -175, -85, -19, -121, -29, -90, 39, 110, -36, 87, 11, 50, -118, 69, -126, -106, 472, -17, 92, -5, 97, -240, -55, 144, -6, 78, -4, 140, 28, 183, -5, 31, -22, -2, -108, 55, 87, -12, 6, -66, 242, 8, -176, -21, -36, -283, 302, -91, -110, 27, 48, 6, -70, 147, 17, 77, -275, -83, -91, -36, -20, 160, 37, 24, -135, 162, -53, -65, -117, -63, -26, -176, -54, -103, -266, -235, 94, 401, 119, -185, -73, 109, 53, 77, -271, 174, -87, 165, -104, -96, 183, 54, -340, -87, -405, 181, -127, 315, 231, 50]
5922E0J8J21l37J6K08M9k70J35K52m15M4J96k09L67j43J06J57k3l76o7L66k79
5944c4M9K83k28k45K92k95L24k64O5q9P1K08R3k61J16N0l29J09j03M63p01L08
5966a18j61K63L2k19M53l1k52J69j7K1J2j50L1J04j48R9k01L18o8Jq8L7j74K95
5990B08k08k34k6O7P1K85J2j69o9M6%J51k97K15j33K54k04k43L7J70j90J44J55
6013D2j56M4n2K47m9k39k1p7N33n02K64K30%j79l31N09j36l98K28j04L04j24O1
6036I4k56K89j90K97o18N24n1p8J60l76L33j60j16P6R0K25m99J2N39m21k0M64
6058C18o0j35j55LL32l29k7j22M2K28n9n1jL8r4k6O7q2K10J20j52J27l22l3L92
6083B29k31k32P7K68k58M05j88j84K90l21J29N6J40k72N3K57j05j97K5K85k63
$$ y = [50, 68, 189, -148, -132, 76, 125, -145, -10, 242, -173, -129, 67, -142, 225, 82, 188, 345, 322, -54, -121, 245, -34, 15, 298, 70, -175, 117, -178, 146, -118, -53, -142, -71, 137, 230, -31, 85, 135, -194, -85, -188, 275, -426, -118, -279, -16, 16, -203, 250, 219, -33, 136, 119, 140, 152, 2, 33, 137, -11, 88, -113, 205, 137, 138, 50, 87, -87, 208, 0, -234, -260, -193, -122, 163, 175, 6, -63, -17, -17, 134, -163, 52, -81, 173, -31, -274, -237, -67, -257, -113, 42, -114, -70, -122, 125, 76, -163, -184, -261, 272, -230, 34, 264, 264, 85, -246, 263, 127, -271, -43, -147, 157, 33, 94, -162, 127, -63, 234, -384, 140, 89, 11, 171, -205, 128, -32, -148, -72, 18, 243, -256, -244, 295, -126, -146, 318, 258, 123, -32, -29, 303, -26, -53, -175, -133, 95, 36, -15, -16, 22, -72, -98, -31, -113, 97, 217, 65, 192, -130, -163, 229, -2, -234, -157, 111, -147, 258, 70, -114, 176, -145, -16, 40, 180, -92, -39, 218, 113, -84, -59, 226, -37]
6104c7o9J72l37L60j54L67k57K11m43n1K46M7J43k56oPL1M6N1k98j0N21l70J40
6128E4r4J59r2j13J10n4P9k37L04ql0k35J82l5j4Q7J97l95J75R5j3O9k57J2R5
6153D1j12Qk5k75N87R8k00k54K12j92K30j9j9j84M6N6k2k5M19j74m49K24m9O1
6177a7p6J23p1K16k04J43j82J35j44l2R7K7m9j43J91j10K72j16j76L5m9P4K10
6200A54Kk54J62n4P9k04M7J92l85PJ56K10k0J9k48M16l49k67M28j91L30j13N9
6223A76k73j06OO5J35n3R6m23L66j9J77J12l53j5L43k58k10M09k16J6o8M4J82
$$ y = [-37, -106, 66, -271, 89, -65, 302, 45, 256, -187, -238, 8, 55, 198, -58, -64, -57, -26, 20, 71, -227, -237, 284, -86, 54, -40, 119, 27, -86, 24, -30, 49, -188, 116, 108, 78, -157, 25, -10, -24, 63, 260, -135, 40, 135, 122, 191, -66, -54, 41, -71, -63, -88, -363, 224, 322, 122, -132, 80, -112, 118, 99, 80, -104, -58, -2, -24, -49, 370, 196, -253, -29, -78, -17, -93, 30, -41, 175, -29, 114, -68, 67, -77, -109, -12, 15, -34, -177, 14, -96, 176, 60, -116, -81, -130, -56, 154, 156, -98, 64, 10, 89, -115, -68, 124, -261, -254, -98, 112, 92, 111, -137, 279, -70, -337, 91, -100, 230, 117, 176, -97, -203, -197, -132, 3, -50, 46, -377, -11, -30, 147, 259, -94, -109, 234, -24, -234, 175, -41, -25, -93, -49, 133]
$$ [...]
8191a83
##END NTUPLES=NMR FID
##END=
