##TITLE=1H_BAU-j-3.06
 DMSO-d6, 8 sc, 
 3.7.2019
##JCAMPDX= 6.0         $$ Bruker NMR JCAMP-DX V2.0
##DATA TYPE= NMR SPECTRUM
##DATA CLASS= XYDATA
##ORIGIN= UXNMR, Bruker Analytische Messtechnik GmbH
##OWNER= root
$$ XWIN-NMR		Version 3.5
$$ Wed Jul  3 16:06:53 2019 Russian Standard Time (UT+4h)  she@DPX200
##.OBSERVE FREQUENCY= 200.13155
##.OBSERVE NUCLEUS= ^1H
##.ACQUISITION MODE= SIMULTANEOUS
##.ACQUISITION SCHEME= undefined
##.AVERAGES= 8
##.DIGITISER RES= 18
##SPECTROMETER/DATA SYSTEM= spect
##.PULSE SEQUENCE= zg30
##.SOLVENT NAME= CDCl3
##.SHIFT REFERENCE= (INTERNAL, CDCl3, 0, 20.1964)
##AUDIT TRAIL= $$ (NUMBER, WHEN, WHO, WHERE, WHAT)
$$ ##TITLE= Audit trail, XWIN-NMR		Version 3.5
$$ ##JCAMPDX= 5.01
$$ ##ORIGIN= Bruker BioSpin GmbH
$$ ##OWNER= she
$$ F:/spectra/data/she/nmr/H-F/1/pdata/1/auditp.txt
$$ ##AUDIT TRAIL=  $$ (NUMBER, WHEN, WHO, WHERE, WHAT)
(   1,<2019-07-03 16:05:09.48 +0400>,<she>,<DPX200>,
      <created by zg, POWCHK disabled, PULCHK disabled
       configuration hash MD5:
       00 E9 B6 7A A2 85 ED C7 34 08 36 98 17 FE 4E 26
       data hash MD5: 16K
       9F 38 54 52 58 6E 81 F3 C7 2C A5 37 33 5B 67 12>)
(   2,<2019-07-03 16:05:12.14 +0400>,<she>,<DPX200>,
      <Start of raw data processing
       efp BC_mod = 2 LB = 0.24 FT_mod = 6 PKNL = 1 PHC0 = -8498.476 PHC1 = 13.60097 SI = 16K 
       data hash MD5: 16K
       4B CB CF C7 73 98 0E 57 4A 46 08 3E 35 91 B9 61>)
(   3,<2019-07-03 16:05:33.75 +0400>,<she>,<DPX200>,
      <pk PHC0 = -3.15522 PHC1 = 0.4000005 
       data hash MD5: 16K
       59 94 C5 6D 08 1F 75 76 D3 0C 80 57 8D 22 D1 4C>)
(   4,<2019-07-03 16:05:37.67 +0400>,<she>,<DPX200>,
      <abs ABSG = 5 
       data hash MD5: 16K
       05 7E 31 DE B7 9E 25 E4 0B AC 74 3D 2E 59 92 4D>)
$$ ##END=
$$ 
$$ hash MD5
$$ 3C 97 E8 90 4C B5 92 A6 AD F1 8B 85 BD F5 D2 3C
##$RELAX= 
##$RELAX= 
##$RELAX= 
##$RELAX= 
##$RELAX= 
##$RELAX= 
$$ Bruker specific parameters
$$ --------------------------
##$DU= <F:/spectra>
##$EXPNO= 1
##$NAME= <H-F>
##$PROCNO= 1
##$TYPE= <nmr>
##$USER= <she>
##$AMP= (0..31)
100 100 100 100 100 100 100 100 100 100 100 100 100 100 100 100 100 100 
100 100 100 100 100 100 100 100 100 100 100 100 100 100 
##$AQSEQ= 0
##$AQ_mod= 1
##$AUNM= <au_zg>
##$AUTOPOS= <>
##$BF1= 200.13
##$BF2= 200.13
##$BF3= 200.13
##$BF4= 200.13
##$BF5= 200.13
##$BF6= 200.13
##$BF7= 200.13
##$BF8= 200.13
##$BYTORDA= 1
##$CFDGTYP= 0
##$CFRGTYP= 5
##$CHEMSTR= <none>
##$CNST= (0..31)
1 1 145 1 1 1 1 1 1 1 1 1 1 1 1 1 1 1 1 1 1 1 1 1 1 1 1 1 1 1 1 1 
##$CPDPRG= <>
##$CPDPRG1= <>
##$CPDPRG2= <>
##$CPDPRG3= <>
##$CPDPRG4= <mlev>
##$CPDPRG5= <mlev>
##$CPDPRG6= <mlev>
##$CPDPRG7= <mlev>
##$CPDPRG8= <mlev>
##$CPDPRGB= <>
##$CPDPRGT= <>
##$D= (0..31)
0 1.2 0 0 0 0 0 0 0 0 0 0.03 0 0 0 0 0 0 0 0 0 0 0 0 0 0 0 0 0 0 0 0 
##$DATE= 1562155508
##$DBL= (0..7)
120 120 120 120 120 120 120 120 
##$DBP= (0..7)
150 150 150 150 150 150 150 150 
##$DBP07= 0
##$DBPNAM0= <>
##$DBPNAM1= <>
##$DBPNAM2= <>
##$DBPNAM3= <>
##$DBPNAM4= <>
##$DBPNAM5= <>
$$ [...]
##$SPNAM4= <gauss>
##$SPNAM5= <gauss>
##$SPNAM6= <gauss>
##$SPNAM7= <gauss>
##$SPNAM8= <gauss>
##$SPNAM9= <gauss>
##$SPOAL= (0..31)
0.5 0.5 0.5 0.5 0.5 0.5 0.5 0.5 0.5 0.5 0.5 0.5 0.5 0.5 0.5 0.5 0.5 0.5 
0.5 0.5 0.5 0.5 0.5 0.5 0.5 0.5 0.5 0.5 0.5 0.5 0.5 0.5 
##$SPOFFS= (0..31)
0 0 0 0 0 0 0 0 0 0 0 0 0 0 0 0 0 0 0 0 0 0 0 0 0 0 0 0 0 0 0 0 
##$SUBNAM0= <"">
##$SUBNAM1= <"">
##$SUBNAM2= <"">
##$SUBNAM3= <"">
##$SUBNAM4= <"">
##$SUBNAM5= <"">
##$SUBNAM6= <"">
##$SUBNAM7= <"">
##$SUBNAM8= <"">
##$SUBNAM9= <"">
##$SW= 24.9336996594482
##$SWIBOX= (0..15)
0 0 2 0 0 0 0 0 0 0 0 0 0 0 0 0 
##$SW_h= 4990.01996007984
##$TD= 16384
##$TD0= 1
##$TE= 0
##$TE2= 300
##$TE3= 300
##$TEG= 300
##$TL= (0..7)
0 120 120 120 120 120 120 120 
##$TP= (0..7)
150 150 150 150 150 150 150 150 
##$TP07= 0
##$TPNAME0= <>
##$TPNAME1= <>
##$TPNAME2= <>
##$TPNAME3= <>
##$TPNAME4= <>
##$TPNAME5= <>
##$TPNAME6= <>
##$TPNAME7= <>
##$TPOAL= (0..7)
0.5 0.5 0.5 0.5 0.5 0.5 0.5 0.5 
##$TPOFFS= (0..7)
0 0 0 0 0 0 0 0 
##$TUNHIN= 0
##$TUNHOUT= 0
##$TUNXOUT= 0
##$USERA1= <user>
##$USERA2= <user>
##$USERA3= <user>
##$USERA4= <user>
##$USERA5= <user>
##$V9= 5
##$VALIST= <valist>
##$VCLIST= <CCCCCCCCCCCCCCC>
##$VD= 0
##$VDLIST= <DDDDDDDDDDDDDDD>
##$VPLIST= <PPPPPPPPPPPPPPP>
##$VTLIST= <TTTTTTTTTTTTTTT>
##$WBST= 1024
##$WBSW= 4
##$XGAIN= (0..3)
0 0 0 0 
##$XL= 0
##$YL= 0
##$YMAX_a= 74470
##$YMIN_a= -91453
##$ZGOPTNS= <>
##$ZL1= 120
##$ZL2= 120
##$ZL3= 120
##$ZL4= 120
##$ABSF1= 20.19639
##$ABSF2= -4.737503
##$ABSG= 5
##$ABSL= 3
##$ALPHA= 0
##$AQORDER= 0
##$ASSFAC= 0
##$ASSFACI= 0
##$ASSFACX= 0
##$ASSWID= 0
##$AUNMP= <proc_1d>
##$AZFE= 0.1
##$AZFW= 0.1
##$BCFW= 0
##$BC_mod= 2
##$BYTORDP= 0
##$COROFFS= 0
##$CY= -3
##$DATMOD= 1
##$DC= 0
##$DFILT= <>
##$DTYPP= 0
##$F1P= 0
##$F2P= 0
##$FCOR= 1
##$FTSIZE= 16384
##$FT_mod= 6
##$GAMMA= 0
##$GB= 0
##$INTBC= 1
##$INTSCL= 8.052554e-10
##$ISEN= 128
##$LB= 0.24
##$LEV0= 0
##$LPBIN= 0
##$MAXI= 10000
##$MC2= 0
##$MEAN= 0
##$ME_mod= 0
##$MI= 1.114404
##$NCOEF= 0
##$NC_proc= -7
##$NLEV= 6
##$NOISF1= 3.799351
##$NOISF2= 2.8
##$NSP= 0
##$NTH_PI= 0
##$NZP= 0
##$OFFSET= 20.19639
##$PC= 1
##$PHC0= -8501.631
##$PHC1= 14.00097
##$PH_mod= 1
##$PKNL= yes
##$PPARMOD= 0
##$PSCAL= 0
##$PSIGN= 0
##$REVERSE= no
##$SF= 200.130003106159
##$SI= 16384
##$SIGF1= 3
##$SIGF2= 2
##$SINO= 5.538805
##$SIOLD= 16384
##$SREGLST= <1H.CDCl3>
##$SSB= 0
##$STSI= 16384
##$STSR= 0
##$SW_p= 4990.01996007984
##$SYMM= 0
##$S_DEV= 0
##$TDeff= 16384
##$TDoff= 0
##$TI= <>
##$TILT= no
##$TM1= 0
##$TM2= 0
##$TOPLEV= 0
##$USERP1= <user>
##$USERP2= <user>
##$USERP3= <user>
##$USERP4= <user>
##$USERP5= <user>
##$WDW= 1
##$XDIM= 16384
##$YMAX_p= 269903908
##$YMIN_p= -1683883
$$ End of Bruker specific parameters
$$ ---------------------------------
##XUNITS= HZ
##YUNITS= ARBITRARY UNITS
##XFACTOR= 0.304585238361707
##YFACTOR= 1
##DELTAX= -0.304585238361707
##NPOINTS= 16384
##FIRSTX= 4041.90362384846
##FIRSTY= 0
##LASTX= -948.116336231376
##MAXY= 269903908
##MINY= -1683883
##XYDATA= (X++(Y..Y))
$$ [...]
10965 -11340 -43187 -81165 251897 189798 -31798 -13902 254145 109328 83763 107930 31661
10954 31661 153038 233915 1629 -18191 -186544 -128945 80258 76517 122335 -134214 -125626
10943 -125626 -181147 111079 -23711 -130001 68781 318497 230403 -18250 -23421 -74364
10933 -74364 -28451 34783 130903 -90791 -187048 -101441 216578 339980 -20959 -182947 -318783
10922 -318783 -141137 191072 186431 198989 185883 514580 353749 294825 82930 114756 285640
10911 285640 214477 73779 -62262 164957 -277159 -144420 41019 106358 38855 170187
10901 170187 240133 98540 118063 148834 58830 255126 36292 194014 356334 345276
10891 345276 -53803 -187218 82085 -136252 58835 118894 -27730 -235382 -235595 -26214
10881 -26214 248315 243500 -43897 -10504 -178472 -112640 -61078 13292 207639 71299 26513
10870 26513 71250 201915 219067 -19663 44636 293143 245192 -179927 -3233 -23686 109707
10859 109707 269703 229175 -81190 95424 195227 214883 186913 146376 -89220 -185224 -132353
10848 -132353 147564 126636 273043 609882 105986 104890 10532 -58455 157226 480579
10838 480579 34949 158120 67838 59217 264517 -18100 -208290 -168796 36502 164835
10828 164835 49287 72784 121653 9161 86915 264976 13087 -112291 -40321 345058
10818 345058 66813 128711 -42399 260779 371811 422727 218635 68585 69324 297935
10808 297935 111998 -123948 288397 266349 121049 182502 53312 -97105 -59688 59127
10798 59127 -78693 -99173 33363 -157909 -227234 4120 -183206 -358049 29416 157704
10788 157704 -95384 -47166 152228 68888 391903 211453 307980 44398 -7835 323659
10778 323659 542622 199275 34687 -96258 227624 289242 373040 290120 186026 225862
10768 225862 379907 210976 -64838 313676 150339 183899 160121 287912 -5593 -89827
10758 -89827 137163 89219 157296 456879 -849 145370 142896 92235 130366 237485 458100
10747 458100 441206 -168198 329551 382880 213539 14821 91321 309360 265575 -2135
10737 -2135 -93251 239455 150676 226248 -152903 -20543 -41999 -69445 194188 279862 181888
10726 181888 -15037 130691 263885 356645 369612 285248 355271 -26094 68352 -184798
10716 -184798 -77802 63495 110625 222980 176807 372012 284657 36280 49479 -7384
10706 -7384 290328 235822 98120 110196 145816 44928 231120 105068 218821 127108 18234
10695 18234 27913 -263099 -70255 -116386 -257873 205946 101424 -51216 73311 58577
10685 58577 121067 243262 224622 263147 334130 119170 254458 357925 -8327 307719
10675 307719 486611 302063 114489 414496 283313 79744 -89357 274165 -48633 5223
10665 5223 381233 438897 -45365 -244678 282476 181732 270992 208649 230339 497642 239035
10654 239035 154661 322361 230261 163165 33152 380170 123946 95479 172326 296685
10644 296685 347779 248579 429307 232430 -85109 -92531 300561 14973 -148379 233741
10634 233741 -49738 -228933 -200655 88160 319133 501265 356246 42652 -39654 97246
10624 97246 182890 -74481 -55584 229546 356599 410244 321916 276461 76440 86128 112764
10613 112764 163442 -249233 -193374 355216 628164 533177 613331 383930 170285 200643
10603 200643 304131 447380 463330 286634 266668 247076 355389 511690 122231 94154
10593 94154 46395 189568 396850 437621 149671 197522 248986 271579 243701 32866 40548
10582 40548 254995 250743 93481 4072 -279631 -302643 74097 330447 195679 94494
10572 94494 235488 356122 163090 141753 -46584 254115 203047 122711 213368 348105
10562 348105 650896 601023 272776 268564 310695 397405 497757 389801 407335 483908 327161
10551 327161 368525 193140 62664 355863 386606 176901 417040 383270 121114 260534
10541 260534 593728 588140 490105 178871 401553 334511 332818 452548 644901 536147 565181
10530 565181 644451 353879 218506 315341 274548 276672 118877 81368 305738 296060 486642
10519 486642 675812 589613 381784 336149 186442 359728 92508 -29378 341765 204184
10509 204184 192860 138799 440082 324698 189406 69768 211217 239441 225299 441095
10499 441095 269044 694006 801871 504591 334048 611438 400959 449887 229924 59509
10489 59509 189900 460433 413621 350718 403540 428372 214086 65951 214665 468156
10479 468156 -99607 88736 247680 -40373 -166475 354485 231180 270220 325736 597869
10469 597869 565644 484710 438934 589100 534181 559093 194465 195270 235681 334608 567470
10458 567470 333245 415873 506311 184950 101933 39670 290408 455588 252497 336987
10448 336987 285069 -10011 209902 196681 177911 224634 -97945 178435 108647 388485
10438 388485 239816 478845 568788 383939 -81900 84785 -5854 106126 275527 157099
10428 157099 577602 562203 602158 920902 668561 355516 293578 307459 53350 375255
10418 375255 481278 443912 191486 447689 368671 626341 656746 625852 655505 441765
10408 441765 630526 431033 401368 333055 284872 402562 293620 343038 267306 261324 188073
10397 188073 316993 607504 578232 395154 404724 265779 231128 225965 410780 331937 251344
10386 251344 184175 257122 264807 261709 546956 258745 411554 73838 144133 313507 576290
10375 576290 386430 104239 354452 422393 344720 504389 716027 646524 433436 454188
10365 454188 347471 365740 309752 445015 259536 236923 275449 490031 496082 482074 554373
10354 554373 294460 429277 457860 161845 400075 472332 514492 52815 -33887 29764
10344 29764 235844 342022 183465 15819 72326 504382 406642 543070 276516 290854
10334 290854 258963 394018 572892 336328 588774 343165 105411 132348 344133 341242
10324 341242 240241 364633 310856 497350 461788 523416 551856 433195 153855 265994
10314 265994 246700 302764 177997 270535 325928 341306 339295 552516 584341 250264 399007
10303 399007 575426 558311 801507 478864 421037 729734 762613 356725 138170 -110031
10293 -110031 22674 297629 438767 408981 214672 233328 217435 304090 423775 381960
10283 381960 645853 351735 138520 255655 157076 383873 447094 285510 173788 127082
10273 127082 485714 600820 441396 377934 313682 451883 443902 388241 127056 416178
10263 416178 559349 498072 444422 527432 427995 661113 690616 669559 606897 501929 584992
10252 584992 165963 410244 450658 576105 559488 400858 220395 451476 279959 319355
10242 319355 534231 655498 515900 566628 574687 706686 1071369 699916 677897 511285
10232 511285 313336 330850 574167 679746 617840 161995 482678 550800 620268 558667
10222 558667 497740 344135 525809 319492 565609 959478 640916 481215 292354 474822
10212 474822 260876 274984 624606 580738 484376 624379 603324 657271 534655 177311
10202 177311 -29385 252275 336997 266480 215018 333099 209277 525322 284607 578823
10192 578823 641234 326775 820792 393955 544494 516009 462499 312380 485252 412421
10182 412421 275340 105027 544602 698810 978281 481199 317054 548652 445939 338989
10172 338989 190327 484426 417008 238202 610432 800815 881834 858763 904147 681381
10162 681381 592165 871042 408534 487577 662726 492480 550093 743883 718367 851060
10152 851060 681147 719330 741243 300612 34449 528203 781292 522074 510470 578834
10142 578834 275843 423013 559546 527787 679887 481367 235957 584630 481905 500285
10132 500285 271763 326886 559503 606911 472885 808242 939319 856941 769908 489188
10122 489188 947976 661599 333235 536025 821905 775755 353865 342647 496269 430370
10112 430370 598765 677864 788286 594762 708858 530044 607063 522698 344686 725013
10102 725013 884181 532720 526145 621464 598444 783125 577852 498701 694048 696616 577368
10091 577368 534134 470123 714852 732422 489556 628605 649083 541422 670718 757865
10081 757865 441381 255624 696889 849945 753392 618402 411968 518396 771102 781731
10071 781731 950356 837189 919302 721744 752700 660049 378774 655312 712656 712662 856272
10060 856272 661028 516555 642592 691746 655094 456756 478787 524913 877384 955586
10050 955586 602028 664900 916293 1219849 964924 732504 656072 788416 737098 705978
10040 705978 776553 1140067 951038 645417 342791 645122 951156 781226 580178 586456
10030 586456 675822 464476 560774 806655 686723 483533 611727 592567 591582 672377 813794
10019 813794 799888 1021931 1077680 568700 694596 879978 884898 988593 654571 366266
10009 366266 400856 687100 643960 636799 814985 835388 1102808 790764 763698 654208 531552
9998 531552 370417 540464 611760 392423 384380 481305 763146 628992 911286 714120
9988 714120 628256 949973 694414 717889 759189 736930 904207 689363 890098 771871
9978 771871 952326 971605 769163 836809 870503 653311 1048023 880571 717734 672850
9968 672850 929493 1022264 888087 567155 790740 1083721 570888 627050 699287 647499
9958 647499 705343 690084 919705 926696 735286 913075 849347 695337 839509 770458 692017
9947 692017 833184 919437 716369 717425 553014 934204 901066 579320 680079 905212
9937 905212 851749 1014990 999832 709814 600917 761830 908432 727664 902807 835511
9927 835511 937742 663961 619912 893876 1024336 788398 830345 914728 726443 817972
9917 817972 779998 688388 766057 881018 1145966 947957 880129 1102887 855688 621095
9907 621095 696599 513933 808782 934439 795005 807089 706325 824160 910870 901134 791309
9896 791309 1153968 1244558 1095029 986601 803024 820850 777999 864527 892429 1302251 935660
9885 935660 997286 855167 747208 768678 850209 1028371 923076 1073583 1015745 812984
9875 812984 802403 665523 473868 664786 918410 1231311 1293417 1092198 779974 640745
9865 640745 881539 1040395 754513 637767 580843 694633 927955 1012543 1030993 1133777
9855 1133777 997981 847874 786475 1029446 823221 792023 703368 662895 1109606 1035837
9845 1035837 839104 816033 1001925 701605 566651 515675 806018 761387 662832 856557
9835 856557 851642 1126330 1205540 912896 694342 883066 924780 783144 869748 675825 1068961
9824 1068961 1176047 1051077 985003 1003130 1004758 966471 1148793 877168 1056190 828351
9814 828351 720990 802287 781655 694702 966309 1223687 743574 598257 1067302 995458
9804 995458 994654 1000715 875378 1100449 994944 893720 930354 1261469 897245 993158 1026050
9793 1026050 857703 1227372 1186105 1315984 1123195 985225 956046 1074396 1278593 1318260
9783 1318260 1053029 1275255 1240047 843895 787492 1067270 1255834 1084773 1061581 1209746
9773 1209746 876048 824577 717283 829849 965703 1040741 1223509 1087034 1202087 1147643
9763 1147643 1075437 1107805 814375 976001 1037620 928675 905236 824244 878546 1044085 1006829
9752 1006829 940785 850815 1217767 1365465 1106011 1000439 1130589 1064793 1075094 1356455
9742 1356455 1432078 1390193 946287 1156029 1073746 1104391 1318475 1191553 1082724 1199885
9732 1199885 1187201 1328431 1158177 1232964 908837 1016556 1105580 1049066 1504974 1290258
9722 1290258 845342 1152112 1091118 1280376 1258909 1174593 1475626 1407520 1409902 1527051 1393302
9711 1393302 1424921 1371957 1407789 1254270 1289524 1360268 1315982 1303355 1157695 1097791 1199282
9700 1199282 1160529 739401 858961 936720 1143028 1235143 1347633 1181543 889186 735540
9690 735540 1091620 1406965 1144244 1218822 1151046 1106492 888898 993629 1222958 1001173
9680 1001173 1178836 1309275 1085796 1313363 1154130 1036849 1364611 1137853 1125308 1346781
9670 1346781 1012979 933448 1156989 1108334 1179331 1063767 1212978 1526933 1283736 1168660
9660 1168660 1090565 1242253 1454771 990133 1063647 1118765 1152529 1449266 1438532 1444851 1737099
9649 1737099 1275178 1378417 1530745 1480537 1469173 1390530 1581955 1556580 1426503 1486055
9639 1486055 1173903 1179813 1218571 1606972 1426380 1425730 1610953 1527769 1479807 1256647 875222
9628 875222 1165090 1080768 993218 1432531 1410701 1301085 1472327 1129424 1255013 1453557
9618 1453557 1534311 1662357 1408650 1687873 1373171 1188657 1199632 1240982 1397930 1408309
9608 1408309 981939 1155345 1678521 1479391 1256249 1422561 1284582 1272230 1659379 1439215
9598 1439215 1386613 1561900 1599736 1639922 1317027 1732617 1564458 1519597 1540199 1536077 1433994
9587 1433994 1787859 1526581 1422741 1528643 1228823 1589215 1665401 1649754 1206160 1286122
9577 1286122 1355615 1441092 1399664 1293377 1393415 1478958 1465110 1475773 1448330 1334437 1680124
9566 1680124 1639360 1259841 1277686 1330690 1184861 1298818 1406212 1313399 1344384 1479955
9556 1479955 1369371 1568671 1609312 1209878 1091548 1501098 1714145 1498981 1334091 1177789
9546 1177789 1494565 1897540 1453933 1375959 1579821 1685242 1475582 1789858 1694706 1584897
9536 1584897 1485617 1476620 1646751 1404548 1588693 1852603 1637924 1691585 1835030 1671466
9526 1671466 1532234 1436560 1584277 1508350 1570085 1638719 1621428 1754257 1582280 1630094 1671324
9515 1671324 1508824 1623267 1734782 1807669 1969887 1830071 1616469 1569345 1611017 1909040
9505 1909040 1828127 1792894 1699949 1940879 1949927 1669648 1394132 1678915 1836608 1533487
9495 1533487 1560802 1526424 1756366 1826368 1487103 1541121 1671649 1951897 1881006 2032068
9485 2032068 1922113 2016831 1806709 1916720 1655265 1570019 1798966 1725939 1738970 1958966
9475 1958966 1812738 1866477 2069693 1724136 1784188 1732150 1929904 1833381 1721615 1745298
9465 1745298 2049539 2029101 2081183 1955219 2282483 2092582 1731153 1924270 1980108 1585035
9455 1585035 1453722 1731822 1597064 1473332 1469305 1678030 1835616 2096778 2011272 1715168
9445 1715168 1935160 1864771 1756974 1786469 2036840 1834881 1981272 1974264 1862218 2063733
9435 2063733 2195419 2272624 2236668 2109932 1649621 1709172 1743355 1686914 1797179 1700034 1927283
9424 1927283 2046969 2126570 1966352 2017648 1633638 1974089 1951135 1968704 2020785 1954430 1685132
9413 1685132 1723031 1929477 1761639 1816680 2054523 2220845 1932233 2048968 2006010 2096161
9403 2096161 1975481 2000159 2009588 1837402 1702788 1827314 1685136 1784680 1818656 1930302
9393 1930302 2022010 2018199 1976048 2134704 1975646 1984224 1841712 1729373 2074691 1929292 1709654
9382 1709654 2217418 1974019 1733342 2056897 2170773 2275185 2382176 2454229 2304963 1982033
9372 1982033 2144780 1972480 2088110 1994002 1973122 2031413 1948313 2040473 2202148 1960299
9362 1960299 2278174 2330693 1978612 1849651 1884915 2046185 1781272 1922366 2174230 2145804
9352 2145804 2589213 2248921 2074340 2159013 2187374 2203524 2065748 2301798 2407708 2247596
9342 2247596 2146401 2043009 2228535 1976011 1942863 2074150 2091658 2214722 2316314 2330505
9332 2330505 1862148 2258959 2160106 2583030 2301591 2252471 2275616 2173924 2347997 2405086
9322 2405086 2381231 2162295 2277464 2217848 1871783 1860448 2279159 2235187 2083762 2047060
9312 2047060 2048975 2323244 2144509 1877851 2280009 2417780 2366167 2090771 2037008 2131880
9302 2131880 2210942 2507713 2411705 2290221 2396697 2381623 2180321 2329336 2209533 2391058
9292 2391058 2232331 2062396 2270638 2288524 2367141 2258936 1866937 1827720 1885624 2240090
9282 2240090 2211046 2516105 2462227 2341045 2463500 2498257 2525965 2192616 2080472 2280006
9272 2280006 2162753 2115899 2280246 2261484 2315870 2342835 2139992 2234572 2533754 2349087
9262 2349087 2077095 2375770 2414924 2136810 1969577 1909260 2118816 2109400 2633609 2651790
9252 2651790 2402125 2254346 2022306 2367916 2610903 2660766 2267372 2461881 2734603 2553578
9242 2553578 2281118 2329776 2450285 2498251 2574203 2460554 2177333 2357331 2369099 2427199
9232 2427199 2598054 2435004 2573412 2781173 2625314 2703409 2846247 2778654 2329317 2412457
9222 2412457 2738963 2534469 2434030 2479774 2731448 2952466 3063742 2498324 2550743 2542319
9212 2542319 2584650 2466429 2803900 2918938 2676363 2644009 2483337 2537323 2359622 2644272
9202 2644272 3012790 2934634 2947173 2381224 2473712 2708126 2425830 2504798 2801894 2706428
9192 2706428 2691014 2408319 2518119 2576841 2644000 2666483 2719927 3046360 2966594 2818979 2997720
9181 2997720 2610599 2697408 3008165 2579426 2734720 2680953 2639600 2677228 2578957 2328386
9171 2328386 2346778 2772725 2462244 2269565 2834037 2943984 2866789 2900260 2929465 2786833
9161 2786833 2658274 2517038 2659967 2866018 2763099 2800815 2627292 3152616 2827950 3005757
9151 3005757 2713952 2589842 3132017 2858593 2978181 3166537 3246615 3048233 2952870 2914990
9141 2914990 2788258 2901235 2982960 2824776 2817069 2518916 2661516 2997365 2787230 2928973
9131 2928973 3024540 2920076 3082125 2876478 2673284 2531070 2820278 2776724 3168442 3163437
9121 3163437 2862584 3051626 2916799 2989040 2837389 2800182 2828630 2996735 3237487 3010110
9111 3010110 3003162 3108265 3097794 3001363 3121121 3103071 2927194 2852432 3306427 3198594 3523562
9100 3523562 3414072 3456812 3271420 3012250 2980024 3201382 3196581 2907976 3219452 3147270
9090 3147270 3210759 3122254 2902228 3016454 2961832 2846113 3228886 2893453 2893190 3071703 3212975
9079 3212975 3254022 3044494 3299521 2927266 2909505 2898316 2780570 2807011 2939187 2994899
9069 2994899 2969418 3134109 3320210 3380126 3173463 3353732 3238264 2925817 3035484 3044629
9059 3044629 3343099 3344458 3013047 3110823 3210767 3367163 3044086 3304426 3053243 3406274
9049 3406274 3418839 3374620 3429569 3168426 3464143 3598789 3321718 3257244 3451841 3540054
9039 3540054 3230522 3536232 3393770 3249782 3457373 3189911 3487331 3572732 3583785 3507266
9029 3507266 2896210 2867956 3065994 3146038 3393719 3489933 3473178 3489061 3528529 3508121 3343441
9018 3343441 3372407 3419817 3417153 3462709 3307453 3491840 3330643 3565951 3671610 3567486
9008 3567486 3565516 3785666 3412965 3360897 3330464 3291283 3221566 3405356 3349963 3397327 3269328
8997 3269328 3230280 3475200 3466108 3247846 3476694 3669183 3520583 3655443 3636238 3469410
8987 3469410 3109043 3167562 3416139 3663080 3406632 3534940 3551357 3427919 3569221 3743954
8977 3743954 3755743 3797742 3716331 3763925 3569362 3746083 3663862 3473237 3447977 3502266 3808970
8966 3808970 3757144 3640366 3548396 3554293 3632199 3333356 3437527 3707796 3592202 3484463
8956 3484463 3652177 3829086 3637508 3531760 3744929 3925654 3978554 3823254 3681050 3999091
8946 3999091 4030066 4118588 3949359 3710436 3610471 3514146 3929598 3912299 3883973 3721065 3709115
8935 3709115 3924670 3894604 4048828 4091192 4081589 3880974 4217658 4285516 4154641 4227910 3983628
8924 3983628 3881366 3940688 3762330 3903215 4143412 4161973 3965208 3863276 3622326 3479267
8914 3479267 3547167 3795578 3817075 3864584 3550671 3463064 3699363 3857901 4082077 3981449
8904 3981449 4225978 4127057 3753695 3809961 4188926 3932211 4053670 4043085 4079562 4149733
8894 4149733 3885218 4450963 4385855 4123313 4086654 4048757 4303508 4188596 4106027 4071301
8884 4071301 4031900 4175625 3902369 3930560 3945951 4033773 3988943 3931027 4008198 4077265 4090878
8873 4090878 4102093 4158713 3988299 4221512 4148184 3942348 4052662 4072113 4109174 3842027
8863 3842027 3920000 4191773 3932202 4109070 3886111 3900153 4114585 4227385 4146136 4055237
8853 4055237 4071498 4088757 4126655 4158772 4542461 3907247 3724634 3966966 3985269 4147822
8843 4147822 4350335 4042334 3749353 3642181 3804291 3960324 3995122 4072740 4055359 4131156
8833 4131156 3988222 4012047 4145545 4011923 3883372 4060311 4085825 4130229 4144212 4141160 4178341
8822 4178341 4259538 4536232 4469576 4402214 4446516 4008164 4248848 4182938 4355780 4223214
8812 4223214 4260096 4297896 4394551 4255335 3886451 4212484 4283804 4309990 4170038 3958795
8802 3958795 3959411 4252345 4445222 4465510 4320367 4160401 4070887 4268413 4304430 4234171 4406440
8791 4406440 4392720 4538765 4370406 4515915 4211663 4369738 4364032 4383031 4760324 4557109
8781 4557109 4411930 4426669 4573103 4597633 4636378 4475162 4457936 4387479 4273509 4846952
8771 4846952 4624957 4739186 4566134 4691030 4820325 4661126 4462541 4565655 4747133 4953732
8761 4953732 4777970 4657855 4697156 4428735 4583678 4357253 4382677 4491504 4694249 4623555
8751 4623555 4266719 4076038 4519213 4336891 4400513 4638377 4581509 4328895 4197809 4478719
8741 4478719 4948120 4864222 4677029 4897386 4825909 4841251 4879400 4599899 4746083 4888043
8731 4888043 4979822 4503642 4727185 5065882 4952055 4869706 4896999 4767096 4927602 4918576
8721 4918576 4960613 4265872 4419668 4408314 4498327 4847951 5105047 4734190 4892498 4802224
8711 4802224 4838028 5055012 4838531 4877164 4982439 4919606 4770882 4482118 4475593 4779440
8701 4779440 4573828 4800116 4765769 4807050 5189133 5071716 4841731 4930200 4874550 4700855
8691 4700855 4867655 5186191 5161328 5152278 5189860 5137669 5393306 5281636 4974978 5137374
8681 5137374 4862509 4865344 4891046 4861518 5034984 4963031 5138569 5086582 4997507 5163447 4942471
8670 4942471 5231439 5216152 5146482 4824560 5076542 5106729 5027715 5081123 4990318 5075586 5191381
8659 5191381 4919901 4977360 5054652 5346571 5294809 5187668 5041865 5021509 5033756 5056506 5189280
8648 5189280 5180642 5359487 5123331 5321928 5219942 5263363 5238867 5221939 5192377 5245875 5432190
8637 5432190 5295747 4999002 5036560 5214908 4948618 5215799 5377425 5594096 5604625 5795817
8627 5795817 5433552 5537607 5632642 5620003 5604526 5628839 5495826 5757562 6041747 5946762
8617 5946762 5992502 5884640 6043189 5965291 6212477 6199851 6610631 6549652 6375690 6827032
8607 6827032 6854377 7104307 7021317 7246526 7353446 7698773 8195044 8488408 8639075 9173595
8597 9173595 9486747 10363514 11117488 11986718 13475422 14337594 16180008 18792303 21828982
8588 21828982 25309644 30514447 39318118 49380544 49994596 39615608 29745634 22906446
8580 22906446 18555497 16455716 14654564 13350772 12298757 11615862 11033172 10411425 9893182
8571 9893182 9426092 8943801 8747389 8488820 7861871 7549471 7382717 7405627 7315413 6953334
8561 6953334 6903469 6600507 6842511 7154355 6999154 6613338 6834527 6680237 6590460 6450927
8551 6450927 6543629 6747173 6248771 6426596 6459045 6032154 6045462 6020873 5946257 5952187 5826318
8540 5826318 5716017 5726459 5799570 5741904 5681644 5409583 5523087 5524007 5577519 5659414 5556244
8529 5556244 5387685 5299512 5263335 5062470 5280825 5355274 5122001 5095175 5283716 5612389
8519 5612389 5640157 5354576 5397811 5213453 5455332 5366195 5554411 5429248 5673439 5758269
8509 5758269 5535697 5428642 5538547 5205689 5231879 5410501 5337360 5026511 5263255 5385471
8499 5385471 5304231 5245084 4998923 5193208 5241017 5023935 5167750 5200435 4956841 4892513
8489 4892513 4803031 5040224 5160751 5478341 5564475 5456665 5263804 5120258 5074114 4983491
8479 4983491 5111477 5227101 5106305 5278407 5417858 5354656 5090637 5089917 5057651 5175097
8469 5175097 5244743 5396455 5395348 5483286 5562997 5357597 5304714 5337189 5226710 5215149 5364643
8458 5364643 5346843 5264746 5219617 4776597 5245592 5497215 5400610 5436091 5579631 5497443 5567066
8447 5567066 5456578 5110610 5121502 5205192 5372909 5186788 5215931 5212909 5121579 5342519 5439443
8436 5439443 5693100 5807808 5783068 5483118 5321281 5064024 5197171 5493537 5426250 5429231
8426 5429231 5469582 5383134 5263009 5376680 5402608 5654257 5262925 5622107 5579170 5540157
8416 5540157 5657238 5368405 5591908 5682249 5331609 5455382 5428746 5529781 5411542 5426904
8406 5426904 5665100 5583424 5798751 5580647 5630023 5578475 5531352 5729542 5625629 5629709 5696313
8395 5696313 5503443 5740191 5823764 6076336 5728703 5970705 5938548 5765499 6026384 5983961
8385 5983961 6084972 6104875 5808722 5863864 5947444 5961904 5970209 5866700 5872934 5893999 6055399
8374 6055399 5934260 5968069 6135260 6121496 6276533 5966966 5903330 6050511 5937672 5829569
8364 5829569 5868603 5979981 6033187 5978377 5864998 6029435 5824838 6126918 6162826 6234416
8354 6234416 6225673 6244967 5952523 6214869 6154320 6220395 6359149 6477423 6339924 6443405
8344 6443405 6457771 6529250 6630426 6602155 6768608 6899622 6818031 6676566 6985094 7117850
8334 7117850 7088448 7000397 7359846 7395908 7496429 7387351 7313506 7512008 7834349 7817741
8324 7817741 7852774 8048107 8363230 8311363 8476433 8587870 9017634 9247333 9651657 9896951
8314 9896951 10385204 10915479 11072327 11492336 11908890 12122742 13007319 13419314 13938631 14687820
8304 14687820 15490008 16398198 17610515 19088594 20629442 22582562 24685438 27628279
8296 27628279 30530440 34310985 38948169 45013786 52387904 61970301 73358586 85667956
8288 85667956 95886568 101831165 102185489 99539489 97569358 98102301 100957581 104282514
8280 104282514 104220728 98067212 87035345 74019308 62129782 52243953 44852175 39278692
8272 39278692 35060747 31903818 29241906 26951629 25097490 23640917 21812927 20143689
8264 20143689 19103292 18027108 16835309 15539489 14894853 14217760 13416489 12679787 12329882
8255 12329882 11765166 11060528 10699274 10278783 10068401 9574790 8910334 8880963 8741176 8538016
8245 8538016 7997501 7598700 7563168 7567133 7200387 7406102 7243594 7064551 7109526 6858888
8235 6858888 6525334 6360204 6633338 6618146 6648618 6553649 6079855 5887016 6296853 6326644
8225 6326644 6348866 6134644 6201176 6084912 5903417 5990708 6000190 5826352 5696193 5904860
8215 5904860 6198768 6039364 5686245 5504758 5782147 5730327 5842053 5464456 5724860 5508133
8205 5508133 5737844 5565871 5983200 6161733 6168814 5676034 5821899 5995052 6199662 6294902
8195 6294902 6691281 5987887 8311157 8928207 4057288 5089153 4961704 5462024 5658145
8186 5658145 5335984 5072451 5031314 5123734 5616490 5416720 5640541 6022001 5672884 5568616
8176 5568616 5732441 5987268 5779956 5737188 5977429 6036493 5859542 5866052 5770735 5874629
8166 5874629 5855905 5962841 6367217 6615384 6713059 6779569 6774099 6900280 7110448 7149708 7482894
8155 7482894 7221389 7091833 7486120 7803455 7966990 8261337 8399272 8874340 9256498 9426233
8145 9426233 9671791 10086861 11008324 11328215 11797777 12214982 13000473 14005526 15345364
8136 15345364 16532284 18268865 20010765 22353229 25228833 28960412 33487082 38795413
8128 38795413 44759584 50557741 54589263 55645717 54326877 52170538 50764658 50787623
8120 50787623 51826585 52630750 51592613 48068453 42289988 36881813 31574859 27559227
8112 27559227 24678266 22856571 21024367 19261924 18301918 17248729 16880066 16031181 15368171
8103 15368171 14983611 14695201 14216838 13971429 13580214 13282204 13154614 13359830 13940820
8094 13940820 14192622 14290389 14705606 15352671 16310897 17222803 18606939 19903311 21798777
8085 21798777 24219784 27338602 31020818 35472581 41084818 46954355 52059515 55102899
8077 55102899 55060598 53076271 51208126 50184082 50872167 52016300 52028770 50090071 45528689
8068 45528689 39551035 33627003 28962979 25087152 22246446 20240205 18185369 16970635
8060 16970635 15780430 14800121 13957809 12883163 12221791 11305122 10439941 9930370 9474057
8051 9474057 9174069 8728844 8250372 7728453 7368474 7161174 6925155 6583410 6726141 6578665
8041 6578665 6425564 6323447 6128740 5894036 5807812 5461069 5796676 5814696 5503715 5604789
8031 5604789 5069006 4658741 5036518 5039828 4988756 5063431 5043912 5149505 4834466 4902913 4960678
8020 4960678 5041659 5060870 4955927 4654538 5054911 5022074 5353018 5701395 5285309 5003115
8010 5003115 4953941 4832475 4653810 5147335 4977604 4880545 4775893 4857471 4945894 4753047
8000 4753047 5006278 4817135 4610442 4637362 4634058 4454160 4347229 4089899 4062786 4466626
7990 4466626 4411768 4408096 4195212 3903334 4237610 4162933 4141677 3779808 3839820 3825238 3817328
7979 3817328 3959621 3884047 4237608 3979927 3552487 3466757 3586514 3781767 3880519 3587291
7969 3587291 3643816 3800537 3884367 3645465 3544876 3629678 3660446 3554315 3773096 3936112
7959 3936112 3693464 3612980 3822057 3444269 3419513 3774646 3645022 3386349 3393706 3649467
7949 3649467 3673021 3432982 3198062 3593035 3474096 3707098 3943958 3612460 3446747 3331501
7939 3331501 3391420 3713061 3513729 3685450 3277698 3362506 3357035 3340416 3252395 3518608 3077188
7928 3077188 3349515 3550693 3574021 3807252 3667580 3429415 3548555 3716153 3267472 3394706
7918 3394706 3475286 3390706 3063659 3266422 3494481 3606681 3529173 3426417 3490346 3657737
7908 3657737 3394971 3232503 3477821 3428426 3301909 3714421 3618333 3336751 3313746 3325496
7898 3325496 3256166 3501490 3396345 3458345 3454950 3229397 3344238 3325942 3267711 3812747 3416579
7887 3416579 3440495 3342994 3244783 3050979 3298349 2979044 3228486 3390657 3292720 3267597
7877 3267597 3697957 3679405 3320712 3324297 3358384 3429459 3161016 3083551 3094024 3418755 3571907
7866 3571907 3408922 3372450 3178748 3315222 3451617 3453812 3403773 3565140 3349073 3436122
7856 3436122 3466588 3137606 3289060 3326440 2995682 3149249 3107083 3101999 3237278 3077573
7846 3077573 3192835 3167982 3397700 3083606 3236026 3484974 3299743 3187870 3421115 3449584
7836 3449584 3914402 3658908 3800356 3529281 3624280 3705057 3502267 3423532 3304296 3636061
7826 3636061 3449364 3139725 3021506 3337681 3323474 3054578 3247342 3338089 3222075 3149348
7816 3149348 3033716 3053355 3313929 3071883 3220149 3080117 3388205 3063099 3078174 3472531
7806 3472531 3016852 2704756 3029821 3081385 3092010 2880164 2857783 3033009 2933477 2779528
7796 2779528 2910886 2815255 2798824 2597577 2568105 2980201 2870326 2767271 2754782 2774471
7786 2774471 2764439 2794051 2636633 2588377 2718196 2455097 2798085 2849815 2683753 2541029
7776 2541029 2535514 2795815 2673932 2752705 2705469 2800542 2572314 2492390 2389880 2523244 2499742
7765 2499742 2526899 2542934 2388282 2485655 2497518 2424865 2337942 2503258 2548996 2737902 2736559
7754 2736559 2739144 2884505 2862352 2646541 2562342 2883249 2798522 2752643 2586721 2848879 2815441
7743 2815441 2619416 2372688 2488594 2660428 2375976 2058339 2277668 2249521 2242863 2586249
7733 2586249 2361371 2622073 2447554 2305226 2604492 2252089 2399741 2472202 2608869 2355620
7723 2355620 2285103 2540739 2755861 2504400 2306453 2537111 2499035 2177383 2316184 2566571
7713 2566571 2337685 2467639 2550968 2612041 2617495 2264270 2581065 2666832 2411799 2490203 2253997
7702 2253997 2363359 2426745 2391763 2315762 2225442 2159039 2070684 2017774 2050731 2380978 2564319
7691 2564319 2488121 2456433 2289517 2435110 2449291 2273921 2563411 2582379 2313158 2495627
7681 2495627 2372158 2530158 2368193 2353556 2437418 2708457 2802578 2704497 3094038 2951047
7671 2951047 2699046 2612179 2689628 2619545 2788642 2774655 2925003 2833036 2599749 2757848
7661 2757848 2805117 2861601 2469676 2572074 2712325 2711403 2662848 2522733 2688176 2689900 2634704
7650 2634704 2305944 2018668 2130404 2176565 2276441 2448611 2495214 2307100 2145769 2336653
7640 2336653 2482623 2358397 1709268 2073145 2291053 2237441 2002736 2375015 2140485 1989279
7630 1989279 1967473 1585728 2033289 2589184 2385727 2289731 2358149 2212336 2396536 2021164
7620 2021164 1892501 1971381 1836078 2019579 2143010 2108829 2379342 2351326 2399424 2155073
7610 2155073 2389683 2266611 2245378 2132824 1665309 2091724 1879327 1963140 1789623 1836787
7600 1836787 2042173 1904393 2124384 1962122 1645604 1909174 1885770 1817089 2177690 1959218
7590 1959218 1846080 1731615 1963791 2127381 1916195 1929350 1757975 1570572 1772011 1894865
7580 1894865 1817659 1602271 1773437 1683284 1865636 1833723 1922212 1968082 1772074 1829727 1875238
7569 1875238 1801660 1677788 1836692 2108854 2034522 1702517 1701221 1654371 1870576 1997402
7559 1997402 1716331 1703874 1814060 1595250 1926087 1837901 1822200 2002478 2119051 2012840
7549 2012840 1850722 1981318 1905463 2048218 1858502 1793606 1837712 1866370 1609291 1555241
7539 1555241 1433193 1575943 2083102 2054170 1936394 1893338 1865973 1633060 1684577 1854039
7529 1854039 1826102 1720858 1585550 1633178 1448431 1658014 1547345 1694502 1640203 1770854
7519 1770854 1836475 1692009 1830242 1913077 1904372 1831524 1845143 1694811 1602193 1507417 1859294
7508 1859294 2026297 1602876 1853018 1687869 1622062 1550776 1609206 1831233 1629267 1836843
7498 1836843 1694966 1825626 2224192 1877019 1667205 1746458 1781862 1829039 1888809 1724044
7488 1724044 1670948 1526625 1338361 1252887 1336254 1427922 1357204 1353571 1475394 1657564 1667249
7477 1667249 1812160 1481409 1451700 1758447 1733582 1700181 1474335 1752906 1644870 1377317
7467 1377317 1655845 1537690 1354059 1495878 1185883 1476443 1674587 1471019 1614470 1325928
7457 1325928 1451918 1393787 1198327 1199981 1394672 1443498 1710755 1855366 1605641 1637478
7447 1637478 1623745 1566305 1463506 1472730 1910708 1551723 1435140 1357257 1590466 1545699 1534785
7436 1534785 1494316 1236377 1247474 1301509 1347956 1506854 1443115 1384409 1329675 1154932 1155608
7425 1155608 1305661 1062059 1032337 1371077 1783468 1499066 1379674 1052101 973843 1135343
7415 1135343 1151452 1165456 1208085 1240098 1211155 1212582 1047282 1202047 1308981 1391126 1362011
7404 1362011 1398071 1504211 1410264 1429048 1074304 1445424 1323798 1488862 1673365 1366273
7394 1366273 1147673 1204662 1393466 1196424 1326419 1550216 1412641 1159343 1350746 1151387
7384 1151387 1108446 1067804 1452249 1442256 1547073 1482707 1369433 1425532 1363833 1468306 1174150
7373 1174150 1204532 1537767 1359602 1476540 1594662 1160893 983980 699298 1036751 1436474
7363 1436474 1297822 1442420 1524579 1319786 1168145 1370186 1415228 1516260 1119864 917503
7353 917503 1076362 1454608 1328670 1143017 1423333 1259185 1274730 1116104 1051822 1315237
7343 1315237 993159 1026368 907757 921472 1026478 1231228 1164536 1309609 1234756 1308621
7333 1308621 1442790 1075207 1027011 1269738 1201550 1107168 918881 1038231 1157364 1224710
7323 1224710 1325907 1354141 1273745 1287139 1236147 1206376 1227925 1544582 1327336 987906 989150
7312 989150 1102449 787105 979183 1168305 732566 991438 1199902 1200126 986384 1231685
7302 1231685 891490 1037871 1122743 1115085 1296346 1465239 1111623 1184647 1260811 1138570
7292 1138570 912565 1186362 1224035 1158634 1128856 1004754 914459 837822 1061947 967786 1189771
7281 1189771 1373714 1165964 948063 1367502 1121657 890845 952649 939199 1057301 1034371
7271 1034371 908807 716622 692842 1061374 942860 906644 728536 700446 868314 1090311
7261 1090311 1016155 665859 869380 708676 838295 1111898 1109641 1104536 838569 850666 861551
7250 861551 817179 807728 1332663 991035 1064753 1283980 1061196 916541 809796 1054822
7240 1054822 1016141 769987 754750 799725 1366964 1370907 1347534 1122006 771598 1179464 1046162
7229 1046162 920003 790486 806801 755492 730802 890372 963895 737220 873202 1061817
7219 1061817 1003443 900448 578063 579808 762875 657197 1151299 999110 1099503 1180589
7209 1180589 1132544 851437 978907 1130554 1131815 790245 727580 945151 981547 938439 1000896
7198 1000896 970885 935382 955839 853279 599271 773309 997816 689170 609991 751261
7188 751261 782233 756230 943187 965209 967357 817384 942673 855023 727591 847349 696271
7177 696271 758094 580057 564249 892593 745824 1041767 1128911 640737 605699 460375
7167 460375 687466 991308 651276 962931 734940 678190 797035 819711 802952 495781
7157 495781 655718 664664 850663 783566 613369 839745 754706 696275 938152 701672 722139
7146 722139 595737 810377 807447 645537 859589 773987 890395 764247 840121 717818
7136 717818 769277 466657 467956 768696 575778 643656 672639 893293 701319 704655 873347
7125 873347 758642 514163 581466 924425 1265613 946955 607942 767030 1140341 1086020
7115 1086020 732475 598205 677735 782963 827372 569903 720898 677580 837633 903694
7105 903694 868262 559459 609071 625900 486737 615684 377595 366739 432800 489341 530039
7094 530039 729712 701998 757005 693876 507107 859083 480621 411503 739755 489378
7084 489378 355583 627352 705749 661755 989404 620975 746741 838397 907135 924749 785379
7073 785379 844957 698899 687875 760466 529884 418529 500582 768833 317129 702667
7063 702667 749498 523020 315121 638075 612569 708115 964557 524621 522841 775424 602397
7052 602397 685679 599768 758941 502828 562435 481101 269045 426830 687275 535808
7042 535808 394867 632871 649168 491762 721878 514910 336361 344700 775618 666823
7032 666823 593270 753458 354631 636947 554651 349066 493014 595348 520257 331284
7022 331284 610913 402107 156849 429056 557389 675617 511198 594265 614312 482402
7012 482402 357712 550764 819358 680185 453311 543206 575075 814967 964567 798699
7002 798699 732691 818653 553434 265788 522385 543830 814554 936592 893737 986391 595798
6991 595798 636153 501143 681102 722723 581855 298628 401042 373222 532098 584208
6981 584208 527569 213026 554040 728251 957550 558399 754841 928394 740862 856246
6971 856246 608460 398053 297614 400516 195957 299087 402758 345950 741300 427921
6961 427921 645281 724745 702840 712020 691937 572297 615036 562209 681545 700662 434199
6950 434199 655792 662841 897699 801294 827324 691593 505551 741304 853342 717685
6940 717685 749101 730925 731162 805629 637673 600177 683859 606329 852672 1052995 929500
6929 929500 820148 987597 847900 733528 814455 884566 993614 1187079 1471485 1364009
6919 1364009 1039520 1086804 1141863 1369955 1419390 1634280 1627668 1902871 2258847 2448980
6909 2448980 3064723 3546079 3984300 4687512 5256698 6404888 8137549 9903862 12715443
6900 12715443 17027929 21373175 19440560 14324920 10766153 7748958 6474203 5342968
6892 5342968 4480426 3856711 3409120 3156985 3036587 2742967 2698571 2426404 2020036 2128708
6882 2128708 1906834 1683377 1796604 1570703 1053154 1417557 1048979 1135194 1074294 770177
6872 770177 650303 884942 825749 817831 841403 1070132 918072 533594 559784 456140 782030
6861 782030 658257 813171 739943 664589 446878 810067 645489 739938 606275 633701
6851 633701 700239 865488 475030 478027 471799 439183 655844 361091 558299 420250 462529
6840 462529 424185 406758 311913 348181 75988 450825 262395 71270 367248 556841
6830 556841 692571 798780 640197 506912 286327 319700 658086 431333 482655 350733
6820 350733 347944 248485 110171 329191 363101 346826 659171 580129 547380 570004 645511
6809 645511 183063 295191 482675 292685 42786 426353 537428 434801 457784 418396
6799 418396 437252 251592 152692 742790 596269 456808 317489 392330 366462 283873 296962
6788 296962 252399 294984 248616 237024 -24077 142031 132892 259728 22670 -52278 207921
6777 207921 172032 267718 226436 358333 613241 404482 64340 48344 298203 384742 499225
6766 499225 260835 280441 170260 23654 287111 297185 220524 221056 -3308 252554 439167
6755 439167 454559 294060 378739 455632 572008 371450 -18145 -227078 -135101 84010
6745 84010 -413581 -173308 87872 16289 348408 14511 176711 402404 348405 249648
6735 249648 240809 251872 259057 293016 275767 302242 315255 366789 510167 411308 351838 -28018
6723 -28018 202069 396918 421932 104225 136225 106865 230802 250646 274329 252017 199576
6712 199576 259465 236861 79593 73215 65943 313892 324905 219405 379895 -9810 218269
6701 218269 67273 -17855 209267 131058 -96167 506220 610660 466836 155844 -9420
6691 -9420 169716 55966 305050 418134 261251 275050 397344 527363 396052 51875
6681 51875 -62708 91998 -49467 27573 166337 -50637 213809 106562 151305 -74942
6671 -74942 59907 387699 353419 -8445 -170980 -154192 35447 444182 40569 106165
6661 106165 102607 381725 229070 182636 260822 120247 181427 89667 82519 231537 80226
6650 80226 169681 -48521 222680 299732 -205330 174166 293108 115127 305327 289088
6640 289088 330803 74678 -10347 115677 -39231 146805 206710 16499 192256 116889
6630 116889 116285 178963 47609 -176706 -70515 264760 235744 202569 32666 150538 135774
6619 135774 282942 282013 4396 244338 62233 184223 237325 149724 185605 72499 184079
6608 184079 140344 318788 61266 88651 356742 123859 101639 149174 71976 119250 395711
6597 395711 428565 473707 506438 456314 368294 216313 135145 81190 386960 270332 155843
6586 155843 -51598 -22146 102918 -268078 -230888 -91680 569960 314722 -101226 313321
6576 313321 216368 147431 392464 429673 266523 246212 336845 364218 197742 204133 -105557
6565 -105557 -73925 128610 -181293 263905 292826 73311 105741 -115974 -112782 334397 416567
6554 416567 146365 93198 264197 51148 -253644 -9627 -25223 486559 171730 165716
6544 165716 104872 95082 -95409 -157117 56542 -111400 -35640 -48400 51307 -10001 100040
6533 100040 95004 250176 220292 3649 79963 157104 57950 75322 -4835 190898 357334
6522 357334 157934 87258 221749 359075 490530 129433 -47824 -70276 16118 243161
6512 243161 177650 77056 105459 -86655 -177768 -277504 97964 102589 115227 40584 111742
6501 111742 52552 -291704 33228 -63148 -29547 -271497 -348822 -241261 -107277 5932
6491 5932 46945 -52327 69275 126414 -30648 -107848 74198 -247326 -328967 -161248 -195472
6480 -195472 -132127 -66335 150714 91733 218143 277835 205264 65124 31882 197557 114398
6469 114398 79035 -163158 -51156 37630 -158928 -153788 -50341 -133474 19455 -257284 -190230
6458 -190230 95713 43287 -22077 4420 339483 282840 -206098 -187899 95663 -22441 -156158
6447 -156158 -179359 167009 -44464 -2371 233583 241677 78687 185266 -51249 -37474 73324
6436 73324 146398 103387 97455 185641 122602 286032 28108 -115048 -127414 -40550 90858
6425 90858 -255911 -54339 -158801 -56679 -244723 -58548 186816 -47420 88769 77844
6415 77844 90457 -38615 -43880 -300000 -87073 92264 150172 148826 163794 -231504 73456
6404 73456 -75916 -11534 -364198 -289306 -157744 -282810 -371384 -422352 -403622 -271635 119812
6393 119812 136364 -172905 -275577 -376296 -191172 -23811 -241599 -264461 -183974 98421
6383 98421 134532 162572 -135604 75892 80346 -5638 -268792 1847 -456564 -241667 -11495
6372 -11495 32574 54146 -280440 -210561 -233006 -81816 -188262 -154669 21355 -243827 -85003
6361 -85003 162151 157173 -144577 -95957 203267 177418 283822 114559 -156293 -115458 291965
6350 291965 -12536 -87767 -217645 -235387 186790 -32062 -109230 -329434 -116108 155371
6340 155371 -128381 -438104 -229528 7595 -13561 -88352 61434 77078 13006 98867 -113263
6329 -113263 21093 351282 546156 192754 329830 -159817 -481521 -527600 -214035 -297505
6319 -297505 -161373 -227720 -459650 -135384 -328010 -184002 -82705 -96795 -121644 45641
6309 45641 -26077 -28290 103551 29395 8136 -289398 -401491 -337178 -276950 -3128 -33280
6298 -33280 94971 -33174 -86709 -215893 32144 -340268 -73073 205339 -29885 43778
6288 43778 115295 -92714 -125107 -131576 -266305 114325 203771 33435 -491005 -242100 -42172
6277 -42172 -324621 -416175 -70924 -84559 -198836 -45728 226995 -45336 -54517 -31873 -7209
6266 -7209 -13582 -208784 -96799 29954 -95794 -281501 -280679 38007 74683 170666 230740
6255 230740 -168142 -22761 -97071 84837 146621 129964 -109872 -142229 -254606 -166890 -222806
6244 -222806 -42014 110394 36857 141206 173947 -312253 -196945 220581 -160966 276805
6234 276805 177604 -128401 -31594 -408793 -463410 -180862 -97842 -107655 58403 421734 82792
6223 82792 -54391 -34162 -232730 -208545 -28411 71040 -84923 -78329 -203485 -97816 38624
6212 38624 -118072 -55248 -272967 -496373 -5919 255391 -778 -4719 -194693 -346194
6202 -346194 -277833 -105317 55260 20876 -139196 -160546 -179852 -11524 -97197 -168634 -96289
6191 -96289 -39380 168404 90263 137524 201812 -126456 -357291 -247797 -216867 -82663 50918
6180 50918 -131852 83203 46912 -98253 -23511 -137305 280468 98383 71127 238990
6170 238990 -47912 250664 -305537 -99472 42321 -71131 -61585 253619 108404 -53038
6160 -53038 212075 103278 332394 307095 -109307 -92326 225681 -95751 -52941 99955
6150 99955 -94200 -40673 28345 78537 36083 -146625 -113261 -90032 -81870 -360391 -500444
6139 -500444 -321648 -501188 -520298 -169955 20685 7487 4530 97281 -152603 -118216 56892
6128 56892 235206 -101036 -183053 -111651 -172489 -240553 50273 -32323 -458578 -281185 -236995
6117 -236995 -94495 -35584 -108389 -210425 -313020 -530818 -448649 -96202 -206694 9846
6107 9846 -51370 -210935 -486437 -94184 -295482 -299247 -126785 -405381 -528868 -413906 -62597
6096 -62597 25973 32324 1909 -64871 -37110 -235883 -291138 -410591 -265001 -139818 -311039
6085 -311039 -65387 91188 -99794 -420989 -449084 -331316 -104702 -23432 -76291 -550713
6075 -550713 -231104 14437 -108353 -124243 215115 262912 158536 -119740 -316956 -119322
6065 -119322 5422 82403 35619 -256532 -147748 -141642 -320639 -104600 -45618 -179947 -214637
6054 -214637 -221951 1622 -350409 -338152 -209482 -76149 -58438 -275902 -45073 -272222
6044 -272222 -389875 -22528 -54005 62016 395151 58901 -95574 -170471 -306663 69228
6034 69228 65135 61534 221731 48879 -294090 -534615 -427976 -385851 -96930 52083 -109075
6023 -109075 18079 46453 -258193 -186474 184219 55188 57586 -220120 -67314 -156278 -250492
6012 -250492 -306576 -172377 -26766 -92459 -321399 -298653 -62599 -109120 -53336 -302212 -79200
6001 -79200 -253209 -90894 3302 -108274 -50106 -241210 -226464 -166624 -288671 -376487 -505312
5990 -505312 -248854 -239168 -229856 -189353 146063 8492 18401 -312754 -200525 -365460 -629275
5979 -629275 -255466 -282334 -10052 -300580 -208736 173629 -234744 -163641 -203208 -346724
5969 -346724 -236372 -110717 -95634 -177009 -285945 -70484 -189129 -236155 -29426 -8585
5959 -8585 9946 -167156 -74653 -160895 -405883 -379789 -227863 -79204 -326311 -238960 -105436
5948 -105436 -304400 -76724 -246895 -149637 -34471 -30154 -150212 -86709 -3252 -105125 -10556
5937 -10556 -29446 -352231 -383826 -344564 -171699 -95689 80508 126183 -17840 63998 -335545
5926 -335545 -255787 -202202 -6958 -91641 -22904 -9090 -237430 -184127 -300951 -119864 -115888
5915 -115888 -245969 -57084 -93356 -182273 28280 -95731 5877 -90846 -22332 -251695
5905 -251695 -7871 -160901 -288934 -190812 -131507 88697 73994 -480069 -491763 -209809
5895 -209809 -246529 -281827 -234168 -155047 -278961 -84162 -179443 -682663 -224064 -19701 -320840
5884 -320840 -140373 -69236 33114 -79472 -211714 -196090 -81459 164161 273913 102911
5874 102911 -191275 -363410 -18842 37222 -144729 -225220 -279978 -380206 -330473 -90836
5864 -90836 210781 350833 -35693 -335955 -341548 -263022 -223940 -317340 -425845 -251664 -12905
5853 -12905 -342006 -262542 -125886 120283 -42904 -356942 -98886 153168 -47166 -310262
5843 -310262 -353833 -104199 241802 335532 158504 -132426 -353491 -200990 56244 -239579
5833 -239579 -212861 -214324 -211438 65125 91752 -58619 -257181 -109074 -307593 -274287 -98327
5822 -98327 -336693 -320286 161426 -91961 -358880 -230755 -507444 -220622 -250741 -286759
5812 -286759 -58461 -132590 -182049 -170716 -261048 -138356 105118 -120140 -78759 102052 189839
5801 189839 152963 28679 -89471 180006 -190952 -320841 -126548 -216578 -35551 4874
5791 4874 150848 -9097 -304773 -16350 -124183 -121237 -102732 55591 400887 499085 379388
5780 379388 -131457 -3834 113657 -9223 -216992 -200047 -160772 282814 -75226 -17009
5770 -17009 137878 111310 -3997 -204184 -189510 -381318 -278296 -276207 -185974 -101530 -11312
5759 -11312 -138473 -126525 213482 115595 -130179 -188386 -296689 -330930 -334884 -67657 55973
5748 55973 144650 112220 -212111 -261568 57395 128978 -227761 -200585 -178284 173940 58370
5737 58370 -188501 172705 -302944 -281895 -60134 107905 223347 247123 -104846 -212673
5727 -212673 -66284 -39044 -131386 -218836 -176785 -31239 233492 -111196 -297144 -116818
5717 -116818 -420358 -359199 -65724 -20126 -53584 -213183 280955 421236 232717 81473
5707 81473 56457 -117252 -41919 -273604 -225251 -219146 -87242 -125599 -35295 137536 102957
5696 102957 -3193 213950 150938 -23242 10240 -130511 -122337 -267128 19909 -34090 -154186
5685 -154186 73480 366115 204908 -66849 -128965 -19286 162181 270335 -105205 -5867
5675 -5867 287604 -20759 232525 277485 205025 145208 -99118 -132 12756 -80623 26000
5664 26000 336322 110842 -134697 158330 116849 19595 43418 142365 371797 342062 -98451
5653 -98451 -246597 -106378 -16597 -32704 -17663 230564 63671 153258 138654 -108924 -117908
5642 -117908 180815 -59126 -15505 -103852 24175 85296 348341 355020 98367 85103 223202
5631 223202 501000 403587 534741 486179 456815 588142 486899 419810 546261 524589 481292
5620 481292 199469 478901 474198 -68465 -177003 -37291 322456 389908 106613 458730
5610 458730 505977 326004 907924 855493 767589 852188 878210 707554 707054 371925 526719
5599 526719 514263 416300 403153 151449 180147 372813 120845 200976 326506 263808 299278
5588 299278 252270 163153 13161 177513 456190 828002 939715 921588 836427 602647
5578 602647 561368 425471 176160 278130 218179 -38331 -184482 174938 118684 120607 -88155
5567 -88155 43951 -219197 -45795 60847 246748 348136 395723 234101 311225 211963
5557 211963 123114 -69573 -87469 -161288 -189895 -9672 -339867 -436971 -96948 -150357 -423655
5546 -423655 -167102 -114243 -218891 -161162 -154253 -200470 -220591 -46249 88643 -193081 -187057
5535 -187057 -129481 -131064 -303422 -373354 -272201 -157267 -178412 -98396 -375859 -249479 -327747
5524 -327747 -174889 48054 -327153 -377049 -4464 76442 -32988 -45808 -170303 -238520
5514 -238520 -362761 -57700 142783 -158726 -64026 -115669 -206898 91286 49458 -47555 -216068
5503 -216068 -349847 166443 266149 87903 110 -264588 -1300 -191696 -202921 -77622
5493 -77622 -224816 -205078 -336456 -299560 -66974 -72119 -27622 -154338 -258597 -123748 -101991
5482 -101991 -332932 -267934 -31281 -268823 -82853 -42186 -454246 99979 114764 85764
5472 85764 -80524 -71373 -361380 -278892 -148730 100299 225184 100501 -47766 -175368
5462 -175368 221794 -11863 -138529 79595 -12063 -10867 221049 -300286 42066 196636
5452 196636 -91047 -159734 237836 -241003 -130815 -385459 -316785 8965 -84756 -67100
5442 -67100 -83486 -96180 271052 80762 -71158 237266 229032 60035 142109 -72964 -132051
5431 -132051 43105 -79156 -369160 -239959 137070 141785 75409 -150441 -214380 -409496
5421 -409496 -393414 -28923 17217 49158 22596 8241 -139233 -21915 -78534 -169493 -257602
5410 -257602 -376423 77398 -37512 -109450 -44732 -366544 -407824 14782 17904 57416 -121423
5399 -121423 -108426 -62968 -236481 -156324 -330974 -116050 -361 33010 198664 122295 198142
5388 198142 -54156 141856 8294 -196935 64441 56521 161274 135099 -373105 -297214
5378 -297214 -8794 -115858 -56356 -114884 -170741 -195863 -114311 -104946 -81661 37925 63676
5367 63676 -79181 -23593 274187 98739 239481 82494 283173 156503 59847 121452
5357 121452 1832 122561 -246694 -105031 42144 162435 352500 -25827 -89238 -135821
5347 -135821 132115 -27135 200131 350299 -6468 89177 -64759 25646 9713 69283
5337 69283 163655 13314 -42142 -33237 -102448 -397933 -237444 47687 116623 93633 -93604
5326 -93604 -36458 42290 18022 322856 -162879 -219744 -181651 -255036 -258497 -34522 70385
5315 70385 -153745 -242890 -279122 -359386 -327092 -243559 -280582 -25877 -72991 -309095 -147095
5304 -147095 12455 -1399 140590 -156603 -112269 -70763 -121166 -244644 -73674 -351832
5294 -351832 -216971 -37878 56813 128840 -315752 -340146 -174146 -224521 -389791 -492120
5284 -492120 -284868 59007 27186 -146704 -186669 -41808 -3582 61702 41832 51645 50086
5273 50086 9946 -80556 -195572 -287488 -332745 -378615 -28463 66615 -2828 -139247 -274482
5262 -274482 33285 -216907 -60925 -15765 -294711 -287397 -240185 -38594 -136473 -369677 -267769
5251 -267769 -95440 69174 -139405 103944 63462 -1749 61675 -329490 -312900 47988
5241 47988 129446 115333 38216 -155320 126543 940 -269483 -235759 -139506 -254978 -288310
5230 -288310 61893 -61673 -189373 -144619 -144272 8887 65927 -137871 173264 82982 -209244
5219 -209244 -130406 -206038 120777 64180 345225 24900 115007 124917 27086 -98860 164717
5208 164717 -99058 106258 246704 222000 158361 -18369 -57475 16204 101973 117825 255473
5197 255473 -64975 82690 -65043 -215144 -521650 -271674 -244663 -269213 -379638 215791
5187 215791 302150 152078 8590 4337 -180329 -170950 -189554 -129532 171895 266133 393897
5176 393897 281231 116413 29830 -17392 -162284 -296708 -135842 32391 -76098 -95024
5166 -95024 38390 77644 207414 -79716 42984 6405 210411 -86365 74172 274897
5156 274897 179656 127005 -97771 59777 178650 162627 325351 157379 86303 378132
5146 378132 435623 155706 56797 423929 511599 -68506 -40150 247575 -215473 214662
5136 214662 211925 -139202 -54048 -83580 69631 257606 387284 452307 343255 192839 -32176
5125 -32176 4521 47718 22166 124826 327261 209109 -47070 -26304 284920 247473 262158
5114 262158 -25823 47519 94160 79058 341362 465670 427802 388783 295490 23946 -81601
5103 -81601 -74076 -250991 -16373 169676 597675 484670 294719 203508 579693 553191 521235
5092 521235 271088 28391 -53003 13754 -251179 225026 355910 312484 353038 379834 414747
5081 414747 61336 411712 487701 323904 129242 457679 313669 470548 800531 705064
5071 705064 579475 649371 483186 422282 553974 596708 545921 528698 344501 315094 438626
5060 438626 352219 246399 235839 677774 395828 177481 256340 643706 541868 476456
5050 476456 757128 733727 930328 855807 799118 908159 651873 926167 590514 550631
5040 550631 444668 488447 737618 412276 562055 431766 611130 484675 750281 421625
5030 421625 623175 730515 432976 462011 840408 602087 624852 845716 552842 641270
5020 641270 500738 928379 1141043 753326 808574 594120 709948 453248 323996 490956
5010 490956 396204 231784 413872 356961 419707 413134 151829 679714 632377 566465 571574
4999 571574 439212 551908 488338 489895 684083 754861 654425 859194 828264 924001 828114
4988 828114 577597 783879 989834 748865 649006 617350 662327 604750 598281 707977 607535
4977 607535 825869 680989 938468 783825 697801 704600 859612 799980 436761 293414
4967 293414 433059 331145 312313 595755 725942 681862 816896 641872 345265 518080
4957 518080 481336 566336 710337 535493 682789 667311 557473 478002 720581 716094 464843
4946 464843 518553 734064 933471 744807 999658 841202 698074 765230 777563 790315
4936 790315 734210 717422 582632 657130 785293 1112483 960834 901000 919044 1021991 1368022
4925 1368022 1166093 1202182 980412 934603 1115389 1388961 989963 863741 1230276 1683468
4915 1683468 1392285 1451088 1361302 1437244 1448852 1589198 1674119 1930331 1888496 1843999 2067699
4904 2067699 2037354 2175533 2223593 2101156 2313166 2341607 2098003 2073155 2314837 2823668
4894 2823668 2763855 3009537 3507326 3490486 3666337 3611747 3969765 4095953 4415522 4618613
4884 4618613 4664299 5087441 5371269 6012792 6375186 6707887 6922063 7912038 8554046 9316228
4874 9316228 10410596 11670130 12901212 14557465 16679068 18847385 21463185 24572665
4866 24572665 27941709 31606126 34904734 36843135 37159856 35878848 33626681 30864457
4858 30864457 28507970 26754897 25583992 24955829 24667287 24940041 25715236 27218119 28972655
4849 28972655 31289413 34003326 37238555 41380400 46725604 52731411 60080425 69147520
4841 69147520 79779662 90351321 99262907 103749783 102909012 96828951 87074862 75900987
4833 75900987 66186527 58389021 52482780 48393955 45722909 44262005 43171247 42869785
4825 42869785 43489662 44566882 46473673 49008267 52374539 56634907 62335887 69760612
4817 69760612 78716966 88914602 99250370 107288852 110192342 107346678 99554316 87828287
4809 87828287 75776150 65184460 56227425 49537959 45096258 41694880 39158061 36751145
4801 36751145 35034405 34040866 33315889 32919119 32834745 33511102 34556339 35984489 37685696
4792 37685696 40550503 44107937 47280528 49407178 49840144 48711027 46196539 42416357
4784 42416357 38957107 36351966 34464386 33275575 33343689 33811730 35111538 37556204 40628596
4775 40628596 44688449 49687405 54011842 56797893 59531388 63335964 69211394 75603178
4767 75603178 80989857 83285767 83021447 84341025 88246866 93467485 96588882 94356163
4759 94356163 88353758 82625224 79587921 78750912 77245079 72749676 65042600 58000060
4751 58000060 52648345 48687171 45630164 41417787 36237119 31084065 26547822 23174940
4743 23174940 20399722 18183747 16500979 14938342 13144592 12168805 11392565 10557056 9497566
4734 9497566 8931726 8419504 7464384 6431802 6274674 5814445 5217661 5024635 4565354
4725 4565354 4153175 4083662 3754333 3800535 3650475 3247006 2886714 2916200 2836575 2788334
4715 2788334 2597086 2294536 2317756 2220246 1686468 2273618 2183594 2055343 2018617 1502424
4705 1502424 1818704 1350805 1080003 1256790 1412691 1452464 1477089 1524004 1016475 1100601
4695 1100601 1136160 1341486 1273478 971591 1043985 933575 1151028 983329 725061 686433
4685 686433 562088 570192 609848 593294 672659 527520 766082 644158 673367 323249 392549
4674 392549 437137 507687 680424 446130 466541 502347 487370 737433 736980 404641 472182
4663 472182 547908 616646 596021 361467 289395 305546 494612 643913 353041 239459 259447
4652 259447 650981 508379 384410 163856 31692 233966 385550 348204 233933 567366
4642 567366 395103 315439 189321 433799 375801 458982 168069 496574 538511 560468 936110
4631 936110 978192 823886 749012 967020 874666 822845 872321 761994 736583 846182 786923
4620 786923 818715 1215013 1213552 1032025 950470 1339461 1091974 859609 817743 909894 583195
4609 583195 523259 896232 662992 694900 684656 774243 855912 640664 536986 614238 504412
4598 504412 281446 286320 229305 154326 161242 210467 -40972 -11744 -60661 55929 215753
4587 215753 373392 203514 159256 415657 468739 168236 474509 473780 234559 -18704 441426
4576 441426 291573 190840 178841 -39191 -67904 -259176 -122943 -98735 112448 44922
4566 44922 91500 195425 149192 14589 -144592 -154656 171572 112517 29593 49435 -44761
4555 -44761 34810 78605 -95862 288183 131264 186132 134373 237835 211614 154466 37868
4544 37868 153563 43312 -50935 -102961 320718 339772 724293 492054 433959 453920 582058
4533 582058 358943 451160 542371 619857 398861 488716 203297 136527 338827 -102135 -80728
4522 -80728 72165 284303 -28703 122913 -86194 123077 179003 466369 84884 -219332
4512 -219332 -21954 129375 35422 88824 287539 62249 -13038 12287 -210198 21668
4502 21668 89319 -63616 -101547 -75819 -31293 -101879 -191897 -419840 -182033 -203693 -140608
4491 -140608 -39339 -363592 -282927 -91026 112273 15432 -69518 -64553 50141 -5981 -338045
4480 -338045 -232094 -217319 27472 -49657 -92653 -39617 -75661 -87651 50150 -253949 -543405
4469 -543405 -228662 -64131 -208285 -188296 -297777 -122151 -139498 -137476 -147864 115816 18553
4458 18553 -62259 32337 30628 56409 70514 -147010 -117586 152262 93189 -160178 -230279
4447 -230279 -90269 -278477 -24125 286798 -78182 -160849 24947 172691 106748 -111895
4437 -111895 -32010 -265143 -349411 -263224 50862 349099 298506 19439 38678 -201669 -178783
4426 -178783 -134456 -44574 34898 250860 337465 71951 -87071 -223553 -34075 -139661
4416 -139661 21631 87026 -27002 -263754 -363180 -171521 -97648 27340 44643 119459 -619924
4405 -619924 -374146 -340066 -257832 -298620 -43661 -73385 -222855 -117448 -138946 6425 -222058
4394 -222058 -229596 -235839 -23262 -64414 -14690 -43477 -295900 -380366 -247753 -56904 249854
4383 249854 27116 -144567 -55796 -200597 -66765 -31086 -168866 -88559 143275 -371017
4373 -371017 -247670 23961 50226 129530 92773 -461941 -142359 -229250 -173131 -62282 -37082
4362 -37082 -74443 123040 127215 -49006 -132936 207802 60149 -94898 91198 89684 235812
4351 235812 174425 40067 -71549 -125335 59929 303725 36648 -204004 68904 256445
4341 256445 35989 -43369 -469230 -13998 236255 310011 32010 155324 -126133 -207056
4331 -207056 72840 58678 -50217 -296425 30331 -96870 -281918 -145671 47292 241755
4321 241755 276692 -145317 -71021 -14350 -53467 -105789 -223950 -30832 -185811 -108150 -6446
4310 -6446 269681 216045 271162 4978 -102298 10665 183731 40502 -35495 -178982 19087
4299 19087 -15800 20855 40496 94815 43611 -38214 -316622 -80691 56831 230136 235954
4288 235954 -97461 -188610 -42903 -102266 -172041 -2665 100113 -93501 -100700 -292003 -106292
4277 -106292 117353 199521 -40022 -142466 -48237 263140 365022 176656 164232 613313
4267 613313 629415 214582 299797 60067 -99364 -153130 -97425 -292377 -171008 -215828 -34970
4256 -34970 68493 -64824 -111841 -216298 -485214 -71732 36901 -51287 -326147 -181696
4246 -181696 -141316 -292119 82610 -72025 42182 10487 -235272 -231116 -33846 -273609
4236 -273609 -211999 6466 -80535 27414 201840 232966 -59454 -356485 -51655 54932
4226 54932 35918 279453 -141863 72235 -135199 -12694 127706 89762 -91268 -162808
4216 -162808 -105857 -43027 87288 -42251 -167647 -164487 29684 -50278 -172311 -40477 -94987
4205 -94987 -192404 73486 189191 98899 212278 -338651 -230177 80633 98480 -145221
4195 -145221 128854 263172 -22174 -111065 -35020 18454 75803 80310 -215541 -86342 262846
4184 262846 163557 181808 -70290 -82819 -336326 -226782 -243561 -337950 108535 330997 426792
4173 426792 207473 13676 129196 444889 327194 253197 105288 238903 311247 60893
4163 60893 263609 350354 286418 212116 258947 -61381 24511 68058 -186327 -158648 -274472
4152 -274472 252486 71790 -211801 33047 174788 -89682 -184778 -115045 25464 192897
4142 192897 165418 272779 405509 309983 227204 213115 -65170 41470 -636 -24369 197855
4131 197855 19261 85292 158892 323197 37398 184893 143003 356316 81842 169440
4121 169440 95345 142053 438835 163338 87687 17508 174039 553176 495076 366443 467745
4110 467745 219151 322870 739465 499051 552048 953545 902124 656835 645677 367787
4100 367787 341132 463265 530147 579096 657705 613627 391281 509308 643105 797721 712118
4089 712118 717059 630420 877903 624544 647278 963858 882243 1321401 1321054 1225290 1131325
4078 1131325 1302844 1013281 687673 571286 758892 828277 502003 407497 592555 670661
4068 670661 553244 463993 409883 478819 472940 621971 198792 521235 629180 466477 733547
4057 733547 989577 933107 781148 821738 608281 335489 383265 443265 189480 -99316
4047 -99316 282166 540253 267486 209324 152963 347940 501266 633616 328741 321690 333763
4036 333763 428476 668105 588486 588159 239045 215780 315116 255997 88710 359519 104657
4025 104657 322270 275901 443083 485410 341820 345982 300711 344210 73618 1543 181232
4014 181232 396902 458936 565770 792492 726269 594330 651925 762143 651923 644484 574790
4003 574790 578885 458623 600457 824319 604467 701181 895920 694628 659530 673122 745504
3992 745504 752393 897839 1176672 1162013 1238602 1244825 922968 791788 1365626 1490171 1161386
3981 1161386 1273833 1339108 1245672 1449337 1156484 1254661 1350767 1414316 1297743 1348668 1248834
3970 1248834 1598080 1941106 1616854 1885733 1692554 1615280 1776669 2172051 2243483 1869153
3960 1869153 1849266 2014798 2240776 2266787 2315285 2490790 2715429 2599515 2598338 2476402
3950 2476402 2598809 3092598 3202862 3427366 3497505 3556541 3845882 3759855 3861324 4143338
3940 4143338 4248064 4308853 4758120 4574398 4862333 5243458 5465032 5697113 6161309 6505506
3930 6505506 6640880 7022019 7591238 8025592 8417464 8846465 9721226 10048659 10588778 11257419
3920 11257419 11998265 12999999 13327142 14131249 15218807 16422956 17650401 19422540 21612794
3911 21612794 24253780 27145246 30760505 35226993 40371346 46453752 53351093 61505613
3903 61505613 72393886 86127147 104441964 124395403 137030873 133007024 116066613
3896 116066613 97697899 83572083 73417911 65901340 61382842 58313690 56070317 55136162
3888 55136162 55653334 56829149 59265871 63099936 68069889 74824831 82614672 91987482
3880 91987482 104171175 119765222 139342549 166756514 205136002 250222533 269903908
3873 269903908 243171764 198818105 159780170 130362005 110195814 96117813 85412355
3866 85412355 77079089 70585878 65892726 62210810 59623466 58643562 58205783 58332527 58804944
3857 58804944 60665877 63669799 68013049 74182245 82141052 93524682 108435326 123265732
3849 123265732 127697678 116294744 96388374 78133091 64166610 54197675 46853897
3842 46853897 40911320 36336786 32025437 28933526 26546934 24317495 22370979 20656963
3834 20656963 18857795 17292987 15822803 14627355 13679609 12851499 12003877 11014032 10328916
3825 10328916 10236965 9410072 8710789 8293452 7681252 6930613 6276561 5948323 5629386 5187380
3815 5187380 4812619 4649398 4508663 4397968 4184803 4148996 4223110 4018239 3964224 3816311
3805 3816311 3092358 2612547 2840506 2618373 2517401 2810851 2786318 2324325 2501279 2605184
3795 2605184 2003555 2046178 1960678 2099254 1928846 1477698 1554750 1487664 1324150 1539794
3785 1539794 1825754 1468112 1452771 1414044 1407409 1336818 1142577 1077293 1054564 815535 676776
3774 676776 805931 873326 1180722 1042913 671813 758810 839605 608970 757136 857791
3764 857791 1005919 1006426 985294 597377 758178 801812 861049 749194 998245 1166989 819616
3753 819616 849594 944860 988137 1036694 949955 857166 583287 675374 614791 353871 410112
3742 410112 270863 536092 396016 238593 425438 720947 717905 534228 410118 264516
3732 264516 150012 248578 359188 275056 749662 614898 325195 63384 193570 460436
3722 460436 316100 241886 106039 83199 230660 639305 243147 221224 -169628 64322
3712 64322 294052 202838 130463 193919 198336 265010 262069 234179 337374 452365 469799 528196
3700 528196 441670 394982 435820 559495 777934 749161 865676 628897 952997 826138
3690 826138 753647 936534 1005580 939269 1093364 855564 718140 440572 492525 777094
3680 777094 492088 460847 329549 614460 824763 510825 565862 788930 937506 862348
3670 862348 739139 851295 1051565 1200977 1598502 1510544 1584606 1228921 928555 952851
3660 952851 1204601 825344 870310 682900 640538 681832 694509 798172 505245 613056
3650 613056 312045 400183 350359 717198 734582 469513 625884 715423 415870 730913
3640 730913 495171 662251 456735 573821 363085 47755 264527 313116 392061 445528
3630 445528 403770 288660 43553 131087 258411 199832 618356 533271 126295 15565
3620 15565 8089 -19193 75019 63530 -158940 144044 47114 101221 464897 531744 410372
3609 410372 111276 181761 209816 161642 192449 98806 23271 294177 293035 42852 -292193
3598 -292193 -175917 -99137 17827 133319 256992 249997 149281 392538 363053 416423 259321
3587 259321 -14470 319356 42175 105312 85466 1451 29865 350183 268405 176217 212877
3576 212877 76124 3212 -154262 156204 119635 528269 251394 206218 503247 385955
3566 385955 355517 235677 234089 303876 319999 32202 -93171 -165397 233165 473137 322613
3555 322613 18786 197812 306838 -52769 -44886 -68013 159720 -144087 -147608 -124398 -89394
3544 -89394 36233 -234435 -97487 -30083 28357 137111 195579 88158 -11965 -391713
3534 -391713 -292370 -303639 -70707 -216456 -283007 -62861 -195873 -255902 -152732 -19885
3524 -19885 -60892 19329 304705 36096 -121360 -190010 22092 -203772 -127950 -116356 235369
3513 235369 147869 -86765 -153868 -223982 -118402 -19236 204160 80198 -2564 -237946 -247023
3502 -247023 -268557 -43748 -264838 -192955 34445 94933 -90682 54132 -445662 -203117
3492 -203117 25063 16100 -90292 -177465 -263784 -290437 28963 68551 -252379 -186588 -98724
3481 -98724 234941 -144419 -582808 -229668 -107347 -104617 -261258 -478992 -188125 -77150
3471 -77150 -388761 -475563 -164574 -336749 -211611 -70122 -143408 -258515 -150478 46051
3461 46051 -168318 -151111 -54599 -60265 -157452 -257942 333488 217655 -15103 140561 119944
3450 119944 -30379 -135579 -102233 1921 -13028 -166302 78428 -141181 -251533 86278
3440 86278 -6051 -34562 -35481 -16031 -341630 -329429 -323641 -169072 -131699 -243373 -58970 -58781
3428 -58781 48227 -326819 -86163 46181 -140130 -82655 253694 24969 273390 -112831
3418 -112831 -231864 -30694 -320825 -265873 -175120 101931 102050 -5243 -46928 -197083 59003
3407 59003 262269 49934 48995 48766 -123929 -132727 -341826 -111605 -323988 -208536 25659
3396 25659 -158412 -331574 -3845 -253139 -33296 54706 181579 -5337 -174095 82711
3386 82711 -257446 -422289 -199263 -246345 -121919 13591 9247 66131 215999 254834 174115
3375 174115 218697 -1462 -73090 -134360 -296125 -196859 -266190 -256960 -86635 107094 159639
3364 159639 207325 169362 -84401 -139147 -144353 128394 186638 75586 186765 63319 137486
3353 137486 216373 183804 82057 -58889 -287122 -246984 137050 -14217 -49403 -609436
3343 -609436 -340665 -114168 -367587 -142878 -329292 -348842 -283635 19595 -44121 9999
3333 9999 -447458 -373669 -282517 -41968 171775 -110039 -44027 -101743 -145356 -190815 -14204
3322 -14204 -77938 240301 -8561 -77439 -171354 -301174 -177725 36058 -222266 -157045 -131184
3311 -131184 -96608 202429 186282 -251609 -59488 -190927 -164546 -210055 -391623 -532158
3301 -532158 -392984 -136233 -33971 -289088 -365621 -116340 8020 -218381 -196937 -102802
3291 -102802 87448 -167719 -148329 39600 64952 20739 76652 614 -130734 -179363 -185146
3280 -185146 -176755 -119945 -236597 -25653 113553 75869 195123 20522 -39785 171170 -185884
3269 -185884 -4253 -14339 -26067 13680 -114778 -347854 -471862 -364137 -28654 4581
3259 4581 -404811 -157832 -23490 -329531 -347700 -129560 120074 -163029 -114471 -42532 -248449
3248 -248449 2760 10375 -199405 -309477 419038 119389 -65595 -216979 -113550 -143405
3238 -143405 338113 87721 -163590 -207592 -67139 -231116 -8845 -136162 -130956 -5350
3228 -5350 -6722 -122240 -175086 331421 -116447 -232422 -176082 -146709 149396 389638 261955
3217 261955 139935 215452 18645 311843 243074 117663 -314259 -346863 -291258 -361322 -162904
3206 -162904 143712 -174584 -290846 -290506 -170180 -263474 -262633 -226554 -57885 198808 -12430
3195 -12430 -145447 90117 -21646 -194793 -34314 -146729 -326840 -335905 -146840 -264669
3185 -264669 -521933 -281634 -406920 -253530 183266 538016 -6811 59834 159372 -32233
3175 -32233 253696 -128852 -131760 -81231 42194 -279483 -45783 -356267 -54554 39878 -104530
3164 -104530 -104241 -124292 -182592 -295874 -356616 -535188 -275771 -136891 -150991 30863 -292822
3153 -292822 -194179 -122308 -188713 -544488 -585123 -174426 99864 198512 -109711 -257 3838
3142 3838 241915 -66858 43321 -93815 -53042 -236597 -119147 12104 -144615 141513
3132 141513 36302 131320 378221 524535 198459 300524 -44884 -25466 -41029 57512
3122 57512 56275 -70729 26702 2267 -11751 330235 297913 397822 606123 1068504 870907
3111 870907 843820 444396 187039 63973 154653 14012 222774 328097 100998 30210
3101 30210 16301 69527 20040 -106579 -168476 -102522 -162121 117776 113731 77441 385796
3090 385796 177480 -9808 251398 -130193 -428909 -205752 91641 56047 46722 -135687
3080 -135687 -201796 -90722 -482220 -242223 -64414 -39499 -13017 -113119 88535 -262685
3070 -262685 64429 100111 251313 120669 -41014 -415576 -193286 -39672 181904 -55764
3060 -55764 39540 -88726 88194 -130958 -23313 387311 310237 377540 -49967 78254
3050 78254 -7232 160471 -32740 -356727 -293900 -443072 -510026 -454506 77417 52455 -478642
3039 -478642 -521690 -394990 -23917 -238646 -347644 -146491 -228706 -81564 75911 -329211
3029 -329211 -243843 -84847 -202534 -85635 41549 -36076 33064 312501 261866 -15176
3019 -15176 60307 -8757 226887 141690 79229 -101032 -157799 13243 -168217 -235798 253076
3008 253076 61182 -72072 99938 255897 100573 -77663 97286 157394 390302 280895
2998 280895 14235 -113689 282718 234313 -80889 -21688 133546 -49185 -55137 -14824 -172115
2987 -172115 -274364 -123484 16466 -87775 -195775 111025 181555 199426 10236 -31622
2977 -31622 -42889 -103829 -23745 -50475 -42312 -72775 -160920 -22848 -34139 -363275 -14139
2966 -14139 257152 87502 265831 210444 86800 98388 -194455 -73326 211590 256050
2956 256050 123853 107302 136928 201777 227440 -68207 -30760 -26292 -217407 -120092 -106524
2945 -106524 -239723 11185 83846 -32627 -220026 -134794 -142584 -7534 -2898 12608 -179277
2934 -179277 -126794 -192812 -204490 -301858 -107981 -109488 -252662 54995 -173347 29908 -342337
2923 -342337 -277451 -509408 -532632 -267667 -43150 -297537 -311920 -271757 -335309 -83737 -214138
2912 -214138 -270298 -20808 157716 -156581 -173974 -198069 -80430 55170 395714 269066
2902 269066 88464 -2186 222095 92631 -203480 -171003 -274347 -17424 262850 108803
2892 108803 106791 306437 261551 82562 -17178 177904 30121 -186584 -42786 156344
2882 156344 -73850 -231291 -125504 46268 153149 180700 234605 69509 -61227 -200085
2872 -200085 -189989 165898 48211 204637 84218 -232135 51093 91745 -78188 220007
2862 220007 247239 162474 -48439 145877 161941 145030 246460 -133166 -325206 -14806
2852 -14806 244668 100949 -65282 -17750 -471459 -9752 106129 -50476 31441 350589
2842 350589 250469 9876 -102484 -225438 -191653 -435931 -236501 -29289 -127582 -226922
2832 -226922 -41059 -152051 -38684 23325 47119 40665 20643 -116062 -199166 -233437 -472249
2821 -472249 -425497 -242200 -136999 -213161 -178176 69158 47779 -119574 102412 -145643
2811 -145643 -232635 -155559 -101517 -29181 -49139 267737 37844 5186 -3471 80427 -55327
2800 -55327 23098 -218495 16128 -37093 -218533 110936 8991 27863 230362 58002
2790 58002 -182726 -134504 -120434 -146186 -210365 -283553 -41527 -289194 -127039 39809 194843
2779 194843 239396 449454 454928 220923 -45911 -139993 65343 -211280 -170876 -11676 -144944
2768 -144944 -58336 -48119 -307835 -314133 -46001 83922 106644 52592 -142897 -165658 131276
2757 131276 271422 -75901 -80031 359947 161948 193677 203492 131854 58579 -96639 -51182
2746 -51182 121176 168191 424173 292259 -14346 -164381 -268021 83022 -50961 81778
2736 81778 -261740 -248667 -196864 -256301 -39073 106758 -11412 14935 -38836 64961 22203
2725 22203 -235103 -22570 158822 -168932 -219271 -100537 -172786 -103114 115904 96026 -10545
2714 -10545 51489 163778 107858 -126726 -183412 -110221 225759 167774 -175324 -358851 -129614
2703 -129614 -22351 -508133 -407460 -271266 -294870 -206925 -304174 -245115 -108576 -125216 -26232
2692 -26232 -58020 -34369 -391376 -166479 -152068 -257702 -311281 -229428 78138 160890 46756
2681 46756 14212 300082 53354 -300614 162755 153785 151972 40236 -413644 -194613 -144571
2670 -144571 -131503 -270615 -352948 -167499 74657 125594 -221830 -469600 -524378 -487594 -326220
2659 -326220 -275221 -394631 -118655 197180 37360 190505 240733 310258 229886 73053
2649 73053 -233997 -642689 -557489 -377168 -242313 -413481 -581627 -206612 -235534 -278551
2639 -278551 -258428 -100001 11288 174476 229070 254599 247393 130950 -179208 -36317 -3293
2628 -3293 -37844 -140388 -144037 27149 -63256 -69509 -92856 111764 126250 -87610 -377860
2617 -377860 -138713 -14394 -138636 -191116 -150953 -174391 -75452 -32138 -32563 237116 -289489
2606 -289489 -275120 127234 -169681 -391590 -366791 -536051 -339816 124938 227792 -49128
2596 -49128 -126270 -264557 210586 179699 -137244 -274711 -322522 -87210 -190683 -99049 -110174
2585 -110174 -199279 95091 47148 -120829 -284937 -121284 -162067 -377293 -311369 -236891 -96233
2574 -96233 -125800 -143886 -58592 111227 -47415 -301585 -80267 143790 84966 27585 303208
2563 303208 35777 1204 33287 -125369 -55156 -65114 27616 -55915 10988 -143786 51316
2552 51316 94340 -15192 -334228 7490 -83501 13165 -107386 -134133 64868 -1798 36526
2541 36526 300442 186313 144567 26618 -154255 -242232 200539 -1925 110759 114814 306023
2530 306023 7157 -361295 -146478 -106996 -70444 300142 148510 142494 353275 241331
2520 241331 -103110 -54783 23158 35414 189837 -443704 124019 397367 215802 28497
2510 28497 28342 -129403 126512 339878 163039 42107 100511 43495 232000 66048 35570
2499 35570 -134470 -128074 -15751 28209 -4276 -293927 -188799 -300728 -83652 167045 36573
2488 36573 30048 51677 20038 -43466 222324 -77688 -62441 13435 2656 -53890 -98558 -118871
2476 -118871 392633 -73797 -93543 9360 -148294 -201468 -59739 -21032 63651 62499 -21698
2465 -21698 78572 150703 -103793 -153458 -76202 -104091 -69056 227672 -103071 -630978 -163174
2454 -163174 -98970 -36434 -16450 -27277 10818 -19349 133750 202812 245731 149691 46216
2443 46216 145739 175424 185916 134567 -133684 -277428 -208175 -150709 -246541 76700 323064
2432 323064 -189413 -85186 -47467 292869 -20058 69840 220994 49496 -11496 -137241
2422 -137241 -191045 -168107 -244976 -38133 205266 186753 149205 419974 230444 170249 -207598
2411 -207598 -292240 -123493 -160519 -58702 33528 311101 156294 -64895 -362318 -325454
2401 -325454 -280084 -473329 -117346 61014 -50063 88478 458636 17827 179196 238979
2391 238979 -133681 50387 -142706 -18740 55111 -138450 63283 -282949 -107391 117607
2381 117607 249428 148007 -72367 -251662 -6992 224151 262907 24833 34596 76139
2371 76139 249056 145985 71403 212061 -3024 53518 30604 -233948 -302462 -144651 -304094
2360 -304094 -131845 -155986 33162 215489 250247 347561 21807 -240609 -123106 73815
2350 73815 21827 -39835 -10043 -243199 -10387 -87029 -15675 -117890 157214 78526 20393
2339 20393 21078 -48936 -235586 227703 162117 -306657 -206354 -259281 -309895 -2232 -124928
2328 -124928 -129889 87076 -165269 -121121 -80700 -22299 102234 -179591 59540 -154725 27049
2317 27049 -80427 226571 303461 266205 195070 -141040 -153814 141179 69332 -24088 291468
2306 291468 310097 -93506 5579 145238 197343 316048 -2378 -50643 56196 92015 -7690
2295 -7690 84375 -348216 -78302 -54827 134789 200571 398868 266086 143317 205522 265711
2284 265711 323734 154294 205286 47589 -59744 46268 195353 78639 -71906 -148060
2274 -148060 -187148 -77264 -93436 -61300 65527 -53691 5746 -81981 -64325 333859 280523
2263 280523 102252 -72382 -8420 -6503 51055 82538 -112288 -268728 63886 -35018 4286
2252 4286 188432 205694 33544 -80452 -65393 -198886 -246738 91017 -41811 84404 95778
2241 95778 100405 130099 91964 -152421 -234162 -420147 -304738 22529 102100 111242 49397
2230 49397 53840 173502 121533 -132604 -277248 -222274 251570 -88255 -475916 -339354 -125999
2219 -125999 -30479 -122179 -396792 -150873 148402 49445 -13723 107290 239971 155053 -79467
2208 -79467 -171317 21764 -104355 -12961 11993 57723 -40252 -167401 12365 -226640 -7845
2197 -7845 -86844 55360 41310 61793 -41469 110030 12675 -285546 -54848 -138510 47616
2186 47616 -1598 -459862 -225985 -167835 -201089 41295 257099 -48829 -64462 -46515 -101868
2175 -101868 -124012 17724 -263389 -63666 167134 -18249 103076 90692 -37390 -360864
2165 -360864 17880 -75460 -174210 -140809 169556 280933 -190889 -262039 37144 47548 -65368
2154 -65368 -21980 82626 320786 232006 -257180 39002 134534 285131 -70477 120955
2144 120955 150314 -14733 29817 -480996 -197564 256444 257898 -25623 -19092 127477 84467
2133 84467 -212930 -159903 -36861 214019 310266 105351 84880 54615 154816 181246 -39256
2122 -39256 -91591 209559 77751 124585 -6148 -251881 -78743 107759 15423 -168033
2112 -168033 199367 370572 340254 251084 336095 344114 118480 -167905 -65830 7013 37946
2101 37946 -437574 74687 -61295 -205887 75842 -91591 238804 297229 67189 71851
2091 71851 -105982 -262586 -71768 -171721 -152504 13451 -86554 194884 284283 171074
2081 171074 -176502 -216596 80881 265315 -79968 -34649 -582 2368 -30724 113295 192401
2070 192401 245210 127382 94800 23013 -165934 75789 -116908 163823 371648 510109
2060 510109 -32583 -50628 -85856 126096 7580 -126202 201929 141933 183121 -204018
2050 -204018 -372207 106460 65411 -81180 -193067 153097 190213 208355 127700 -169273
2040 -169273 -148098 -70402 121599 114066 121661 129753 175267 178812 -8587 -117275 9950 -130431
2028 -130431 -170804 -55810 64347 -48757 -131479 -26215 187726 325381 -248433 -366399
2018 -366399 -17694 -8057 -155323 -113261 128209 72504 30669 265910 -74972 -19431 -73115
2007 -73115 54268 311616 332936 63970 47705 -118716 70941 268037 73208 101073
1997 101073 -71857 -153750 -4137 -276969 -97120 -56842 -13253 -90543 127257 189998 -21022
1986 -21022 -90078 -115367 -109592 -174299 165089 -142981 -312189 -228289 -215130 105678 74079
1975 74079 -267729 -246361 36366 -104157 -44375 -93138 8618 346621 67313 218507
1965 218507 11810 -199801 6201 -24429 252337 111756 -91608 46662 107225 -183532
1955 -183532 -210062 221405 19308 -11473 90996 280422 17382 -38060 -227478 -193962
1945 -193962 -123250 161765 -69597 -105354 -362153 45301 72063 31185 46742 149898 -138328
1934 -138328 35108 200581 108748 99611 -220233 137853 132421 143380 20962 15119 90328
1923 90328 -137579 -106509 -199065 -284916 37124 164544 -63162 195399 58973 87349 10134
1912 10134 99470 -101006 -287044 -59451 -176401 -132367 -122519 163027 109887 78734 127856
1901 127856 -106684 -28713 -177298 -24724 -191261 -626027 -248898 -105857 93185 -124693
1891 -124693 -218471 -167754 -81243 -18475 -222444 -256280 -42299 162252 -155065 -140121 214769
1880 214769 37781 50304 -27429 25140 -80180 -214912 -71550 189349 105781 162681 -50190
1869 -50190 -95775 142149 123775 94925 31796 -206915 273510 252871 314380 -269260 -74543
1858 -74543 -256216 -27017 54436 -211551 170015 115970 69933 -166357 -91129 -169520 48845
1847 48845 376163 116427 -118737 -242451 -443 99470 233176 248413 158663 316761
1837 316761 117287 -80146 93107 8917 20450 62694 -9583 -80585 44193 -85388 -114620
1826 -114620 41957 19079 -230725 -110341 -36163 -221314 31590 -344233 159419 245829
1816 245829 341956 21799 8383 131346 74260 255045 194501 -278161 73261 -42711
1806 -42711 -91956 -73613 -61454 60710 180477 296956 232061 321365 21726 -329124 -210123
1795 -210123 -27269 21598 117696 -180132 -16233 -163940 -208451 -70091 56220 182809
1785 182809 -202231 -165719 -80503 95972 3488 1417 -74360 168647 220988 -30888 11342
1774 11342 -118856 112750 265615 132659 262917 169291 -227550 -270756 -186471 -107069 -50784
1763 -50784 97028 -102534 -356859 -526237 -32247 221944 258733 -169488 -191071 -365576
1753 -365576 -274101 -17261 -153944 139728 147950 78788 41767 -252046 -232954 -76035 -206367
1742 -206367 -26953 -287764 -149529 -139390 -64230 -74295 25665 35891 -10200 31572 -63840
1731 -63840 183281 -14145 76427 118843 -243624 -194158 241050 20104 -392630 -115566
1721 -115566 -186279 -113319 -225782 -140066 183526 -85977 -60435 229957 73226 248634
1711 248634 423278 181658 -45902 -101043 224514 124689 1773 59481 190047 92277
1701 92277 33275 64490 58076 -46374 -5383 -127484 99064 124086 18975 34649 -49546
1690 -49546 67725 -124383 -221486 -199226 -5431 142840 207374 -33997 -206113 119395
1680 119395 -4402 -118801 -57025 15140 250057 78657 94765 2939 75733 70931 27573
1669 27573 -442257 -383028 121876 102076 61690 118481 -86084 -185609 73162 161027 -8070
1658 -8070 -415606 -50324 267886 282754 405941 142754 -44285 72132 178173 97166
1648 97166 -205138 -214929 -145355 100595 87571 312732 346609 37753 -61939 370395 43832
1637 43832 -60211 -184496 -154208 -45943 136229 69895 -40242 -71804 57360 -81907
1627 -81907 160641 94636 126970 195706 -43995 -52231 30507 101870 -99600 18915 -205376
1616 -205376 40586 173507 315345 121878 23422 144198 246509 104378 133779 203008
1606 203008 53652 -87660 104782 -143206 -151656 173768 -3628 -252231 -58730 -88211
1596 -88211 52901 66699 261189 337997 238152 108370 63880 -111574 69243 73364 466786
1585 466786 376933 311942 369035 -4640 -121734 54926 -177693 7240 -25075 265553
1575 265553 41681 -99896 -56783 -174287 -62652 -163763 -174256 -64427 158110 20616
1565 20616 230999 383150 249021 265614 143752 -31614 42938 -63149 109641 -238278
1555 -238278 -196127 314414 180909 -29313 30863 43614 374274 245485 141324 -238232
1545 -238232 -235263 -176818 45934 -235650 194513 338 -84899 -284424 -38275 -258575
1535 -258575 -277166 -18370 -263738 -232498 -276510 -273925 -192343 -84301 180549 190603 -14626
1524 -14626 274366 88314 -30439 223797 -151607 46479 266506 11710 179373 34060
1514 34060 215915 -19361 -205357 -279052 -18930 95984 88694 166566 273583 -37495 43838
1503 43838 -24553 454826 278288 121648 136422 -35486 9287 211044 48728 -564 418664
1492 418664 -60732 -276905 -36156 -176601 -66076 -36734 80242 76826 -94965 -86853 -216393
1481 -216393 -10684 8280 107830 135716 -33179 174736 -82237 167230 222124 -391636
1471 -391636 -214202 48399 382954 314535 152954 127666 35388 -368739 -278730 -73247
1461 -73247 289537 229235 66723 -159020 4204 3050 34125 -66370 -18650 -107592 -171561
1450 -171561 18407 -78764 -243825 236353 138164 143628 130272 63760 -148070 -434195 -183177
1439 -183177 124112 -186039 -428472 9729 -57706 -76504 -55274 -80549 -203578 -118623 -261194
1428 -261194 -54887 -129987 -766 75607 -172905 25446 80959 -306021 -253129 -163208 -36941
1417 -36941 129510 139004 -113027 -133086 -144561 196407 -140803 -145181 -53853 -229581 -215706
1406 -215706 -5461 -114866 135010 -381470 -123872 -65519 -69522 -90285 -74589 200233 -147150
1395 -147150 -24548 106983 32206 -190754 288987 105316 48979 68674 144267 176462 -56110
1384 -56110 111493 56310 -32054 106594 173612 463968 394745 224496 -26016 84623 -22687
1373 -22687 115465 174390 272086 189646 29642 8868 208160 -227552 -297828 -89212 -108467
1362 -108467 -37283 12798 104972 -126537 -108738 -303323 -178935 -65384 126412 204074 -155367
1351 -155367 -384938 -438298 -207319 -262271 -209064 495321 280068 155608 121648 197323 120345
1340 120345 129567 268416 101971 -24195 -136354 -42176 -84198 -134615 -288235 88792 452723
1329 452723 255605 145475 145238 185995 83971 301375 405590 148013 237213 -32469 99170
1318 99170 332255 169548 9858 30936 196410 329699 317367 84189 142681 293493
1308 293493 228942 137312 77303 174189 203539 -30255 -107467 -147382 -41486 327896 307733
1297 307733 45345 -188570 -106401 191690 118125 -60047 -137471 -242876 -120304 -95096
1287 -95096 -379256 -475204 -384519 15389 468112 197775 24853 133392 115874 -13964
1277 -13964 48424 108351 50469 -76555 9114 -115994 -376397 172004 -51076 -6434 198118
1266 198118 -129047 -126478 -143858 -35208 132473 8130 -180190 -254442 -341413 -150255 -37175
1255 -37175 91974 -136472 -72262 -11136 154248 104875 -4613 286971 120172 -285776
1245 -285776 -436385 -32312 -121142 -88783 -120256 -238797 62791 -28693 -183340 -229586 -295909
1234 -295909 -290395 19156 -48627 209600 216090 116854 257930 -145450 390521 502830 144875
1223 144875 137271 -149842 39539 -163296 110468 68886 -32011 56785 79732 133220 -104225
1212 -104225 -47944 -31363 350316 -2205 -45169 79615 190091 349359 13210 133186
1202 133186 340088 271373 27025 24093 2956 -237136 -152322 163465 -118717 65922 -102971
1191 -102971 -107763 -79225 75046 129626 -54711 146438 252372 135736 -94809 -22156 -13067
1180 -13067 16760 -9674 -135586 -25392 96983 -163217 -336938 -451504 54273 100712
1170 100712 95500 225592 139860 315062 448427 189496 167828 -226269 -96513 -116731 265405
1159 265405 360835 -22489 202316 -28961 -101558 92987 -154008 8390 -181169 -168417
1149 -168417 -31826 160008 44120 75105 91127 299189 267679 -37936 -259584 84185
1139 84185 12538 87565 273149 255164 189983 -68922 302002 273202 369780 223085 -47306
1128 -47306 -66319 -46856 -99211 -10788 224878 119338 -18897 -88559 -82500 -129618 -277569
1117 -277569 -168474 -82242 12957 -262561 -201377 107485 -85600 264559 -10730 -162063
1107 -162063 -196064 -19815 208098 -206594 -144289 106395 374601 289656 97170 -135066
1097 -135066 142156 19856 45668 -182366 214775 -83013 21625 219436 207730 114245
1087 114245 66912 230936 417658 299944 -58550 -92976 100488 299638 164455 156773
1077 156773 34525 -141569 -95734 -155474 -171932 -131372 -296500 -195504 149625 -144998
1067 -144998 66821 208020 161893 155628 194294 -148723 -119333 -210292 -294258 -178334 -396802
1056 -396802 -275133 -95064 -44854 169933 -129330 45542 345837 -112788 -232719 71222
1046 71222 237603 -91483 -51620 35553 78478 -16247 -32574 358681 175614 82362 -34652
1035 -34652 -348430 -27445 -7737 134980 -277090 -275740 -175962 -202662 -78798 121873 -61895
1024 -61895 -13690 40124 -53488 63772 114211 73558 58440 275644 286705 263124 49887
1013 49887 78240 68436 -112209 -97509 200831 139914 67845 42801 -85578 -9500 118814
1002 118814 88525 161369 69317 18752 448537 -157995 -283919 -48361 -126643 -84836 150349
991 150349 319438 221349 120967 143656 116106 114077 230130 25508 -81790 3273 -37407
980 -37407 182912 101518 33138 277068 318057 370200 207530 -149030 -46498 -230802 -192630
969 -192630 -377598 -184728 -217999 238693 129223 -152032 213701 9877 253220 201290
959 201290 49746 -244645 143697 279483 204191 -99535 -24251 121957 -171402 34802
949 34802 -489413 -448523 64963 224101 -2510 -42847 -6342 109952 -280055 -380944 -235787
938 -235787 161881 -110741 -189949 32913 221080 444244 182451 274101 -40594 -90051
928 -90051 150828 159802 24375 -38094 358708 594453 189564 98902 181608 131596 -63852
917 -63852 22927 75571 298986 340198 269834 -120604 -63802 -151617 -89864 -284716 134708
906 134708 138724 -241229 162504 113987 -110158 138 -63059 -188830 -450906 97431 211816
895 211816 55558 152004 -60969 -163243 -119056 32858 50289 193829 -147217 -186891 31741
884 31741 169414 9995 -156477 -123164 -139524 -7562 282342 341927 438348 -4785 42438
873 42438 -110839 -77305 48883 -402136 -552272 -291223 30353 -1569 47525 -67967 -153110
862 -153110 134884 65387 50119 21942 11160 151874 285467 34682 -52771 85112 -45591
851 -45591 -69947 25004 109181 177388 180019 -219897 137038 -49052 -306710 -200694 2817
840 2817 58032 -53990 21313 -12032 71214 -17444 187742 -63105 -143186 -102147 -75583 216818
828 216818 -17542 190300 115156 -104419 33595 78198 139940 319663 151593 225031 95188
817 95188 172234 131920 -116335 33808 138799 169674 26549 -22492 102421 180077 50037
806 50037 -308730 96028 -10081 63059 196913 -88220 -224489 -57305 281933 544148
796 544148 185345 -178436 31756 -515422 -620774 -343862 -175302 20797 110272 63974
786 63974 82484 90673 340365 276733 61897 39405 183637 241089 17481 -496795 -399387
775 -399387 -252895 -378218 -386500 -149883 218031 141664 -102190 4381 -95545 68795 -89707
764 -89707 -109778 96631 146675 -13041 -61785 -155503 50107 40314 -102877 -7195 -93566
753 -93566 -11524 186914 69107 19764 -109806 51739 -111633 -17130 -22923 -29960 259787
742 259787 51547 80027 -71438 60720 -24092 -141703 -108793 -265942 95270 84833 -73837
731 -73837 -89769 -156367 -94148 53916 175233 -260321 -1609 14966 -27115 -206834 -54397
720 -54397 -85696 -57571 -177978 97254 156452 -209361 256243 90323 -68367 224836 13331
709 13331 -28954 32683 132225 145725 140016 282915 105940 313976 195022 -55387 17933
698 17933 47553 -72559 -14400 49318 166260 14117 -69994 190360 142172 -86906 96531
687 96531 178523 -153437 -125023 -570291 -218796 -228426 95631 202231 -20063 -115276 -75721
676 -75721 286818 -131539 -219981 -182306 111163 -37284 -55477 -370781 -540926 -267159 -351202
665 -351202 122386 -149478 -225296 -157246 -40284 -67071 -100003 2420 141526 238755 -215256
654 -215256 -259873 -238605 174698 33222 -14223 -81004 -285842 -12534 236400 27149 61801
643 61801 1436 13863 6232 -123284 39272 282635 331672 234352 -208189 -116335 -212807
632 -212807 -144974 -47995 22252 167536 225669 -293409 -243900 22553 -164250 49593 -191988
621 -191988 41988 235417 178774 153236 4123 -276315 -357657 -304707 -114581 -191776 -173140
610 -173140 -77853 -44563 -40066 -194848 -86706 -257510 -148154 -61037 -3017 15269 -337283
599 -337283 -252179 99836 -20069 -43436 -185288 -437189 -511954 -161840 -19832 -88072 -69613
588 -69613 -44069 -263039 -187505 14392 -79307 141285 32887 137562 213709 92696 95761
577 95761 286990 -18035 -34492 -475262 -194332 -181181 -74084 -7367 42914 145588 -228168
566 -228168 -497440 -100484 707871 286018 252960 330174 5279 16953 264979 -69438
556 -69438 42091 -33591 -172787 -94166 -105512 220558 72536 144319 213558 218397 58992
545 58992 40137 -242947 -90129 -170034 -56708 47063 323024 133546 -37716 -73099 293634
534 293634 145498 -208266 -204516 66850 -139610 76460 106049 -180217 200486 1949
524 1949 -246552 -280064 122668 18943 -243358 -343488 168892 220851 75094 -11146 579927
513 579927 75524 199650 135380 71921 -62457 110247 66232 44114 212906 -251523 -53025
502 -53025 -156268 6875 3837 -225994 -160168 -80476 -248321 -319886 -63520 108336 -88393
491 -88393 129566 -171634 -297264 -22928 154962 -19043 -326444 -341003 -100483 -188586
481 -188586 -174990 287553 30889 -159470 -196501 -111211 2883 513158 381047 -84579
471 -84579 -189201 -62544 -12256 76936 -44135 123221 25193 150933 64294 90305 51388
460 51388 58653 -130210 -188164 109397 -270042 -289011 134497 -33491 -139881 -204222 -130284
449 -130284 343563 279703 353751 79216 -106046 -200312 36526 -32534 -64942 60650 111005
438 111005 -51622 310685 146463 -116077 -121844 -216007 -197275 -373453 -253933 110474 125992
427 125992 146712 147115 -97822 -199867 -237690 -40206 -29687 -169461 -167632 -180107 16149
416 16149 -195550 -257988 90748 264831 -263476 15661 283630 127961 168992 128246 92526
405 92526 -205352 -260187 -90902 38428 -360548 -342622 -188743 -122455 -220418 -94355 -121759
394 -121759 -89963 -359458 -238650 -29894 -18220 -196194 -240586 -198789 -225279 39484 -162274
383 -162274 -290869 -64344 77697 47358 -58725 -205054 -154061 -217034 -434938 -356829 -80836
372 -80836 -224348 -204607 -13306 -130592 -61317 -341343 -100685 -200324 -233035 133717 -55639
361 -55639 -45425 -110874 -246735 -327982 -73612 -47671 -202289 -111667 384952 153850 198287
350 198287 38052 -180108 35233 -197822 143657 77024 -28653 33357 49356 71810 77425
339 77425 160218 -59470 -179609 -276837 -72824 -207340 -115084 -48367 -191186 -383150 -278830
328 -278830 -215485 -276251 -234685 -198776 -100059 -249792 -282354 -55604 101069 -110341 181276
317 181276 23840 -153125 -243072 -231754 -91376 -153975 -37301 88544 -129641 -445891
307 -445891 -547753 -400649 -141221 -103342 74922 140381 58410 -13988 -404113 -296862 14664
296 14664 -177667 138256 -171775 -272679 -275592 -139373 -147250 -118625 133675 -348108 -108341
285 -108341 -66722 -293158 -251380 -280757 -50900 -179919 -87297 -208581 -444628 -221927 93692
274 93692 16346 333875 305694 55118 24193 8038 -117510 -277333 170279 97863 -47323
263 -47323 -214309 -37650 -76169 -99668 87059 -96001 -153419 -164778 -254923 -207536 -116001
252 -116001 -17591 -356789 -231422 58873 96548 54538 -296034 -145551 -307136 -276101 -332688
241 -332688 -406 117348 51955 -159848 -266471 -271460 -178465 -334542 -314511 -191256 -343964
230 -343964 -500586 -339926 -142566 -134890 -220336 -262226 84474 -238396 -142460 -89852 -25380
219 -25380 -60457 71603 7885 8424 -152139 -173126 -12628 63052 -113128 -152852 -121120 -43711
207 -43711 -205790 -322114 -201744 -224688 -24146 -4329 93918 -60465 -44000 -122317 -269441
196 -269441 -188474 -400632 674 -7994 -129599 -295384 -249501 -233357 -88343 19390 115581
185 115581 -194855 -243144 -85737 49558 -203354 -366946 -132510 -117373 -192937 -196722 -144403
174 -144403 -217414 -310439 -10033 -139049 -164919 -215337 -68577 -22730 -283327 91444 5667
163 5667 27457 118217 -77339 -126184 -387138 -289405 -209863 -404073 -215558 -288526 -215012
152 -215012 -35785 140624 138198 -7163 -94619 -130902 -24554 -127905 -109067 -49512 -16491
141 -16491 189577 -36948 -75359 65234 150830 -15920 -7362 -285511 21107 -192735 -279889
130 -279889 -241031 -104691 -159993 -118360 -133989 63780 63429 58900 71683 -346780 -54360 -66013
118 -66013 -274482 -173875 -128287 -51432 -137671 -347325 -145182 58153 -303906 -320532 -228227
107 -228227 -221749 -91277 -32590 -115672 -92968 -18620 -164292 -377813 -350656 -203497 -45999
96 -45999 96630 -109856 -86552 -91529 -311210 -154238 -122077 -215322 -113431 -93150 -65989
85 -65989 -252935 -274458 -55147 -199223 -329375 -299815 -122575 -224478 12770 92606 -210920
74 -210920 -345150 -91959 -124877 -170067 -27456 -61233 -54099 -317692 -138577 -412617 -297038
63 -297038 -134629 -225827 -106123 -78387 -102722 -41345 -116104 -53305 78243 27745 -282169
52 -282169 -231574 -247027 -185198 -130653 -93232 -174374 -143850 -36553 -135666 -141707 -226976 -122486
40 -122486 -15384 -104772 15589 -62308 -292525 -201984 -169655 -264437 -213474 -20504 -57143
29 -57143 -104091 -66570 146919 -299532 -237283 -20698 -151004 -135323 101486 7080 38825
18 38825 -99573 -207543 -175466 -220934 -115190 17528 -14845 -74156 -375696 -208527 -200066
7 -200066 -199633 -25359 -49044 -39123 -7493 -325810 -492326
0 -492326
##END=
