##TITLE=1H_BAU-j-29N
 CDCl3, 8 sc, 
 29.8.2019
##JCAMPDX= 6.0         $$ Bruker NMR JCAMP-DX V2.0
##DATA TYPE= NMR FID
##DATA CLASS= NTUPLES
##ORIGIN= UXNMR, Bruker Analytische Messtechnik GmbH
##OWNER= root
$$ XWIN-NMR		Version 3.5
$$ Thu Aug 29 14:05:11 2019 Russian Standard Time (UT+4h)  she@DPX200
##.OBSERVE FREQUENCY= 200.13155
##.OBSERVE NUCLEUS= ^1H
##.DELAY= (6, 6)
##.ACQUISITION MODE= SIMULTANEOUS
##.ACQUISITION SCHEME= undefined
##.AVERAGES= 8
##.DIGITISER RES= 18
##SPECTROMETER/DATA SYSTEM= spect
##.PULSE SEQUENCE= zg30
##.SOLVENT NAME= CDCl3
##.SHIFT REFERENCE= (INTERNAL, CDCl3, 0, 15.7039)
##AUDIT TRAIL= $$ (NUMBER, WHEN, WHO, WHERE, WHAT)
$$ ##TITLE= Audit trail, XWIN-NMR		Version 3.5
$$ ##JCAMPDX= 5.01
$$ ##ORIGIN= Bruker BioSpin GmbH
$$ ##OWNER= she
$$ F:/spectra/data/she/nmr/H-F/1/audita.txt
$$ ##AUDIT TRAIL=  $$ (NUMBER, WHEN, WHO, WHERE, WHAT)
(   1,<2019-08-29 14:04:12.10 +0400>,<she>,<DPX200>,
      <created by zg, POWCHK disabled, PULCHK disabled
       configuration hash MD5:
       00 E9 B6 7A A2 85 ED C7 34 08 36 98 17 FE 4E 26
       data hash MD5: 16K
       D9 B0 7D D0 EB 11 FB BD 64 09 F4 DF 96 7F DA B3>)
$$ ##END=
$$ 
$$ hash MD5
$$ 0C CE 23 A9 F6 FA 3E FA E3 42 DF 28 1F 6A 81 A3
##$RELAX= 
##$RELAX= 
##$RELAX= 
##$RELAX= 
##$RELAX= 
##$RELAX= 
$$ Bruker specific parameters
$$ --------------------------
##$DU= <F:/spectra>
##$EXPNO= 1
##$NAME= <H-F>
##$PROCNO= 1
##$TYPE= <nmr>
##$USER= <she>
##$AMP= (0..31)
100 100 100 100 100 100 100 100 100 100 100 100 100 100 100 100 100 100 
100 100 100 100 100 100 100 100 100 100 100 100 100 100 
##$AQSEQ= 0
##$AQ_mod= 1
##$AUNM= <au_zg>
##$AUTOPOS= <>
##$BF1= 200.13
##$BF2= 200.13
##$BF3= 200.13
##$BF4= 200.13
##$BF5= 200.13
##$BF6= 200.13
##$BF7= 200.13
##$BF8= 200.13
##$BYTORDA= 1
##$CFDGTYP= 0
##$CFRGTYP= 5
##$CHEMSTR= <none>
##$CNST= (0..31)
1 1 145 1 1 1 1 1 1 1 1 1 1 1 1 1 1 1 1 1 1 1 1 1 1 1 1 1 1 1 1 1 
##$CPDPRG= <>
##$CPDPRG1= <>
##$CPDPRG2= <>
##$CPDPRG3= <>
##$CPDPRG4= <mlev>
##$CPDPRG5= <mlev>
##$CPDPRG6= <mlev>
##$CPDPRG7= <mlev>
##$CPDPRG8= <mlev>
##$CPDPRGB= <>
##$CPDPRGT= <>
##$D= (0..31)
0 1.2 0 0 0 0 0 0 0 0 0 0.03 0 0 0 0 0 0 0 0 0 0 0 0 0 0 0 0 0 0 0 0 
##$DATE= 1567073051
##$DBL= (0..7)
120 120 120 120 120 120 120 120 
##$DBP= (0..7)
150 150 150 150 150 150 150 150 
##$DBP07= 0
##$DBPNAM0= <>
##$DBPNAM1= <>
##$DBPNAM2= <>
##$DBPNAM3= <>
##$DBPNAM4= <>
##$DBPNAM5= <>
##$DBPNAM6= <>
##$DBPNAM7= <>
##$DBPOAL= (0..7)
0.5 0.5 0.5 0.5 0.5 0.5 0.5 0.5 
##$DBPOFFS= (0..7)
0 0 0 0 0 0 0 0 
##$DE= 6
##$DECBNUC= <off>
##$DECIM= 24
##$DECNUC= <off>
##$DECSTAT= 4
##$DIGMOD= 1
##$DIGTYP= 9
##$DL= (0..7)
0 120 120 120 120 120 120 120 
##$DP= (0..7)
150 150 150 150 150 150 150 150 
##$DP07= 0
##$DPNAME0= <>
##$DPNAME1= <>
##$DPNAME2= <>
##$DPNAME3= <>
##$DPNAME4= <>
##$DPNAME5= <>
##$DPNAME6= <>
##$DPNAME7= <>
##$DPOAL= (0..7)
0.5 0.5 0.5 0.5 0.5 0.5 0.5 0.5 
##$DPOFFS= (0..7)
0 0 0 0 0 0 0 0 
##$DQDMODE= 0
##$DR= 18
##$DS= 0
##$DSLIST= <SSSSSSSSSSSSSSS>
##$DSPFIRM= 0
$$ [...]
##$SUBNAM2= <"">
##$SUBNAM3= <"">
##$SUBNAM4= <"">
##$SUBNAM5= <"">
##$SUBNAM6= <"">
##$SUBNAM7= <"">
##$SUBNAM8= <"">
##$SUBNAM9= <"">
##$SW= 24.9336996594482
##$SWIBOX= (0..15)
0 0 2 0 0 0 0 0 0 0 0 0 0 0 0 0 
##$SW_h= 4990.01996007984
##$TD= 16384
##$TD0= 1
##$TE= 0
##$TE2= 300
##$TE3= 300
##$TEG= 300
##$TL= (0..7)
0 120 120 120 120 120 120 120 
##$TP= (0..7)
150 150 150 150 150 150 150 150 
##$TP07= 0
##$TPNAME0= <>
##$TPNAME1= <>
##$TPNAME2= <>
##$TPNAME3= <>
##$TPNAME4= <>
##$TPNAME5= <>
##$TPNAME6= <>
##$TPNAME7= <>
##$TPOAL= (0..7)
0.5 0.5 0.5 0.5 0.5 0.5 0.5 0.5 
##$TPOFFS= (0..7)
0 0 0 0 0 0 0 0 
##$TUNHIN= 0
##$TUNHOUT= 0
##$TUNXOUT= 0
##$USERA1= <user>
##$USERA2= <user>
##$USERA3= <user>
##$USERA4= <user>
##$USERA5= <user>
##$V9= 5
##$VALIST= <valist>
##$VCLIST= <CCCCCCCCCCCCCCC>
##$VD= 0
##$VDLIST= <DDDDDDDDDDDDDDD>
##$VPLIST= <PPPPPPPPPPPPPPP>
##$VTLIST= <TTTTTTTTTTTTTTT>
##$WBST= 1024
##$WBSW= 4
##$XGAIN= (0..3)
0 0 0 0 
##$XL= 0
##$YL= 0
##$YMAX_a= 94612
##$YMIN_a= -86769
##$ZGOPTNS= <>
##$ZL1= 120
##$ZL2= 120
##$ZL3= 120
##$ZL4= 120
##$ABSF1= 10
##$ABSF2= 0
##$ABSG= 5
##$ABSL= 3
##$ALPHA= 0
##$AQORDER= 0
##$ASSFAC= 0
##$ASSFACI= 0
##$ASSFACX= 0
##$ASSWID= 0
##$AUNMP= <proc_1d>
##$AZFE= 0.1
##$AZFW= 0.1
##$BCFW= 1
##$BC_mod= 2
##$BYTORDP= 1
##$COROFFS= 0
##$CY= 11.3945322036743
##$DATMOD= 1
##$DC= 2
##$DFILT= <>
##$DTYPP= 0
##$F1P= 20.1720416913024
##$F2P= 0.152960286110954
##$FCOR= 0.5
##$FTSIZE= 0
##$FT_mod= 4
##$GAMMA= 1
##$GB= 0.15
##$INTBC= 1
##$INTSCL= 1
##$ISEN= 128
##$LB= 0.24
##$LEV0= 0
##$LPBIN= 0
##$MAXI= 10000
##$MC2= 0
##$MEAN= 0
##$ME_mod= 0
##$MI= 1.114404
##$NCOEF= 0
##$NC_proc= 0
##$NLEV= 6
##$NOISF1= 3.799351
##$NOISF2= 2.8
##$NSP= 1
##$NTH_PI= 0
##$NZP= 0
##$OFFSET= 15.70392
##$PC= 1
##$PHC0= -9226.494
##$PHC1= 40.40096
##$PH_mod= 1
##$PKNL= yes
##$PPARMOD= 0
##$PSCAL= 0
##$PSIGN= 0
##$REVERSE= no
##$SF= 200.130013532006
##$SI= 16384
##$SIGF1= 3
##$SIGF2= 2
##$SINO= 400
##$SIOLD= 16384
##$SREGLST= <1H.CDCl3>
##$SSB= 0
##$STSI= 0
##$STSR= 0
##$SW_p= 3612.71676300578
##$SYMM= 0
##$S_DEV= 0
##$TDeff= 0
##$TDoff= 0
##$TI= <>
##$TILT= no
##$TM1= 0
##$TM2= 0
##$TOPLEV= 0
##$USERP1= <user>
##$USERP2= <user>
##$USERP3= <user>
##$USERP4= <user>
##$USERP5= <user>
##$WDW= 1
##$XDIM= 8192
##$YMAX_p= 0
##$YMIN_p= 0
$$ End of Bruker specific parameters
$$ ---------------------------------
##NTUPLES= NMR FID
##VAR_NAME=  TIME,          FID/REAL,        FID/IMAG
##SYMBOL=    X,             R,               I
##VAR_TYPE=  INDEPENDENT,   DEPENDENT,       DEPENDENT
##VAR_FORM=  AFFN,          ASDF,            ASDF
##VAR_DIM=   8192,          8192,            8192
##UNITS=     SECONDS,       ARBITRARY UNITS, ARBITRARY UNITS
##FACTOR=    0.0002004,     1,               1
##FIRST=     0,             0,               0
##LAST=      1.6414764,     0,               0
##MIN=       0,             -86769,          0
##MAX=       1.6414764,     94612,           0
$$ Real data points
##PAGE= N=1
##DATA TABLE= (X++(R..R)), XYDATA
$$ plain form
0 0 0 0 0 0 0 0 0 0 8 -8 8 -8 8 -16 16 -17 24 -29 32 -40 48 -55 63 -72 81 -95 107 -122 138 -158 176 -199
32 -199 223 -250 278 -309 345 -384 426 -471 523 -579 641 -710 786 -873 969 -1080 1204 -1351
50 -1351 1525 -1734 1987 -2306 2723 -3293 4122 -5447 7913 -14130 67066 86261 15529 74181
64 74181 94612 64719 34778 63964 65362 40985 33038 55961 44747 22011 27041 47167 30248
77 30248 8320 16895 36260 21278 2667 7795 18961 10945 5471 9215 7980 -3655 -3322 8091
91 8091 9939 -3342 -10308 -1494 5347 -2382 -9535 -3314 3024 -4941 -11637 -3640 2610 -4744 -9853
106 -9853 -2661 82 -8293 -9942 1515 4243 -8953 -13876 -2112 3135 -5706 -7658 -1772 -5695
120 -5695 -12843 -5218 2986 -6161 -15920 -8534 -715 -9150 -15763 -7460 -2869 -11405 -16680 -9895 -5382
$$ packed form
0@%%%%%%%%Qj6J6j6J6k4L2l3M1n3O1p2Q8j03J18j35J53j76K02k29K60k96L34l75
32a99M22m73N28n87O54p29Q10q97R94j102J220j351J496j659J842k049K284k555
50a351K876l259L721m293N029o016P415r569J3360k2043Q1196J9195p0732N8652
64G4181K0431k9893k9941K9186J398k4377p947K2923j1214k2736N030K0126j6919
77C0248k1928Q575J9365j4982j8611N128J1166q016n474L744j235j1635L33J1413
91H091J848j3281o966Q814O841p729p153O221O338p965o696P997O250p354n109
106i853P192K743q375j649J1457K728j3196m923J1764N247q841j952N886l923
120e695p148P625Q204r147r759P386P819q435o613Q303M591q536n275O785M513
$$ plain form
135 -5382 -10650 -12612 -8503 -10096 -15381 -11234 -2682 -6079 -14734 -13335 -4940 -3556 -7225 -7313 -4342 -4358
151 -4358 -5238 -3848 -101 744 -1001 -893 1310 1703 1749 5195 7422 3646 792 4503 10023 8643 5113
168 5113 5485 7206 6516 5416 8755 9896 5235 2358 5672 8133 5007 3740 5939 4400 -588 572
184 572 5129 4323 -1051 -1802 529 -808 -2230 -732 1349 -2939 -6564 -4198 -294 -1451 -4082 -3489
200 -3489 -3512 -5293 -4035 -224 -209 -3859 -4404 -1517 -167 -1460 -374 1408 154 -2075 -301 3454
216 3454 3657 2036 1939 2322 1718 2302 5401 6182 2296 569 3294 5094 3301 2822 3781 2483 183
233 183 1254 3324 2587 7 -735 -576 -1647 -1642 360 -119 -3856 -5760 -3464 -2123 -3194 -4225 -3786
250 -3786 -5258 -6872 -5449 -2548 -3235 -5702 -5751 -5018 -4483 -3673 -1932 -2293 -4210 -4643 -2592 -199 110
$$ packed form
135e382n268j962M109j593n285M147Q552l397q655J399Q395J384l669q8K971j6
151d358q80J390L747Q45j745J08K203L93M6L446K227l776k854L711N520j380l530
168E113L72J721o90j100L339J141m661k877L314K461l126j267K199j539m988J160
184E72M557q06n374p51K331j337j422J498K081m288l625K366L904j157k631N93
200c489k3j781J258L811J5l650n45K887J350j293J086J782j254k229J774L755
216C454K03j621r7L83o04N84L099P81l886j727K725J800j793m79R59j298k300
233A83J071K070p37k580p42J59j071NK002m79l737j904K296J341j071j031M39
250c786j472j614J423K901o87k467m9P33N35Q10J741l61j917m33K051K393L09
$$ plain form
267 110 -577 -345 -468 -761 1017 3549 3356 1718 936 2538 3990 4355 5278 5042 3010 2638 4548 5883
285 5883 5860 3990 3055 3574 3663 3706 4288 4548 2273 79 1324 2570 1909 1212 425 -826 -1769 -1567 591
304 591 103 -2246 -3567 -2560 -1671 -2511 -2223 -1400 -2399 -4826 -3241 -475 -635 -2219 -2322 -1768 -2280 -1736
322 -1736 660 1349 -1124 -1728 -78 1810 2158 1518 2144 1726 407 1177 3936 4798 2297 1577 2262 2887
340 2887 2388 3585 3619 1995 659 1313 2668 2581 1687 401 274 -523 -1432 387 1634 -1175 -3523 -2482
358 -2482 -1136 -1672 -2155 -1827 -2907 -4573 -3865 -2199 -1880 -3006 -3908 -3588 -3232 -3290 -2497 -979 -1829 -3775
376 -3775 -3292 -104 456 -722 -497 -318 -753 -547 1761 2764 1518 246 1074 2383 2630 2720 3350 3175
394 3175 1300 1138 3745 4536 2824 1770 2187 1858 1487 2546 3241 1683 -213 -100 933 1498 732
$$ packed form
267A10o87K32j23k93J778K532j93j638p82J602J452L65R23k36k032l72J910J335
285E883k3j870r35N19Q9M3N82K60k275k194J245J246o61o97p87j251r43K02K158
304E91m88k349j321J007Q89q40K88Q23r99k427J585K766j60j584j03N54n12N44
322a736K396O89k473o04J650J888L48o40O26m18j319P70K759Q62k501p20O85O25
340B887m99J197L4j624j336O54J355q7q94j286j27p97r09J819J247k809k348J041
358b482J346n36m83L28j080j666P08J666L19j126r02L20L56n8P93J518q50j946
376c775M83L188N60j178K25J79m35K06K308J003j246j272Q28J309K47R0O30j75
394C175j875j62K607P91j712j054M17l29l71J059O95j558j896J13J033N65p66
$$ plain form
411 732 -186 -644 -1901 -2468 -869 673 -874 -3039 -2807 -1825 -2555 -1889 -683 -1666 -3462 -3568 -1615 -783
429 -783 -1524 -1786 -1703 -1569 -1887 -488 989 178 -1696 -1313 661 1626 1284 1702 1733 570 763 2500 3297
448 3297 2446 1750 1465 2003 2361 2464 3202 3060 1211 201 1844 2646 1632 894 935 149 -789 429 1415
467 1415 98 -1695 -1733 -1275 -578 -1198 -1361 -1499 -2379 -3655 -1976 -775 -1540 -2857 -2909 -2499 -2509 -2252 -822
486 -822 -1069 -2319 -2911 -1403 -27 -143 -424 -294 -609 -926 286 2065 1927 316 47 1397 1745 1948
504 1948 2646 2402 1312 685 2081 3012 2415 1538 1456 1239 1125 1499 2067 1848 375 -386 -6 1079 366
523 366 265 237 -924 -1753 -1127 343 -566 -1685 -2212 -1631 -1785 -1941 -877 -971 -2177 -3285 -2317 -859 -711
542 -711 -1578 -1306 -1599 -1819 -1301 225 298 -778 -836 -228 724 616 1296 1562 715 -374 837 2745 2411
$$ packed form
411G32r18m58j257n67J599J542j547k165K32R82p30O66J206r83j796j06J953Q32
429g83p41k62Q3J34l18J399J477q11j874L83J974R65l42M18L1j163J93J737P97
448C297q51o96k85N38L58J03P38j42j849j010J643Q02j014p38M1p86r38J218R86
467A415j317j793l8M58O97o20j63j38q80j276J679J201p65j317n2M10j0K57J430
486h22k47j250n92J508J376j16k81J30l15l17J212J779j38j611k69J350L48K03
504A948O98k44j090o27J396R31n97q77q2k17j14L74N68k19j473p61L80J085p13
523C66j01k8j161q29O26J470r09j119n27N81j54j56J064r4j206j108R68J458J48
542g11q67K72k93k20N18J526P3j076n8O08R52j08O80K66q47j089J211J908l34
$$ plain form
561 2411 1350 1283 1552 1703 1742 1979 2705 1156 217 1187 1630 2163 1561 1371 627 -397 -180 964 1082
580 1082 -589 -1216 -968 -557 -833 -808 -311 -1338 -2592 -2043 -862 -652 -1821 -1838 -1682 -2072 -1948 -703 -152
599 -152 -1549 -2384 -1390 -403 -272 -566 37 -443 -1271 -438 1079 1465 660 290 642 882 1000 1607 2200 1016
619 1016 468 1184 2190 2121 1732 1629 1139 921 674 1669 2006 799 -223 266 791 294 602 840 -237
638 -237 -1147 -1099 -197 107 -770 -1431 -1409 -1484 -1533 -1018 -217 -1246 -2566 -1892 -907 -486 -1193 -1012 -1114 -1513 -1455
659 -1455 -231 249 -222 -676 -455 -83 256 636 1071 1051 -213 153 1483 2201 1421 926 1319 935 1052
678 1052 1899 2192 1178 438 765 928 1507 1159 775 769 189 -38 498 1416 78 -933 -667 -536 -824 -433
698 -433 1 -691 -2053 -1719 -1038 -994 -900 -1038 -1640 -1541 -1499 -911 -366 -753 -1562 -1622 -952 -442 -538 -138 179 -724
$$ packed form
561B411j061o7K69J51L9K37P26j549r39R70M43N33o02j90p44j024K17J144J18
580A082j671o27K48M11k76K5M97j027j254N49J181K10j169j7J56l90J24J245N51
599a52j397q35R94R87J31k94O03m80q28Q33J517L86q05l70L52K40J18O07N93j184
619A016n48P16J006o9l89j03m90k18k47R95L37j207j022M89N25m97L08K38j077
638b37r10M8R02L04q77o61K2p5m9N15Q01j029j320O74R85M21p07J81j02l99N8
659a455J224M80m71m54K21L72L39L80M35k0j264L66J330P18p80m95L93l84J17
678A052Q47K93j014p40L27J63N79l48l84on80k27N36R18j338j011K66J31k88L91
698d33M34o92j362L34O81M4R4j38o02R9M2N88N45l87q09o0O70N10r6M00L17r03
$$ plain form
720 -724 -705 465 820 608 368 -9 586 790 861 1654 1443 444 444 1385 2008 969 1463 1386 910 464 1404
741 1404 1543 978 -12 360 603 288 356 416 155 -675 -1131 -270 92 -638 -940 -1011 -1341 -1611 -775 -202 -863
762 -863 -1750 -1579 -1123 -928 -724 -832 -1176 -1148 -1270 -936 123 155 -427 -803 -197 -62 35 1015 841 22 -33
783 -33 594 1320 1416 960 845 822 592 563 1706 1633 638 295 564 957 1211 1188 1375 131 -199 813 870 479
805 479 -80 -686 -190 -318 -372 28 -171 -937 -1328 -891 132 -663 -623 -785 -1247 -1854 -1093 -92 -229 -1318
825 -1318 -940 -875 -612 -164 192 -64 -571 -521 -235 538 579 373 -247 142 258 571 981 1187 448 317 636
846 636 1218 1462 1160 1087 501 383 303 949 1570 554 144 454 310 612 468 508 -147 -554 -540 142 51 -747
868 -747 -304 -877 -972 -823 -656 -355 -962 -1262 -1288 -655 -443 -519 -508 -1051 -1332 -626 -62 187 -116 -807 -257 -280
$$ packed form
720g24J9J170L55k12k40l77N95K04P1P93k11r99%R41O23j039M94p7m76m46R40
741A404J39n65r90L72K43l15O8O0k61q30m56Q61L62p30l02p1l30k70Q36N73o61
762h63q87J71M56J95K04j08l44K8j22L34J059L2n82l76O06J35R7R80j74q19n5
783c3O27P26R6m56j15k3k30k9J143p3r95l43K69L93K54k3J87j244l30J012N7l91
805D79n59o06M96j28n4M00j99p66l91M37J023p95M0j62m62o07P61J001j37j089
825a318L78O5K63M48L56k56n07N0K86P73M1k06o20L89J16L13M10K06p39j31L19
846F36N82K44l02p3n86j18q0O46O21j016m10L10j44L02j44M0o55m07J4O82r1p98
868g47M43n73r5J49J67L01o07l00k6O33K12p6J1n43k81P06N64K49l03o91N50k3
$$ plain form
890 -280 150 399 851 247 28 303 590 1171 982 742 774 420 320 890 1240 789 126 513 836 1027 821
911 821 870 800 114 158 561 709 455 -222 11 -221 -396 46 89 -810 -1201 -1167 -499 -435 -493 -615 -758 -1227 -1232
934 -1232 -367 -326 -560 -1113 -877 -725 -705 -119 208 -234 -607 -430 -12 523 438 21 429 43 403 891 1336
955 1336 745 160 476 801 851 998 1223 853 87 622 944 927 821 423 55 59 379 357 677 173 -397 -454
977 -454 279 2 32 -571 -378 -785 -1104 -620 -330 -329 -1138 -806 -637 -446 -769 -611 -421 -990 -1009 -274 -316 -187
999 -187 -52 -258 -543 -185 189 431 380 0 -182 466 696 742 536 579 124 4 954 1231 1076 649 222
1020 222 723 479 533 788 571 46 -127 290 736 606 210 162 189 -547 -244 78 -298 -707 -746 -350 -181
1041 -181 -344 -373 -411 -814 -833 -538 -37 -292 -798 -847 -764 -361 -573 274 -124 -777 -459 -167 488 85 -20 124
$$ packed form
890b80M30K49M52o04k19K75K87N81j89k40L2l54j00N70L50m51o63L87L23J91k06
911H21M9p0o86M4M03J48k54o77K33k32j75M42M3q99l91L4O68O4n8j22j43m69n
934a232Q65M1k34n53K36J52K0N86L27m42l73J77M18N35q5m17M08l86L60M88M45
955A336n91n85L16L25N0J47K25l70p66N35L22j7j06l98l68ML20k2L20n04n70n7
977d54P33k77L0o03J93m07l19M84K90Jq09L32J69J91l23J58J90n69j9P35m2J29
999a87J35k06k85L58L74K42n1l80j82O48K30M6k06M3m55j20R50K77j55m27m27
1020B22N01k44N4K55k17n25j73M17M46j30l96m8K7p36L03L22l76m09l9L96J69
1041a81j63k9l8m03j9K95N01k55n06m9Q3M03k12Q47l98o53L18K92O55m03j05J44
$$ plain form
1063 124 -269 -106 285 752 772 425 237 549 544 628 861 815 509 -2 544 759 644 432 54 -42 55 132 629
1086 629 162 -87 -697 -437 31 50 -202 -188 -509 -666 -561 -10 -613 -369 -647 -562 -526 20 -165 -258 -710 -776
1108 -776 -528 -302 -279 -584 -251 -214 -578 -219 618 809 90 -124 378 161 499 400 521 59 61 273 914 648
1130 648 274 306 189 312 604 915 620 17 11 -18 282 491 402 -48 -186 -470 -333 183 181 -282 -1109 -423
1152 -423 -271 -189 165 -345 -658 -826 -722 -309 -205 -276 -38 -428 -562 -473 244 -82 44 -556 -117 209 245
1173 245 199 23 -28 -353 251 703 755 269 113 109 365 670 856 530 513 51 482 534 720 453 -184 185
1195 185 99 450 384 436 181 -70 161 1 -101 74 88 -315 -504 -499 -187 -199 -376 -580 -472 -631 -741 -199
1217 -199 -543 -269 -925 -570 -306 111 -130 -253 -152 -286 -334 -115 208 114 -173 27 58 345 274 577 310
$$ packed form
1063A24l93J63L91M67K0l47j88L12nQ4K33m6l06n11N46K15j15k12l78r6R7P7M97
1086F29m67k49o10K60M68J9k52J4l21j57J05N51o03K44k78Q5L6N46j85r3m52o6
1108g76K48K26K3l05L33L7l64L59Q37J91p19k14N02k17L38r9J21m62KK12O41k66
1130F48l74L2j17J23K92L11k95o03ok9L00K09q9m50j38k84J37N16km63q27O86
1152d23J52Q2L54n10l13j68J04M13J04p1K38l90j34Q9P17l26J26o00M39L26L6
1173B45m6j76n1l25O04M52N2m86j56mK56L05J86l26j7m62M31N2J86k67o37L69
1195A85q6L51o6N2k55k51K31j60j02J75J4m03j89NL12j2j77k04J08j59j10N42
1217a99l44K74o56L55K64M17k41j23J01j34m8K19L23r4k87K00L1K87p1L03k67
$$ plain form
1238 310 169 32 779 422 267 372 173 218 462 655 454 373 -41 -17 392 221 359 57 248 -216 -562
1259 -562 137 -96 -210 -618 -112 -387 -271 -261 -121 -415 -764 -295 -355 -72 -397 -376 -443 -578 -539 -157 182 -41
1281 -41 -83 -619 -42 242 -65 317 60 -102 -210 -14 43 199 494 234 -58 292 553 364 329 33 331
1302 331 413 113 460 352 125 -4 89 436 164 -16 32 137 83 -65 -22 -3 14 -440 -518 -397 61 -32 -495
1325 -495 -437 -505 -515 -537 -202 -142 -282 -236 -300 -305 -186 -137 -155 -319 -383 150 216 -108 -358 -181 269 -106 590 238
1349 238 346 2 -118 536 725 466 414 108 -46 230 366 510 142 88 -144 -18 209 379 341 23 -352
1370 -352 -240 103 240 94 -16 -216 -444 -243 -118 65 -333 -601 -296 -320 121 2 -609 -417 -439 -555 -459
1391 -459 265 269 -323 -107 -175 -186 173 139 301 -374 -8 179 285 307 36 -95 259 -39 107 414 546 6
$$ packed form
1238C10j41j37P47l57j55J05j99M5K44J93k01q1m14K4M09j71J38l02J91m64l46
1259e62O99k33j14m08N06k75J16J0J40k94l49M69o0K83l25K1o7j35L9L82L39k23
1281d1m2n36N77K84l07L82k57j62j08J96N7J56K95k60k92L50K61j89l5k96K98
1302C31Q2l00L47j08k27j29R3L47k72j80M8J05n4j48M3J9J7m54p8J21M58r3m63
1325d95N8o8j0k2L35O0j40M6o4nJ19M9j8j64o4N33O6l24k50J77M50l75O96l52
1349B38J08l44j20O54J89k59n2l06j54K76J36J44l68n4k32J26K27J70l8l18l75
1370c52J12L43J37j46j10k00k28K01J25J83l98k68L05k4M41j19o11J92k2j16R6
1391d59P24Mn92K16o8j1L59l4J62o75L66J87J06K2k71j31L54k98J46L07J32n40
$$ plain form
1413 6 -25 242 537 374 606 307 -287 67 103 604 351 222 -121 -113 226 -102 69 182 -132 -408 -136 -164
1435 -164 -482 -55 -137 -497 -450 -144 -66 26 -231 -750 -538 0 113 -119 24 136 -212 -131 87 279 10 26
1457 26 51 -95 -1 505 -49 25 40 -198 532 603 100 28 345 167 115 152 390 -68 44 62 44 496 250 252
1481 252 -88 -54 -81 308 -36 -4 42 -289 -235 -455 25 24 -406 -499 -402 -150 -209 -108 -166 -40 -248 -293 -148 241
1505 241 70 -91 -180 -151 200 -68 -71 305 -79 -240 288 52 31 355 441 217 401 412 416 209 112 229 282 345
1529 345 95 261 193 40 -156 236 347 -159 78 188 26 -20 130 -21 -301 -365 -549 -357 127 -236 -59
1550 -59 -254 -404 -273 -37 87 -474 -365 1 -101 -108 142 120 -221 -114 -304 -30 143 -177 97 135 -82 20
1572 20 24 532 299 37 50 246 221 189 404 61 65 -347 456 141 521 311 -202 14 -123 55 295 297 424
$$ packed form
1413Fl1K67K95j63K32k99n94L54L6N01k53j29l43QL39l28J71J13l14k76K72k8
1435a64l18M27q2l60M7L06P8R2k57n19K12N38J13k32J43J12l48Q1K18J92k69J6
1457B6K5j46R4N06n54P4J5k38P30P1n03p2L17j78n2L7K38m58J12J8j8M52k46K
1481B52l40L4k7L89l44L2M6l31N4k20M80jm30r3R7K52n9J01n8J26k08m5J45L89
1505B41j71j61q9K9L51k68lL76l84j61N28k36k1L24Q6k24J84J1Mk07r7J17N3O3
1529C45k50J66o8j53j96L92J11n06K37J10j62m6J50j51k80o4j84J92M84l63J77
1550e9j95j50J31K36J24n61J09L66j02pK50k2l41J07j90K74J73l20K74L8k17J02
1572B0MN08k33k62J3J96k5l2K15l43Mm12Q03l15L80k10n13K16j37J78K40KJ27
$$ plain form
1595 424 -428 14 392 -32 42 -43 -260 -186 66 345 -70 -95 -497 -195 -166 -49 -98 -611 -44 -481 -189 218
1617 218 177 -35 -88 -25 261 124 -45 -115 -484 6 63 163 101 87 47 130 65 70 123 271 -234 -3 383 214
1641 214 403 132 172 -61 176 105 88 10 167 61 -24 -193 85 195 -136 -312 -439 -521 38 64 -41 -206
1663 -206 -22 -239 -118 -36 117 -119 -174 -351 -275 -93 -58 -207 -256 -334 -124 -212 32 -107 -80 -115 25 -93 222
1686 222 67 124 375 -86 299 153 430 113 69 119 322 397 286 166 93 -89 -70 -191 243 293 -90 -277
1708 -277 -81 -264 292 50 13 -236 -212 -136 36 -140 -303 -213 -149 -15 48 36 15 -248 -211 -102 -82 -446 -273
1731 -273 1 -20 -178 -118 327 160 -75 -580 -46 102 239 -71 65 136 204 -236 440 201 322 87 148 183
1753 183 276 614 -189 -50 7 -267 19 310 310 266 -158 216 -20 -183 188 -192 -142 47 -54 -95 -77 -10 -127
$$ packed form
1595D24q52M42L78m24P4q5k17P4K52K79m15k5m02L02K9J17m9n13N67m37K92M07
1617B18m1k12n3O3K86j37j69p0l69M90N7J00o2j4m0Q3o5NN3J48n05K31L86j69
1641B14J89k71M0k33K37p1j7p8J57j06q5j69K78J10l31j76j27q2N59K6j05j65
1663b06J84k17J21Q2J53k36n5j77P6J82L5j49m9p8K10q8K44j39K7l5J40j18L15
1686B22j55N7K51m61L85j46K77l17m4N0K03P5j11j20p3j82J9j21M34N0l83j87
1708b77J96j83N56k42l7k49K4P6J72j76j63R0O4J34O3j2k1k63L7J09K0l64J73
1731b73K74k1j58O0M45j67k35n05N34J48J37l10J36P1O8m40O76k39J21k35O1L5
1753A83R3L38q03J39N7k74K86K91%m4m24L74k36j63L71l80N0J89j01m1J8O7j17
$$ plain form
1776 -127 -516 -275 -220 -294 -100 18 -126 4 -275 111 145 -159 -267 -232 -23 -142 4 105 233 3 234
1797 234 383 275 -12 -244 88 170 148 277 69 -110 215 45 -64 150 -33 102 -214 72 -125 69 58
1818 58 190 -159 84 9 54 13 -24 -196 -209 31 -143 134 54 -56 -348 84 5 -1 -249 13 -328 -164 -115 -150
1842 -150 -20 -28 167 9 -170 -117 110 444 -124 -298 69 311 -87 305 112 6 -135 50 254 490 146
1863 146 -318 33 -244 215 339 65 144 32 241 231 -17 -19 -97 -61 325 -5 -56 -39 -25 254 -336 -126 -184
1886 -184 -104 -57 -92 -181 116 -116 -166 -263 -75 22 -191 -22 295 -71 -26 -227 22 123 20 -237 -72 -82 -119
1909 -119 308 343 63 -223 157 22 1 -130 -102 1 -126 143 209 112 -26 191 145 37 181 -84 129 108
1931 108 -109 -142 71 33 -225 -49 -31 -70 -28 -16 18 109 179 153 -285 -218 -101 -72 35 -310 -114 -84 258 -220
$$ packed form
1776a27l89K41N5p4J94J18j44J30k79L86L4l04j08L5K09j19J46J01J28k30K31
1797B34J49j08k87k32L32Q2k2J29k08j79L25j70j09K14j83J35l16K86j97J94j1
1818E8J32l49K43p5M5m1l7j72j3K40j74K77q0j10k92M32p9ok48K62l41J64M9l5
1842a50J30qJ95j58j79N3K27L34n68j74L67K42l98L92j93j06j41J85K04K36l44
1863A46m64L51k77M59J24k74P9j12K09j0k48kp8L6L86l30n1J7J4K79n90K10n8
1886a84Q0M7l5q9K97k32n0r7J88R7k13J69L17l66M5k01K49J01j03k57J65j0l7
1909a19M27L5k80k86L80j35k1j31K8J03j27K69O6r7j38K17m6j08J44k65K13k1
1931A08k17l3K13l8k58J76J8l9M2J2L4R1P0k6m38O7J17K9J07l45J96L0L42m78
$$ plain form
1955 -220 176 -9 -169 -141 96 20 154 -193 3 -49 229 -11 77 -56 -30 232 -112 202 376 62 130 121 13
1978 13 238 131 122 -31 -122 -32 269 34 -6 -51 -271 -116 -31 92 -135 -32 305 -164 -110 -33 -387 24 -217
2001 -217 -121 -70 100 -131 27 -111 -100 -216 -108 -65 -79 -217 -91 -98 170 12 -218 197 -111 -157 107 280 10
2024 10 -219 -66 124 283 204 274 162 222 -150 285 98 312 230 -125 -147 77 -253 -6 253 73 -144 -378
2046 -378 -190 293 -29 276 97 -137 -32 -113 -124 -107 396 -89 -225 -499 205 -14 -318 -242 -138 43 -92
2067 -92 -4 56 -431 155 -19 246 82 -79 -277 -4 -42 -47 117 -83 136 272 -52 86 231 135 -13 136
2089 136 -79 -290 23 80 201 190 1 42 31 -331 69 26 -42 -97 252 -53 116 70 23 -230 -208 6 -527
2112 -527 -181 68 -327 -157 77 -225 -56 -21 93 -154 -327 -326 -159 -540 -85 -96 -109 -83 -94 -227 155 -103
$$ packed form
1955b20L96j85j60K8K37p6J34l47J96n2K78k40Q8j33K6K62l44L14J74l14O8rj08
1978A3K25j07rj53r1R0L01k35m0m5k20J55Q5J23k27J03L37m69N4P7l54M11k41
2001b17R6N1J70k31J58j38J1j16J08M3j4j38J26pK68j58k30M15l08m6K64J73k70
2024A0k29J53J90J59p9P0j12O0l72M35j87K14q2l55k2K24l30K47K59j80k17k34
2046c78J88M83l22L05j79k34J05q1j1J7N03m85j36k74P04k19l04P6J04J81j35
2067i2Q8O0m87N86j74K65j64j61j98K73l8nJ64k00K19J36l24J38J45r6j48J49
2089A36k15k11L13N7J21j1j89M1j1l62M00m3o8n5L49l05J69m6m7k53K2K14n33
2112e27L46K49l95J70K34l02J69L5J14k47j73JJ67l81M55j1j3K6j1j33L82k58
$$ plain form
2134 -103 176 211 -183 -49 167 -150 134 15 -71 236 9 -113 -105 59 -48 -64 203 -73 200 155 -188 161
2156 161 -204 83 281 -269 -217 -169 -29 -484 -99 -119 -41 119 -158 -312 -6 -268 203 21 -135 -492 71
2177 71 -251 137 -149 -180 -45 121 -185 -237 -30 -107 -49 131 15 148 83 -282 -71 92 175 127 118 306 -121
2200 -121 66 -52 30 -96 60 254 5 -79 239 157 174 168 -184 1 -60 351 -113 13 236 46 -59 -247
2222 -247 199 11 -72 33 -317 -106 119 -44 -290 -48 -422 -92 -367 198 115 -79 -49 -111 -305 -127 75
2243 75 -47 9 -178 -6 106 -102 -33 -57 29 -90 -32 357 79 -4 -216 -72 41 153 90 -30 -122 -35 -211
2266 -211 -164 -44 43 -67 -77 168 -306 23 -94 -280 -90 -92 166 -44 112 -66 66 -162 -110 376 163 -135
2288 -135 -89 -103 79 255 265 -207 -208 -82 -47 -55 121 -107 172 -77 39 -33 131 86 120 38 303 -122 295 191
$$ packed form
2134a03K79L5l94J34K16l17K84j19q6L07k27j22QJ64j07j6K67k76K73m5l43L49
2156A61l65K87J98n50N2M8J40m55L85k0P8J60k77j54L06k62M71j82j56l57N63
2177G1l22L88k86l1J35J66l06n2K07p7N8J80j16J33o5l65K11J63Q3m8rJ88m27
2200a21J87j18Q2j26J56J94k49q4L18q2J7ol52J85o1M11m64J26K23j90j05j88
2222b47M46j88q3J05l50K11K25j63k46K42l74L30k75N65q3j94L0o2j94J78K02
2243G5j22N6j87J72J12k08O9k4Q6j19N8L89k78q3k12J44J13J12o3j20r2Q7j76
2266b11M7J20Q7j10j0K45m74L29j17j86J90kK58k10J56j78J32k28N2M86k13k98
2288a35M6j4J82J76J0m72jJ26L5qJ76k28K79k49J16p2J64m5L4q2K65m25M17j04
$$ plain form
2312 191 -167 -36 -217 -35 102 -102 206 -68 -20 -60 -81 294 -38 66 -12 -15 4 42 -227 -328 -215 85 -99
2335 -99 105 -177 -141 156 11 233 447 -43 180 -30 13 9 -53 108 -388 -144 -381 195 -79 293 69 -206
2357 -206 386 -254 23 -43 85 151 -59 -50 21 -528 31 -65 95 160 43 -155 130 -115 -97 61 -157 194 125
2380 125 -33 -359 -303 -8 174 -26 189 46 -113 13 17 44 -102 28 -93 112 -9 -172 238 -220 -193 0
2402 0 -317 -116 115 -105 -190 65 6 -89 -273 -189 146 -68 60 148 -137 -74 64 -103 -31 -64 117 392 273
2425 273 -166 -67 113 92 -145 -198 -91 53 18 246 108 48 218 93 -40 42 190 -219 -64 -139 -27 -139
2447 -139 102 -104 -99 219 -210 350 243 204 71 62 115 121 32 -29 57 -31 194 -217 -169 162 -80 -38 -58 265 -83
2472 -83 14 -206 -64 335 -81 -151 -16 219 -12 -189 163 191 -202 65 211 177 138 28 187 190 86 36 -113
$$ packed form
2312A91l58J31j81J82J37k04L08k74M8m0k1L75l32J04p8lJ9L8k69j01J13L00j84
2335i9K04k82L6K97j45K22K14m90K23k10M3mo2J61m96K44k37N76k74L72k24k75
2357b06N92o40K77o6J28O6k10RP1n49N59r6J60O5j17j98K85k45J8J58k18L51o9
2380A25j58l26N6K95J82k00K15j43j59J26MK7j46J30j21K05j21j63M10m58K7J93
2402@l17K01K31k20q5K55n9r5j84Q4L35k14J28Q8k85O3J38j67P2l3J81K75j19
2425B73m39R9J80k1k37n3J07J44l5K28j38o0J70j25j33Q2J48m09J55p5J12j12
2447a39K41k06NL18m29N60j07l9j33rN3Oq9o1Q6q8K25m11M8L31k42M2k0L23l48
2472h3R7k20J42L99m16p0J35K35k31j77L52K8l93K67J46l4l9j10J59Lj04n0j49
$$ plain form
2495 -113 166 43 -46 -14 -59 125 51 -130 -57 -53 -141 207 -356 -200 -150 44 -152 105 -177 15 48 67 -64 -28
2519 -28 37 -101 224 -117 -223 -318 251 -15 -32 -9 38 -279 61 -75 -81 -47 179 334 55 115 86 138 136 -182 -153
2544 -153 -211 192 1 -44 -25 83 -189 127 67 -50 54 -318 112 99 282 -26 137 -21 -56 149 41 -101
2566 -101 86 -166 -265 -153 -132 251 -48 66 30 -428 -49 -59 201 -19 -110 32 -143 -199 -74 78 -265 62
2588 62 137 -190 11 58 -95 -189 21 -138 -93 -297 132 117 -47 -35 121 66 -34 -23 16 -132 47 -94 71
2611 71 69 -357 -198 -129 393 238 -8 -78 -163 -179 66 68 -119 27 -129 -251 101 -298 172 -81 -312 -63 134
2634 134 -5 -159 -159 -100 -349 88 -152 -281 257 -337 -71 219 16 -216 -427 164 37 137 43 14 197 71
2656 71 387 89 316 -20 46 107 9 -31 138 -28 33 105 184 24 -48 96 -128 209 76 72 74 -171 148 -176
$$ packed form
2495a13K79j23q9L2m5J84p4j81P3Mq8L48n63J56N0J94j96K57k82J92L3J9j31L6
2519b8O5j38L25l41j06r5N69k66j7K3M7l17L40j36oL4K26J55k79O0k9N2kl18K9
2544a53n8M03j91m5J9J08k72L16o0j17J04l72M30j3J83l08J63j58l5K05j08j42
2566a01J87k52r9J12K1L83k99J14l6m58L79j0K60k20r1J42j75n6J25J52l43L27
2588F2P5l27K01M7j53r4K10j59M5k04M29j5j64J2J56n5j00J1L9j48J79j41J65
2611G1km26J59O9N22j55k46p0q5j6K45Kj87J46j56j22L52l99M70k53k31K49J97
2634A34j39j54%N9k49M37k40j29N38n94K66K90k03k32k11N91j27J00r4k9J83j26
2656G1L16k98K27l36O6O1r8m0J69j66O1P2P9j60p2J44k24L37j33mKk45L19l24
$$ plain form
2680 -176 -53 8 -83 -58 -306 -41 -41 -132 -19 -164 1 -16 -196 -32 -9 -144 -154 124 -188 -110 -189 127 -120 -53
2704 -53 -52 -69 187 -146 196 -339 -87 72 38 127 6 59 124 141 -77 -345 -300 69 175 516 279 31 100 100
2728 100 65 49 -135 148 -148 -70 -145 -19 -263 223 200 -22 -68 -188 97 52 94 -35 -281 -153 180 -83 67
2751 67 6 -73 14 393 1 70 107 232 -2 -62 -46 -269 167 -174 30 -248 144 118 -53 12 -201 -19 85
2774 85 -29 101 -7 143 -386 36 68 -129 187 -66 37 96 183 50 -188 -163 -162 -184 113 -34 -153 60 142
2797 142 -95 -245 -27 -3 164 -386 283 -145 -169 -65 180 -58 79 -61 47 -43 -202 95 -270 128 268
2818 268 479 201 255 -135 205 104 212 68 -89 -190 12 214 22 -95 8 -33 163 11 167 3 150
2839 150 -88 422 -230 34 -69 0 -50 -275 19 -19 112 147 -118 -149 258 184 -89 -31 -67 -80 40 45 -152 -122
$$ packed form
2680a76J23O1r1K5k48K65%r1J13j45J65j7j80J64K3j35j0K78l12P8p9L16k47O7
2704e3Jj7K56l33L42n35K52J59l4Q9j21N3O5J7k18k68M5L69J06L41k37k48O9%
2728A00l5j6j84K83k96P8p5J26k44M86k3k22m6j20K85m5M2j29k46J28L33k63J50
2751F7o1p9Q7L79l92O9L7J25k34o0J6k23M36l41K04k78L92k6j71O5k13J82J04
2774H5j14J30j08J50n29M22L2j97L16k53J03N9Q7j33k38K5Jk2K97j47j19K13Q2
2797A42k37j50K18K4J67n50O69m28k4J04K45k38J37j40J08r0j59K97l65L98J40
2818B68K11k78N4l90L40j01J08j44j57j01K02K02j92j17J03m1J96j52J56j64J47
2839A50k38N10o52K64j03O9n0k25K94l8J31L5k65l1M07p4k73N8l6j3J20Nj97L0
$$ plain form
2863 -122 -134 -508 -93 184 -7 -362 95 -61 -112 350 321 106 9 44 45 -92 217 0 -106 117 -34 -14 103
2886 103 0 29 69 151 -13 231 167 -94 -43 183 209 -168 48 -89 -140 56 -10 -16 -167 23 -220 -133 -319 99
2910 99 -418 329 41 341 -84 -331 -77 -172 -136 -179 0 134 113 237 -219 71 248 -179 -31 155 164 -95
2932 -95 254 -8 76 -85 -102 -27 -151 -144 252 -76 -248 29 -223 49 -271 89 222 227 -96 -283 48 269 -8
2955 -8 35 306 43 147 270 -119 24 111 251 -1 -237 -118 56 67 -89 117 137 106 -180 -52 -127 -117 101
2978 101 -13 211 14 -169 -112 -388 -189 -186 -47 -80 -225 -139 57 81 119 15 28 -5 121 -182 -102 -18 -108 43
3002 43 -124 194 43 -29 178 -201 -295 214 -130 -151 162 -24 -180 52 -63 -78 6 39 -193 3 -197 -82
3024 -82 -198 75 92 -169 118 90 -337 -21 -94 -110 -43 -242 60 -162 -103 0 168 178 -112 180 -120 185 -135
$$ packed form
2863a22j2l74M15K77j91l55M57j56n1M62k9k15r7L5Jj37L09k17j06K23j51K0J17
2886A03j03K9M0Q2j64K44o4k61N1K26K6l77K16j37n1J96o6oj51J90k43Q7j86M18
2910I9n17P47k88L00m25k47K54r5L6m3J79J34k1J24m56K90J77m27J48J86Rk59
2932i5L49k62Q4j61j7P5j24PL96l28j72K77k52K72l20L60J33Nl23j87L31K21k77
2955hM3K71k63J04J23l89J43Q7J40k52k36J19J74J1j56K06K0l1k86J28p5J0K18
2978A01j14K24j97j83N7k76J99LJ39l3j45Q6J96K4L8j04J3l3J26l03Q0Q4r0J51
3002D3j67L18j51p2K07l79r4N09l44k1L13j86j56K32j15j5Q4L3k32J96k00J15
3024h2j16K73J7k61K87k8m27L16p3j6O7j99L02k22N9J03J68J0k90K92l00L05l20
$$ plain form
3047 -135 104 127 -30 117 -131 -118 7 -81 184 30 124 160 234 134 238 313 -194 -81 -28 223 24 -81 301
3070 301 24 -36 -57 23 60 -133 -93 -8 368 27 -34 -150 35 45 -395 -130 -27 23 -332 -64 -27 30 59 93
3094 93 54 181 171 -75 -132 -109 21 75 -192 -142 48 130 -77 -19 -2 -215 -181 -75 56 -149 -66 -14 148 -383
3118 -383 3 268 31 -206 117 -53 17 -120 -97 -148 -377 231 69 160 33 -21 190 -53 69 97 -70 26
3140 26 136 -86 22 23 -152 74 93 18 -34 -338 -57 -95 -93 246 -204 199 109 137 7 158 -64 -53 -32 -118 -24
3165 -24 -224 -84 52 58 104 -7 -136 53 311 -34 -110 110 -182 217 -54 -200 -402 -161 166 239 -137 110
3187 110 45 -283 123 -157 -119 -115 87 -98 44 -82 -212 206 154 17 7 -74 103 -247 -91 73 -103 370
3209 370 -194 -107 -52 -44 214 66 131 244 -73 -112 52 345 103 67 -26 35 270 -118 341 118 -177 -247 -61
$$ packed form
3047a35K39K3j57J47k48J3J25q8K65j54R4L6P4j00J04P5n07J13N3K51j99j05L82
3070C01k77o0k1Q0L7j93M0Q5L76l41o1j16J85J0m40K65J03N0l55K68L7N7K9L4
3094I3l9J27j0k46n7K3J30N4k67N0J90Q2k07N8J7k13L4J06J31k05Q3N2J62n31
3118c83L86K65k37k37L23j70P0j37K3n1k29O08j62R1j27n4K11k43J22K8j67R6
3140B6J10k22J08Jj75K26J9p5n2l04K81l8KL39m50M03r0K8j30J51k22J1K1q6R4
3165b4k00J40J36OM6j11j29J89K58l45p6K20k92L99k71j46k02K41L27P3l76K47
3187A10o5l28M06k80L8MK02j85J42j26j30M18n2j37j0q1J77l50J56J64j76M73
3209C70n64Q7N5QK58j48O5J13l17l9J64K93k42l6r3O1K35l88M59k23k95p0J86
$$ plain form
3232 -61 26 -236 -41 -118 108 -181 253 44 6 108 -34 -124 -15 94 44 -251 -178 -207 194 -60 -9 -190 -85
3255 -85 -29 -105 55 28 -14 112 50 36 -108 -50 17 112 42 -30 -91 -1 128 -112 175 -171 -24 114 13 -91 16
3280 16 16 251 168 182 -71 63 -261 -8 10 85 -223 125 238 -289 -33 104 218 -72 225 206 -20 -60 -27
3303 -27 -24 130 102 -107 -62 142 36 57 -201 -46 -7 147 150 58 264 29 -111 -1 99 -250 335 -205 -8
3326 -8 -293 -103 29 -230 -84 13 9 -208 -143 -116 212 22 29 3 -152 -362 245 -47 100 -51 -166 -167 250 -134
3350 -134 -7 -113 -56 183 298 -26 -63 -251 63 -24 -13 115 155 149 86 293 2 -51 115 -98 120 -553 -175
3373 -175 -260 -65 -41 37 -56 66 65 -4 100 -128 -55 -18 145 39 179 103 -183 -137 -38 -120 100 -72 -194 19
3397 19 383 8 7 -61 26 -151 142 -45 -241 170 -155 -211 -252 81 -18 -95 -154 -165 -26 65 118 167 -82 50 -21
$$ packed form
3232f1Q7k62J95p7K26k89M34k09l8J02j42r0J09J09n0k95P3k9M01k54N1j81J05
3255h5N6p6J60k7m2J26o2j4j44N8O7R5p0p2o1R0J29k40K87l46J47J38j01j04J07
3280A6%K35q3J4k53J34l24K53J8P5l08L48J13n27K56J37J14k90K97j9k26m0L3
3303b7LJ54k8k09M5K04j06K1k58J55L9J54Lr2K06k35j40J10J00l49N85n40J97
3326hk85J90J32k59J46R7mk17O5K7L28j90Pk6j55k10O07k92J47j51j15jM17l84
3350a34J27j06N7K39J15l24l7j88L14q7J1J28M0oo3K07k91n3J66k13K18o73L78
3373a75q5J95K4P8r3J22jo9J04k28P3L7J63j06J40p6k86M6R9q2K20j72j22K13
3397A9L64l75jo8Q7j77K93j87j96M11l25n6m1L33r9p7n9j1J39R1N3M9k49J32p1
$$ plain form
3422 -21 -43 17 222 -9 53 271 -25 79 -158 161 226 -155 -7 -63 -197 360 -126 199 101 48 13 92 -21
3445 -21 -29 136 -145 -6 -114 -438 163 96 -268 -2 194 -89 135 73 161 -256 -381 128 -372 182 238 302 28
3468 28 477 201 103 92 214 -40 -78 -107 -252 101 -155 231 37 -143 9 187 -18 110 222 -144 -76 -86
3490 -86 -78 -275 43 -163 -70 114 -158 190 154 -26 310 106 198 205 -233 101 -200 26 94 -71 84 12 -95
3513 -95 7 -15 -121 1 89 104 185 182 -166 198 63 6 -117 20 365 114 19 92 77 109 64 -166 -87 90 -31
3538 -31 -192 103 156 257 -94 39 -200 -69 -49 71 -130 -66 106 292 100 46 308 -333 182 71 2 -216
3560 -216 -99 214 -45 -63 -329 4 193 63 218 58 -39 182 102 115 35 -197 99 40 299 -15 262 -119
3582 -119 99 21 13 477 -135 325 7 -157 -68 26 -15 105 154 12 23 235 16 -42 75 -128 161 -349 -144
$$ packed form
3422b1k2O0K05k31O2K18k96J04k37L19O5l81J48n6j34N57m86L25r8n3l5P9j13
3445b1qJ65k81J39j08l24O01o7l64K66J96k83K24o2Q8m17j25N09n00N54N6O4k74
3468B8M49k76r8j1J22k54l8k9j45L53k56L86j94j80J52J78k05J28J12l66O8j0
3490h6Qj97L18k06R3J84k72L48l6j80L36k04R2Pm38L34l01K26O8j65J55p2j07
3513i5J02k2j06J22Q8J5Q1ll48L64j35n7j23J37L45k51r5P3j5L2m5k30P9J77j21
3538c1j61K95N3J01l51J33k39J31K0J20k01O4J72J86j92n4K62o41N15j11o9k18
3560b16J17L13k59j8k66L33J89j30J55j60r7K21q0J3q0k32K96n9K59l14K77l81
3582a19K18p8qM64o12M60l18j64Q9R4m1J20M9j42J1K12k19n8J17k03K89n10K05
$$ plain form
3605 -144 149 13 63 -47 -99 -90 -34 9 -60 -27 -26 -175 -208 -210 -173 -53 -43 -105 163 23 33 268 -165 122 -183 -30
3631 -30 -207 103 206 -93 79 -199 40 109 -21 8 -129 -90 -151 135 123 -150 74 238 -55 -66 -225 119
3653 119 20 192 -98 -72 -269 5 -24 204 -303 72 -87 104 -153 -280 281 -222 -76 146 91 214 -42
3674 -42 22 -129 -164 -180 -301 -193 -39 30 -140 103 37 -89 -79 246 452 133 -74 78 83 211 140 20 -402
3697 -402 -484 -79 272 -138 -76 31 10 -130 82 -186 -309 4 -220 -119 173 -32 126 187 26 55 3 105
3719 105 34 50 -82 -150 -106 146 -53 35 1 57 -31 128 -4 -52 268 199 71 16 -98 -293 -152 -110 56 -61
3743 -61 -141 69 -37 -78 62 -62 -81 -138 212 -187 81 -80 -17 -9 -376 -90 284 185 -127 186 -347 264 10
3766 10 -337 0 -101 299 -184 -43 -321 2 246 94 217 369 202 -22 -144 -135 115 -85 -72 11 -227 68
$$ packed form
3605a44K93j36N0j10n2RN6M3o9L3Jj49l3kL7J20J0o2K68j40J0K35m33K87l05J53
3631c0j77L10J03k99J72k78K39O9j30K9j37L9o1K86j2k73K24J64k93j1j59L44
3653A19r9J72k90K6j97K74k9K28n07L75j59J91k57j27N61n03J46K22n5J23k56
3674d2O4j51l5j6j21J08J54O9j70K43o6j26J0L25K06l19k07J52NJ28p1j20m22
3697d02q2M05L51m10O2J07k1j40K12k68j23L13k24J01K92k05J58O1j61K9n2J02
3719A05p1J6j32o8M4K52j99Q8l4N6q8J59j32m8L20o9j28n5j14j95J41M2J66j17
3743f1q0K10j06m1J40j24j9n7L50l99K68j61O3Ql67K86L74r9l12L13n33O11k54
3766A0l47L37j01M00m83J41k78L23K44j52J23J52j67k24j22RK50k00J3Q3k38K95
$$ plain form
3788 68 96 204 -571 -101 217 -37 246 252 -160 -59 -162 -164 51 -238 -26 -66 230 -165 125 -1 -425 -328 49
3811 49 -256 -35 -31 -135 -28 60 -47 -64 188 105 -120 116 265 -336 -42 -154 -156 166 392 -222 49 7 -303
3834 -303 42 112 -63 14 -142 -251 -158 210 -95 -204 -70 -98 -198 203 18 -60 266 80 16 -32 137 115 20
3857 20 -43 67 -279 -163 -72 119 35 -23 -134 398 -17 -28 41 100 385 300 134 317 58 -255 116 -107 214
3880 214 294 -2 28 -149 -164 -115 31 -247 38 -192 15 -24 -135 322 -176 94 190 -311 -66 214 -279 10
3902 10 74 47 37 114 185 -295 -140 -174 308 98 -57 -189 -80 -15 33 -82 131 -141 64 188 -179 420 61
3925 61 -266 -166 160 -127 145 -225 -126 42 -86 -218 -153 187 -161 -260 76 120 -71 -185 -29 75 -61 -121
3947 -121 -237 114 35 193 -513 124 -95 -443 -34 66 201 24 148 47 -30 71 -78 152 208 66 70 75
$$ packed form
3788F8K8J08p75M70L18k54K83Om12J01j03kK15k89K12m0K96l95K90j26m24R7L77
3811D9l05K21Mj04J07Q8j07j7K52q3k25K36J49o01K94j12kL22K26o14K71m2l10
3834c03L45P0j75P7j56j09R3L68l05j09J34k8j00M01j85p8L26j86o4m8J69k2r5
3857B0o3J10l46J16R1J91q4n8j11N32m15j1O9N9K85q5j66J83k59l13L71k23L21
3880B14Q0k96L0j77j5M9J46k78K85k30K07l9j11M57m98K70R6n01K45K80m93K89
3902A0O4k7j0P7P1m80J55l4M82k10j55j32J09O5M8j15K13k72K05J24l67N99l59
3925F1l27J00L26k87K72l70R9J68j28j32O5L40l48r9L36M4j91j14J56J04j36o0
3947a21j16L51p9J58p06O37k19l48M09J00J35j77J24j01p7J01j49K30N6j42MN
$$ plain form
3969 75 -54 67 -84 -98 207 195 -139 -64 -113 107 9 40 68 36 159 -65 -114 -296 123 -17 -67 -357 48 19
3993 19 -227 -109 -43 209 193 -94 -326 107 69 -195 -292 186 156 -147 129 -91 -54 229 80 114 -186 -91 13
4016 13 26 -146 -161 230 -139 -19 -56 21 86 372 85 -45 70 144 -351 -65 -16 19 -123 295 55 -33 -24 347
4040 347 -32 32 -112 8 -188 -145 51 115 -253 -38 -33 -21 198 -90 188 44 -105 -143 130 -61 -14 -87 182
4063 182 89 25 -5 113 -88 77 141 77 -431 -245 78 -146 50 -276 213 41 -184 207 -182 73 62 -143
4085 -143 -38 -131 -55 -122 -328 67 112 41 396 130 -442 4 -248 -38 -89 -81 114 -56 -42 -99 -31 -59 -156 61
4109 61 47 157 147 28 -45 -17 68 -80 -167 -417 -264 -124 -29 109 -21 -143 -29 -223 170 -84 320 -54 35
4132 35 -114 -195 -20 27 79 -321 -143 152 224 459 115 30 -19 -68 -131 -62 -44 161 42 231 -122 -157 226 83
$$ packed form
3969G5j29J21j51j4L05j2l34P5m9K20r8L1K8l2J23k24m9j82M19j40n0k90M05k9
3993A9k46J18O6K52j6k87k32M33l8k64r7M78l0l03K76k20L7K83j49L4l00R5J04
4016A3J3j72j5L91l69J20l7P7O5K86k87j30J15P4m95K86M9L5j42M18k40q8RL71
4040C47l79O4j44J20j96M3J96O4l68K15NJ2K19k88K78j44j49l8K73j91M7p3K69
4063A82r3o4l0J18k01J65O4o4n08J86L23k24J96l26M89j72k25L91l89K55j1k05
4085a43J05r3P6o7k06L95M5p1L55k66n72M46k52K10n1QJ95j70J4n7O8k8r7K17
4109F1j4J10j0j19p3K8Q5j48q7k50J53J40R5J38j30j22J14j94L93k54M04l74Q9
4132C5j49q1J75M7N2m00J78K95P2K35l44q5m9m9o3O9J8K05j19J89l53l5L83j43
$$ plain form
4156 83 6 -121 24 -278 256 315 302 11 77 94 -173 19 56 -136 -162 205 -17 111 -70 37 140 82 70
4179 70 16 -105 -333 -85 -161 -33 -16 63 136 -52 242 -135 100 107 -133 -151 61 161 -43 -119 -29 -41 83 318
4203 318 -258 -153 -195 127 42 -76 23 191 -108 -49 96 -30 148 4 139 -91 341 0 120 -54 111
4224 111 0 -208 -121 -94 42 211 -229 -284 -88 -27 -163 -22 -196 218 -117 92 -137 -203 138 102 -82 -253
4246 -253 -97 -91 161 -175 47 -134 -136 112 -6 36 106 226 104 -79 88 -135 44 49 -18 110 334 34 130
4269 130 65 -329 93 108 85 259 -132 0 318 79 -62 -246 -43 70 -62 -31 196 222 7 152 41 -26
4291 -26 144 -103 124 -55 188 163 -65 127 305 1 131 -23 -176 -287 66 -184 -26 76 -196 -179 -9
4312 -9 222 -158 10 -204 -140 51 315 -29 172 -37 145 -113 -181 17 -159 241 -108 -18 181 -4 -233 -291
$$ packed form
4156H3p7j27J45l02N34N9j3k91O6J7k67J92L7j92k6L67k22J28j81J07J03n8j2
4179G0n4j21k28K48p6J28J7P9P3j88K94l77K35Pk40j8K12J00k04p6R0j2J24K35
4203C18n76J05m2L22q5j18R9J68k99N9J45j26J78j44J35k30M32l41J20j74J65
4224A11j11k08Q7K7J36J69m40n5J96O1j36J41j74M14l35K09k29o6L41l6j84j71
4246b53J56OK52l36K22j81kK48j18M2P0J20j22j83J67k23J79No7J28K24l00R6
4269A30o5l94M22J5k3J74l91J32L18k39j41j84K03J13j32L1K27K6k15J45j11o7
4291b6J70k47K27j79K43k5k28J92J78l04J30j54j53j11L53k50J58J02k72J7J70
4312iK31l80J68k14O4J91K64l44K01k09J82k58o8J98j76M00l49R0J99j85k29n8
$$ plain form
4334 -291 -150 -206 -77 6 88 98 52 -93 67 -132 55 120 -35 -172 21 1 124 430 137 -387 180 303
4356 303 51 249 -65 -30 39 -180 -171 -85 -14 -92 -383 17 -222 -274 -61 -48 -28 178 -12 26 -12 -230 -71 -140
4380 -140 -43 143 -104 -235 133 -237 -91 -22 350 -184 45 44 -54 217 -203 343 -72 266 150 88 17 -106
4402 -106 -49 -20 112 86 111 40 57 -92 43 58 -23 118 -9 282 74 91 -146 -196 -8 155 175 -72 301 82
4426 82 159 124 124 -89 66 0 -198 -184 246 -114 -215 66 -112 -61 -24 50 77 -213 -121 274 -141 -435 -29 -31 -191
4451 -191 210 -216 -93 124 461 128 -36 -168 80 -254 -35 -58 -192 142 -100 -49 -70 -123 -61 268 180 -17
4473 -17 85 -144 325 -84 238 -65 -73 74 -67 -120 -172 -77 -91 134 239 98 21 -63 88 -225 45 112 475
4496 475 10 -11 -40 -37 4 28 65 149 228 156 272 -49 150 -3 128 25 -45 -121 160 -112 297 74 60 87 -19
$$ packed form
4334b91J41n6J29Q3Q2J0m6j45J60j99J87O5j55j37J93k0J23L06k93n24N67J23
4356C03k52J98l14L5O9k19RQ6P1p8k91M00k39n2K13J3K0K06j90L8l8k18J59o9
4380a40R7J86k47j31L68l70J46O9L72n34K29jr8K71m20N46m15L38j16o2p1j23
4402a06N7K9J32k6K5p1J7j49J35J5q1J41j27K91k08J7k37n0J88J63K0k47L73k19
4426H2P7l5%k13J55o6j98J4M30l60j01K81j78N1L7P4K7k90R2L95m15k94M06kj60
4451a91M01m26J23K17L37l33j64j32K48l34K19k3j34L34k42N1k1n3O2L29q8j97
4473a7J02k29M69m09L22l03qJ47j41n3n2R5j4K25J05j41p7q4J51l13K70O7L63
4496D75m65k1k9LM1K4L7Q4P9p2J16l21J99j53J31j03p0p6K81k72M09k23j4K7j06
$$ plain form
4521 -19 223 303 -72 351 -301 -151 -3 22 -347 -4 -39 31 -70 387 48 -178 -155 -194 -113 42 245 8 -30
4544 -30 86 216 38 255 -342 13 82 -133 -1 -165 173 96 -133 44 53 95 -39 30 287 103 -222 64
4566 64 236 -108 165 284 149 -117 -42 -89 48 154 195 -107 -1 167 65 210 -198 105 -29 -83 130 -60
4588 -60 63 -93 201 228 12 36 -177 279 -116 24 -311 -147 21 237 -64 78 326 -37 61 40 99 158
4610 158 -148 -46 -32 -146 -68 134 -27 24 87 -123 -306 171 265 -16 -80 79 49 -48 125 63 125 -3 6 -13
4634 -13 -163 -200 39 232 48 -63 -75 -17 -108 -87 135 -28 7 95 -202 -251 87 162 133 -4 121 130 61 -233 -94
4659 -94 62 -12 -151 -106 4 10 -139 -171 188 205 -29 208 -94 189 143 -360 -229 92 49 169 -21 158 -108
4682 -108 -31 367 226 -11 6 -82 343 -94 -105 78 115 -349 -70 -72 -2 -182 95 -84 35 148 -199 129 -214
$$ packed form
4521a9K42Q0l75M23o52J50J48K5l69L43l5P0j01M57l39k26K3l9Q1J55K03k37l8
4544c0J16J30j78K17n97L55O9k15J32j64L38p7k29J77RM2j34O9K57j84l25K86
4566F4J72l44K73J19j35k66P5m7J37J06M1l02J06J68j02J45m08L03j34n4K13j90
4588f0J23j56K94K7k16K4k13M56l95J40l35J64J68K16l01J42K48l63R8k1N9N9
4610A58l06J02J4j14P8K02j61N1O3k10j83M77R4k81o4J59l0r7J73o2O2j28Rj9
4634a3j50l7K39J93j84j11j2N8r1K1K22j63L5Q8k97m9L38P5k9j37J25Ro9k94J39
4659i4J56p4j39M5J10Oj49l2L59J7k34K37l02K83m6n03J31L21m3J20j90J79k66
4682a08P7L98j41k37J7q8M25m37j1J83L7m64K79kP0j80K77j79J19J13l47L28l43
$$ plain form
4705 -214 143 -338 229 61 56 105 -156 276 -200 311 225 26 -95 7 84 -295 142 30 -175 42 69 -97
4727 -97 103 4 191 47 31 -45 196 160 -26 192 147 190 -149 -70 -230 167 -41 232 191 242 148 163 -64 -171
4751 -171 37 -53 -115 -17 -29 413 172 -168 -181 -94 -45 80 -2 -194 44 -106 -65 -92 -122 -216 208 -43 -320 51
4775 51 86 40 -304 -102 87 101 121 29 206 -114 -78 -86 0 -13 -138 54 -310 350 -203 -256 -36 163 -10 36
4799 36 -97 -38 -85 73 89 -250 -38 -40 -69 330 177 69 -21 214 96 69 63 -24 -103 -170 362 75 132 70 -50
4824 -50 130 -218 -25 179 49 -155 210 190 -7 -299 70 -18 34 -111 314 113 130 117 55 -105 329 -20
4846 -20 -65 50 -26 133 19 3 -169 -106 29 72 51 67 -94 -29 -59 49 -86 -87 149 -53 -110 -170 81 240 114
4871 114 160 -30 354 218 -27 -34 -270 26 -193 -24 172 -1 -69 -121 -60 -48 -126 -139 -58 132 -69 64 26 -9
$$ packed form
4705b14L57m81N67j68nM9k61M32m76N11q6j99j21J02P7l79M37j12k05K17K7j66
4727i7K00r9J87j44j6p6K41l6j86K18m5M3l39P9j60L97k08K73m1N1r4J5k27j07
4751a71K08r0o2R8j2M42k41l40j3Q7M9J25q2j92K38j50M1k7l0r4M24k51k77L71
4775E1L5m6l44K02J89J4K0r2J77l20L6qQ6j3j25J92l64O60n53n3K20J99j73M6
4799C6j33N9m7J58J6l39K12kk9L99j53j08r0K35j18k7oq7p9o7N32k87N7o2j20
4824e0J80l48J93K04j30k04L65k0j97k92L69q8N2j45M25k01J7j3o2j60M34l49
4846b0m5J15p6J59j14j6j72O3J35M3k1J6j61O5l0J08j35jK36k02n7o0K51J59j26
4871A14M6j90L84j36k45pk36K96k19J69J96j73o8n2O1J2p8j3Q1J90k01J33l8l5
$$ plain form
4895 -9 56 204 -38 -210 -99 -103 -29 -2 113 222 118 -9 44 -9 108 22 -90 223 -157 155 140 198 294 -158
4919 -158 -135 32 -120 113 -51 -25 165 149 86 -254 -135 -133 104 111 35 100 -136 101 -119 99 -347 -332 -93 -100
4943 -100 -79 -298 119 106 137 -245 127 -178 -128 85 124 -216 95 -133 109 -163 109 -17 -43 23 50 114 -215
4966 -215 -14 -134 -162 -37 -3 49 -165 -202 -207 -99 0 -239 -198 -113 250 -264 102 -69 53 25 107 -37 121 -153
4990 -153 40 -6 35 160 -197 -127 243 238 49 -193 -242 -99 61 -152 65 117 4 -15 -416 266 74 -87 -254
5013 -254 50 110 -8 58 -33 100 60 160 49 192 -120 183 151 154 198 126 42 40 -120 -117 199 231 131 -30 212
5038 212 -108 177 -129 330 -167 -142 92 67 114 -161 -45 -146 -131 -11 -153 51 -144 141 -106 201 331
5059 331 72 205 -104 -207 -103 148 -193 -52 43 438 -118 -128 -12 65 44 226 19 98 -74 -17 119 79
$$ packed form
4895iO5J48k42j72J11mP4K7J15J09j04j27N3n3J17q6j12L13l80L12j5N8R6m52
4919a58K3J67j52K33j64K6J90j6o3l40J19KK37Pp6O5k36K37k20K18m46J5K39p
4943a00K1k19M17j3L1l82L72l05N0K13L9l40L11k28K42k72K72j26k6O6K7O4l29
4966b15K01j20k8J25L4N2k14l7nJ08R9k39M1Q5L63n14L66j71J22k8Q2j44J58k74
4990a53J93m6M1J25l57P0L70nj89k42m9J43J60k13K17N2j13j9m01O82j92j61j67
5013b54L04O0j18O6r1J33m0J00j11J43l12L03l2LM4p2q4kj60LL16L2j00j61K42
5038B12l20K85l06M59m97K5K34k5M7k75J16j01J5J20j42K04j95K85k47L07J30
5059C31k59J33l09j03J04K51l41J41R5L95n56j0J16P7k1J82k07P9j72N7J36m0
$$ plain form
5081 79 448 -9 -128 -18 133 -95 -303 194 -109 -176 -38 -207 117 43 -88 57 477 16 171 -1 -72
5102 -72 166 -124 11 -88 81 306 84 65 112 -179 -18 40 212 -78 -147 204 179 72 -41 -114 -257 -352 -210
5125 -210 20 -47 149 -19 0 -186 115 -266 -107 -34 112 -179 80 -96 -392 -81 -45 -60 -28 9 53 120 -61
5148 -61 23 -153 -150 186 -162 114 -76 -342 -336 -52 -59 -38 2 -235 -78 -184 238 -426 441 244 -38 -211 -97
5171 -97 126 -132 217 15 95 19 104 -122 94 -77 84 62 -112 122 195 -163 -176 -39 97 176 49 -286 85
5194 85 -63 30 -217 -328 -36 115 172 -128 -84 -10 94 -361 167 -45 43 171 75 -37 -115 247 193 87 -190
5217 -190 -168 -120 45 52 147 -248 149 -92 46 144 -208 261 130 -70 -204 -304 2 -22 84 257 0 -95 -159
5240 -159 136 -245 -55 432 -50 -91 79 209 277 56 -65 44 247 62 12 -335 -24 188 77 50 -205
$$ packed form
5081G9L69m57j19J10J51k28k08M97l03o7J38j69L24p4j31J45M20m61J55j72p1
5102g2K38k90J35r9J69K25k22j9M7k91J61N8J72k90o9L51k5j07j13p3j43r5J42
5125b10K30o7J96j68J9j86L01l81J59P3J46k91K59j76k96L11L6j5L2L7M4O7j81
5148f1Q4j76LL36l48K76j90k66OK84pK1M0k37J57j06M22o64Q67j97k82j73J14
5171i7K23k58L49k02Q0p6Q5k26K16j71J61k2j74K34P3l58j3J37J36P9j27l35L71
5194H5j48R3k47j11K92J51N7l00M4P4J04m55N28k12Q8J28r6j12p8L62n4j06k77
5217a90K2M8J65PR5l95L97k41J38R8l52M69j31k00j34j00L06k4J06J73k57r5o4
5240a59K95l81J90M87m82m1J70J30O8k21j21J09K03j85n0l47L11K12j11k7k55
$$ plain form
5261 -205 88 -81 -32 181 147 61 -66 147 25 166 -31 -145 342 18 -109 306 -82 -156 89 257 29
5282 29 -328 137 97 137 1 -365 83 199 -226 -2 281 -244 44 -250 246 -129 -88 26 -39 -4 60 45 146
5305 146 67 -244 -39 -204 23 108 80 220 -188 -54 70 199 258 -1 -362 217 -24 -166 47 -164 -4
5326 -4 134 43 31 350 -240 -296 107 -3 -116 101 -178 64 -114 -121 269 136 -235 -46 -34 82 62 378 70
5349 70 -290 164 -121 31 -23 -349 47 -234 -133 145 -88 211 -58 -29 266 -29 73 -155 -185 -273 31 73
5371 73 28 -49 68 -108 -310 -52 -176 136 264 169 -116 216 -205 -314 224 56 97 174 -78 -217 112 116 -66
5394 -66 -115 -318 215 185 -239 -191 137 -134 -153 110 -131 -287 -197 69 36 47 -108 20 187 -113 153 20 69
5417 69 175 306 -56 78 361 -58 -251 -15 55 -56 -40 -7 -335 70 -64 -79 98 379 -223 1 20 211
$$ packed form
5261b05K93j69M9K13l4q6j27K13j22J41j97j14M87l24j27M15l88p4K45J68k28
5282B9l57M65m0M0j36l66M48J16m25K24K83n25K88k94M96l75M1J14o5L5O4j5J01
5305A46p9l11K05j65K27Q5k8J40m08J34J24J29N9k59l61N79k41j42K13k11J60
5326dJ38r1j2L19n90n6M03j10j13K17k79K42j78pL90j33l71J89J2J16k0L16l08
5349G0l60M54k85J52n4l26L96k81J01K78k33K99k69K9K95k95J02k28l0q8L04M2
5371G3m5p7J17j76k02K58j24L12J28r5k85L32m21j09N38j68M1P7k52j39L29Mj82
5394f6m9k03N33l0m24M8L28k71j9K63k41j56R0K66l3J1j55J28J67l00K66j33M9
5417F9J06J31l62J34K83m19j93K36P0j11J6L3l28M05j34j5J77K81o02K24J9J91
$$ plain form
5439 211 223 92 -35 -1 -236 -144 -251 -133 80 -134 -21 -370 74 37 82 170 -16 182 84 41 97 9 -37 -81
5463 -81 -30 3 104 -22 -394 181 211 -99 72 -37 111 137 -252 -203 18 14 365 74 213 -205 -161 -11 -72
5486 -72 12 181 132 -88 -99 71 147 -231 -19 -152 85 0 191 160 -32 95 132 -165 185 68 113 69 -131
5509 -131 -42 105 73 449 171 -11 122 -8 -8 -50 95 -153 -57 -60 180 -169 101 34 -28 2 129 -2 87 337
5533 337 173 264 89 41 94 -309 -131 288 126 -153 30 442 90 103 270 63 102 -224 -281 53 16 132
5555 132 -140 83 33 -52 75 124 58 -75 121 190 -229 -123 -156 -232 154 280 3 -272 17 181 -27 159
5577 159 97 95 152 -247 44 36 -37 203 15 51 62 -160 247 147 -106 -263 -240 -59 53 -361 -89 -96 359 -242
5601 -242 -172 -405 37 38 154 231 -21 67 284 96 -137 73 -50 -255 -178 147 -86 -29 -107 -10 -53 246 -165
$$ packed form
5439B11J2j31j27L4k35R2j07J18K13k14J13l49M44l7M5Q8j86J98r8m3N6q8m6m4
5463h1N1L3J01j26l72N75L0l10J71j09J48K6l89M9K21mL51k91J39m18M4J50o1
5486g2Q4J69m9k20j1J70P6l78K12j33K37q5J91l1j92J27L7k97L50j17M5m4k00
5509a31Q9J47l2L76k78j82J33j30%m2J45k48R6lK40l49K70o7o2L0J27j31Q9K50
5533C37j64R1j75m8N3m03J78M19j62k79J83M12l52J3J67k07L9l26n7L34l7J16
5555A32k72K23n0q5J27M9o6j33J96O9m19J06l3p6L86J26k77k75K89J64k08J86
5577A59o2kN7l99K91qp3K40j88L6J1k22M07j00k53j57K3J81J12m14K72pM55o01
5601b42P0k33M42JJ16P7k52Q8K17j88k33K10j23k05P7L25k33N7p8R7m3K99m11
$$ plain form
5624 -165 -209 -99 123 -264 37 128 123 134 -36 52 -160 74 10 32 41 -45 -25 -89 103 -76 87 80 -36 35 45 9
5650 9 14 -4 5 -132 -144 42 -231 186 279 130 121 -15 -99 61 133 143 -115 -1 -172 -162 -39 -57 0 -212 25 -382
5676 -382 -99 94 -279 -119 -269 177 190 48 -17 -290 61 -9 -199 324 -203 -76 111 -20 -97 -185 321 387
5698 387 243 198 362 56 -343 294 65 10 110 189 7 -221 112 -88 134 45 -154 135 98 -74 67 -147
5720 -147 -110 -228 242 5 -51 -137 -139 -8 -25 -48 155 -128 -73 176 192 -108 -525 121 -140 -95 37 -246 196
5743 196 -52 -109 -90 -195 -21 -18 42 -53 -76 -172 83 85 -195 105 142 -8 -58 27 293 195 -37 -58 59 297 -41
5768 -41 265 50 -116 -14 -61 -46 -9 -66 -324 275 -31 13 -85 109 5 32 -148 -129 -85 -137 -6 -60 -41 0 5
5793 5 -37 95 -128 -47 -88 -437 37 -234 80 -12 -38 -129 197 -18 216 62 -18 -276 -151 81 -243 -116 -142
$$ packed form
5624a65m4J10K22l87L01R1nJ1j70Q8k12K34o4K2Rq6K0o4J92j79J63pj16P1J0l6
5650INj8Rj37j2J86k73M17R3j49rj36q4J60P2J0k58J14j71J0J23j8N7k12K37m07
5676c82K83J93l73J60j50M46J3j42o5k73L51p0j90N23n27J27J87j31p7q8N06O6
5698C87j44m5J64l06l99O37k29n5J00P9j82k28L33k00K22q9j99K89l7j72J41k14
5720a47L7j18M70k37n6q6kJ31j7k3K03k83N5K49J6l00m17O46k61M5J32k83M42
5743A96k48n7J9j05J74LO0r5k3r6K55Kk80L00L7j50n0Q5K66r8k32k1J17K38l38
5768d1L06k15j66J02m7J5L7n7k58N99l06M4r8J94j04K7j80J9M4n2J31n4J9M1N
5793Em2J32k23Q1m1l49M74k71L14r2k6r1L26k15K34j54q0k58J25K32l24J27k6
$$ plain form
5816 -142 -32 -158 -68 -24 79 -58 -144 -164 -52 45 -243 -140 -106 132 -101 138 -9 103 97 126 307 192 239
5839 239 -57 78 18 -5 -2 157 184 -54 219 240 82 -30 -181 24 43 -26 239 72 -155 64 -158 52 10
5862 10 -89 -95 176 -137 328 -63 -96 41 84 -21 76 -327 -171 -76 117 185 -323 9 38 -27 6 -137 94 260
5886 260 63 188 119 -62 8 17 -188 -159 -43 -2 1 -155 -180 -35 -199 -86 -302 4 28 -213 -78 -4 -84 106
5910 106 218 176 -139 90 300 -176 -134 123 -425 33 -267 21 54 -147 126 -63 -137 193 -42 125 217 46
5932 46 154 23 45 -112 -121 8 -154 77 -290 -122 -53 295 219 30 -17 -29 -320 -164 -169 26 2 354 68 2
5956 2 -7 -23 85 206 284 74 -39 -139 131 83 181 67 -76 85 -18 105 -103 55 -39 -223 12 -56 183
5979 183 84 6 -86 -25 -78 -131 -97 160 34 -54 16 82 155 -239 -108 -29 -51 -1 181 151 235 0 32 -14 116 -178
$$ packed form
5816a42J10j26R0M4J03j37q6k0J12R7k88J03L4K38k33K39j47J12oK9J81j15M7
5839B39k96J35o0k3LJ59K7k38K73K1j58j12j51K05J9o9K65j67k27K19k22K10m2
5862A0r9oK71l13M65l91l3J37M3j05R7m03J56R5J93O8n08L32K9o5L3j43K31J66
5886B60j97J25o9j81P0Rk05K9J16M1Lj56k5J45j64J13k16L06K4k41J35P4q0J90
5910A06J12m2l15K29K10m76M2K57n48M58l00K88L3k01K73j89p4L30k35J67R2j71
5932D6J08j31K2j57rJ29j62K31l67J68O9L48p6j89m7j2k91J56nJ95k4L52k86o6
5956Brj6J08J21P8k10j13j00K70m8R8j14j43J61j03J23k08J58r4j84K35o8K39
5979A83r9p8r2O1n3n3L4K57j26q8P0O6P3l94J31P9k2N0J82l0Q4k35L2m6J30k94
$$ plain form
6005 -178 -93 -20 178 -69 9 85 -55 236 -308 58 -28 -194 206 -80 -67 -24 240 195 -65 48 -128 -32 117
6028 117 -14 -253 -42 47 320 5 -91 -79 340 87 -128 358 -121 171 -489 -53 -108 -214 -61 -41 -37 -234
6050 -234 -292 43 -162 257 -297 114 302 -188 93 -115 166 -52 -95 -103 -50 -245 39 -284 82 -113 408 -12
6072 -12 -1 -139 -23 -180 -133 58 89 138 -55 45 58 -78 -227 180 -201 138 -363 -47 11 -51 -16 130 -191
6095 -191 10 -68 99 -25 3 -197 69 224 -110 67 292 -51 -154 -49 -183 188 268 276 -311 185 124 -12
6117 -12 28 -31 -45 97 122 134 -285 -84 101 227 24 26 -21 -23 -71 -31 -10 -74 63 -103 -173 -209 165 67 -135 170
6143 170 -75 34 126 -156 -278 199 114 42 -125 96 27 -18 47 -227 148 -184 -82 -131 222 -87 45 291
6165 291 -150 -96 -2 41 129 -54 24 75 81 -156 -279 28 2 49 -222 -225 62 -104 9 265 -97 146 228 -219
$$ packed form
6005a78Q5P3J98k47P8P6j40K91n44L66q6j66M00k86J3M3K64m5k60J13j76R6J49
6028A17j31k39K11Q9K73l15r6J2M19k53k15M86m79K92o60M36n5j06J53K0Mj97
6050b34n8L35k05M19n54M11J88m90K81k08K81k18m3qN3j95K84l23L66j95N21m20
6072a2J1j38J16j57M7J91L1M9j93J00J3j36j49M07l81L39n01L16N8o2L5J46l21
6095a91K01p8J67j24K8k00K66J55l34J77K25l43j03J05j34L71Q0Qn87M96o1j36
6117a2M0n9j4J42K5J2m19K01J85J26k03Km7km8M0K1o4J37j66p0l6L74r8k02L05
6143A70k45J09R2k82j22M77q5p2j67K21o9m5O5k74L75l32J02m9L53l09J32K46
6165B91m41N4R4M3Q8j83P8N1Ok37j23L07k6M7k71lK87j66J13K56l62K43Q2m47
$$ plain form
6189 -219 -188 -45 -280 158 342 144 -272 -255 -229 -289 55 -292 -128 32 156 114 -276 -35 -119 -6 116 -142
6211 -142 -225 -343 100 -54 -55 -26 72 86 -46 53 155 -280 125 -194 38 151 33 -188 43 515 77 -47
6233 -47 1 -62 -95 -43 109 -20 -86 207 88 23 -262 -37 -56 -132 -97 -2 121 165 72 58 28 -76 172 -115 54
6258 54 -79 -85 -39 91 26 -117 -77 250 321 34 145 -100 160 -176 57 149 -89 293 -104 11 192 289 142
6281 142 40 -1 -36 146 280 18 348 328 -2 -1 -363 94 -54 44 221 -86 132 -89 38 169 36 328
6303 328 131 23 71 133 -4 -68 -152 73 -116 -161 -376 -83 169 -402 25 -28 -309 27 300 256 -242 50
6325 50 -298 -40 238 232 -56 -26 119 283 137 122 -164 -162 -44 -15 -64 327 97 -149 -254 -98 -145 45 38 -296
6349 -296 88 172 165 -208 -94 -252 -62 -226 -13 -284 -179 -19 -168 38 -5 102 -4 -180 -36 80 135 -309
$$ packed form
6189b19L1J43k35M38J84j98m16J7K6o0L44l47J64J60J24m2l90K41q4J13J22k58
6211a42q3j18M43j54jK9R8J4j32R9J02m35M05l19K32J13j18k21K31M72m38j24
6233d7M8o3l3N2J52j29o6K93j19o5k85K25j9p6L5R5J23M4r3j4l0j04K48k87J69
6258E4j33oM6J30o5j43M0L27P1k87J11k45K60l36K33R2k38L82l97J15J81R7j47
6281A42j02m1l5J82J34k62L30k0l30Jl62M57j48R8J77l07K18k21J27J31j33K92
6303C28j97j08M8O2j37o4q4K25j89m5k15K93K52n71M27n3k81L36K73m4m98K92
6325E0l48K58K78ok88L0J45J64j46j5k86KJ18K9m9L91k30k46j05J56m7J90pl34
6349b96L84Q4pl73J14j58J90j64K13k71J05J60j49K06m3J07j06j76J44J16N5m44
$$ plain form
6371 -309 23 135 -1 -360 -160 142 107 -44 -137 206 -18 94 52 -155 10 12 198 20 266 188 131 134 119
6394 119 -306 14 121 -65 -140 -223 13 -79 -17 -37 -159 -114 -79 -232 160 -40 109 68 71 127 137 -133 -229 -268 -136
6419 -136 170 52 232 -10 -204 2 -76 69 -16 31 -314 -147 343 89 -11 -204 -131 -86 -137 -52 257 -246
6441 -246 -73 272 -159 -168 364 -145 123 10 -281 -110 -38 119 98 -381 204 64 41 101 157 -125 -176 63 -151
6464 -151 -29 9 -41 -65 -279 26 -45 -77 -22 11 -139 -73 -256 -154 -214 -98 49 -17 108 19 63 -145 43 -16
6488 -16 52 -147 88 278 72 43 -156 -143 -311 113 113 -16 -137 -125 -150 -83 -88 -65 -104 57 -14 -46 -134 -403 -78
6513 -78 -53 -188 213 -24 -1 -57 84 -46 -199 -91 90 3 -90 -146 -33 50 -74 -103 170 58 -5 113 -139
6536 -139 25 -3 11 281 -136 -42 -27 -31 66 201 -26 101 -44 -134 206 -226 64 190 62 151 -20 -89 35
$$ packed form
6371c09L32J12j36l59K00L02l5j51r3L43k24J12m2k07J65KJ86j78K46p8n7Lj5
6394A19m25L20J07j86p5q3K36r2O2k0j22M5L5j53L92k00J49m1LN6J0k70r6l9J32
6419a36L06j18J80k42j94K06p8J45q5M7l45J67M90k54j00j93P3M5n1Q5L09n03
6441b46J73L45m31rN32n09K68j13k91J71P2J57k1m79N85j40k3O0N6k82n1K39k14
6464a51J22L8n0k4k14L05p1l2N5L3j50O6j83J02o0J16J47o6J25q9M4k08J88n9
6488a6O8j99K35J90k06k9j99J3j68M24%j29j21J2k5O7nK3l9J61p1l2q8k69L25
6513g8K5j35M01k37K3n6J41j30j53J08J81q7r3n6J13Q3j24k9K73j12o3J18k52
6536a39J64k8J4K70m17R4J5mR7J35k27J27j45r0L40m32K90J26j28Q9j71o9J24
$$ plain form
6559 35 214 331 89 -307 181 -63 -212 -48 -132 31 72 7 -233 125 -5 0 279 100 47 112 144 -95 -80
6582 -80 62 -213 -128 -63 39 140 -132 41 -62 -159 -50 -100 -16 16 34 223 171 -87 212 58 16 -247 21
6605 21 82 178 -134 -6 -146 -96 165 -63 157 101 -71 -123 54 -5 -388 123 -35 -364 206 -19 111 134 -65
6628 -65 -246 79 -25 -283 -111 45 -47 -16 241 -133 -221 -52 217 -71 116 115 -96 223 -86 -170 -57 59
6650 59 35 -106 117 144 63 -119 -53 121 -108 -102 129 48 -29 -83 -62 -115 94 -140 128 232 139 447 -501 -142
6674 -142 -36 118 43 193 164 3 -101 233 -61 103 115 -115 66 -54 93 -465 -93 -105 -221 28 -170
6695 -170 -61 -443 -222 -90 -189 52 -157 35 -25 -121 -228 1 85 -21 94 -29 -56 127 -19 -178 -277 -293
6717 -293 -2 -44 -235 119 -69 120 17 -55 -82 25 -37 87 288 6 -85 -212 -157 82 277 -310 -129 -422
$$ packed form
6559C5J79J17k42l96M88k44j49J64q4J63M1o5k40L58j30NK79j79n3O5L2k39J5
6582h0J42k75Q5O5J02J01k72J73j03r7J09n0Q4L2J8J89n2k58K99j54m2k63K68
6605B1O1R6l12J28j40N0K61k28K20n6j72n2J77n9l83N11j58l29N70k25J30K3j99
6628f5j81L25j04k58J72J56r2L1K57l74q8J69K69k88J87jk11L19l09q4J13J16
6650E9k4j41K23K7q1j82O6J74k29OK31q1p7n4K1n3K09k34K68J04r3L08r48L59
6674a42J06J54p5J50k9j61j04L34k94J64J2k30J81j20J47n58L72j2j16K49j98
6695a70J09l82K21J32r9K41k09J92o0r6j07K29Q4j06J15j23k7J83j46j59r9j6
6717b93K91m2j91L54j88J89j03p2k7J07o2J24K01k82r1j27N5K39J95n87J81k93
$$ plain form
6739 -422 -195 -145 100 4 37 137 66 -1 -249 33 141 64 -11 -68 113 -32 -395 -33 -183 -136 282 -113 176
6762 176 16 69 -134 172 147 -169 369 81 79 137 111 5 49 14 -259 -62 -187 -77 40 145 -90 7 -141
6785 -141 59 190 16 -117 -14 -184 268 -296 107 46 98 -1 -183 264 -46 170 116 -191 -393 -7 -16 224
6807 224 -18 56 75 -164 11 27 -71 73 -140 -86 -219 130 78 -190 -68 -74 75 -97 -47 -154 -40 -145 167
6830 167 83 142 159 -33 91 219 -27 155 37 201 -201 109 -43 -85 51 -110 333 155 187 -173 199 -183
6852 -183 -10 -287 -272 -168 -9 323 69 98 -100 -189 176 -81 92 -34 36 -164 243 314 -25 -58 -84 58
6874 58 -219 -44 456 42 -277 -51 -214 -38 -56 -25 -99 49 -18 17 60 -70 -264 -412 12 262 33 -10 -85
6897 -85 -19 -341 -219 -166 38 47 -298 -56 -62 -12 164 37 -117 172 -126 -157 256 -164 19 -147 -135 -55 37 -37
$$ packed form
6739d22K27N0K45r6L3J00p1o7k48K82J08p7p5n7J81j45l63L62j50M7M18l95K89
6762A76j60N3k03L06k5l16N38k88kN8k6j06M4l5k73J97j25J10J17J05k35R7j48
6785a41K00J31j74j33J03j70M52n64M03o1N2r9j82M47l10K16n4l07k02L86rK40
6807B24k42P4J9k39J75J6r8J44k13N4j33L49n2k68J22oJ49j72N0j07J14j05L12
6830A67q4N9J7j92J24J28k46J82j18J64m02L10j52m2J36j61M43j78L2l60L72l82
6852a83J73k77J5J04J59L32k54K9j98q9L65k57J73j26P0k00M07P1l39l3k6J42
6874E8k77J75N00m14l19K26j63J76j8L1p4J48o7L5M3j30j94j48M24K50k29m3p5
6897h5O6l22J22N3K04Rl45K42oN0J76j27j54K89k98l1M13m20J83j66J2Q0R2p4
$$ plain form
6921 -37 70 -52 270 303 92 104 41 124 -133 -186 286 53 222 -269 -35 11 -117 -66 -269 -110 -73 45 -225
6944 -225 -38 85 -442 -62 -70 287 -215 344 -19 13 207 -7 20 57 15 179 25 207 28 -210 -37 -131
6966 -131 -182 279 1 4 250 -127 -63 140 236 -146 69 166 -194 -137 23 -64 24 -192 114 -33 -29 289 407 186
6990 186 -75 -83 -328 119 -113 28 72 141 -137 107 28 -292 -88 156 165 -165 29 -65 118 -286 190 231 -46
7013 -46 -202 -205 -64 197 87 118 -232 2 -66 242 22 -225 143 7 47 -241 51 -31 136 -42 -123 76 331
7036 331 105 -114 78 34 -390 61 -313 -31 -43 23 -31 463 -170 140 -290 -221 281 -25 -50 -22 -37 -182 -58
7059 -58 126 205 -143 173 125 -33 206 93 107 292 111 17 -22 30 -52 -20 -123 80 333 -65 -7 -8 124 15
7083 15 7 -15 289 -55 183 64 137 -92 -180 -16 69 73 -197 -64 -86 12 76 -62 -59 72 95 -274 21 -94 98
$$ packed form
6921c7J07j22L22L3k11J2o3Q3k57n3M72k33J69m91K34M6j28N1k03J59L7J18k70
6944b25J87J23n27L80qL57n02N59l63L2J94k14K7L7m2J64j54J82j79k38J73r4
6966a31n1M61k78LK46l77O4K03R6l82K15R7l60N7J60q7Q8k16L06j47ML18J18k21
6990A86k61qk45M47k32J41M4O9k78K44p9l20K04K44Rl30J94r4J83m04M76M1k77
7013d6j56lJ41K61j10L1l50K34o8L08k20k47L68j36M0k88K92q2J67j78q1J99K55
7036C31k26k19J92m4m24M51l74K82j2O6n4M94o33L10m30O9N02l06k5K8j5j45J24
7059e8J84P9l48L16m8j58K39j13J4J85j81r4l9N2q2L2j03K03K53l98N8jJ32j09
7083A5qk2L04l44K38j19P3k29q8J64Q5Mk70J33k2R8O4j38LJ31K3l69K95j15J92
$$ plain form
7108 98 -199 94 355 -141 -61 -74 -58 193 52 -11 -112 119 121 81 144 -145 226 -36 -127 -60 -232 -9 -51 -143
7132 -143 -169 -187 -222 -441 -5 -188 -108 186 -192 105 -242 207 38 126 -22 278 311 -37 68 -61 -282 35
7154 35 85 -302 -83 39 -181 418 99 122 36 -275 -400 -98 132 89 128 -8 -111 172 113 88 183 287 112
7177 112 61 -36 47 54 -89 34 -182 -71 40 83 -50 175 -74 67 11 -140 39 20 -83 -144 299 -102 -52
7200 -52 -73 -117 -240 53 -72 66 -2 -91 29 -147 -86 -132 13 -54 42 72 -256 -116 15 -32 -97 -95 127 -261 150
7225 150 20 78 80 19 214 166 -112 3 -20 48 -194 66 22 -38 -189 -77 -67 -37 -53 137 29 -116 -120 27 -68
7250 -68 -397 -112 -174 33 135 159 -98 109 -137 -107 -207 -159 -162 -149 67 29 302 237 280 -57 128 -101 103 132
7274 132 -106 101 46 -86 -43 39 -346 125 119 -51 148 -19 15 216 -155 -84 178 7 100 69 44 -66 -121 300
$$ packed form
7108I8k97K93K61m96Q0j3J6K51j41o3j01K31Km0O3k89L71k62r1O7j72K23m2r2
7132a43k6j8l5k19M36j83Q0K94l78K97l47M49j69Q8j48L00L3l48J05j29k21L17
7154C5N0l87K19J22k20N99l19K3q6l11j25L02K30m3L9j36j03K83n9k5R5J04j75
7177A12n1r7Q3Pj43J23k16J11J11M3j33K25k49J41n6j51J79j9j03o1M43m01N0
7200e2k1m4j23K93j25J38o8q9J20j76O1m6J45o7R6L0l28J40J31m7o5KK22l88M11
7225A50j30N8Ko1J95m8k78J15k3O8k42K60m4o0j51J12J0L0j6J90j08j45mJ47r5
7250f8l29K85o2K07J02K4k57K07k46L0j00M8lJ3K16l8K73o5M3l37J85k29K04K9
7274A32k38K07n5j32M3Q2l85M71oj70J99j67L4K01l71P1K62j71R3l1k5j10n5M21
$$ plain form
7298 300 -206 202 31 68 39 403 100 -19 -19 179 32 7 129 -278 -31 -118 -147 -251 -1 271 -54 -90 -263
7321 -263 477 204 -76 -146 -10 -160 36 170 133 -56 93 -89 62 5 -253 -181 -103 53 81 152 75 6 -193
7344 -193 -117 180 18 253 121 -59 135 -156 -330 40 353 117 39 -56 -77 -260 -231 -47 115 112 125 -168 72
7367 72 -123 -155 -23 -462 -181 -208 -69 178 -82 -70 188 91 23 8 142 -121 -359 228 -255 33 -108 379
7389 379 157 -85 204 95 66 -196 -128 318 174 -256 -348 -134 90 -117 60 83 19 12 -323 26 19 -27 -264
7412 -264 -225 424 102 288 243 -234 -16 119 -64 147 -252 26 183 51 329 5 142 22 -94 -140 -109
7433 -109 -156 106 6 -179 48 52 57 -156 4 -75 55 50 90 144 -4 129 64 -46 82 265 -182 88 253 -282
7457 -282 -19 92 56 -69 193 -27 -36 -89 8 -155 16 241 -5 -108 70 190 -169 -6 -1 -31 -110 239 -85
$$ packed form
7298C00n06M08j71L7k9L64l03j19%J98j47k5J22m07K47q7k9j04K50K72l25l6j73
7321b63P40k73k80p0J36j50J96J34l7j89J49j82J51n7k58P2P8J56K8P1p7o9j99
7344a93P6K97j62K35j32j80J94k91j74L70L13k36p8r5k1j83K9J84J62lJ3k93K40
7367G2j95l2J32m39K81k7J39K47k60J2K58r7o8j5J34k63k38N87m83K88j41M87
7389C79k22k42K89j09k9k62O8M46j44m30r2K14K24k07J77K3o4pl35L49pm6k37
7412b64L9O49l22J86m5m77K18J35j83K11l99K78J57j32K78l24J37j20j16m6L1
7433a09m7K62j00j85K27MNk13J60p9J30nM0N4j48J33o5j10J28J83m47K70J65n35
7457b82K63J11l6j25K62k20rn3R7j63J71K25k46j03J78J20l59J63Nl0p9L49l24
$$ plain form
7480 -85 -152 -431 8 80 40 -179 -86 -142 18 -10 -28 144 -38 -200 -3 -92 -64 69 277 145 17 -60 72 42
7504 42 77 102 -89 73 -86 45 98 -105 118 -112 191 -90 232 241 168 93 264 160 191 89 -14 -138 -37
7527 -37 105 -150 -137 -163 24 -140 12 -8 -43 -141 28 15 -52 -18 -155 25 34 147 -64 123 -49 -15 303 -198
7551 -198 161 -56 110 191 -69 -85 105 -75 -141 -11 44 -94 -229 -159 79 -8 -5 -161 45 -178 196 282 -35
7574 -35 -163 -44 133 -226 -73 -84 15 -41 -127 -134 -192 -240 185 -169 17 -138 -188 -135 -169 134 176 115 -189 9 211
7599 211 64 -29 -75 -135 158 81 -102 179 -79 354 -149 -235 -152 -8 8 134 116 76 -39 -168 176 127 -9
7622 -9 -45 -162 72 -67 -305 -80 294 -215 -4 111 34 197 165 -1 117 62 95 -128 -122 142 -123 285 -93
7645 -93 173 97 37 -57 -51 121 5 104 312 21 136 -56 -56 -297 110 -26 138 -9 30 -163 -183 142 211 -37
$$ packed form
7480h5o7k79M39P2m0k19R3n6J60k8j8J72j82j62J97q9K8J33K08j32j28p7J32l0
7504D2L5K5j91J62j59J31N3k03K23k30L03k81L22Rp3p5J71j04L1j02j03j24J01
7527c7J42k55J3k6J87j64J52k0l5r8J69j3o7L4j37J80RJ13k11J87j72L4L18n01
7551a98L59k17J66Q1k60j6J90j80o6J30N5j38j35P0K38q7Lj56K06k23L74Q6l17
7574c5j28J19J77l59J53j1R9n6q6pn8m8M25l54J86j55n0N3l4L03M2o1l04J98K02
7599B11j47r3m6o0K93p7j83K81k58M33n03q6Q3J44J6J26j8m0j15j29L44m9j36
7622il6j17K34j39k38K25L74n09K11J15p7J63l2j66J18n5L3k23OK64k65M08l78
7645i3K66p6o0r4OJ72j16R9K08k91J15j92%k41M07j36J64j47L9j93k0L25O9k48
$$ plain form
7669 -37 -154 -86 168 -106 90 -152 -14 -175 -387 -152 -115 -99 -68 -11 -168 -207 92 262 -150 72 88 24 -311
7692 -311 -58 -95 -67 -275 -84 -123 -76 -5 52 -35 -69 44 -22 7 -39 82 -165 97 -123 26 131 -144 -98 -21
7716 -21 -170 236 46 316 85 -88 -149 70 -31 212 15 -202 263 -289 -44 100 -320 -90 -41 -218 -295
7737 -295 26 -153 -16 -47 -145 -42 8 -74 296 80 -47 -149 -153 101 -87 343 26 103 51 23 -212 262 13
7760 13 193 -14 -130 99 -161 -183 51 266 -31 14 34 207 -35 -93 37 88 59 148 98 148 -114 66 79 -128
7784 -128 34 -76 -137 -151 -191 55 -191 -341 -212 -242 9 -147 -18 -118 -272 99 15 108 -111 -22 10 -90 288
7807 288 -285 -235 138 -111 -37 148 9 131 68 -253 10 -90 -284 -125 78 -36 99 1 -91 59 -47 128
7829 128 -185 29 -99 263 -148 -123 -13 -3 -272 16 67 -105 303 -140 19 -180 -235 22 115 -66 109 -197
$$ packed form
7669c7j17O8K54k74J96k42J38j61k12K35L7J6L1N7j57l9K99J70m12K22J6o4l35
7692c11K53l7K8k08J91l9M7P1N7q7l4J13o6K9m6J21k47K62k20J49J05k75M6P7
7716b1j49M06j90K70k31j73o1K19j01K43j97k17M65n52K45J44m20K30M9j77p7
7737b95L21j79J37l1r8J03N0q2L70k16j27j02mK54j88M30l17P7n2k8k35M74k49
7760A3J80k07j16K29k60k2K34K15k97M5K0J73k42n8J30N1k9Q9n0N0k62J80J3k07
7784a28J62j10o1j4m0K46k46j50J29l0K51j56J29j00j54L71q4R3k19Q9L2j00L78
7807B88n73N0L73k49P4J85j39J22o3l21K63j00j94J59K03j14J35r8r2J50j06J75
7829A28l13K14j28L62m11K5J10J0k69K88N1j72M08m43J59j99n5K57R3j81J75l06
$$ plain form
7851 -197 59 -363 66 366 301 30 -13 -2 271 -110 -25 90 -41 248 -37 41 117 -16 266 -160 -40 114
7873 114 125 127 256 185 258 81 129 218 -87 240 -331 71 83 -51 -190 131 -9 152 9 -230 5 -161 -244
7896 -244 -9 96 -151 140 36 -133 -229 -23 -215 -151 -229 258 100 70 -120 152 -171 48 42 -28 -195 70
7918 70 -127 -14 -165 -117 -37 257 -46 -44 -149 -118 299 -201 287 322 -188 171 63 -250 -176 189 149 81 -71
7941 -71 -30 43 -10 145 -80 33 170 5 -217 -253 11 72 44 221 329 182 -54 133 -71 35 79 23 -54
7964 -54 -16 137 135 -75 20 -67 -135 126 267 -219 107 -140 -147 -53 52 -220 -24 -140 -89 207 246 44 233 340
7988 340 76 110 -27 -67 -303 -164 53 -55 -76 -321 -83 33 110 249 -46 38 -88 -118 74 -122 -17 -219
8010 -219 -107 -259 143 176 -201 181 22 -56 -207 33 282 -38 94 -168 -121 14 110 -57 219 -173 -305
$$ packed form
7851a97K56m22M29L00o5k71m3J1K73l81Q5J15j31K89k85P8P6j33K82m26J20J54
7873A14J1KJ29p1P3j77M8Q9l05L27n71M02J2j34j39L21j40J61j43k39K35j66q3
7896b44K35J05k47K91j04j69r6K06j92O4p8M87j58l0j90K72l23K19op0j67K65
7918G0j97J13j51M8Q0K94l03Kj05L1M17n00M88L5n10L59j08l13P4L65m0o8j52
7941g1M1P3n3J55k25J13J37j65k22l6K64O1k8J77J08j47k36J87k04J06M4n6p7
7964e4L8J53kk10R5q7o8K61J41m86L26k47pR4J05k72J96j16N1K96L9k02J89J07
7988C40k64L4j37m0k36J39K17j08k1k45K38J16P7J39k95Q4j26l0J92j96J05k02
8010b19J12j52M02L3l77L82j59p8j51K40K49l20J32k62M7J35R6j67K76l92j32
$$ plain form
8031 -305 -63 -64 -74 25 120 212 -2 -14 -21 -279 -164 130 236 200 264 51 -298 -224 -85 -160 123 -226 44 -31 -10
8056 -10 309 -32 61 -12 202 236 104 -14 -280 -49 -116 -247 14 -2 143 245 -162 139 -242 19 60 -71
8078 -71 -153 -87 -123 87 159 -30 204 -16 207 181 -66 92 430 -257 -101 -85 9 94 -139 -234 -81 98 2 40
8102 40 -347 388 142 115 131 395 -18 -192 -79 -42 262 343 288 -283 -37 157 221 194 -42 163 23 -145 -4
8125 -4 -13 170 -344 -76 9 100 -3 111 145 205 131 -220 2 -10 -21 -2 -105 26 -157 -38 428 151 -73 239
8149 239 -251 160 167 295 252 69 -152 86 167 -142 -150 163 380 -184 -145 59 -77 291 61 76 96 228 176
8172 176 -118 40 -86 88 -294 -181 -177 49 -126 -107 135 -87 146 206 -311 90 -61 -7 10
$$ packed form
8031c05K42jj0R9R5R2k14j2pk58J15K94J06l6O4k13l49P4J39p5K83l49K70p5K1
8056a0L19l41R3p3K14L4j32j18k66K31o7j31K61j6J45J02m07L01l81K61M1j31
8078g1q2O6l6K10P2j89K34k20K23k6k47J58L38o87J56J6R4Q5k33r5J53J79r6L8
8102D0l87P35k46k7J6K64m13j74J13L7L04Q1n5n71K46J94O4k7k36K05j40j68J41
8125drJ83n14K68Q5R1j03J14L4O0p4l51K22j2j1J9j03J31j83J19M66k77k24L12
8149B39m90M11PJ28m3j83k21K38Q1l09qL13K17n64L9K04j36L68k30J5K0J32n2
8172A76k94J58j26J74l82J13MK26j75J9K42k22K33O0n17M01j51N4J7
8191A0
$$ Imaginary data points
##PAGE= N=2
##DATA TABLE= (X++(I..I)), XYDATA
$$ plain form
0 0 0 0 0 0 0 0 0 0 0 0 0 0 -8 8 -8 8 -8 8 -16 16 -16 24 -24 30 -32 39 -43 48 -55 63 -71 79 -87 98 -109
35 -109 122 -136 149 -165 185 -203 225 -248 277 -306 340 -376 422 -471 530 -600 684 -788 921
54 921 -1097 1340 -1704 2305 -3477 6594 -31170 -86769 -21711 2986 -34372 -57100 -22780 -16528
68 -16528 -43074 -42293 -12227 -19703 -46657 -35535 -6760 -19250 -44393 -30082 -2613 -14009 -37092
81 -37092 -28287 -7316 -9876 -20678 -17775 -12463 -16348 -15639 -7089 -4106 -12978 -16687 -8784 -1599 -5641
96 -5641 -11249 -6961 -1436 -5729 -9796 -2710 1562 -5067 -8397 -2243 188 -7073 -6943 3176 2829 -10507
112 -10507 -13030 914 5065 -6726 -10011 -1847 -3196 -10936 -4700 4501 -3882 -14296 -5978 4137
126 4137 -2781 -10310 -2424 3808 -2978 -7934 -112 5811 1424 -1277 2946 3674 562 5615 12702
$$ packed form
0@%%%%%%%%%%%%qJ6j6J6j6J6k4L2l2M0m8N4o2P1q2R1j03J18j34J50j66J85k07
35a09K31k58K85l14L50l88M28m73N25n83O46p16P98q93J001j130J284j472J709
54I21k018K437l044M009n782J0071l7764n5599O5058K4697l7358k2728L4320O252
68a6528k6546P81L0066p476k6954J1122K8775j2490k5143J4311K7469j1396k3083
81c7092Q805K0971k560j0802K903N312l885P09Q550K983q872l709P903P185m042
96e641n608M288N525m293m067P086M272o629l330O154K431p261J30J0119l47j3336
112a0507k523J3944M151j1791l285Q164j349p740O236R201q383j0414Q318J0115
126D137o918p529P886O232o786m956P822N923m387k701M223P28l112N053P087
$$ plain form
141 12702 8824 518 4211 13781 13875 8793 8950 12272 11980 10781 12467 15311 14374 10960 11353 13356
157 13356 12883 11221 12921 13648 9037 5316 9124 13536 10188 4170 3698 5858 4746 2829 4086 3963
173 3963 -589 -3520 -54 1823 -1566 -4037 -2807 -3817 -6941 -6087 -1327 -2873 -8188 -8225 -4505 -5005
189 -5005 -6727 -4346 -3248 -6447 -8956 -5184 -700 -2099 -5087 -4523 -2708 -3437 -2368 1170 640 -3092
205 -3092 -3226 555 2063 420 375 1415 332 -1580 490 3379 2710 -90 -951 -92 -422 -145 1877
222 1877 985 -2949 -4452 -1510 293 -1971 -3377 -2944 -3381 -5504 -3791 -1670 -2726 -5409 -5611 -4498
238 -4498 -4212 -4078 -2792 -2969 -5935 -6232 -2909 -886 -2108 -3148 -2245 -1739 -2423 -431 2370 1401 -728
255 -728 -213 1981 2431 3018 4440 3448 1703 2505 4770 6331 5561 4386 3901 4034 3993 5138 6066 5234
$$ packed form
141A2702l878q306L693R570R4n082J57L322k92j199J686K844r37l414L93K003
157A3356m73j662J700P27m611l721L808M412l348o018m72K160j112j917J257j23
173C963m552k931L466J877l389k471J230j010l124Q54M760j546n315l7L720n00
189e005j722K381J098l199k509L772M484j399k988N64J815p29J069L538n30l732
205c092j34L781J508j643m5J040j083j912K070K889o69k800q61Q59l30K77K022
222A877q92l934j503K942J803k264j406M33m37k123J713K121j056k683k02J113
238d498K86J34J286j77k966k97L323K023j222j040R03N06o84J992K801r69k129
255g28N15K194M50N87J422r92j745Q02K265J561p70j175m85J33m1J145R28q32
$$ plain form
273 5234 2874 2304 3633 4519 3960 3170 2383 767 361 1745 2075 1032 -1196 -1950 -1143 -903 -1331 -1495
291 -1495 -1522 -3516 -4962 -3447 -1523 -2000 -3920 -3971 -3983 -4261 -2632 -752 -1678 -3551 -4105 -1720 -263 -654
309 -654 -783 -94 -563 -1642 344 3108 3085 800 733 1813 2382 2437 4211 3813 1807 1292 2860 4259
327 4259 3610 2447 2246 2238 1223 1620 3309 3043 -154 -1105 319 670 -185 127 -83 -2079 -3462 -1823
345 -1823 -887 -1354 -2727 -3498 -3352 -3123 -3385 -1952 -1691 -3610 -5469 -3544 -1309 -1522 -2132 -1973 -2240 -2952
363 -2952 -1861 344 1012 -765 -1624 248 922 1144 1819 2572 2113 243 1202 4454 4427 2387 2225 2678
381 2678 2605 2431 4225 4228 2289 856 1876 3135 2976 1815 1966 1420 52 -633 1949 2195 -500 -2030
399 -2030 -1166 -716 -1464 -437 -680 -2251 -3757 -3099 -1249 -1106 -2324 -2679 -2697 -2885 -2627 -1204 -248 -1935
$$ packed form
273E234k360n70J329Q86n59p90p87j616m06J384L30j043k228p54Q07K40m28j64
291a495k7j994j446J515J924m77j920n1j2k78J629J880r26j873n54K385J457l91
309f54j29O89m69j079J986K764k3k285o7J080N69N5J774l98k006n15J568J399
327D259o49j163k01qj015L97J689k66l197r51J424L51q55L12k10j996j383J639
345a823R36m67j373p71J46K29k62J433K61j919j859J925K235k13o10J59k67p12
363b952J091K205O68j777q59J872O74K22O75P53m59j870R59L252k7k040j62M53
381B678p3j74J794Lj939j433J020J259j59j161J51n46j368o85K582K46k695j530
399b030Q64M50p48J027k43j571j506O58J850J43j218l55j8j88K58J423R56j687
$$ plain form
417 -1935 -3304 -2015 -281 -471 -582 98 -292 -1496 -687 1662 2105 697 344 1015 1617 1687 2422 3239
435 3239 2410 586 1055 3063 3519 1676 1431 2012 953 590 2377 2562 1099 -487 -437 477 -76 148
453 148 194 -234 -2447 -2590 -910 -80 -1429 -2567 -1973 -2195 -2516 -1760 -816 -1971 -3609 -3435 -1781 -1158
471 -1158 -1645 -1566 -1553 -1830 -2136 -430 1219 -92 -1273 -666 343 351 1019 2249 1570 6 475 2350 2768
490 2768 2316 1708 1703 1718 1895 2325 3372 2410 807 491 2309 2451 1388 1563 1254 -359 -270 847 1466
509 1466 380 -739 -1352 -908 -1139 -657 -609 -1001 -2638 -3226 -1533 -673 -1636 -2518 -2181 -2388 -2429 -1567 -583
528 -583 -1069 -2099 -2170 -1231 -805 -456 55 213 -840 -986 200 1594 1557 483 622 1177 922 1645 2122
547 2122 2187 1038 615 1804 2437 2421 1706 1602 1187 694 1635 2671 2053 157 -260 377 602 -72 624
$$ packed form
417a935j369J289J734j90j11O80l90j204Q09K349M43j408l53O71O02P0P35Q17
435C239q29j824M69K008M56j843k45N81j059l63J787J85j463j586N0R14n53K24
453A48M6m28k213j43J680Q30j349j138N94k22l21P56R44j155j638J74J654O23
471a158m87P9J3k77l06J706J649j311j181O07J009QO68J230o79j564M69J875M18
490B768m52o08nJ5J77M30J047r62j603l16J818J42j063J75l09j613Q9J117O19
509A466j086j119o13M44k31M82M8l92j637n88J693Q60r63q82L37k07m1Q62R84
528e83m86j030p1R39M26L49N11J58j053j46J186J394l7j074J39N55k55P23M77
547B122O5j149m23J189O33j6p15j04m15m93R41J036o18j896m17O37K25o74O96
$$ plain form
566 624 277 -1069 -1921 -560 13 -704 -1418 -1503 -1715 -2165 -1579 -888 -893 -2502 -2850 -2053 -881 -1277 -1297 -1100
586 -1100 -1592 -2123 -924 678 355 -823 -1061 -358 120 323 1308 1210 229 -337 1136 2486 1999 1172 1600
605 1600 958 763 1443 2398 2535 717 402 1364 1601 1552 1563 1879 438 -625 23 1209 810 -271 -778
624 -778 -514 -1145 -775 -117 -432 -1350 -2357 -1667 -704 -850 -1353 -1451 -1843 -2541 -1660 -374 -481 -1306 -1420 -1490
644 -1490 -1011 -454 -185 203 -497 -1115 -506 1060 969 478 513 645 446 427 2005 2195 985 405 1276 1263
664 1263 1614 1976 1568 1212 385 647 1551 1673 528 153 466 12 -61 1083 994 -559 -1378 -878 -193 -266
684 -266 -910 -966 -1228 -1835 -1393 -833 -523 -977 -1971 -1947 -1115 -1181 -674 -896 -1215 -1855 -1054 -391 370 -235 -329 -710
706 -710 -500 8 510 1021 401 96 -11 1234 1495 964 983 1289 298 821 1662 1921 1325 799 923 902 1104
$$ packed form
566F24l47j346q52J361N73p17p14q5k12m50N86O91nj609l48P97J172l96k0J97
586a100m92n31J199J602l23j178k38P03M78K03R85r8r81n66J473J350m87q27M28
605A600o42j95O80R55J37j818l15R62K37m9J1L16j441j063O48J186l99j081n07
624g78K64o31L70O58l15r18j007O90R63j46n03r8l92o98Q81J286j07q25j14p0
644a490M79N57K69L88p00o18O09J566r1m91L5J32j99j9J578J90j210n80Q71j3
664A263L51L62m08l56q27K62R04J22j145l75L13m54p3J144q9j553q19N00O85p3
684b66o44n6k62o07M42N60L10m54r94K4Q32o6N07k22l19o40Q01O63P61o05r4l81
706g10K10N08N02N11o20l05j07J245K61n31J9L06r91N23Q41K59n96n26J24k1K02
$$ plain form
727 1104 1136 1323 879 -52 -226 727 1120 -112 -281 -30 -868 -1519 -496 -98 -714 -1490 -1491 -990 -881 -892 -797
748 -797 -1162 -1902 -1665 -1008 -712 -903 -1297 -1188 -684 -709 -126 340 -429 -885 -646 317 596 495 473 429 336 523
770 523 1176 1655 1081 347 364 1317 1492 1420 1512 1044 427 317 1132 1352 948 558 158 207 286 666 577 403
792 403 -601 -1084 -274 57 -513 -523 -710 -1247 -1688 -839 -129 -884 -1542 -1395 -982 -1243 -663 -507 -921 -1060
812 -1060 -1420 -538 38 -340 -325 -336 -318 -664 298 1141 595 31 233 392 771 1270 966 803 321 474 932
833 932 1357 1556 574 620 605 800 551 1340 893 200 -625 391 921 753 69 -157 -273 -621 -280 -17 6
854 6 -771 -1292 -929 -722 -728 -611 -609 -1460 -1675 -1034 -301 -422 -948 -839 -908 -727 -508 212 46 -421 -1018 332
876 332 378 578 306 345 187 -54 514 1228 1002 548 222 312 710 761 1014 1307 596 389 411 1270 833 434
$$ packed form
727A104L2J87m44r31j74R53L93j232j69K51q38o51J023L98o16p76jN01J09j1R5
748g97l65p40K37O57K96j91l94J09N04k5N83M66p69m56K39R63K79j01k2m4r3J87
770E23O53M79n74p34J7R53J75p2R2m68o17j10Q15K20m04l90m00M9P9L80q9j74
792D03j004m83Q10L31n70j0j87n37m41Q49P10p55o58J47M13k61N80J56m14j39
812a060l60Q82N76l78J5j1J8l46R62Q43n46n64K02J59L79M99l04j63m82J53M58
833I32M25J99r82M6j5J95k49P89m47o93q25J016N30j68o84k26j16l48L41K63K3
854Fp77n21L63K07oJ17Kq51k15O41P33j21n26J09o9J81K19P20j66m67n97J350
876C32M6K00k72L9j58k41N68P14k26m54l26R0L98N1K53K93p11k07K2Q59m37l99
$$ plain form
898 434 265 123 -194 89 852 411 -122 -832 -134 -77 -21 -155 -464 -813 -996 -814 -323 -215 -1072 -1188 -920
919 -920 -909 -864 -450 -550 -1240 -1228 -756 117 -219 -192 1 -486 -852 -348 489 840 75 -430 313 740 637 822
941 822 1168 419 -73 669 827 1199 633 372 580 356 725 907 935 271 -2 64 -156 385 270 4 -136
962 -136 -497 -171 5 81 -325 -703 -736 -266 -644 -683 -373 -751 -1211 -997 -619 -355 -535 -602 -969 -1055 -589 -260
984 -260 343 10 -918 -531 315 217 186 267 396 -231 -95 908 748 613 110 176 813 693 1171 987 495
1005 495 132 327 912 713 739 451 278 -43 -49 443 516 -168 -326 -205 -230 -31 56 -234 -193 -657 -676 -247 -172
1028 -172 -353 -927 -836 -653 -745 -229 -73 -484 -991 -733 0 -96 -324 -605 -555 -374 -238 -300 687 134 -382 -5
1050 -5 290 522 447 658 481 -117 22 784 266 743 807 499 179 390 762 440 649 -25 -116 145 325 329
$$ packed form
898D34j69j42l17K83P63m41n33p10O98N7N6j34l09l49j83J82M91J08q57j16K68
919i20J1M5M14j00o90J2M72Q73l36K7J93m87l66N04Q37L51p65n05P43M27j03J85
941H22L46p49m92P42J58L72n66k61K08k24L69J82K8o64k73O6k20N41j15k66j40
962a36l61L26J76P6m06l78l3M70l78l9L10l78m60K14L78K64j80o7l67q6M66L29
984b60O03l33r28L87Q46r8l1Q1J29o27J36J003j60j35n03O6O37j20M78j84m92
1005D95l63J95N85j99K6k88j73l21oM92P3o84j58J21k5J99Q7k90M1m64j9M29P5
1028a72j81n74R1J83r2N16J56m11n07K58P33r6k28k81N0J81J36o2R87n53n16L77
1050eK95K32p5K11j77n98J39P62n18M77O4l08l20K11L72l22K09o74r1K61J80M
$$ plain form
1072 329 672 13 -300 -716 93 414 -528 -476 -257 -665 -457 -460 -136 -192 -616 -883 -789 -54 -202 -545 -655 -570
1094 -570 -955 -271 108 -150 -727 -257 -267 216 208 316 325 -161 24 171 619 509 172 205 277 514 377 1035
1116 1035 817 392 230 528 669 441 472 -35 -74 58 -209 493 628 -342 -489 -327 -281 -183 79 -400 -691
1137 -691 -771 -272 3 -138 -601 -300 -1093 -660 -382 85 -139 -567 -575 -341 27 -145 -264 -219 -467 -587 -371
1158 -371 399 255 160 -61 352 427 299 424 445 505 242 337 631 631 390 253 422 108 358 900 629 17
1180 17 -38 327 262 590 454 275 -270 -244 14 71 152 -247 -273 -262 -434 -613 -113 -309 -646 -623 -299 -210 -378
1203 -378 -174 -311 -753 -1016 -220 -63 -86 -236 -235 60 -63 99 158 -28 1 -384 166 573 223 460 170 -49
1225 -49 458 429 788 733 140 67 419 625 527 19 96 332 -180 371 420 492 -113 26 -105 -35 137 -57 228
$$ packed form
1072C29L43o59l13m16Q09L21r42N2K19m08K08lL24n6m24k67R4P35j48l43j10Q5
1094e70l85O84L79k58n77M70j0M83qJ08Rm86J85J47M48j10l37L3P2K37j37O58
1116A035k18m25j62K98J41k28L1n07l9J32k67P02J35r70j47J62M6R8K62m79k91
1137f91q0M99K75j41m63L01p93M33K78M67k24m28qK34L68j72j19M5k48j20K16
1158c71P70j44r5k21M13P5j28J25K1O0k63R5K94%k41j37J69l14K50N42k71o12
1180A7n5L65o5L28j36j79n45K6K58N7Q1l99k6J1j72j79N00j96l37K3L24Q9j68
1203c78K04j37m42k63P96J57k3j50JK95j23J62N9j86K9l85N50M07l50K37k90k19
1225d9N07k9L59n5n93p3L52K06r8n08P7K36n12N51M9P2o05J39j31P0J72j94K85
$$ plain form
1248 228 -213 -510 -365 -86 -214 -146 -590 -412 -570 -483 109 -455 -191 -409 -674 -65 37 8 -137 -94 -613
1269 -613 -207 317 161 17 -197 -132 12 63 431 544 68 30 391 450 618 504 478 318 220 -38 204 448
1291 448 356 59 258 74 316 235 288 412 -312 -178 37 137 24 -250 -432 -529 -144 -32 5 -392 -767 -593
1313 -593 -433 -101 -83 -473 -341 -297 -231 -49 239 -100 -170 -497 -39 157 295 226 36 -333 -207 187 -29 245
1335 245 -17 94 -8 107 537 709 400 322 212 377 103 264 364 226 -139 6 392 381 -246 89 86
1356 86 -237 -330 -307 214 -68 -86 -386 -124 23 -352 -333 -146 -276 -619 -158 -232 -196 -49 -378 -341 -209 -92 308
1379 308 -118 -302 -313 -52 148 28 249 22 135 145 205 465 518 32 114 606 310 312 178 398 22 98 164
1402 164 336 202 92 -262 -33 341 317 231 346 -198 -330 -29 222 -68 68 17 -730 -400 -333 -130 -247
$$ packed form
1248B28m41k97J45K79j28O8m44J78j58Q7N92n64K64k18k65O09J02k9j45M3n19
1269f13M06N24j56j44k14O5J44N1L68J13m76l8L61N9J68j14k6j60r8k58K42K44
1291D48r2k97J99j84K42q1N3J24p24J34K15J00j13k74j82r7L85J12L7l97l75J74
1313e93J60L32J8l90J32M4O6J82K88l39p0l27M58J96J38o9j90l69J26L94k16K74
1335B45k62J11j02J15M30J72l09p8j10J65k74J61J00j38l65J45L86j1o27L35l
1356H6l23r3K3N21k82j8l00K62J47l75J9J87j30l43M61p4L6J47l29L7J32J17M00
1379C08m26j84j1K61K00j20K21k27J13J0O0K60N3m86Q2M92k96Kj34K20l76P6O6
1402A64J72j34j10l54K29L74k4q6J15n44j32L01K51k90J36n1p47L30O7K03j17
$$ plain form
1423 -247 -429 -558 -24 -266 5 137 -363 -69 -423 -20 184 -205 -207 -291 -50 -396 304 207 211 139 218 -50 211
1446 211 451 267 439 10 68 351 521 365 223 105 386 103 462 292 298 57 -236 309 24 410 133
1467 133 48 93 -61 -22 -24 227 -182 -577 -45 8 -230 -66 -500 -279 -565 98 -248 320 -89 -548 -434 -139
1489 -139 -288 92 -34 -371 -306 -9 377 -8 138 -82 -327 -150 176 158 180 -86 -179 317 239 286 115 446
1511 446 417 -323 117 158 401 -44 28 123 -356 349 133 -47 115 -38 52 34 217 -80 -180 -331 -298 64
1533 64 352 -200 -462 -415 -104 140 -62 92 -109 -386 -453 -234 134 -171 50 -329 0 -265 60 81 179 -55
1555 -55 52 60 68 77 299 242 -64 73 491 278 11 86 8 173 159 488 125 315 368 -202 232 180 449 293
1579 293 -303 -4 133 -200 -104 273 -275 -174 -562 -11 -260 -406 44 -287 -397 -559 171 34 -247 -304 -278
$$ packed form
1423b47j82j29N34k42K71J32n00K94l54M03K04l89kq4K41l46P00r7Mp2P9k68K61
1446B11K40j84J72m29N8K83J70j56j42j18K81k83L59j70Ok41k93N45k85L86k77
1467A33q5M5j54L9kK51m09l95N32N3k38J64m34K21k86O63l46N68m09m59J14K95
1489a39j49L80j26l37O5K97L86l85J46k20k45J77L26j8K2k66r3M96p8M7j71L31
1511D46k9p40M40M1K43m45P2R5m79P05k16j80J62j53R0j8J83k97j00j51L3L62
1533F4K88n52k62M7L11K44k02J54k01k77o7K19L68l05K21l79L29k65L25K1R8k34
1555e5J07QQRK22n7l06J37M18k13k67P5p8J65j4L29l63J90N3n70M34n2K69j56
1579B93n96K99J37l33R6L77n48J01l88N51k49j46M50l31j10j62P30j37k81n7K6
$$ plain form
1600 -278 -173 -67 -132 455 -123 -304 -383 99 126 117 -85 -113 -15 103 252 174 232 -36 171 176 86 183 205 253 -18
1625 -18 21 210 334 163 65 -9 80 180 -117 373 -255 -195 36 23 156 41 -52 -57 -116 -381 -174 27 -229 -278
1649 -278 -168 -115 -287 -97 -125 -102 -714 -305 55 59 -48 -87 -288 -62 96 154 155 -23 -71 -93 213 14 232 126
1673 126 24 111 70 389 75 66 -71 -57 69 200 256 350 108 -82 30 -134 205 126 163 -309 -80 -74 -134 98
1697 98 33 89 94 33 -174 39 58 102 -217 -80 -78 -229 -20 -86 59 -225 -254 -52 -67 -140 -292 21 -80 -227 131
1722 131 62 196 200 -363 -10 230 143 318 102 247 113 158 220 113 -21 -135 377 245 355 27 -129 -442
1744 -442 -77 -105 547 282 44 11 112 -243 92 181 -118 -319 -244 46 99 -92 -470 -113 -109 -43 -115 -92 -238
1767 -238 -280 -617 -105 -270 -46 -95 -159 -60 137 227 60 228 -57 41 -38 186 171 150 -212 109 146 91 415 485
$$ packed form
1600b78J05J06o5N87n78j81p9M82K7rk02k8R8J18J49p8N8k68K07Nr0R7K2M8k71
1625a8L9J89J24j71r8p4Q9J00k97M90o28O0K31j3J33j15r3nn9k65K07K01k56m9
1649b78J10N3j72J90k8K3o12M09L60Mj07l9k01K26J58N8Jj78m8k2L06j99K18j06
1673A26j02Q7m1L19l14rj37J4J26J31N6R4k42j90J12j64L39p9L7m72K29Oo0K32
1697I8o5N6No1k07K13J9M4l19J37Kj51K09o6J45k84k9K02j5p3j52L13j01j47L58
1722A31o9J34Mn63L53K40q7J75k16J45j34M5O2j07j34j14N12j32J10l28j56l13
1744d42L65k8O52k65k38l3J01l55L35Q9k99k01P5K90N3j91l78L57MO6p2K3j46
1767b38m2l37N12j65K24m9o4R9J97R0j67J68k85R8p9K24j5k1l62L21L7n5L24P0
$$ plain form
1791 485 190 185 53 216 -12 143 128 145 139 -39 402 197 -22 109 -121 -253 -182 -346 320 268 -221 -35 -243
1814 -243 -104 121 119 -8 -199 -187 -273 -159 32 142 -205 -157 -261 167 -300 52 51 46 65 -69 -43 19 142 101
1838 101 -12 251 61 -46 83 -198 -25 183 315 247 129 90 -147 565 110 106 80 -8 -76 -146 -133 155 156 -141
1862 -141 -27 -137 -38 46 131 -358 -260 -15 -133 -65 -109 9 -71 -265 -133 64 -69 27 124 -212 121 212 -271
1885 -271 -289 93 -345 -178 -166 -151 -7 -169 -120 71 -105 -105 87 82 -5 -30 64 35 133 -311 84 135 206 94 349
1910 349 74 -3 210 270 92 200 19 -64 -304 318 174 -49 28 -71 -36 -74 -263 91 78 -84 -137 -42 92
1933 92 -93 -123 -182 -190 -183 -128 290 45 -150 4 -172 265 26 -84 -55 -157 8 -110 -110 163 -17 152 40 115
1957 115 -25 276 270 -50 166 136 119 96 233 372 188 -291 21 499 105 -122 22 -257 -97 -48 -99 -105 -112 -28
$$ packed form
1791D85k95nj32J63k28J55j5J7oj78M41k05k19J31k30j32P1j64O66n2m89J86k08
1814b43J39K25kj27j91J2q6J14J91J10l47M8j04M28m67L52jnJ9j34K6O2J23m1
1838A01j13K63j90j07J29k81J73K08J32o8j18l9k37P12m55mk6q8o8p0J3K88Jk97
1862a41J14j10R9Q4Q5m89R8K45j18O8m4J18q0j94J32J97j33R6R7l36L33R1m83
1885b71j8L82m38J67J2J5J44j62M9J91j76%J92nq7k5R4k9R8m44L95N1P1j12K55
1910C49k75p7K13O0j78J08j81q3k40O22j44k23P7r9L5l8j89L54j3j62n3R5J34
1933I2j85l0n9qPN5M18k45j95J54j76M37k39j10K9j02J65j18%K73j80J69j12P5
1957A15j40L01ol20K16l0j7k3J37J39j84m79L12M78l94k27J44k79J60M9n1opQ4
$$ plain form
1981 -28 -255 -278 208 96 -101 -285 -41 77 -162 2 9 -27 -123 -53 111 -272 -90 12 -222 10 -234 337
2003 337 118 2 -94 -164 68 180 180 -78 -49 37 -144 97 -58 254 28 146 -138 158 16 34 85 -17 -32
2026 -32 311 13 124 92 95 -71 184 33 45 -76 222 -93 -54 -216 -134 45 203 -88 -120 170 -32 -139 -164
2049 -164 73 -334 127 6 -267 56 -172 -101 167 -126 -221 -282 -117 -58 -5 268 42 183 -272 -231 -384 -94
2071 -94 209 92 306 312 -109 178 396 -205 214 157 -10 -129 209 -49 94 -18 102 -178 -36 -5 -203 77
2093 77 -82 -76 40 14 -238 -514 -268 -23 85 57 95 -395 -177 29 158 52 -170 -153 -74 -88 101 -253 97
2116 97 -178 -136 33 -1 7 77 444 -187 125 -57 -90 83 -225 32 -52 152 -160 84 -168 304 1 87 -16
2139 -16 -146 258 -337 213 -238 -289 -16 -34 -99 -61 182 -96 163 -303 1 -273 -4 -293 -132 -127 -28 38 -23
$$ packed form
1981b8k27k3M86j12j97j84K44J18k39J64Pl6r6P0J64l83J82J02k34K32k44N71
2003C37k19j16r6p0K32J12%k58K9Q6j81K41j55L12k26J18k84K96j42J8N1j02j5
2026c2L43k98J11l2Lj66K55j51J2j21K98l15L9j62Q2J79J58k91l2K90k02j07k5
2049a64K37m07M61j21k73L23k28P1K68k93r5o1J65N9N3K73k26J41m55M1j53K90
2071i4L03j17K14Om21K87K18o01M19n7j67j19L38k58J43j12J20k80J42L1j98K80
2093G7j59OJ16k6k52k76K46K45J08k8L8m90K18K06J29j06k22J7P9j4J89l54L50
2116I7k75M2J69l4QP0L67o31L12j82l3J73l08K57q4K04l12K44k52M72l03Q6j03
2139a6j30M04n95N50m51n1K73j8o5L8K43k78K59m66L04k74K69k89J61NR9O6o1
$$ plain form
2162 -23 -67 -163 -31 125 179 -177 -102 -51 124 230 -112 1 34 -15 -197 267 81 -36 -40 -101 146 164 161 -114 -336
2187 -336 11 78 -48 75 158 65 -227 51 43 -9 154 -28 73 -103 -142 253 42 -196 -178 -101 74 43 -134
2210 -134 -94 -60 -166 -251 97 116 -105 -14 74 -228 200 15 245 151 157 -68 313 23 111 -85 -385 -103 232
2233 232 139 -15 299 125 -69 175 78 161 158 118 153 -131 -13 219 26 -25 -113 68 28 160 -204 170 84 153
2257 153 134 -199 129 54 -88 -128 -61 49 92 -76 -104 -260 -143 134 -112 161 158 -45 -6 -144 9 -60 -143 3
2281 3 44 148 431 226 52 207 -16 -55 273 159 284 240 183 -286 216 279 -139 -172 178 247 -75 -231 -64
2304 -64 71 4 235 38 185 -60 -143 244 140 32 -106 186 2 32 -133 223 -213 -280 -173 125 -209 38
2326 38 126 5 191 37 25 180 -21 -130 134 -48 -204 123 -67 255 -8 249 -98 147 147 -156 53 190
$$ packed form
2162b3m4r6J32J56N4l56P5N1J75J06l42J13L3m9j82M64j86j17mo1K47J8lk75k22
2187c36L47O7j26J23Q3r3k92K78qn2J63j82J01j76l9L95k11k38J8P7J75l1j77
2210a34M0L4j06q5L48J9k21R1Q8l02M28j85K30r4Ok25L81k90Q8j96l00K82L35
2233B32r3j54L14j74j94K44r7Q3lm0L5k84J18K32j93n1q8J81m0J32l64L74q6O9
2257A53j9l33L28p5j42m0O7J10M3j68k8j56J17K77k46K73lk03L9j38J53o9q3J46
2281CM1J04K83k05j74J55k23l9L28j14J25m4n7m69N02O3m18l3L50O9l22j56J67
2304f4J35o7K31j97J47k45q3L87j04j08j38K92j84L0j65L56m36o7J07K98l34K47
2326C8Q8j21J86j54j2J55k01j09K64j82j56L27j90L22k63K57l47K45%l03K09J37
$$ plain form
2348 190 66 -163 -205 -107 -125 52 182 34 -2 -43 -96 -207 153 66 155 -151 181 161 21 -122 228 50 236
2371 236 -30 73 23 97 80 -72 -82 42 -145 -272 -150 -94 153 -16 167 -256 -115 -252 -74 113 -138 -233
2393 -233 -177 -99 -208 114 31 -28 30 -162 252 -54 95 72 162 -112 53 61 -113 68 -2 -140 -237 236 181 -153
2417 -153 107 99 31 19 246 72 52 2 -114 -470 333 220 26 44 -191 -174 -206 -59 -19 95 -141 -32 101
2440 101 -109 -12 -365 -131 -231 26 131 154 335 96 -258 -290 -14 331 -74 -103 121 51 0 103 74 192
2462 192 -467 78 -142 -126 315 -27 119 321 0 54 39 111 -256 -148 89 -18 -28 -203 -302 194 -144 116
2484 116 -135 -98 205 103 -147 -58 42 210 -235 87 145 -326 29 -290 -222 23 -91 96 22 12 73 -25 -267
2507 -267 -14 -144 129 -16 -71 -197 76 -28 -441 358 -15 38 -215 -28 9 38 -250 -68 -70 188 -110 156
$$ packed form
2348A90j24k29m2R8j8J77J30j48l6m1n3j11L60q7Q9l06L32k0j40j43L50j78J86
2371B36k66J03n0P4j7j52j0J24j87j27J22N6K47j69J83m23J41j37J78J87k51r5
2393b33N6P8j09L22q3n9N8j92M14l06J49k3R0k74J65Qj74J81p0j38r7M73n5l34
2417a53K60qo8j2K27j74k0n0j16l56Q03j13j94J8k35J7l2J47M0J14k36J09J33
2440A01k10R7l53K34j00K57J05K3J81k39l54l2K76L45m05k9K24p0n1J03k9J18
2462A92o59N45k20J6M41l42J46K02l21N4j5P2l67J08K37j07j0j75r9M96l38K60
2484A16k51L7L03j02k50Q9J00J68m45L22N8m71L55l19O8K45j14J87p4j0O1r8k42
2507b67K53j30K73j45n5j26K73j04m13P99l73N3k53J87L7K9k88J82kK58k98K66
$$ plain form
2529 156 378 226 103 -80 229 79 -166 -10 42 -374 128 191 -13 -79 239 -197 -121 2 275 -295 -289 -349
2551 -349 -171 16 -70 -157 -24 -265 -194 -92 68 143 62 -227 17 141 -71 506 36 194 -27 -125 -24 -121
2573 -121 -208 28 -328 -111 128 -33 -143 -288 119 -46 122 109 -8 -146 233 -75 151 278 23 -52 -107
2594 -107 108 -52 -97 -55 -63 118 -10 -81 385 62 -156 -7 -171 -4 95 -161 -35 -38 -43 -174 -32 -143 -156 119
2618 119 -50 185 -111 15 29 176 -126 -132 47 -195 -127 90 -69 193 190 216 86 34 -64 -222 253 0 304
2641 304 29 -85 -209 183 130 -19 144 49 31 236 92 106 57 -176 -9 31 448 27 -55 -47 -57 -148 5 109
2665 109 -109 55 -252 51 -39 -77 53 34 -7 -29 241 93 -286 -66 -90 -4 -77 374 -19 46 65 -121 157
2688 157 -11 -157 -63 -57 -233 -343 4 54 -24 99 309 320 -94 12 -68 44 187 -62 -24 -27 145 160 -83 -224
$$ packed form
2529A56K22j52j23j83L09j50k45J56N2m16N02O3k04o6L18m36P6J23K73n70Oo0
2551c49J78J87q6q7J33k41P1J02J60P5q1k89K44J24k12N77m70J58k21r8J01r7
2573a21q7K36l56K17K39j61j10j45M07j65J68j3j17j38L79l08K26J27k55p5n5
2594a07K15j60m5M2qJ81j28p1M66l23k18J49j64J67R9k56J26lnj31J42j11j3K75
2618A19j69K35k96J26J4J47l02oJ79k42O8K17j59K62lK6j30n2r8j58M75k53L04
2641C04k75j14j24L92n3j49J63r5j8K05j44J4m9k33J67M0M17m21q2Qj0r1J53J04
2665A09k18J64l07L03r0l8J30j9m1k2K70j48l79K20k4Q6p3M51l93O5J9j86K78
2688A57j68j46R4Oj76j10L47N0p8J23K10J1m14J06q0J12J43k49L8lJ72J5k43j41
$$ plain form
2712 -224 -79 -203 189 192 -398 50 -197 -191 -9 3 -9 170 112 -58 145 -38 281 -175 -30 -188 -138 172 -110
2735 -110 183 73 -89 80 -251 -4 -39 146 -176 -37 296 -65 70 77 35 4 112 179 163 -67 8 285 -49
2758 -49 -14 -85 -209 -81 130 -170 -19 -35 160 -70 6 234 250 -92 55 -243 14 -113 -13 -83 210 -240
2780 -240 285 324 -17 71 -12 -79 -10 300 15 -147 110 -28 178 -50 -297 21 174 -89 305 191 -279 223
2802 223 -38 54 -183 -222 -39 156 -66 -143 105 -92 -167 354 -315 113 50 -49 232 190 149 124 -75 23 -88
2825 -88 261 -85 -123 -98 -278 19 83 -119 -22 -157 -55 -238 184 29 -159 -139 39 84 -82 -166 164 46 235
2848 235 84 -281 131 -123 28 387 -25 -28 132 -110 150 220 -135 -12 -16 -31 104 -25 -8 -64 231 177 -129
2871 -129 47 21 -54 -245 -83 6 143 -195 -50 -176 320 -219 58 -315 127 -77 -69 -91 81 -142 35 116
$$ packed form
2712b24J45j24L92Ln90M48k47OJ82J2j2J79n8j70K03j83L19m56J45j58N0L10k82
2735a10K93j10j62J69l31K47l5J85l22J39L33l61J35Pm2l1J08O7j6k30P5K77l34
2758d9L5p1j24J28K11l00J51j6J95k30P6K28J6l42J47k98K57j27J00p0K93m50
2780b40N25L9l41Q8q3o7O9L10k85j62K57j38K06k28k47L18J53k63L94j14m70N02
2802B23k61R2k37l9J83J95k22p7K48j97p5N21o69M28o3r9K81m2m1k5j99R8j11
2825h8L49l46l8K5j80K97O4k02R7j35J02j83M22j55j88K0J78M5j66q4L30j18J89
2848B35j51l65M12k54J51L59m12lJ60k42K60P0l55J23mj5J35j29J7n6K95n4l06
2871a29J76k6p5j91J62Q9J37l38J45j26M96n39K77l73M42k04Qk2J72k23J77Q1
$$ plain form
2893 116 -88 66 -241 -124 -285 73 3 -137 -166 -204 -184 136 -145 53 43 93 -1 70 322 -29 -120 -49 -126 177
2917 177 -185 -197 212 -111 -90 158 -85 -28 74 39 146 -276 95 49 38 -146 27 -84 -300 0 34 9 -24
2940 -24 -54 157 60 111 -17 -66 352 90 28 28 -208 42 151 -168 -132 171 6 272 -270 -4 -268 475 -148
2963 -148 -100 51 -246 31 28 -62 -40 470 45 31 -66 -146 67 -292 -141 102 113 -126 184 -209 -17 -88 -348
2986 -348 -144 -42 99 -79 -250 164 -273 -153 -130 22 -296 -190 -21 -38 -305 134 -82 -89 -20 -187 51 -6
3008 -6 128 10 -106 10 159 4 -50 -37 180 -187 -58 -38 23 228 181 105 -39 -86 -101 117 85 39 -78 89
3032 89 -144 3 169 252 -230 -266 -227 167 -150 -324 147 112 124 231 60 298 95 7 -309 -25 125 -201
3054 -201 -42 -38 49 159 -268 123 -183 26 -34 26 154 86 -176 -218 -7 -150 170 -67 230 -93 -248 150
$$ packed form
2893A16k04J54l07J17j61L58p0j40k9l8K0L20k81J98j0N0r4P1K52l51r1P1p7L03
2917A77l62j2M09l23K1K48k43N7J02l5J07m22L71m6j1j84J73j11k16L00L4k5l3
2940b4l0K11r7N1j28m9M18k62o2%k36K50J09l19L6L03j65K66n42K66k64P43o23
2963a48M8J51k97K77lr0K2N10m25j4r7q0K13l59J51K43J1k39L10l93J92p1k60
2986c48K04J02J41j78j71M14m37J20K3J52l18J06J69j7k67M39k16pO9j67K38n7
3008fJ34j18j16J16J49j55n4J3K17l67J29K0O1K05m7p6j44m7j5K18l2m6j17J67
3032H9k33J47J66Q3m82l6L9L94l17j74M71l5J2J07j71K38k03q8l16K84J50l26
3054b01J59MQ7J10m27L91l06K09o0O0J28o8k62m2K11j43L20k37K97l23j55L98
$$ plain form
3076 150 -113 -102 -195 144 165 -52 156 -206 -30 1 76 -14 -53 -43 90 -203 110 0 168 -340 -285 61 -23
3099 -23 -190 22 -113 -42 177 -168 86 277 85 68 -80 -100 80 -57 213 267 -128 52 87 -156 -264 238
3121 238 -97 8 26 141 138 173 333 51 -275 -74 45 -165 -11 -135 150 -21 -77 -162 181 25 -13 106
3143 106 -30 -204 -101 -139 152 57 -132 -84 -150 -252 -9 116 -7 -68 6 -89 4 219 202 -172 -130 25 125
3166 125 -134 27 73 84 24 -260 370 87 126 -26 -207 41 149 -291 -448 -119 -24 -241 321 141 -256 -152
3188 -152 -213 23 89 76 137 -276 -127 36 -324 316 75 -136 -148 146 65 347 -211 55 -117 85 199 -117
3210 -117 -94 -37 175 -239 130 47 -27 140 -82 -71 32 -113 -29 206 -18 -75 -47 -367 -96 39 -68 -133 47
3233 47 158 115 206 43 -162 -169 -66 276 -83 -135 -101 395 -3 -181 -17 -204 116 94 -178 422 -74 46 171
$$ packed form
3076A50k63J1r3L39K1k17K08l62J76L1P5r0l9J0J33k93L13j10J68n08N5L46q4
3099b3j67K12j35P1K19l45K54J91j92j7j48k0J80j37K70N4l95J80L5k43j08N02
3121B38l35J05J8J15lL5J60k82l26K01J19k10J54j24K85j71n6q5L43j56l8J19
3143A06j36j74J03l8K91r5j89M8o6j02K43J25j23o1P4r5R3K15j7l74M2J55J00
3166A25k59J61M6J1o0k84O30k83L9j52j81K48J08m40j57L29R5k17N62j80l97J04
3188a52o1K36O6j3O1m13J49J63l60O40k41k11j2K94q1K82n58K66j72K02J14l16
3210a17K3N7K12m14L69q3p4J67k22J1J03j45Q4K35k24n7K8l20K71J35j07o5J80
3233D7J11m3R1j63k05pJ03L42l59n2L4M96l98j78J64j87L20k2k72O00m96J20J25
$$ plain form
3256 171 -143 47 263 267 -41 118 85 -130 189 14 -45 -111 -388 18 -127 -158 148 115 -38 96 -65 28 27
3279 27 163 -276 -106 332 223 89 -100 149 99 -31 -315 223 82 -86 -76 -98 134 223 -144 88 194 -63
3301 -63 122 -44 -36 -31 -136 -78 -440 317 116 -38 -189 -1 -84 -38 -61 83 -168 -280 5 -37 -15 -34 81 66
3325 66 70 -84 221 213 -94 42 -181 -180 318 -226 67 174 -50 161 -38 67 -175 14 6 -34 -44 -137 97 -169
3349 -169 -44 -122 290 56 126 137 230 -75 -67 166 149 -291 133 42 -233 -97 146 -184 190 -104 50 -239 266
3372 266 -309 -195 167 -167 115 -91 59 60 210 -374 70 219 30 73 249 308 34 195 -10 -115 213
3393 213 41 133 42 -41 -115 -145 35 -254 131 119 -83 -52 64 -300 132 -133 -190 -37 -11 234 93 -284 4
3416 4 -27 364 -7 86 -135 157 54 -131 50 115 171 -76 -48 53 257 107 84 -87 -73 -234 181 -1 -60
$$ packed form
3256A71l14J90K16Ml08J59l3k15L19j75n9o6k77M06j45l1L06l3j53J34j61R3j
3279B7J36m39J70M38j09j34j89K49n0j30k84N38j41j68J0k2K32Q9l67K32J06k57
3301f3J85j66QNj05N8l62P57k01j54j51J88q3M6k3J44k51j12K85m2K2j9J15j5
3325F6Mj54L05ql07J36k23JM98n44K93J07k24K11j99J05k42J89qm0j0r3K34k66
3349a69J25p8M12k34P0J1R3l05QK33j7m40M24r1k75J36K43l30L74k94J54k89N05
3372B66n75J14L62l34K82k06J50JJ50n84M44J49j89M3J76N9k74J61k05j05L28
3393B13j72R2r1q3p4l0J80k89L85j2k02L1J16l64M32k65n7J53K6K45j41l77K88
3416Dl1L91l71R3k21K92j03j85J81O5N6k47K8J01K04j50k3j71J4j61M15j82n9
$$ plain form
3439 -60 213 242 -334 -65 -172 -271 -164 170 -201 -41 95 138 -5 -51 -28 -9 3 119 -50 -288 -49 -144 426
3462 426 161 -191 -51 95 -19 91 -125 -101 98 -49 -170 29 438 68 -87 -271 85 162 39 79 -334
3483 -334 -67 -77 -56 49 419 5 390 291 111 151 64 19 172 -107 125 -169 -176 55 -115 132 304 -172 -21
3506 -21 18 -79 -29 250 -237 -325 31 -198 -234 55 -231 -20 46 -151 58 1 -95 -387 142 -19 97 -145 -213
3529 -213 -14 -154 238 30 100 71 -2 110 -136 366 -276 -101 -178 183 135 -51 -59 -23 249 244 -180 142 -11
3552 -11 134 -343 -319 -368 -14 202 -47 -95 249 136 -54 -96 149 9 32 -15 55 -29 265 37 156 119 195 251
3576 251 -67 218 -118 -2 -148 -127 -210 -156 104 135 -23 -97 20 59 -125 29 -31 -188 -95 103 33 151 201
3599 201 144 -8 82 -131 -65 -26 -248 -245 -302 -241 -44 84 -51 -202 -213 -376 103 -125 -25 -205 -80 -47 13 208
$$ packed form
3439f0K73K9n76K69j07r9J07L34l71J60J36M3j43m6K3J9J2J16j69k38K39r5N70
3462D26k65l52J40J46j14J10k16K4J99j47j21J99M09l70j55j84L56P7j23M0m13
3483c34K67j0K1J05L70m14L85r9j80M0q7m5J53k79K32k94pK31j70K47J72m76J51
3506b1L9r7N0K79m87q8L56k29l6K89k86K11O6j97K09n7r6k92N29j61J16k42o8
3529b13J99j40L92k08P0k9p3J12k46N02o42J75p7L61m8j86qL6K72nm24L22j53
3552a1J45m77K4m9L54K16k49m8L44j13j90m2K45j40K3m7P0q4K94k28J19l7P6N6
3576B51l18K85l36J16j46K1q3N4K60L1j58p4J17L9j84J54o0j57R3J98p0J18N0
3599B01n7j52R0k13O6L9k22Ln7O1J97J28j35j51j1j63M79k28J00j80J25L3O0J95
$$ plain form
3623 208 -243 -99 -380 -55 20 27 107 -216 -71 311 -155 -248 -17 178 49 -182 -54 140 -132 12 62 320
3645 320 -101 3 107 143 288 96 226 132 -62 -42 19 3 225 254 163 361 118 230 -42 -9 -56 51 218
3668 218 -187 -51 -142 -13 -124 212 -165 51 90 149 239 -148 96 196 133 -10 -220 46 -11 126 -150 -64
3690 -64 72 162 -1 -96 -238 178 27 245 -147 77 38 -275 -156 -50 82 148 -41 80 -130 150 -339 -5
3712 -5 -82 -275 213 -176 56 -93 24 -114 139 31 2 305 -262 19 43 3 -94 -184 221 -258 -18 1 9 -47
3736 -47 -36 164 76 -247 357 141 35 80 -387 -363 73 -154 -105 18 32 44 -310 -144 121 2 514 -80 -38
3759 -38 80 -190 37 91 77 6 -126 -134 38 -140 -7 76 -31 -252 -234 -80 194 -77 156 48 -72 106 476
3782 476 88 19 203 288 -14 31 82 86 236 -144 114 -34 -56 -3 47 -164 3 41 147 -164 134 -274 4
$$ packed form
3623B08m51J44k81L25P5PQ0l23J45L82m66r3K31J95j29k31J28J94k72J44N0K58
3645C20m21J04J04L6J45j92J30r4j94K0O1j6K22K9r1J98k43J12k72L3m7J07J67
3668B18m05J36r1J29j11L36l77K16L9N9R0l87K44J00o3j43k10K66n7J37k76Q6
3690f4J36R0j63r5j42M16j51K18l92K24l9l13J19J06J32O6j89J21k10K80m89L34
3712ep7j93M88l89K32j49J17j38K53j08k9L03n67K81K4m0r7r0M05m79K40J9Qn6
3736d7J1K00q8l23O04k16j06M5m67K4M36k27M9J23J4J2l54J66K65j19N12n94M2
3759c8J18k70K27N4j4p1j32qJ72j78J33Q3j07k21J8J54K74k71K33j08j20J78L70
3782D76l88o9J84Q5l02M5N1MJ50l80K58j48k2N3N0k11J67L8J06l11K98m08K78
$$ plain form
3805 4 42 -330 32 114 -208 57 147 -163 143 32 221 -58 -59 129 28 146 270 -43 -115 165 93 -71 -175
3828 -175 55 175 -320 80 95 196 -43 -207 110 138 -263 -79 305 -208 -33 139 176 106 379 -256 185
3849 185 -220 93 107 205 -41 -74 -265 215 191 55 78 -106 139 183 -29 -84 82 -149 96 -33 -317 -128
3871 -128 -66 -135 110 33 60 -79 38 133 -228 131 122 -76 -275 143 77 -135 -29 50 -131 185 68 -21 -164
3894 -164 -137 -233 -102 -63 348 -414 -105 23 188 186 267 -43 -72 20 -230 129 26 -1 147 -9 81 -192 209
3917 209 365 -142 -3 -117 336 -111 263 -158 202 -69 -22 28 47 -75 -68 18 -71 127 68 -288 -35 182 2
3940 2 -123 70 -158 -91 -82 -225 28 -68 215 -39 -64 54 51 85 -73 -106 299 158 -115 231 -125 -3 -99 -13
3964 -13 -123 143 59 120 -92 -55 -5 -270 32 173 -34 113 322 42 -32 -138 248 -332 80 64 -73 65
$$ packed form
3805DL8l72L62Q2l22K65R0l10L06j11J89k79jJ88j01J18J24l13p2K80p2j64j04
3828a75K30J20m95M00J5J01k39j64L17K8m01J84L84n13J75J72L7p0K73o35M41
3849A85m05L13J4R8k46l3j91M80k4j36K3j84K45M4k12n5J66k31K45j29k84J89
3871a28O2o9K45p7K7j39J17R5l61L59rj98j99M18o6k12J06P9j81L16j17q9j43
3894a64K7r6J31L9M11p62L09J28J65kQ1l10k9R2k50L59j03k7J48j56R0k73M01
3917B09J56n07J39j14M53m47L74m21L60k71M7N0J9j22PQ6q9J98n9l56K53K17j80
3940Bj25J93k28O7Rj43K53r6K83k54k5J18lL4j58l3M05j41k73L46l56J22r6Q6
3964a3j10K66q4O1k12L7N0k65L02J41k07J47K09k80p4j06L86n80M12j6j37J38
$$ plain form
3986 65 88 -107 128 76 -1 -209 -313 -299 177 -166 -41 192 -89 100 311 -205 -18 166 369 22 -342 -5
4008 -5 -90 53 81 54 145 77 -73 -99 247 299 -22 52 -112 -35 31 -9 140 10 58 129 30 -169 -27 -203 66
4033 66 -18 -131 178 18 138 -26 -1 73 -208 177 112 -70 -53 -99 12 270 -121 124 -88 131 108 -132 250
4056 250 -49 -113 198 -157 -172 -20 16 -165 118 302 -254 391 -355 -86 -120 -7 25 155 -133 116 162 -21
$$ packed form
3986F5K3j95K35n2p7k08j04J4M76l43J25K33k81J89K11n16J87J84K03l47l64L37
4008eq5J43K8k7R1o8j50k6L46N2l21P4j64P7O6m0J49j30M8P1r9j99J42j76K69
4033F6q4j13L09j60J20j64K5P4k81L85o5j82J7m6J11K58l91K45k12K19k3k40L82
4056B50k99o4L11l55j5J52L6j81K83J84n56O45p46K69l4J13L2J30k88K49M6j83
$$ [...]
8191a44
##END NTUPLES=NMR FID
##END=
