##TITLE=1H_BAU-j-2908M
 CDCl3, 8 sc, 
 29.8.2019
##JCAMPDX= 6.0         $$ Bruker NMR JCAMP-DX V2.0
##DATA TYPE= NMR FID
##DATA CLASS= NTUPLES
##ORIGIN= UXNMR, Bruker Analytische Messtechnik GmbH
##OWNER= root
$$ XWIN-NMR		Version 3.5
$$ Thu Aug 29 14:15:20 2019 Russian Standard Time (UT+4h)  she@DPX200
##.OBSERVE FREQUENCY= 200.13155
##.OBSERVE NUCLEUS= ^1H
##.DELAY= (6, 6)
##.ACQUISITION MODE= SIMULTANEOUS
##.ACQUISITION SCHEME= undefined
##.AVERAGES= 8
##.DIGITISER RES= 18
##SPECTROMETER/DATA SYSTEM= spect
##.PULSE SEQUENCE= zg30
##.SOLVENT NAME= CDCl3
##.SHIFT REFERENCE= (INTERNAL, CDCl3, 0, 15.7039)
##AUDIT TRAIL= $$ (NUMBER, WHEN, WHO, WHERE, WHAT)
$$ ##TITLE= Audit trail, XWIN-NMR		Version 3.5
$$ ##JCAMPDX= 5.01
$$ ##ORIGIN= Bruker BioSpin GmbH
$$ ##OWNER= she
$$ F:/spectra/data/she/nmr/H-F/1/audita.txt
$$ ##AUDIT TRAIL=  $$ (NUMBER, WHEN, WHO, WHERE, WHAT)
(   1,<2019-08-29 14:14:30.59 +0400>,<she>,<DPX200>,
      <created by zg, POWCHK disabled, PULCHK disabled
       configuration hash MD5:
       00 E9 B6 7A A2 85 ED C7 34 08 36 98 17 FE 4E 26
       data hash MD5: 16K
       47 A5 23 F4 8A B8 1D 92 42 EA E9 0F 9A E0 39 48>)
$$ ##END=
$$ 
$$ hash MD5
$$ 4D E9 07 85 7B 19 99 58 5C 44 D1 12 45 74 6B 45
##$RELAX= 
##$RELAX= 
##$RELAX= 
##$RELAX= 
##$RELAX= 
##$RELAX= 
$$ Bruker specific parameters
$$ --------------------------
##$DU= <F:/spectra>
##$EXPNO= 1
##$NAME= <H-F>
##$PROCNO= 1
##$TYPE= <nmr>
##$USER= <she>
##$AMP= (0..31)
100 100 100 100 100 100 100 100 100 100 100 100 100 100 100 100 100 100 
100 100 100 100 100 100 100 100 100 100 100 100 100 100 
##$AQSEQ= 0
##$AQ_mod= 1
##$AUNM= <au_zg>
##$AUTOPOS= <>
##$BF1= 200.13
##$BF2= 200.13
##$BF3= 200.13
##$BF4= 200.13
##$BF5= 200.13
##$BF6= 200.13
##$BF7= 200.13
##$BF8= 200.13
##$BYTORDA= 1
##$CFDGTYP= 0
##$CFRGTYP= 5
##$CHEMSTR= <none>
##$CNST= (0..31)
1 1 145 1 1 1 1 1 1 1 1 1 1 1 1 1 1 1 1 1 1 1 1 1 1 1 1 1 1 1 1 1 
##$CPDPRG= <>
##$CPDPRG1= <>
##$CPDPRG2= <>
##$CPDPRG3= <>
##$CPDPRG4= <mlev>
##$CPDPRG5= <mlev>
##$CPDPRG6= <mlev>
##$CPDPRG7= <mlev>
##$CPDPRG8= <mlev>
##$CPDPRGB= <>
##$CPDPRGT= <>
##$D= (0..31)
0 1.2 0 0 0 0 0 0 0 0 0 0.03 0 0 0 0 0 0 0 0 0 0 0 0 0 0 0 0 0 0 0 0 
##$DATE= 1567073669
##$DBL= (0..7)
120 120 120 120 120 120 120 120 
##$DBP= (0..7)
150 150 150 150 150 150 150 150 
##$DBP07= 0
##$DBPNAM0= <>
##$DBPNAM1= <>
##$DBPNAM2= <>
##$DBPNAM3= <>
##$DBPNAM4= <>
##$DBPNAM5= <>
##$DBPNAM6= <>
##$DBPNAM7= <>
##$DBPOAL= (0..7)
0.5 0.5 0.5 0.5 0.5 0.5 0.5 0.5 
##$DBPOFFS= (0..7)
0 0 0 0 0 0 0 0 
##$DE= 6
##$DECBNUC= <off>
##$DECIM= 24
##$DECNUC= <off>
##$DECSTAT= 4
##$DIGMOD= 1
##$DIGTYP= 9
##$DL= (0..7)
0 120 120 120 120 120 120 120 
##$DP= (0..7)
150 150 150 150 150 150 150 150 
##$DP07= 0
##$DPNAME0= <>
##$DPNAME1= <>
##$DPNAME2= <>
##$DPNAME3= <>
##$DPNAME4= <>
##$DPNAME5= <>
##$DPNAME6= <>
##$DPNAME7= <>
##$DPOAL= (0..7)
0.5 0.5 0.5 0.5 0.5 0.5 0.5 0.5 
##$DPOFFS= (0..7)
0 0 0 0 0 0 0 0 
##$DQDMODE= 0
##$DR= 18
##$DS= 0
##$DSLIST= <SSSSSSSSSSSSSSS>
##$DSPFIRM= 0
$$ [...]
##$SUBNAM2= <"">
##$SUBNAM3= <"">
##$SUBNAM4= <"">
##$SUBNAM5= <"">
##$SUBNAM6= <"">
##$SUBNAM7= <"">
##$SUBNAM8= <"">
##$SUBNAM9= <"">
##$SW= 24.9336996594482
##$SWIBOX= (0..15)
0 0 2 0 0 0 0 0 0 0 0 0 0 0 0 0 
##$SW_h= 4990.01996007984
##$TD= 16384
##$TD0= 1
##$TE= 0
##$TE2= 300
##$TE3= 300
##$TEG= 300
##$TL= (0..7)
0 120 120 120 120 120 120 120 
##$TP= (0..7)
150 150 150 150 150 150 150 150 
##$TP07= 0
##$TPNAME0= <>
##$TPNAME1= <>
##$TPNAME2= <>
##$TPNAME3= <>
##$TPNAME4= <>
##$TPNAME5= <>
##$TPNAME6= <>
##$TPNAME7= <>
##$TPOAL= (0..7)
0.5 0.5 0.5 0.5 0.5 0.5 0.5 0.5 
##$TPOFFS= (0..7)
0 0 0 0 0 0 0 0 
##$TUNHIN= 0
##$TUNHOUT= 0
##$TUNXOUT= 0
##$USERA1= <user>
##$USERA2= <user>
##$USERA3= <user>
##$USERA4= <user>
##$USERA5= <user>
##$V9= 5
##$VALIST= <valist>
##$VCLIST= <CCCCCCCCCCCCCCC>
##$VD= 0
##$VDLIST= <DDDDDDDDDDDDDDD>
##$VPLIST= <PPPPPPPPPPPPPPP>
##$VTLIST= <TTTTTTTTTTTTTTT>
##$WBST= 1024
##$WBSW= 4
##$XGAIN= (0..3)
0 0 0 0 
##$XL= 0
##$YL= 0
##$YMAX_a= 72393
##$YMIN_a= -76127
##$ZGOPTNS= <>
##$ZL1= 120
##$ZL2= 120
##$ZL3= 120
##$ZL4= 120
##$ABSF1= 10
##$ABSF2= 0
##$ABSG= 5
##$ABSL= 3
##$ALPHA= 0
##$AQORDER= 0
##$ASSFAC= 0
##$ASSFACI= 0
##$ASSFACX= 0
##$ASSWID= 0
##$AUNMP= <proc_1d>
##$AZFE= 0.1
##$AZFW= 0.1
##$BCFW= 1
##$BC_mod= 2
##$BYTORDP= 1
##$COROFFS= 0
##$CY= 11.3945322036743
##$DATMOD= 1
##$DC= 2
##$DFILT= <>
##$DTYPP= 0
##$F1P= 20.1720416913024
##$F2P= 0.152960286110954
##$FCOR= 0.5
##$FTSIZE= 0
##$FT_mod= 4
##$GAMMA= 1
##$GB= 0.15
##$INTBC= 1
##$INTSCL= 1
##$ISEN= 128
##$LB= 0.24
##$LEV0= 0
##$LPBIN= 0
##$MAXI= 10000
##$MC2= 0
##$MEAN= 0
##$ME_mod= 0
##$MI= 1.114404
##$NCOEF= 0
##$NC_proc= 0
##$NLEV= 6
##$NOISF1= 3.799351
##$NOISF2= 2.8
##$NSP= 1
##$NTH_PI= 0
##$NZP= 0
##$OFFSET= 15.70392
##$PC= 1
##$PHC0= -9221.323
##$PHC1= 28.40096
##$PH_mod= 1
##$PKNL= yes
##$PPARMOD= 0
##$PSCAL= 0
##$PSIGN= 0
##$REVERSE= no
##$SF= 200.130013532006
##$SI= 16384
##$SIGF1= 3
##$SIGF2= 2
##$SINO= 400
##$SIOLD= 16384
##$SREGLST= <1H.CDCl3>
##$SSB= 0
##$STSI= 0
##$STSR= 0
##$SW_p= 3612.71676300578
##$SYMM= 0
##$S_DEV= 0
##$TDeff= 0
##$TDoff= 0
##$TI= <>
##$TILT= no
##$TM1= 0
##$TM2= 0
##$TOPLEV= 0
##$USERP1= <user>
##$USERP2= <user>
##$USERP3= <user>
##$USERP4= <user>
##$USERP5= <user>
##$WDW= 1
##$XDIM= 8192
##$YMAX_p= 0
##$YMIN_p= 0
$$ End of Bruker specific parameters
$$ ---------------------------------
##NTUPLES= NMR FID
##VAR_NAME=  TIME,          FID/REAL,        FID/IMAG
##SYMBOL=    X,             R,               I
##VAR_TYPE=  INDEPENDENT,   DEPENDENT,       DEPENDENT
##VAR_FORM=  AFFN,          ASDF,            ASDF
##VAR_DIM=   8192,          8192,            8192
##UNITS=     SECONDS,       ARBITRARY UNITS, ARBITRARY UNITS
##FACTOR=    0.0002004,     1,               1
##FIRST=     0,             0,               0
##LAST=      1.6414764,     0,               0
##MIN=       0,             -76127,          0
##MAX=       1.6414764,     72393,           0
$$ Real data points
##PAGE= N=1
##DATA TABLE= (X++(R..R)), XYDATA
$$ plain form
0 0 0 0 0 0 0 0 0 0 0 -8 8 -8 8 -8 16 -16 16 -24 24 -32 34 -41 48 -56 65 -74 83 -96 108 -122 138 -155 175
33 175 -194 217 -242 271 -300 334 -369 410 -454 502 -556 616 -685 760 -846 944 -1062 1195
51 1195 -1357 1555 -1804 2128 -2569 3206 -4221 6088 -10716 50180 37668 -23021 49625 72393
65 72393 23788 -1260 49083 49592 6637 7976 49815 32353 -7390 8605 47817 22027 -14827
78 -14827 4137 36600 12727 -15163 3311 25130 4029 -14194 2320 14417 -3989 -13680
90 -13680 3474 11263 -8982 -18342 1684 11594 -9905 -21352 -201 10804 -9902 -18732 1104
103 1104 6020 -14717 -14825 8302 4858 -21415 -14416 13461 4820 -24506 -14279 14016 2035
116 2035 -24114 -9694 11473 -7677 -24487 -1687 10650 -16786 -26397 2522 8415 -21982 -25319
$$ packed form
0@%%%%%%%%%qJ6j6J6j6K4l2L2m0M8n6O6p5Q9j04J21j39J57j79K04k30K60k93L30
33A75l69M11m59N13n71O34p03P79q64R56j058J172j301J445j606J790k006K257
51A195k552K912l359L932m697N775p427J0309j6804O0896j2512o0689P2646K2768
65G2393m8605k5048N0343N09m2955J339M1839j7462l9743J5995L9212k5790l6854
78a4827J8964L2463k3873k7890J8474K1819k1101j8223J6514J2097j8406r691
90a3680J7154P789k0245r360K0026R910k1499j1447K1151J1005k0706q830J9836
103A104M916k0737j08K3127l444k6273O999K7877q641k9326J0227K8295j1981
116B035k6149J4420K1167j9150j6810K2800J2337k7436r611K8919N893l0397l337
$$ plain form
129 -25319 3754 4675 -22949 -21625 2048 -1985 -22372 -15130 2770 -6788 -22523 -9567 5023
142 5023 -9202 -22056 -6525 7282 -5984 -17450 -5030 5862 -2962 -10903 -821 7129 -1241
155 -1241 -6354 4933 10418 -1430 -4690 9927 15525 489 -3966 11991 17189 1931 -1797 13957
169 13957 15660 937 1401 15112 11172 -3313 3088 17427 7876 -7610 2809 16158 3128
182 3128 -10192 1958 11691 -1919 -10309 2277 5416 -8830 -10684 3431 1684 -13537 -11486
195 -11486 2524 -1649 -15463 -11409 1218 -4385 -14750 -8675 -441 -7062 -13324 -5513 376 -7741
209 -7741 -11485 -2668 1543 -6918 -9950 -761 3203 -4069 -6847 725 3662 -2824 -4082 3423 3952
224 3952 -2992 -2094 5848 5012 -4277 -2364 6944 5156 -4230 -2122 6196 2800 -4768 -716 5533 -156
$$ packed form
129b5319K9073R21k7624J324K3673m033k0387P242J7900r558j5735J2956J4590
142E023j4225j2854J5531J3807j3266j1466J2420J0892q824p941J0082P950q370
155a241n113J1287N485j1848l260J4617N598j5036m455J5957N198j5258l728J5754
169A3957J703j4723M64J3711l940j4485O401J4339r551j5486J0419J3349j3030
182C128j3320J2150R733j3610q390J2586L139j4246j854J4115j747j5221K051
195a1486J4010m173j3814M054J2627n603j0365O075Q234o621o262P811N889q117
209g741l744Q817M211q461l032R189L964p272k778P572K937o486j258P505N29
224C952o944Q98P942q36r289J913R308j788r386K108Q318l396p568M052O249n689
$$ plain form
240 -156 -6353 -224 4707 -3505 -7937 307 3661 -5231 -8535 319 1952 -6837 -7388 1189 7 -7497
256 -7497 -5304 1510 -1345 -7266 -3066 3129 -1300 -6434 -792 4259 -380 -3813 1593 5265 727
271 727 -879 3965 6075 1347 879 6485 6642 1998 2440 6901 7046 2500 3413 7542 6632 2482 3511
288 3511 7013 5507 1312 2841 6583 3919 -599 2641 5526 1230 -1977 1436 3829 -496 -3625
303 -3625 886 1920 -2877 -4181 80 826 -4475 -4530 211 -221 -5312 -3776 816 -656 -5104 -2399
319 -2399 1624 -1373 -4429 -891 2252 -715 -3160 807 3253 -388 -2132 2668 4396 -2 -553
334 -553 4036 4392 461 867 4895 4185 152 1502 4533 3137 -348 1082 4327 2270 -1440 593
350 593 3087 61 -2664 -343 1718 -2009 -3870 -818 425 -3673 -4734 -1923 -1129 -4537 -5223 -1792
$$ packed form
240a56o197O129M931q212m432Q244L354q892l304Q854J633q789n51Q577j182p504
256g497K193O814k855n921M200O195m429n134N642N051m639l433N406L672m538
271G27j606M844K110m728m68N606J57m644M42M461J45m546R13M129r10m150J029
288C511L502j506m195J529L742k664m518L240K885m296l207L413K393m325l129
303c625M511J034m797j304M261P46n301n5M741m32n091J536M592j472m448K705
319b399M023k997l056L538L143k967k445L967K446l641j744M800J728m398n51
334e53M589L56l931M06M028p10m033J350L031j396l485J430L245k057l710K033
350E93K494l026k725K321K061l727j861L052J243m098j061K811P94l408o86L431
$$ plain form
366 -1792 -1990 -5519 -5328 -1746 -1904 -5633 -4501 -1327 -1821 -5357 -3295 449 -1629 -4046 -1214 1783
382 1783 -799 -2469 562 2787 625 -934 2532 4291 1213 314 4094 5073 1657 1514 5424 4759
398 4759 1761 2336 5656 4210 1451 2495 5261 3113 377 2191 4371 2108 -307 1355 3083
413 3083 602 -1540 1234 2029 -1084 -2125 562 842 -2326 -2222 132 -189 -3045 -1945 -129 -486
429 -486 -2840 -1962 321 -458 -2344 -1212 937 -119 -1946 -30 1886 298 -873 1566 2342 842
445 842 158 2190 3265 1113 676 3064 3197 1241 1111 3232 2903 639 1228 3108 2250 -90 1063
462 1063 2534 995 -680 506 1617 -246 -1721 -302 421 -1537 -2648 -926 -492 -2618 -3147 -1449
478 -1449 -1205 -3074 -2991 -1062 -1673 -3287 -2740 -1097 -1993 -3095 -1883 -455 -1508 -2457 -1368 110 -470
$$ packed form
366a792j98l529J91L582j58l729J132L174m94l536K062L744k078k417K832K997
382A783k582j670L031K225k162j559L466J759l078q99L780R79l416j43L910o65
398D759k998N75L320j446k759J044K766k148k736J814K180k263k415J662J728
413C083k481k142K774P95l113j041K687K80l168J04K354l21k856J100J816l57
429d86k354Q78K283p79j886J132K149j056j827J916J916j588j171K439P76j500
445H42o84K032J075k152m37K388J33j956j30K121l29k264N89J880q58k340J153
462A063J471j539j675J186J111j863j475J419P23j958j111J722M34k126n29J698
478a449K44j869Q3J929o11j614N47J643q96j102J212J428j053r49J089J478n80
$$ plain form
495 -470 -1271 -227 628 -221 -582 975 1573 324 477 2169 2100 824 787 2288 2343 937 1207 2239 1983
514 1983 638 797 2211 1469 -448 837 1817 401 -889 174 711 -596 -1647 -531 -310 -2058
530 -2058 -2298 -1375 -953 -2453 -2629 -1189 -1941 -3568 -2827 -1120 -1938 -3798 -2614 -1621 -1937 -2740 -1492 -800
548 -800 -1933 -1998 -388 304 -1498 -1182 526 710 -635 -750 1382 1780 40 679 1931 1709 837 1721
566 1721 2583 1823 685 1778 2847 1796 382 1480 2899 1296 131 1085 2185 668 -5 1031
582 1031 1179 -298 -577 884 453 -1980 -1573 570 -58 -2357 -1582 135 -580 -2382 -1400 -149 -1365
599 -1365 -2437 -990 117 -1684 -2686 -273 802 -1400 -1901 308 1340 -549 -863 913 1160 -356
615 -356 105 1914 1079 -627 681 2838 2056 12 942 2914 1766 79 689 2046 1172 -13 722
$$ packed form
495d70q01J044Q55q49l61J557N98j249J53J692o9j276l7J501N5j406K70J032k56
514A983j345J59J414p42j917J285R80j416j290J063N37j307j051J116K21j748
530b058k40R23M22j500j76J440p52j627P41J707q18j860J184R93l16q03J248O92
548h00j133o5J610O92j802L16J708J84j345j15K132L98j740O39J252k22q72Q84
566A721Q62p60j138J093J069j051j414J098J419j603j165R54J100j517o73J036
582A031J48j477k79J461m31k433M07K143o28k299P75J717p15j802R82J251j216
599a365j072J447J107j801j002K413J075k202n01K209J032j889l14J776K47j516
615c56M61J809q35j706J308K157p82k044R30J972j148j687O10J357q74j185P35
$$ plain form
632 722 1615 -9 -660 988 1533 -850 -1632 609 1163 -992 -2263 -418 86 -1722 -2160 -549 -607 -2135
650 -2135 -1779 76 -934 -2775 -1866 359 -837 -3059 -1826 484 -357 -2214 -936 261 -561 -1216
666 -1216 53 1054 -545 -741 1831 1949 -48 -621 2170 2702 469 393 2153 2243 662 730 2332 1663
684 1663 387 1503 2452 1561 -591 913 2516 1055 -970 -94 1608 669 -1202 -315 421 -544 -1315
701 -1315 -397 357 -1504 -2128 -46 416 -1749 -2587 -514 -42 -2061 -2368 -238 -211 -1788 -1455 292 -296
719 -296 -1590 -460 1282 12 -1502 271 1894 881 -1000 383 1828 833 -13 1496 1971 345
735 345 265 2337 2186 233 389 2634 2213 305 497 2274 2112 327 171 1478 801 -344 522 1249
753 1249 251 -894 342 1174 -565 -1302 -113 750 -554 -1477 -665 -141 -1018 -1275 -607 -67 -1036 -1051 -49
$$ packed form
632G22Q93j624o51J648N45k383p82K241N54k155j271J845N04j808m38J611n8j528
650b135L56J855j010j841R09K225j196k222J233K310q41j857J278J197q22o55
666a216J269J001j599j96K572J18j997n73K791N32k233p6J760R0j581O8J602o69
684A663j276J116R49q91k152J504J603j461k025Q76J702r39j871Q87P36r65p71
701a315R18P54j861o24K082M62k165q38K073M72k019l07K130K7j577L33J747n88
719b96j294J130J742j270j514J773J623j013j881J383J445r95q46J509M75j626
735C45q0K072j51j953J56K245m21j908J92J777j62j785j56J307o77j145Q66P27
753A249r98j145J236Q32j739p37J189Q63j304r23Q12N24q77k57O68N40r69j5J002
$$ plain form
772 -49 74 -1569 -1216 598 373 -930 -1026 889 825 -337 -216 802 785 -85 438 1205 544 -262 814
791 814 1726 664 -113 1013 1905 509 183 987 1300 223 76 1086 887 -155 -201 853 231 -747
809 -747 -838 203 -176 -1439 -886 -129 -370 -1575 -1195 -760 -1343 -1628 -919 -565 -1364 -1609 -1023 -551 -978 -1537
829 -1537 -1060 -162 -962 -1403 -748 -259 -588 -658 169 -9 -415 -246 794 570 -233 -1 1122 882 385 361
849 361 1121 871 453 901 1286 828 157 724 1149 182 42 412 448 -253 -296 402 589 -300 -336 -202 -481
870 -481 -852 -396 -518 -888 -1111 -1088 -349 -935 -949 -900 -547 -843 -934 -688 -463 -722 -623 -660 -451 -684 -720 -223 -197
893 -197 -420 -261 204 298 -69 -17 588 695 530 464 405 774 743 602 1173 1106 267 979 898 807 774 796 948 472
917 472 361 310 741 261 169 284 516 -54 -168 198 5 -333 -24 -115 -134 -543 -465 -435 -545 -588 -333 -339 -327 -671
$$ packed form
772d9J23j643L53J814k25j303r6J915o4j162J21J018j7q70N23P67o61q06J076
791H14R12j062p77J126Q92j396l26Q04L13j077j47J010j99j042m6J054o22r78
809g47r1J041l79j263N53P57k41j205L80M35n83k85P09L54p99k45N86M72m27n59
829a537M77Q98q00m41O55M89l29p0Q27j78m06J69J040k24q03K32J123k40m97k4
849C61P60k50m18M48L85m58o71N67M25r67j40L70L6p01m3O98J87q89l6J34k79
870d81l71M56j22l70k23K3P39n86j4M9L53k96r1K46K25k59R9l7K09k33l6M97K6
893a97k23J59M65R4l67N2O05J07j65o6n9L69l1j41N71o7q39P12q1r1l3K2J52m76
917D72j11n1M31m80r2J15K32n70j14L66j93l38L09r1j9m09P8L0j10m3K55oJ2l44
$$ plain form
941 -671 -297 -275 -595 -387 -94 -206 -363 167 42 122 236 -41 211 261 507 249 634 716 428 449 763 793
963 793 604 677 992 915 448 517 694 232 733 528 420 157 -44 208 178 -58 -96 -102 -146 -348 -347 136 -388 -966
987 -966 -666 -322 -519 -1037 -557 -346 -916 -1056 -429 -525 -595 -644 -648 -436 -794 -542 -269 -221 -575 -282 6 144
1009 144 22 243 538 214 381 314 236 231 495 520 713 612 313 472 519 489 642 443 566 495 449 574 308
1032 308 552 57 463 362 109 124 234 305 -491 -363 -81 -97 -627 -95 -405 -269 -677 -498 -254 -633 -777
1053 -777 -328 -344 -572 -292 -229 -30 -619 -107 78 302 -268 -188 388 163 -169 281 595 383 -98 667 825
1074 825 241 393 410 534 547 427 594 513 466 318 421 626 152 110 401 117 -62 -6 141 262 143 -27
1096 -27 -202 -112 10 -252 -322 -333 -517 -414 -362 -655 -753 -580 -402 -767 -481 -415 -283 -294 -508 -147 -132 -373 -117
$$ packed form
941f71L74K2l20K08K93j12j57N30j25Q0J14k77K52N0K46k58L85Q2k88K1L14L0
963G93j89P3L15p7m67O9J77m62N01k05j08k63k01K52l0k36l8om4k02JM83n24n78
987i66L00L44j97n18M80K11n70j40O27r6p0m9mK12l58K52K73M8l54K93K88J38
1009A44j22K21K95l24J67o7p8nK64K5J93j01k99J59M7l0J53j99J23p1m6J25k66
1032C08K44m95M06j01k53J5J10P1p96J28K82j6n30N32l10J36m08J79K44l79j44
1053g77M49j6k28K80O3J99n89N12J85K24n70Q0N76k25l32M50L14k12m81P65J58
1074H25n84J52J7J24J3j20J67q1m7j48J03K05m74m2K91k84j79N6J47J21j19j70
1096b7j75R0J22k62p0j1j84J03N2k93r8J73J78l65K86O6J32j1k14L61J5k41K56
$$ plain form
1119 -117 9 154 127 304 0 -99 137 399 511 144 503 694 682 252 457 679 577 480 344 923 325
1140 325 232 348 406 470 127 324 207 139 -223 239 411 -175 -210 -302 -137 -294 -510 -67 -365 -465 -461 -116 -297
1163 -297 -329 -454 -371 -515 -301 -389 -195 -349 -289 -456 -89 -150 -268 47 -145 134 -267 168 315 200 16 194
1185 194 456 166 361 379 282 340 462 719 425 205 414 570 348 -150 292 279 185 -199 138 319 -63 -42
1207 -42 -240 -62 125 -404 -349 -17 -679 -565 -428 102 -734 -675 -279 -222 -573 -474 -417 -100 -426 -417 -83 -262 -487
1230 -487 -80 83 -113 -73 -121 21 53 -326 -118 609 115 109 262 113 209 380 505 295 217 -12 389 382 217
1253 217 -40 297 -90 -190 102 214 60 -80 -303 58 207 -209 -84 51 -123 -534 32 -56 -537 -659
1273 -659 -189 -416 -724 -529 -18 41 -153 -130 -36 -449 -463 -374 -193 -424 -238 -377 349 243 -139 -286 216 -158
$$ packed form
1119a17J26J45k7J77l04r9K36K62J12l67L59J91j2m30K05K22j02r7j36N79n98
1140C25r3J16N8O4l43J97j17o8l62M62J72n86l5r2J65j57k16M43k98j00ML45j81
1163b97l2j25Q3j44K14q8J94j54O0j67L67o1j18L15j92K79m01M35J47j15j84J78
1185A94K62k90J95J8r7N8J22K57k94k20K09J56k22m98M42j3r4l84L37J81l82K1
1207d2j98J78J87n29N5L32o62J14J37N30q36N9L96N7l51R9N7L17l26RL34j79k25
1230d87M07J63j96M0m8J42L2l79K08P27m94oJ53j49R6J71J25k10p8k29M01pj65
1253B17k57L37l87j00K92J12j54j40k23L61J49m16J25J35j74m11N66q8m81j22
1273f59M70k27l08J95N11N9j94K3R4m13j4Q9J81k31J86j39P26j06l82j47N02l74
$$ plain form
1295 -158 183 42 303 137 -130 570 575 -56 248 727 644 171 256 326 399 330 309 537 362 99 53 440 246
1318 246 -371 24 389 181 -410 116 202 2 -386 -364 -105 -318 -525 -130 71 -23 -107 41 64 19 -306 -292
1340 -292 -78 -91 -211 6 152 -119 70 178 165 -26 -119 -47 107 59 443 495 198 95 103 336 34 117 111 213
1364 213 131 207 214 260 133 187 -59 340 1 -340 279 161 -241 -69 -137 16 -348 -270 -131 -104 -384 -318 -158
1387 -158 -526 -407 -400 241 -530 -429 -433 -217 -111 -701 -82 -225 -48 -345 -277 76 -245 -200 27 -129 -157 46
1409 46 73 401 165 -126 186 96 -23 356 321 167 108 181 294 271 188 216 514 183 -79 74 333 -75 -42
1432 -42 -212 -154 81 -19 161 -199 -225 -506 -78 249 -95 -305 -117 -11 18 -144 -481 187 -539 -417 -34
1453 -34 -43 -284 -455 -67 -120 -234 -9 -26 15 -127 83 126 57 -191 396 509 -300 325 296 340 548 210 299 33
$$ packed form
1295a58L41j41K61j66k67P00No31L04M79q3m73Q5P0P3o9k1K28j75k63m6L87j94
1318B46o17L95L65k08n91N26Q6k00l88K2K59k13k07L95K01r4q4J48K3m5l25J4
1340b92K14j3j20K17J46k71J89J08j3j91r3P2J54m8L84N2k97j03QK33l02Q3oJ02
1364B13q2P6PM6j27N4k46L99l39l41O19j18m02J72o8J53l64P8J39K7k80O6J60
1387a58l68J19PO41p71J01mK16J06n90O19j43J77k97O8L53l21M5K27j56k8K03
1409D6K7L28k36k91L12r0j19L79l5j54n9P3J13k3q3K8K98l31k62J53K59m08L3
1432d2j70N8K35j00J80l60k6k81M28L27l44k10J88J06K9j62l37O68p26J22L83
1453c4rk41j71L88n3j14K25j7M1j42K10M3o9k48N87J13q09O25k9M4K08l38Q9k66
$$ plain form
1477 33 -79 94 -37 272 241 -9 201 -55 352 27 184 -31 17 146 -71 -218 -286 -60 39 18 -83 -80 -263
1500 -263 -151 -338 -160 -16 -522 -253 115 132 -588 -313 -370 -186 -398 -48 -147 103 249 74 -86 -128 113
1521 113 199 100 56 -78 46 139 241 254 197 346 -67 142 213 47 153 321 206 186 203 119 185 87 -234 -34
1545 -34 244 -77 -106 73 184 44 16 124 63 154 -149 -151 -234 69 -114 -230 -18 -57 -246 -134 -61 -38 94 -303
1569 -303 43 51 -45 101 52 44 -30 268 -25 101 267 214 18 274 145 -78 22 255 141 115 -51 221 -63
1592 -63 130 1 183 17 -65 -50 -11 331 4 -176 -118 -9 -227 -313 -101 -140 151 -170 -377 59 -211 -95
1614 -95 119 -100 -221 -337 67 -381 -291 -198 -433 -238 4 -102 -359 -121 294 -217 -178 31 -101 279 -3
1635 -3 110 214 272 57 93 416 187 18 55 149 126 101 76 -18 79 180 16 159 -17 7 121 86 -142 -220 202
$$ packed form
1477C3j12J73j31L09l1k50K10k56M07l25J57k15M8J29k17j47o8K26R9k1j01Lj83
1500b63J12j87J78J44n06K69L68J7p20K75n7J84k12L50r9K50J46j75j60m2K41
1521A13Q6r9m4j34J24R3J02J3n7J49m13K09P1j66J06J68j15k0J7q4O6r8l21K00
1545c4K78l21k9J79J11j40k8J08o1R1l03kq3L03j83j16K12l9j89J12P3K3J32l97
1569c03L46Qr6J46m9qp4K98k93J26J66n3j96K56j29k23J00K33j14k6j66K72k84
1592f3J93j29J82j66q2J5L9L42l27j80N8J09k18q6K12l9K91l21k07M36k70J16
1614i5K14k19j21j16M04m48R0R3k35J95K42j06k57K38M15n11L9K09j32L80k82
1635cJ13J04N8k15L6L23k29j69L7R4k3k5k5r4R7J01j64J43j76K4J14l5k28p8M22
$$ plain form
1660 202 24 -7 60 -77 32 -160 46 -277 108 45 112 -178 -80 174 -208 -268 -16 -152 -6 147 -419 -14
1682 -14 216 -15 -188 -84 -79 -131 317 30 320 168 33 50 -240 -69 117 -60 158 527 -31 412 53 293
1704 293 275 82 93 -172 48 -23 -109 99 -38 196 25 71 358 119 250 256 -82 138 -89 70 -227 -271 51
1727 51 -90 -492 -243 5 -367 57 -150 163 -249 -218 -47 23 57 -258 -102 -117 -170 -173 -75 225 200 218 134 244
1751 244 77 230 150 115 249 127 355 403 -56 232 472 266 -58 81 222 426 -157 -27 27 225 278 573
1773 573 -179 -75 372 -57 14 121 -237 -57 -184 -28 -75 -96 -103 -294 -170 -103 -32 -217 -140 -48 -291 240 -188
1796 -188 181 335 -79 -76 31 197 17 234 247 43 137 507 -147 167 -63 108 249 9 -6 246 -138 -61
1818 -61 67 75 3 37 134 -59 -195 11 194 53 -224 -146 192 -290 13 -221 -75 205 -364 29 1 78 -349
$$ packed form
1660B02j78l1O7j37J09j92K06l23L85o3O7k90R8K54l82o0K52j36J46J53n66M05
1682a4K30k31j73J04Nn2M48k87K90j52j35J7k90J71J86j77K18L69n58M43l59K40
1704B93j8j93J1k65K20p1q6K08j37K34j71M6K87k39J31Ol38K20k27J59k97m4L22
1727E1j41m02K49K48l72M24k07L13m12L1J71P0L4l15J56j5n3lR8L00k5J8q4J10
1751B44j67J53q0l5J34j22K28M8m59K88K40k06l24J39J41K04n83J30N4J98N3K95
1773E73p52J04M47m29P1J07l58J80j27J56m7k1pj91J24O7P1j85P7R2k43N31m28
1796a88L69J54m14LJ07J66j80K17J3k04R4L70o54L14k30J71J41k40j5K52l84P7
1818f1J28Qp2L4R7j93j36K06J83j41k77P8L38m82L03k34J46K80n69L93k8P7m27
$$ plain form
1841 -349 -325 -339 -288 -124 67 -173 -191 -7 -39 -9 -67 -296 -229 -234 17 -64 186 9 -106 -2 -33 -25 21 171 260
1866 260 -94 21 131 360 205 -6 266 0 -333 244 -78 -83 -18 229 -57 236 -116 -212 31 46 -68 -2
1888 -2 410 68 -97 -260 18 -346 -284 181 -33 -161 -72 63 165 -161 -161 -41 93 -79 -188 -428 8 -267
1910 -267 -112 103 37 86 8 -70 -57 217 76 -44 351 7 -52 -97 208 56 -79 434 620 -81 45 44 -82
1933 -82 141 -103 42 104 -17 13 487 211 48 -37 -31 91 77 -473 333 173 -281 -131 -58 -72 42 -94 -203
1956 -203 -264 -351 -106 -275 -312 105 -156 -53 -327 -268 -288 -86 187 78 30 111 168 62 398 -174 -127 244 159
1979 159 -116 245 308 228 199 -201 -102 102 -83 18 94 -193 113 219 -114 -153 -93 89 88 -11 -61 24 130 151
2003 151 -47 -161 40 132 -101 185 -41 -125 -165 8 52 -178 -147 391 39 137 -128 -18 126 123 151 135 -186
$$ packed form
1841c49K4j4N1J64J91k40j8J84l2L0n8k29O7nK51q1K50j77j15J04l1QM6J50Q9
1866B60l54J15J10K29j55k11K72k66l33N77l22nO5K47k86K93l52r6K43J5j14O6
1888bM12l42j65j63K78l64O2M65k14j28Q9J35J02l26%J20J34j72j09k40M36k75
1910b67J55K15o6M9p8p8J3K74j41j20L95l44n9m5L05j52j35N13J86p01J26jj26
1933h2K23k44J45O2j21L0M74k76j63q5OJ22j4n50Q06j60m54J50P3j4J14j36j09
1956b03o1q7K45j69l7M17k61J03k74N9k0K02K73j09m8Q1N7j06L36n72M7L71q5
1979A59k75L61O3q0k9m00R9K04j85J01P6k87L06J06l33l9O0J82jr9n0Q5J06K1
2003A51j98j14K01R2k33K86k26q4m0J73M4k30L1N38l52R8k65J10J44lK8j6l21
$$ plain form
2026 -186 183 -156 -285 -138 191 -41 -55 142 -3 19 -131 -20 101 144 314 -228 164 -215 171 -454 20
2047 20 246 -58 -167 146 79 107 -126 90 224 27 57 -1 77 129 -301 -116 43 -116 -251 -165 -88 90 109
2070 109 -23 69 -195 -189 -350 -23 150 -337 168 -238 -267 -79 289 49 215 -238 -105 44 263 -12 -157
2091 -157 378 127 -104 161 -13 -152 -43 -39 -284 -155 -276 -27 360 -245 41 158 6 121 129 357 16
2112 16 -62 22 83 -16 239 0 315 -214 -80 232 -272 -198 115 51 -236 -193 -35 181 37 -218 -61 27 172
2135 172 39 -228 57 -259 305 158 237 248 -90 157 -153 -43 207 -62 -108 -278 -7 6 -89 134 210 -49
2157 -49 54 82 194 31 53 48 -111 7 197 -25 -162 10 151 218 -173 -340 108 260 57 127 63 -163 -348
2180 -348 -133 -39 -345 223 -117 -192 14 93 -109 75 -203 55 -95 80 -283 -152 -176 -52 -141 55 -113 166
$$ packed form
2026a86L69l39j29J47L29k32j4J97j45K2j50J11J21M3J70n42L92l79L86o25M74
2047B0K26l04j09L13o7K8k33K16J34j97L0n8P8N2m30J85J59j59j35Q6P7J78J9
2070A09j32R2k64Oj61L27J73m87N05m06k9J88L68k40J66m53J33J49K19k75j45
2091a57N35k51k31K65j74j39J09Mk45J29j21K49L87o05K86J17j52J15QK28l41
2112A6p8Q4O1r9K55k39L15n29J34L12n04P4L13o4k87M3J58K16j44k55J57Q8J45
2135A72j33k67K85l16N64j47P9J1l38K47l10J10K50k69m6j70K71J3r5K23P6k59
2157d9J03K8J12j63K2nj59J18J90k22j37J72J41O7l91j67M48J52k03P0o4k26j85
2180c48K15R4l06N68l40p5K06P9k02J84k78K58j50J75l63J31k4J24q9J96j68K79
$$ plain form
2202 166 222 4 485 -94 162 47 37 -77 71 40 -46 176 186 231 81 -261 40 174 -70 -162 154 -79
2224 -79 -110 428 43 141 -92 -92 165 445 -97 -8 6 1 -30 254 -91 -157 -158 24 97 -21 228 -84 -96 -216 -364
2249 -364 161 28 -104 -27 126 429 -27 -17 -39 -96 201 -19 171 -43 -39 -22 -290 -74 69 -128 171 287
2271 287 -53 307 227 93 -35 30 -125 -40 247 152 -40 -48 24 21 131 -105 36 -226 242 -3 -81 -192 -366
2294 -366 -347 166 2 -56 -140 -115 -38 -85 52 -15 -35 45 -118 81 116 12 12 -152 -292 114 -113 -89 -35 102 126
2319 126 50 -105 61 -95 51 -9 -189 -174 42 332 -197 107 -33 127 9 43 -3 160 -216 149 -41 2
2341 2 38 -23 104 101 -50 64 -162 -255 -82 179 21 115 -381 9 78 -152 -75 -73 -126 77 -18 153 69 -6 -42 -41
2367 -41 -66 -287 7 -41 50 -61 22 79 -4 -216 -46 273 146 -152 7 -56 -227 106 21 96 356 126 -54
$$ packed form
2202A66N6k18M81n79K56j15j0j14J48l1q6K22J0M5j50l42L01J34k44r2L16k33
2224g9l1N38l85R8k33%K57K80n42Q9J4nl1K84l45o6jJ82P3j18K49l12j2j20j48
2249c64N25j33j32P7J53L03m56J0k2n7K97k20J90k14MJ7k68K16J43j97K99J16
2271B87l40L60q0j34j28O5j55Q5K87r5j92qP2lJ10k36J41k62M68k45p8j11j74
2294c66J9N13j64n8q4K5P7m7J37o7k0Q0j63J99L5j04%j64j40M06k27K4N4J37K4
2319A26p6j55J66j56J46o0j80J5K16K90n29L04j40J60j18L4m6J63l76L65j90M3
2341BL6o1J27lj51J14k26r3J73K61j58R4m96L90O9k30P7Kn3K03r5J71q4p5l6J
2367d1k5k21K94m8R1j11Q3N7q3k12J70L19j27k98J59o3j71L33q5P5K60k30j80
$$ plain form
2390 -54 -154 67 147 65 112 -59 -109 -64 -18 115 139 152 -285 -348 -276 88 119 -125 88 177 130 136 61 -17 159 -207
2416 -207 -152 -192 -61 24 216 -94 -11 -87 318 -13 100 30 112 -215 -48 -226 -273 215 -96 283 -145 -214 80
2439 80 -2 -68 97 54 37 -37 69 31 -37 -86 317 -96 -96 -86 162 -45 163 138 138 -213 75 26 169 -170 110
2464 110 -91 150 58 42 -28 -322 255 -425 -222 54 94 -127 -94 -100 -221 9 -56 -98 11 -19 -31 67 -181 -324
2488 -324 81 69 -73 -156 100 -47 -114 -109 -87 143 -37 -158 -60 194 59 27 96 -143 419 30 268 100 75
2511 75 235 -49 -154 86 57 -449 -94 178 -163 -28 84 289 37 -67 -283 12 -142 -201 -63 -33 -142
2532 -142 188 46 -191 42 107 178 190 -230 -249 209 -198 -6 20 -193 170 169 -77 218 -90 -81 24 161 -105
2555 -105 -105 -11 -73 27 -126 3 67 156 118 -97 157 -131 111 -3 -1 -254 -216 -159 -5 76 -85 7 305 -27
$$ packed form
2390e4j00K21Q0q2M7j71n0M5M6J33K4J3m37o3P2L64L1k44K13Q9m7Op5p8J76l66
2416b07N5m0J31Q5J92l10Q3p6M05l31J13p0Q2l27J67j78m7M88l11L79m28o9K94
2439H0q2o6J65m3j7p4J06l8o8m9M03m13%J0K48k07K08k5%l51K88m9J43l39K80
2464A10k01K41r2j6p0k94N77o80K03K76M0k21L3oj21K30o5m2J09l0j2R8k48j43
2488c24M05j2j42q3K56j47o7NK2K30j80j21R8K54j35l2O9k39N62l89K38j68k5
2511G5J60k84j05K40k9n06L55K72l41J35J12K05k52j04k16K95j54n9J38L0j09
2532a42L30j42k37K33O5P1J2m20j9M58m07J92K6k13L63jk46K95l08RJ05J37k66
2555a05%R4o2J00j53J29O4Q9l8k15K54k88K42j14Kk53L8N7J54Q1j61R2K98l32
$$ plain form
2579 -27 -137 -10 -388 42 32 24 -57 259 -92 -257 173 51 140 -33 -13 190 -67 52 -110 -202 -38 80 49
2602 49 104 -194 162 -58 -480 0 -114 -49 -108 225 -49 -203 -68 -173 -12 21 -82 166 -50 65 29 31 -60
2625 -60 -44 -163 207 -28 44 -135 214 -319 -193 -14 -148 185 -40 -41 157 -61 71 80 64 -56 40 79 6 144
2649 144 58 -72 3 -32 109 128 -171 -99 94 -131 10 -75 50 7 -77 -208 112 25 17 237 -26 -325 -20 -94
2673 -94 -119 283 -322 -13 -177 290 247 108 -93 10 -20 -73 -199 315 15 272 290 -143 119 -110 -89 213
2695 213 -8 -163 -60 -183 229 -107 -31 215 130 -115 -15 117 -34 50 -80 186 92 64 20 -97 -58 -5 -137
2718 -137 -335 59 360 38 -245 -110 -19 -269 87 268 60 176 31 4 107 29 -84 228 62 317 17
2739 17 484 -177 244 217 -84 -126 127 -196 -46 13 -357 -245 -241 155 105 150 -119 222 299 -207 -258 201 -262
$$ packed form
2579b7j10J27l78M30j0qq1L16l51j65M30j22Q9j73K0K03k57J19j62r2J64J18l1
2602D9N5k98L56k20m22M80j14O5n9L33k74j54J35j05J61L3j03K48k16J15l6Kr1
2625f0J6j19L70k35P2j79L49n33J26J79j34L33k25jJ98k18J32Rj6j20R6L9p3J38
2649A44q6j30P5l5J41J9k99P2J93k25J41q5J25m3q4j31L20q7qK20k63k99L05p4
2673i4k5M02o05L09j64M67m3j39k01J03l0n3j26N14l00K57J8m33K62k29K1L02
2695B13k21j55J03j23M12l36P6K46q5k45J00J32j51Q4j30K66r4k8m4j17L9N3j32
2718a37j98L94L01l22k83J35R1k50L56J81k08J16j45k7J03p8j13L12j66K55l00
2739A7M67o61M21k7l01m2K53l23J50N9l70J12ML96n0M5k69L41P7n06n1M59m63
$$ plain form
2762 -262 -87 176 -84 113 15 -8 -170 198 30 93 37 259 149 201 209 75 390 -43 117 -315 -50 101
2784 101 -49 2 28 12 -99 147 201 -20 41 63 -4 -64 148 -64 47 -35 180 246 -26 -157 5 -115 -81 -158
2808 -158 -6 30 86 114 -375 206 132 206 0 -21 -61 -64 15 -5 -251 2 -28 25 203 332 43 -379 260 1
2832 1 -130 134 -74 145 110 34 -122 195 73 9 105 333 127 -33 76 6 11 23 -199 317 -126 -389 28
2855 28 -127 -129 -8 43 72 -98 -13 284 107 200 -6 113 -136 334 -175 -168 109 -281 53 -178 25 135 -10
2878 -10 1 -50 148 32 382 -369 -68 102 75 69 35 -176 122 1 69 95 -121 -325 -86 -120 13 -60 -48 91
2902 91 97 417 -346 -17 82 -40 -64 -76 -33 136 134 64 197 -333 137 -59 -22 260 346 65 71 -122 -87 -87 -113 -25
2928 -25 -86 -1 415 137 -27 172 -230 221 -31 20 100 20 176 -16 226 151 -6 256 261 -148 59 -34 191
$$ packed form
2762b62J75K63k60J97r8k3j62L68j68O3n6K22j10N2Qj34L15m33J60m32K65J51
2784A01j50N1K6j6j11K46N4k21O1K2o7o0K12k12J11q2K15O6k72j31J62j20L4p7
2808a58J52L6N6K8m89N81p4P4k06k1m0lP9k0k46K53l0N3J78J29k89m22O39k59
2832Aj31K64k08K19l5p6j56L17j22o4R6K28k06j60J09p0NJ2k22N16m43k63M17
2855B8j55kJ21N1K9j70Q5K97j77R3k06J19k49M70n09PK77l90L34k31K03J10j45
2878a0J1n1J98j16L50p51L01J70k7ol4k11K98j21O8K6k16k04K39l4J33p3J2J39
2902I1OL20p63L29R9j22k4j2M3J69kp0J33n30M70j96L7K82Q6k81Oj93L5%k6Q8
2928b5o1Q5M16k78j64J99m02M51k52N1Q0q0J56j92K42p5j57K62Nm09K07r3K25
$$ plain form
2951 191 323 103 161 113 364 -111 260 -205 -75 226 46 -21 -157 82 7 -78 -152 -164 -164 -7 -126 -90 90
2974 90 -125 238 122 234 -205 -176 -168 165 226 33 -146 111 173 178 -32 -245 175 6 -25 3 22 -24 168 -77
2998 -77 22 238 -279 -122 -69 175 54 -17 -113 90 12 -203 361 -134 -132 -153 -139 -110 -95 -133 -76 -58 109 -40 -18
3023 -18 -234 -215 -192 19 -93 -155 -44 -10 338 -76 43 -136 21 -134 106 343 161 112 -184 77 -126 120
3045 120 -11 223 -263 307 42 -110 107 -43 -236 -155 16 -16 -71 -226 -39 -20 -17 388 61 119 -106 -93 -244
3068 -244 -235 93 -199 -95 -172 178 218 -175 79 164 -68 -181 102 -93 106 -206 113 -34 19 -187 -97 -126 30
3091 30 101 -133 -134 -361 -51 -22 -25 -150 -91 -5 -227 30 119 222 -244 -79 129 -88 -60 227 21 -125 1 99
3115 99 154 -67 134 -192 -114 48 -103 8 86 59 64 -239 -80 281 -48 -193 -92 6 221 -268 40 121 109
$$ packed form
2951A91J32k20N8m8K51m75L71m65J30L01j80o7j36K39p5q5p4j2%J57j19L6J80
2974I0k15L63j16J12m39K9QL33O1j93j79K57O2Nk10k13M20j69l1K8J9m6J92k45
2998g7R9K16n17J57N3K44j21p1r6K03p8k15N64m95Kk1J4K9J5l8N7J8J67j49K2
3023a8k16J9K3K11j12o2J11L4L48m14J19j79J57j55K40K37j82m9k96K61k03K46
3045A20j31K34m86N70k65j52K17j50j93Q1J71l2n5j55J87J9LM05l27N8k25J3j51
3068b44RL28k92J04p7L50M0l93K54Q5k32j13K83j95J99l12L19j47N3k06R0k9J56
3091C0P1k34jk27L10K9lj25N9Q6k22K57Q9J03m66J65K08k17K8K87k06j46J26R8
3115I9N5k21K01l26P8J62j51J11P8k7Nl03J59L61l29j45J01R8K15m89L08Q1j2
$$ plain form
3138 109 86 -32 36 -4 -184 28 -15 -344 13 75 309 8 -101 -245 1 251 -85 -86 149 -181 -67 -168
3160 -168 -30 -27 61 -68 70 -7 180 -310 -200 60 149 -123 4 327 -207 18 -56 -85 138 92 32 165 85
3183 85 196 166 98 225 11 60 144 -81 -98 197 69 229 346 -135 -158 75 382 -34 -104 -322 425 -6 152
3206 152 28 202 201 -121 80 43 60 -26 0 244 -176 27 -10 -81 -236 -69 120 109 208 53 -77 177 62
3229 62 -57 289 179 70 -32 174 -235 20 -16 -30 -181 41 28 28 188 -49 253 -125 -94 -120 -147 8 -75
3252 -75 -219 -388 -119 -215 305 -18 -171 -70 -15 30 -215 -43 8 40 144 166 -149 -161 -56 -112 -164 -77 -338 -204
3276 -204 -12 -173 -108 -31 -45 -260 -93 181 115 105 95 -45 -368 115 -47 -109 119 11 -185 -34 319 86
3298 86 -66 -300 -13 77 -117 17 185 -47 161 -144 259 61 108 134 79 -52 17 -121 0 -208 -216 -50 82
$$ packed form
3138A09k3j18O8m0j80K12m3l29L57O2K34l01j09j44K46K50l36jK35l30J14j01
3160a68J38LQ8j29J38p7J87m90J10K60Q9k72J27L23n34K25p4k9K23m6o0J33q0
3183H5J11l0o8J27k14M9Q4k25j7K95j28J60J17m81k3K33L07m16p0k18P47m31J58
3206A52j24J74jl22K01l7J7q6K6K44m20K03l7p1j55J67J89j1R9j55j30K54j15
3229F2j19L46j10j09j02K06m09K55l6j4j51K22j3%J60k37L02l78L1k6k7J55q3
3252g5j44j69K69r6N20l23j53J01N5M5k45J72N1L2J04K2l15j2J05n6n2Q7k61J34
3276b04J92j61O5P7j4k15J67K74o6j0j0j40l23M83j62o2K28j08j96J51L53k33
3298H6j52k34K87R0j94J34J68k32K08l05M03j98M7K6n5j31O9j38J21k08qJ66J32
$$ plain form
3321 82 -239 -57 46 11 40 40 -1 -162 -36 -182 39 -2 -19 253 -6 38 -206 96 191 -140 -64 448 -344 95
3345 95 64 2 152 68 29 -91 53 -53 -91 166 -7 -17 96 210 7 -87 278 -95 329 54 40 28 -10 -44
3369 -44 -2 120 150 -46 9 -157 222 48 179 -176 256 346 -34 -65 286 -10 -87 -135 -130 145 -68 0 -86 272
3393 272 73 -58 -90 -396 23 -107 -56 85 61 197 -181 -207 184 28 -56 252 -6 -122 128 -220 -150 -50
3415 -50 -87 68 86 98 -151 90 -52 -119 223 54 55 -39 -9 -95 147 -68 -116 224 121 -84 143 177 -230 85
3439 85 -311 19 125 -75 155 -128 58 -121 123 153 -79 -11 -255 -227 -180 -91 -153 -54 212 -120 -211 -228 -200 104
3463 104 -269 -141 -44 3 93 -41 67 52 -89 -191 4 -223 209 17 -29 -240 -327 132 -128 -10 281 -48
3485 -48 252 -155 -88 83 207 68 -39 81 -181 39 52 117 -35 130 -52 -17 149 114 106 214 115 241 -145
$$ packed form
3321H2l21J82J03l5K9%m1j61J26j46K21m1j7K72k59M4k44L02R5l31P6N12p92M39
3345I5l1o2J50q4l9j20J44j06l8K57j73j0J13J14k03r4L65l73M24k75j4j2l8l4
3369d4M2J22L0j96N5j66L79j74J31l55M32R0l80l1L51k96p7m8NK75k13O8q6L58
3393B72j99j31l2l06M19j30N1J41k4J36l78k6L91j56q4L08k58j16K50l48P0J00
3415e0l7J55J8J2k49K41j42o7L42j69Jr4L0q6K42k15m8L40j03k05K27L4m07L15
3439H5l96L30J06k00K30k83J86j79K44L0k32O8k44K8M7Q9o2R9K66l32r1j7K8L04
3463A04l73J28R7M7R0j34J08j5j41j02J95k27M32j92m6k11q7M59k60J18K91l29
3485d8L00m07O7J71J24j39j07J20k62K20J3O5j52J65j82L5J66l5qJ08r9J26l86
$$ plain form
3508 -145 -78 86 169 395 174 155 221 -61 27 -102 -44 -257 -127 204 -149 -59 -11 -210 -195 69 -94 -286 45
3531 45 -153 128 189 -298 -113 -21 -86 76 119 -5 154 -8 55 -27 231 189 175 -133 -126 192 51 34 -5 -53 -187
3556 -187 -93 63 111 67 -1 25 -30 219 -159 -152 -29 -93 -29 136 -11 414 337 146 226 90 159 -165 -152 28 -53
3581 -53 -108 84 18 -117 -108 -189 127 -336 156 -58 85 -34 265 3 -9 81 -107 285 10 -16 43 -52 109 194
3605 194 12 -5 -150 15 374 199 -158 -5 -253 103 -184 -2 125 -264 39 204 -253 -50 117 14
3625 14 -189 -65 -21 -71 46 -210 88 14 -120 -31 171 63 44 -80 314 160 -99 137 -65 -43 -32 48 -144
3648 -144 88 228 -108 -101 -50 -201 155 129 -152 -137 59 -505 -161 145 -156 24 205 -245 58 -8 -30 24 -167
3671 -167 18 193 -83 153 -134 116 33 174 -9 22 -18 -116 40 86 47 -97 440 -92 105 121 2 103
$$ packed form
3508a45O7J64Q3K26k21j9O6k82Q8j29N8k13J30L31l53R0M8j99J5K64j63j92L31
3531D5j98K81O1m87J85R2o5J62M3j24J59j62O3q2K58m2j4l08PL18j41j7l9m8j34
3556a87R4J56M8m4o8K6n5K49l78PJ23o4O4J65j47M25p7j91Q0j36O9l24J3J80q1
3581e3n5J92o6j35Rq1L16m63M92k14J43j19K99k62j2R0j88L92k75k6N9r5J61Q5
3605A94j82j7j45J65L59j75l57J53k48L56k87J82J27l89L03J65m57K03J67j03
3625A4k03J24M4n0J17k56K98p4j34Q9K02j08j9j24L94j54k59K36k02K2J1Q0j92
3648a44K32J40l36PN1j51L56k6k81J5J96n64L44L06l01J80J81m50L03o6k2N4j91
3671a67J85J75k76K36k87K50q3J41j83L1m0r8J56M6l9j44N37n32J97J6j19J01
$$ plain form
3693 103 -432 -35 200 -77 213 99 71 23 -106 -581 226 158 58 86 -23 -66 -244 -77 -59 -138 -90 -208 -157
3716 -157 94 220 -183 -162 -79 -226 -238 -13 3 -16 -68 127 143 38 16 90 -75 -193 -102 296 126 112 248 103
3740 103 -68 280 -178 167 -28 21 -31 -153 266 57 -48 -255 -376 -307 56 154 56 -176 119 -42 143 -200
3762 -200 -45 -153 243 -93 -57 -85 -257 -239 -109 0 -249 142 150 -76 -80 92 356 -15 -115 -36 43 132 64 58
3786 58 -38 363 -34 78 47 240 -1 6 102 22 -126 -133 105 20 142 -35 136 168 -205 75 -109 -105 -25 17 114
3811 114 -287 154 116 20 -91 -121 142 -182 64 188 24 -57 158 -152 -211 -248 35 -141 -148 -117 205 20 135
3834 135 162 86 -97 225 -169 36 24 -137 -21 -173 -2 -9 191 -42 -139 -81 376 429 -185 93 193 -180 377
3857 377 -183 -161 -2 -177 124 -56 -153 -310 200 68 30 315 -166 -200 -183 -24 -240 -220 -144 111 17 -43 205
$$ packed form
3693A03n35L97K35k77K90j14k8m8j29m75Q07o8j00K8j09m3j78J67J8p9M8j18N1
3716a57K51J26m03K1Q3j47j2K25J6j9n2J95J6j05k2P4j65j18R1L98j70j4J36j45
3740A03j71L48m58L45j95M9n2j22M19k09j05k07j21O9L63R8r8k32K95j61J85l43
3762b00J55j08L96l36L6k8j72J8J30J09k49L91Qk26mJ72K64l71j00P9P9Q9o8o
3786E8r6M01l97J12l1J93k41PR6q0j48pK38q5J22j77J71L2l73K80j84MQ0M2R7
3811A14m01M41l8r6j11l0K63l24K46J24j64q1K15l10n9l7K83j76pL1L22j85J15
3834A35K7p6j83L22l94K05j2j61J16j52J71pK00k33r7N8M57N3o14K78J00l73N57
3857C77n60K2J59j75L01j80r7j57N10j32l8K85m81l4J7J59k16K0P6K55r4o0K48
$$ plain form
3880 205 118 119 18 44 188 101 -255 0 134 -335 -283 35 -173 13 273 140 -9 94 190 41 -87 -29 -92
3903 -92 1 155 22 -290 197 101 197 -82 -63 6 -238 -125 111 -19 -160 125 -64 65 71 193 168 -132 -135 178
3927 178 -270 -26 -428 46 -61 -75 -80 -205 -140 0 -68 -128 -93 -2 167 -45 69 -184 -110 -157 -214 33 72 127
3951 127 178 -63 64 -88 -68 66 -33 227 -192 203 353 -34 8 -95 155 162 -230 31 229 -55 -28 -22 147
3974 147 -127 11 -125 162 4 126 241 130 63 22 -52 -56 113 135 44 29 78 -70 -60 -20 361 -159 38 -58
3998 -58 -43 -46 -75 126 -142 202 -120 -308 278 -154 -97 -204 -310 -119 104 -181 -29 -150 100 -13 -25 -278
4020 -278 199 -137 13 47 81 130 -191 -151 59 262 14 -205 167 249 13 199 -96 157 -114 98 -173 -201
4042 -201 0 21 49 141 -239 -92 68 -89 19 17 -61 162 -173 366 35 -78 -164 8 -49 62 151 70 -109
$$ packed form
3880B05q7Jj01K6J44q7l56K55J34m69N2L18k08J86K60j33j49J03R6j49j28N8o3
3903i2R3J54j33l12M87r6R6k79J9O9k44J13K36j30j41K85j89J29OJ22k5l00lL13
3927A78m48K44m02M74j07j4nj25O5J40o8o0L5R1J69k12J14k53P4m7n7K47L9N5
3951A27N1k41J27j52K0J34r9K60m19L95J50l87M2j03K50Pl92K61J98k84K7OJ69
3974A47k74J38j36K87j58J22J15j11o7m1p4mJ69K2r1j5M9j48J0M0L81n20J97r6
3998e8J5lk9K01k68L44l22j88N86m32N7j07j06J91K23k85J52j21K50j13j2k53
4020b78M77l36J50L4L4M9l21M0K10K03k48k19L72Q2k36J86k95K53k71K12k71k8
4042b01K01K1K8R2l80J47J60j57J08kp8K23l35N39l31j13q6J72n7J11Q9q1j79
$$ plain form
4065 -109 64 -247 -128 30 -141 -12 -142 15 -87 -122 38 44 57 86 11 135 -305 180 5 47 160 167 -83
4088 -83 -35 340 -49 -128 96 -41 95 356 -138 -55 55 -11 218 1 19 58 84 52 -47 -9 -131 225 86 153
4112 153 -152 -121 -178 65 -90 75 28 -94 -342 16 74 -139 -177 26 70 169 295 -7 -17 -8 -53 18 21 72 12
4137 12 42 -215 -140 -162 -82 -549 -49 -132 88 176 101 191 -445 -334 -42 131 2 164 26 109 151 32 240 -9
4161 -9 102 110 119 64 -154 -59 -23 129 -84 -75 122 -48 -9 -24 129 -290 -158 153 -134 125 -245 -192 -45 -145 112
4186 112 33 68 -34 -100 81 285 -123 78 146 48 168 -111 -94 -191 158 70 -40 -170 -137 -88 -9 271 155 -287
4210 -287 10 242 -133 261 139 141 -35 17 -325 -38 69 -205 79 202 -185 104 38 -404 -23 238 -167
4231 -167 92 -110 186 156 -105 110 107 174 143 -293 408 185 -80 -111 104 -31 -38 -46 -91 72 82 189 -51 -79
$$ packed form
4065a09J73l11J19J58j71J29j30J57j02l5J60OJ3K9p5J24m40M85j75M2J13Pk50
4088h3M8L75l89p9K24j37J36K61m94Q3J10o6K29k17J8L9K6l2r9L8j22L56j39O7
4112A53l05L1n7K43j55J65m7j22k48L58N8k13l8K03M4R9J26l02j0Rm5P1LN1o0
4137A2L0k57P5k2Q0m67N00q3K20Q8p5R0o36J11K92J73j29J62j38Q3M2j19K08k49
4161iJ11QRn5k18R5L6J52k13RJ97j70L9j5J53m19J32L11k87K59l70N3J47j00K57
4186A12p9L5j02o6J81K04m08K01O8r8J20k79J7r7L49q8j10j30L3M9P9K80j16m42
4210b87K97K32l75L94j22Kj76N2l42K87J07k74K84J23l87K89o6m42L81K61m05
4231a67K59k02K96l0k61K15lO7l1m36P01k23k65l1K15j35pqm5J63J0J07k40k8
$$ plain form
4255 -79 -37 186 -26 -53 92 142 -138 252 43 148 38 34 -73 143 275 93 57 270 -9 113 311 -192
4277 -192 341 33 44 146 -44 79 -257 112 168 105 -10 133 34 110 -190 80 -151 -39 -135 -66 94 -31
4299 -31 -16 -131 150 -21 98 -44 244 -19 -125 128 -164 53 -317 -375 -12 -245 -148 42 -254 24 18 -142
4321 -142 -96 11 -43 -5 -41 29 -81 -226 -276 216 -183 75 16 53 -75 -45 -39 45 97 121 396 91 -46 -139 -34
4346 -34 -71 -1 -160 -81 -127 63 104 96 210 -115 -43 -48 -65 77 -21 -345 135 29 212 194 3 -174 -185 175 19
4371 19 -14 -30 303 13 -96 -97 -122 105 -39 -172 66 -234 200 -11 75 65 144 141 1 -3 123 83 -88 114 -241
4396 -241 9 -41 19 -29 -31 -60 -22 172 233 94 135 11 -220 141 145 -52 -53 -174 345 -16 -127 -282 -332 147 -143
4421 -143 -246 -182 31 123 185 -21 168 87 58 43 -13 130 -254 99 157 58 -50 115 302 -23 76 -243 105
$$ packed form
4255g9M2K23k12k7J45N0k80L90k09J05j10mj07K16J32j82l6K13k79J22J98n03
4277a92N33l08J1J02j90J23l36L69N6o3j15J43r9P6l00K70k31J12r6O9J60j25
4299c1J5j15K81j71J19j42K88k63j06K53k92K17l70n8L63k33R7J90k96K78oj60
4321a42M6J07n4L8l6P0j10j45n0M92l99K58n9L7j28L0OQ4N2K4K75l05j37r3J05
4346c4l7P0j59P9m6J90M1qJ14l25P2nj7J42r8l24M80j06J83j8j91j77j1L60j56
4371A9l3j6L33k90j09jk5K27j44j33K38l00M34k11Q6j0P9lj40mJ26m0j71K02l55
4396b41K50n0O0m8kk9L8J94O1j39M1j24k31L61Mj97jj21N19l61j11j55n0M79k90
4421a43j03O4K13R2O2k06J89q1k9j5n6J43l84L53N8r9j08J65J87l25R9l19L48
$$ plain form
4444 105 -162 -24 122 243 -162 -81 -119 -114 85 240 95 46 122 -171 -384 34 332 108 -43 34 -225 66
4466 66 -90 -109 -115 204 107 -71 228 -269 158 298 93 -26 22 72 8 -92 1 105 151 -188 114 -4 -9 -7 18
4491 18 293 -140 -35 -141 -189 -58 -3 69 344 -51 473 -178 168 -106 118 17 52 -49 136 231 27 236
4513 236 -70 -85 76 -144 147 -27 373 149 -202 130 -200 55 -181 -259 -108 151 -4 -228 -199 108 -73
4534 -73 272 -3 -77 124 93 394 39 -25 97 -244 -84 -160 336 -85 206 75 -195 293 200 -70 -179 -224
4556 -224 -230 102 -206 41 25 -256 -33 19 -85 -135 -200 -40 129 63 47 -81 -75 19 -249 196 -191 -36 102 130
4580 130 45 -49 89 147 -22 -15 185 -248 142 -176 7 -120 -195 58 53 -320 -76 107 -18 60 -135 -177 108
4603 108 178 -87 -165 -125 -100 -66 27 53 262 0 -148 26 240 -5 -70 140 24 187 64 -133 -25 278 66
$$ packed form
4444A05k67J38J46J21m05Q1l8NJ99J55j45m9P6k93k13M18K98k24j51P7k59K91
4466F6j56j9oL19r7j78K99m97M27J40k05j19M8N0o4j00R3J04M6l39L02j18nKK5
4491A8K75m33J05j06m8J31N5P2K75l95N24o51L46k74K24j01L5j01J85R5k04K09
4513B36l06j5J61k20K91j74M00k24l51L32l30K55k36p8J51K59j55k24K9L07j81
4534g3L45k75p4K01l1L01l55o4J22l41J60p6M96m21K91j31k70M88r3k70j09m5
4556b24oL32l08K47j6k81K23N2j04n0o5J60J69o6j6j28OR4k68M45l87J55J38K8
4580A30q5r4J38N8j69PK00m33L90l18J83j27p5K53nl73K44J83j25P8j95m2K85
4603A08P0k65p8M0K5L4R3K6K09k62j48J74K14k45o5K10j16J63j23j97J08L03k12
$$ plain form
4626 66 -58 121 247 -71 49 150 -27 51 236 -74 -67 -99 -271 -223 104 56 -34 -100 60 -243 72 59 -53
4649 -53 -267 -246 -277 131 -108 -295 -128 2 182 -51 93 -81 -1 -19 -153 -58 -44 32 -75 266 265 -51 11 -82
4673 -82 161 63 -181 -19 -50 -15 12 -44 56 70 -282 88 94 -26 181 18 -155 226 162 -293 -99 124 -203
4696 -203 -206 -40 -133 62 -164 -61 37 3 -96 -174 236 192 -442 -81 28 -199 29 -439 49 152 -139 -156 11
4719 11 133 -97 -337 -53 33 102 43 -198 81 -135 118 -243 117 -22 -66 -30 -131 -76 -103 -113 58 27 106 -326
4743 -326 -31 -66 148 97 140 -6 18 -150 -35 250 235 -187 -59 -52 -7 22 113 -57 -70 -5 -230 -90 -97 88 120
4768 120 95 -199 70 -73 -61 -104 162 -17 -149 -67 -172 62 254 215 -5 7 -39 -219 -262 68 -132 -63 91
4791 91 53 28 -105 -13 -192 52 -146 15 24 70 352 -83 -69 -93 213 -367 32 24 104 -118 -180 -89 1 -101 -141
$$ packed form
4626F6j24J79J26l18J20J01j77P8J85l10Pl2j72M8L27m8r0o6J60l03L15j3j12
4649e3k14K1l1M08k39j87J67J30J80k33J44j74Q0j8j34R5J4P6j07L41jl16O2r3
4673h2K43r8k44J62l1L5K7n6J00J4l52L70Oj20K07j63j73L81o4m55J94K23l27
4696b03lJ66r3J95k26J03R8l4r9p8M10m4o34L61J09k27K28m68M88J03k91j7J67
4719A1J22k30k40K84Q6O9n9k41K79k16K53l61L60j39m4L6j01N5k7j0J71l1P9m32
4743c26K95l5K14n1M3j46K4j68J15K85j5m22J28PM5K9R1j70j3O5k25J40pJ85L2
4768A20k5k94K69j43J2m3K66j79j32Q2j05K34J92l9k20J2m6j80m3L30k00O9J54
4791I1l8k5j33R2j79K44j98J61RM6K82m35J4k4L06n80L99qQ0k22o2R1R0j02m0
$$ plain form
4816 -141 60 116 93 -22 -19 152 118 112 6 -70 94 -91 79 97 -145 -105 210 -29 60 134 29 187 -304 -134
4840 -134 102 51 -120 2 -200 118 121 140 88 -146 77 15 -233 0 -315 189 -150 2 118 -5 -105 135
4862 135 408 -251 59 -81 -265 110 69 79 -181 -151 170 -112 266 29 94 -9 107 -127 284 -150 181
4883 181 -29 323 209 43 202 -67 -162 13 -2 -15 -119 113 -12 231 127 -203 -14 -168 -289 165 -42
4904 -42 92 110 14 216 -5 -25 331 -47 11 17 -58 146 -273 -126 385 -158 20 21 -69 -79 -160 29 31 -132 -93
4929 -93 -151 121 -97 -226 -12 230 59 154 83 203 77 -234 56 190 -9 -121 293 17 215 263 64 177
4951 177 -34 141 -74 231 -119 381 -129 -44 211 -72 -255 -23 143 -23 5 -169 -122 -7 101 -11 -110
4972 -110 65 10 -206 264 -174 2 72 -224 102 148 25 211 -100 -209 -327 -17 -127 470 107 -32 -17
$$ packed form
4816a41K01N6k3j15LJ71l4oj06p6J64j85J70J8k42M0L15k39Q9P4j05J58m91J70
4840a34K36n1j71J22k02L18LJ9n2k34K23o2k48K33l15N04l39J52J16j23j00K40
4862A35K73o59L10j40j84L75m1J0k60L0L21k82L78k37O5j03J16k34M11m34L31
4883A81k10L52j14j66J59k69r5J75j5j3j04K32j25K43j04l30J89j54j21M54k07
4904d2J34J8r6K02k21k0L56l78N8Op5K04m19J47N11n43J78Jr0j0q1J89Kj63L9
4929i3n8K72k18j29K14K42j71R5p1J20j26l11K90J34j99j12M14k76J98M8j99J13
4951A77k11J75k15L05l50N00n10Q5K55k83j83K32J66j66K8j74M7J15J08j12r9
4972a10J75n5k16M70m38J76P0k96L26M6j23J86l11j09j18L10j10N97l63j39J5
$$ plain form
4993 -17 -37 -96 34 -75 8 -237 150 -6 177 88 -120 -188 212 213 50 -269 -151 -185 -196 12 -237 -80 -10 -228
5017 -228 251 26 228 -132 -122 175 -193 -58 -186 229 164 -59 -142 287 105 2 113 84 21 180 236 -71
5039 -71 -236 201 -70 31 146 35 29 22 58 -31 157 54 261 176 -288 69 192 -117 -317 -77 36 -50 -72
5062 -72 335 76 -208 208 188 -274 249 -56 174 -47 109 -23 -129 -42 99 -31 212 35 247 -204 -239
5083 -239 315 -12 -325 8 283 -192 172 -28 -265 17 -266 35 -159 -98 -30 -117 27 -74 300 133 53
5104 53 -315 -134 -157 161 232 -58 -246 81 4 -61 -91 161 12 -98 -31 57 -121 50 -385 -263 74 -365 116
5127 116 -364 158 56 141 -194 29 102 77 159 -44 77 -338 -56 -105 291 -142 -229 -63 -41 130 -11 -114
5149 -114 118 -141 115 -205 -10 30 -39 -173 -7 270 1 -43 -148 307 216 140 -144 198 -125 121 -338 221
$$ packed form
4993a7k0n9J30j09Q3k45L87j56J83q9k08o8M00Jj63l19J18l4j1K08k49J57P0k18
5017b28M79k25K02l60J0K97l68J35j28M15o5k23q3M29j82j03J11k9o3J59N6l07
5039g1j65M37k71J01J15j11opL6q9J88j03K07q5m64L57J23l09k00K40J13q6k2
5062g2M07k59k84M16k0m62N23l05K30k21J56j32j06Q7J41j30K43j77K12m51l5
5083b39N54l27l13L33K75m75L64k00k37K82k83L01j94O1O8q7J44j01L74j67q0
5104E3l68J81k3L18P1k90j88L27p7o5l0K52j49j10O7Q8j78J71m35J22L37m39M81
5127A16m80N22j02Q5l35K23P3k5Q2k03J21m15K82m9L96m33q7J66K2J71j41j03
5149a14K32k59K56l20J95M0o9j34J66K77k69m4j05M55r1p6k84L42l23K46m59N59
$$ plain form
5171 221 93 367 28 -22 206 -10 151 -17 -91 -190 -165 28 319 69 20 28 -206 -2 -74 99 -230 -25 -242
5194 -242 -47 291 216 -82 18 163 60 -129 -70 160 -107 35 314 69 57 -159 -1 -36 -156 -154 -159 316 -156
5217 -156 60 205 90 -195 -3 -39 -77 11 -232 -91 108 24 56 227 52 101 52 119 -79 -22 154 -37 -172
5240 -172 -168 -236 -66 179 128 -175 262 104 -249 13 -157 186 123 -100 52 -40 -66 -91 -21 212 -80 57 -155
5263 -155 -185 81 53 46 167 134 -166 -77 -296 -75 191 170 -51 -81 -62 -114 245 164 381 -18 -373 84 -93 -188
5287 -188 -30 394 100 -88 -36 -93 44 -127 169 112 -251 -32 194 -60 -7 91 -52 -161 27 153 46 59
5309 59 -151 -433 -310 129 -61 -141 81 -65 66 50 -103 96 -337 173 -73 147 -85 -107 -109 -37 122 48 -289
5332 -289 -270 -110 17 -107 28 -204 -151 43 21 272 108 146 146 87 40 375 -81 -97 218 117 -115 -10 -182
$$ packed form
5171B21j28K74l39n0K28k16J61j68p4r9K5J93K91k50m9Qk34K04p2J73l29K05k17
5194b42J95L38p5k98J00J45j03j89N9K30k67J42K79k45j2k16J58l5j20KnM75m72
5217a56K16J45j15k85J92l6l8Q8k43J41J99q4L2J71j75M9m9O7j98N7J76j91j35
5240a72Mo8J70K45n1l03M37j58l53K62j70L43o3k23J52r2k6k5P0K33k92J37k12
5263a55l0K66k8pJ21l3l00Q9k19K21K66k1k21l0J9n2L59q1K17l99l55M57j77r5
5287a88J58M24k94j88N2n7J37j71K96n7l63K19K26k54N3R8j43j09J88J26j07J3
5309E9k10k82J23M39j90q0K22j46J31j6j53J99m33N10k46K20k32k2kP2J59p4l37
5332b89J9J60J27j24J35k32N3J94k2K51j64L8%n9m7L35m56j6L15j01k32J05j72
$$ plain form
5355 -182 85 -8 -64 26 46 215 140 -126 -151 204 -66 -93 191 236 -42 -221 -273 -215 259 -206 14 107 -32 235
5379 235 67 -426 -207 46 25 198 -110 111 109 109 -147 -27 69 110 -8 84 -214 -155 -147 -134 295 68 -11 -295
5403 -295 -264 268 172 -202 -158 29 6 -126 -70 -217 17 -8 -162 -303 159 141 165 58 17 225 92 -24 -92
5426 -92 54 9 17 133 -107 102 -138 61 94 93 58 -106 -8 7 1 -49 62 -200 180 -185 -250 -224 -3 89 -24
5451 -24 -359 -80 172 -83 -2 157 27 123 351 -214 212 -48 29 -64 383 248 -33 17 -86 21 268 79
5473 79 -206 -87 -29 202 259 33 101 208 -107 -57 108 97 -67 -27 -39 77 -285 128 227 -126 -213 -82 -117 -65
5497 -65 135 276 -44 53 40 167 -53 -110 -88 -35 -252 -61 -52 53 -88 -1 44 156 38 205 -230 205 -37
5520 -37 -39 87 -86 -261 -39 -91 287 33 -235 -109 183 159 -10 -23 -159 7 -292 -218 122 225 -34 38 72
$$ packed form
5355a82K67r3n6R0K0J69p5k66k5L55k70k7K84M5k78j79n2N8M74m65K20R3j39K67
5379B35j68m93K19K53k1J73l08K21k%k56J20R6M1j18R2k98N9QJ3M29k27p9k84
5403b95L1N32r6l74M4J87k3j32N6j47K34k5j54j41M62j8K4j07m1K08j33j16o8
5426i2J46m5QJ16k40K09k40J99L3jl5j64R8J5on0J11k62L80l65o5K6K21R2j13
5451b4l35K79K52k55Q1J59j30R6K28n65M26k60P7r3M47j35k81N0j03J07K47j89
5473G9k85J19N8K31N7k26O8J07l15N0J65j1j64M0j2J16l62M13R9l53q7J31l5N2
5497f5K00J41l20R7j3J27k20n7K2N3k17J91RJ05j41Q7M5J12j18J67m35M35k42
5520c7kJ26j73j75K22n2L78k54k68J26K92k4j69j3j36J66k99P4L40J03k59P2L4
$$ plain form
5543 72 109 -317 -131 217 40 -23 274 -67 -164 -53 -306 134 -21 61 -61 -142 -87 -70 -92 56 -150 56 -22
5566 -22 237 95 -102 273 164 -54 -71 -70 -61 138 178 29 -135 96 137 152 171 7 244 -133 27 53 297 133
5590 133 90 110 125 117 -95 -384 -76 -19 45 -77 121 260 -241 79 -36 -151 1 -72 -260 123 73 189 -294
5613 -294 -50 55 200 -42 -154 -230 -19 -133 -19 5 21 57 225 -80 -283 -192 -125 222 42 113 61 56 -85
5636 -85 46 252 -60 -145 91 -125 200 -125 -45 -96 34 214 332 41 -10 54 59 -181 -181 5 -137 -44 106 22
5660 22 58 -97 -98 -158 -40 363 18 134 -140 12 26 2 -97 -115 -235 -483 117 -212 -327 -186 -38 55 -203
5683 -203 34 -253 33 -149 143 158 10 -68 162 211 -28 -300 -65 -1 -199 291 93 -11 -138 320 -2
5704 -2 178 -122 282 302 138 79 -153 179 73 133 134 37 -88 126 378 -127 -1 -48 132 71 124 -162 13 -82
$$ packed form
5543G2L7m26J86L48j77o3K97l41r7J11k53M40j55Q2j22q1N5J7k2J48k06K06p8
5566b2K59j42j97L75j09k18j7JRJ99M0j49j64K31M1J5J9j64K37l77J60K6K44j64
5590A33m3K0J5qk12k89L08N7O4j22J98J39n01L20j15j15J52p3j88L83n0J16m83
5613b94K44J05J45k42j12p6K11j14J14K4J6L6J68l05k03R1O7L47j80P1n2nj41
5636h5J31K06l12q5K36k16L25l25Q0n1J30J80J18k91n1O4Nk40%J86j42R3J50q4
5660B2L6j55jo0J18M03l45J16k74J52J4k4r9j8j20k48O00l29j15J41J48R3k58
5683b03K37k87K86j82K92J5j48p8K30M9k39k72K35O4j98M90j98j04j27M58l22
5704bJ80l00M04K0j64n9k32L32j06O0Jr7j25K14K52n05J26m7J80o1N3k86J75r5
$$ plain form
5728 -82 18 -109 -39 -58 -260 -52 -66 163 -32 194 -35 -133 127 -88 -197 65 51 1 -22 93 -132 20 -16
5751 -16 105 122 -25 -95 85 -383 58 240 29 11 -83 -214 -109 33 170 -140 -347 26 92 -92 105 -4
5773 -4 185 84 -7 123 8 237 204 -64 176 96 -107 151 113 -181 79 152 30 198 165 90 16 -65 43 265
5797 265 -103 -43 -39 -172 139 94 -17 198 174 167 84 -35 307 122 -98 -17 58 104 113 64 123 209 -86 115 85 -51
5823 -51 -41 -221 -109 -40 128 -343 -76 -236 190 -117 139 181 246 32 -35 390 16 -43 -15 -113 -170 -124 -51 129
5847 129 247 -15 321 265 -116 3 -92 -65 266 -66 -28 121 -138 48 36 -140 -190 275 374 -177 14 -66 -186
5870 -186 -325 24 96 22 200 209 24 -121 131 -151 -201 -154 95 -200 -313 -346 137 -114 144 -64 99 -251
5892 -251 -45 30 294 -1 247 79 299 -224 24 -140 -179 128 -199 -190 -34 -283 -23 40 239 231 143 -171 145
$$ packed form
5728h2J00j27P0j9k02K08j4K29j95K26k29r8K60k15j09K62j4n0k3J15k25J52l6
5751a6J21J7j47p0J80m68M41J82k11j8r4j31J05J42J37l10k07L73O6j84J97j09
5773dJ89j01r1J30j15K29l3k68K40q0k03K58l8k94K60P3j22J68l3p5p4q1J08K22
5797B65l68O0Mj33L11m5j11K15k4pq3j19L42j85k20Q1P5M6Rm9N9Q6k95K01l0j36
5823e1J0j80J12O9J68m71K67j60M26l07K56M2O5k14o7M25l74n9K8r8n7M6P3J80
5847A29J18k62L36n6l81J19r5K7L31l32L8J49k59J86j2j76n0M65R9n51J91q0j20
5870a86j39L49P2p4J78Rj85j45K52k82n0M7K49k95j13l3M83k51K58k08J63l50
5892b51K06P5K64k95K48j68K20n23K48j64l9L07l27RJ56k49K60O3J99qq8l14L16
$$ plain form
5915 145 368 -255 100 -109 -87 -90 -121 185 182 -25 -161 66 177 -72 261 -267 297 -168 -126 -421 38 75 -168
5938 -168 74 -157 -92 34 -34 2 -34 -200 67 8 -89 2 -13 84 49 68 -69 109 235 -121 173 185 5 69
5962 69 130 -251 216 135 71 -50 -25 156 146 -410 118 70 -184 -86 -3 187 -78 185 -249 -123 199 -198 10
5985 10 16 58 408 -22 28 44 -141 97 -25 -128 -324 -105 21 119 89 19 -17 -2 30 -75 75 40 160 -128
6009 -128 8 6 165 -92 165 35 -100 -110 -14 -396 122 -180 50 91 -151 -18 -217 142 407 -37 -204 -294
6031 -294 144 186 273 -27 -115 -217 152 105 -142 -89 -17 78 -18 124 173 -280 44 -243 -38 -173 -100 67 -52
6054 -52 -175 -155 17 -223 -259 -155 -233 16 -100 90 225 44 347 154 111 -58 -178 64 -274 103 113 426
6076 426 108 -87 145 142 228 77 184 -141 130 -155 158 -143 145 -99 89 161 96 201 -27 186 -278 65
$$ packed form
5915A45K23o23L55k09K2ll1L06lk07j36K27J11k49L33n28N64m65M2k95M59L7k43
5938a68K42k31O5J26o8L6l6j66K67n9r7R1j5R7l5J9j37J78J26l56K94J2j80O4
5962F9O1l81M67q1o4j21K5J81j0n56N28m8k54R8Q3J90k65K63m34J26L22l97K08
5985A0OM2L50m30N0J6j85K38j22j03j96K19J26R8l0p0l6J5L2j05J50l5J20k88
6009a28J36kJ59k57K57j30j35j0R6l82N18l02K30M1k42J33j99L59K65m44j67r0
6031b94M38M2Q7l00q8j02L69m7k47N3P2R5r6J42M9m53L24k87K05j35P3J67j19
6054e2j23K0J72k40l6J04p8K49j16J90J35j81L03j93m3j69j20K42l38L77J0L13
6076D26l18j95K32lQ6j51J07l25K71k85L13l01K88k44J88P2o5J05k28K13m64L43
$$ plain form
6098 65 256 -92 47 -137 -115 2 -200 -56 241 -62 117 -46 73 280 -147 -2 -64 -202 215 -41 -65
6119 -65 4 -65 30 284 -102 -179 -134 32 235 -414 -20 -141 -197 89 179 50 66 217 -59 -126 -31 -178 -164 -347
6143 -347 -244 40 76 187 235 -53 63 49 -161 136 340 -172 -171 -78 110 198 114 -104 -257 20 -48 94 246
6166 246 105 103 125 24 176 70 -87 -225 -47 -14 317 194 -199 -38 122 -53 -150 -47 -96 -288 -48 123
6188 123 6 156 11 -348 27 -100 48 151 172 2 151 53 134 -105 90 156 242 -45 -176 111 58 -1
6210 -1 107 58 -35 111 48 60 71 72 -325 -182 124 -75 -96 98 77 52 69 -15 -53 -166 -21 -124 134 -123 82
6235 82 229 -152 132 -122 -23 133 202 57 76 36 -263 10 247 -10 14 58 -82 41 -36 57 -38 204 -64
6258 -64 -17 55 -185 21 -114 167 165 -44 -146 5 -200 -27 -25 -52 49 -76 25 -71 8 -51 15 111 -182 8
$$ packed form
6098F5J91l48J39j84K2J17k02J44K97l03J79j63J19K07m27J45o2j38M17k56k4
6119f5O9o9R5K54l86p7M5J66K03o49L94j21n6K86R0j29J6J51k76o7R5j47J4j83
6143c47J03K84L6J11M8k88J16j4k10K97K04n12JR3J88Q8q4k18j53K77o8J42J52
6166B46j41kK2j01J52j06j57j38J78L3L31j23l93J61J60j75r7J03m9j92K40J71
6188A23j17J50j45l59L75j27J48J03K1j70J49r8Q1k39J95O6Q6k87j31K87n3n9
6210aJ08m9r3J46o3J2J1Jl97J43L06j99k1J94k1k5J7q4l8j13J45j03K58k57K05
6235H2J47l81K84k54R9J56O9j45J9m0k99K73K37k57K4M4j40J23p7R3r5K42k68
6258f4M7P2k40K06j35K81kk09j02J51k05J73Kk7J01j25J01r6P9n9O6R6k93J90
$$ plain form
6282 8 -394 -208 17 -5 285 -142 132 20 146 -150 22 -152 107 -6 -12 171 -42 26 253 152 27 -3
6304 -3 48 21 87 -108 132 -135 -204 146 -79 153 197 111 -25 -128 -464 9 -76 -97 -60 204 242 236 196 -14 -56
6329 -56 -197 -98 -159 -266 76 81 -74 82 -116 -85 -160 15 -128 353 -106 169 -50 -54 73 -341 230 66 -42
6352 -42 -100 109 18 24 -182 127 -98 149 -473 -235 51 -11 -191 -53 -252 -386 -322 -310 -165 -357 576 11 57
6375 57 -30 -175 -148 233 -113 -74 95 -59 300 -85 59 49 54 -57 -116 88 128 86 36 -69 97 -84 24 237
6399 237 79 160 -67 193 294 12 316 93 -74 72 19 242 18 -111 -35 34 -146 -33 -189 -229 11 5
6421 5 -121 42 -249 21 127 58 62 -57 -116 -95 -27 -19 36 86 172 263 267 -222 -45 19 298 -41 -180 -35 0 133
6447 133 -72 -65 -251 -39 89 160 41 8 152 231 129 136 74 68 -278 63 -192 58 -57 -288 33 23 -74 447
$$ packed form
6282Hm02J86K25k2K90m27K74j12J26k96J72j74K59j13oJ83k13O8K27j01j25l0
6304cN1k7O6j95K40k67o9L50k25K32M4q6j36j03l36M73q5k1L7K64L8om0k10m2
6329e6j41R9o1j07L42Nj55J56j98L1p5J75j43M81m59K75k19mJ27m14N71j64j08
6352d2n8K09r1Ok06L09k25K47o22K38K86o2j80J38j99j34O4J2J45j92R33n65M6
6375E7q7j45K7L81l46L9J69j54L59l85J44j0Nj11n9K04M0m2n0j05J66j81J08K13
6399B37j58Q1k27K60J01k82L04k23j67J46n3K23k24j29P6O9j80J13j56m0K40o
6421Ej26J63k91K70J06o9Mj19n9K1O8QN5N0Q6R1Mm89J77O4K79l39j39J45L5J33
6447A33k05Pj86K12J28P1j19l3J44P9j02Po2ol46L41k55K50j15k31L21j0r7N21
$$ plain form
6471 447 -187 -116 218 56 -7 -386 55 7 -155 336 95 76 107 138 133 -63 -141 13 71 62 68 283 -185 -56 -1
6496 -1 82 -6 316 46 -148 -39 20 -200 131 99 -136 174 -44 -127 -110 117 0 -338 34 74 -32 -115 43
6519 43 255 -163 -87 -111 -138 71 29 114 30 -331 -90 85 107 4 199 278 173 -260 -6 232 -324 47 159
6542 159 -12 -51 -282 -72 77 -5 -62 9 -65 296 -32 -232 288 250 31 67 281 260 106 449 -153 -116 89
6565 89 130 152 33 151 -178 -39 295 -333 -267 -43 103 126 -223 -14 -119 81 171 -171 -101 374 257 -56
6587 -56 108 246 -237 68 191 1 -50 -165 -261 15 262 -109 -46 1 -66 -32 -124 203 -21 342 0 153 235
6610 235 215 40 105 19 9 78 -77 -164 -74 -59 -95 -140 -13 -104 -56 48 28 30 -7 -112 -90 -70 156 71 -304 27
6636 27 159 129 111 522 121 -371 -61 131 -142 66 -78 -4 -56 -116 -191 -44 79 168 12 -37 164 -82 51
$$ packed form
6471D47o34P1L34j62o3l79M41m8j62M91k41j9L1L1nj96p8J54N8rOK15m68J29N5
6496aQ3q8L22k70j94J09N9k20L31l2k35L10k18q3J7K27j17l38L72M0j06q3J58
6519D3K12m18P6k4k7K09m2Q5q4l61K41J75K2j03J95P9j05m33K54K38n56L71J12
6542A59j71l9k31K10J49q2n7P1p4L61l28k00N20l8k19L6K14k1j54L43o02L7K05
6565H9M1K2j19J18l29J39L34o28O6K24J46K3l49K09j05K00R0l42P0M75j17l13
6587e6J64J38m83L05J23j90n1j15r6K76K47l71O3M7o7L4r2L27k24L63l42J53Q2
6610B35k0j75O5q6j0O9j55q7R0J5l6m5J27r1M8J04k0Kl7j05K2K0K26q5l75L31
6636B7J32l0j8M11m01m92L10J92k73K08j44P4n2o0p5J47J23Q9j56m9K01k46J33
$$ plain form
6659 51 -191 229 60 -137 164 -21 164 28 -260 290 -106 98 -140 207 146 -62 366 -110 -52 -266 30
6680 30 129 259 -37 -183 165 -119 5 64 88 8 -60 -11 7 171 187 -215 -64 -48 -167 -114 -281 288 -122 57
6704 57 11 74 72 10 -101 -71 -60 9 -79 -86 105 -138 13 -254 -48 -130 -74 -326 -150 -208 -132 -112 79 -157 -44 -180
6730 -180 232 -143 87 -25 138 47 -52 93 -144 198 -78 81 116 169 42 -123 66 -48 -63 132 -315 -90
6752 -90 23 102 -6 3 -101 -118 -187 125 -57 -89 136 84 -312 -75 -228 -107 30 -89 -49 54 -19 -104 94 153
6776 153 -155 -47 -90 -16 8 124 -9 16 -50 160 -203 61 242 -68 13 -21 -144 -95 -13 -219 -91 162 -85
6799 -85 -117 184 151 -7 -50 -1 -254 47 -328 189 -533 85 348 69 36 56 34 -88 112 -77 41 -323 -72
6822 -72 147 174 226 -92 60 28 -48 -104 -130 -11 -196 159 -60 306 147 -349 38 60 219 225 58 -131 8
$$ packed form
6659E1k42M20j69j97L01j85J85j36k88N50l96K04k38L47o1k08M28m76N8k14K96
6680C0R9J30k96j46L48k84J24N9K4q0o8M9J8J64J6m02J51J6j19N3j67N69m10J79
6704E7m6O3ko2j11L0J1O9q8pJ91k43J51k67K06q2N6k52J76n8P6K0J91k36J13j36
6730a80M12l75K30j12J63r1r9J45k37L42k76J59L5N3j27j65J89j14j5J95m47K25
6752i0J13P9j08Rj04j7o9L12j82l2K25n2l96K37j53J21J37j19M0J03p3q5J98N9
6776A53l08J08m3P4K4J16j33K5o6K10l63K64J81l10Q1l4j23M9Q2k06J28K53k47
6799h5l2L01l3j58m3M9k53L01l75N17p22O18K63k79l3K0k2j22K00j89J18l64K51
6822g2K19K7N2l18J52l2p6n6k6J19j85L55k19L66j59m96L87K2J59Oj67j89J39
$$ plain form
6845 8 175 167 179 -134 -210 116 -312 104 175 12 212 -124 171 155 88 -133 114 234 -191 30 245 252 -116 10
6869 10 -12 -148 75 114 -108 168 -23 -229 -190 5 299 -188 -63 -17 -91 -140 -163 84 -142 -91 -69 129 -184
6892 -184 155 -267 -117 32 -309 75 -94 9 86 -59 12 73 -187 62 81 54 23 314 -148 -365 125 -76
6914 -76 -88 111 -86 91 65 -165 41 47 -73 48 -34 -157 264 -162 246 -275 413 -225 72 53 152 44 -114
6937 -114 64 -54 51 39 -233 125 -139 -34 -131 154 -35 -72 243 152 -145 -108 32 151 -347 161 -87 0
6959 0 -4 -98 59 -32 46 -58 176 5 -71 -50 -53 115 73 -130 170 129 -74 -27 413 62 55 -452 58 356 -54
6984 -54 -42 2 8 62 120 -242 -125 -104 174 -12 19 29 158 19 -275 -90 55 25 -210 164 99 -159 -232 151
7008 151 98 10 52 -97 21 -222 75 -22 108 -118 2 -135 168 -91 -236 133 -222 -157 -93 294 274 -134
$$ packed form
6845HJ67qJ2l13p6L26m28M16P1j63K00l36K95j6o7k21K47J20m25K21K15Pl68J26
6869A0k2j36K23L9k22K76j91k06L9J95K94m87J25M6p4m9k3K47k26N1K2J98l13
6892a84L39m22J50J49l41L84j69J03P7j45P1O1k60K49J9k7l1K91m62k17M90k01
6914g6j2J99j97J77k6k30K06Oj20J21q2j23M21m26M08n21O88o38K97j9R9j08j58
6937a14J78j18J05j2k72L58k64J05r7K85j89l7L15r1k97L7J40J19m98N08k48Q7
6959@mr4J57r1P8j04K34j71p6K1lJ68m2k03L00m1k03M7M40l51pn07N10K98m10
6984e4J2M4ON4N8l62J17K1K78j86L1J0J29j39k94J85J45l0k35L74o5k58p3L83
7008A51n3q8M2j49J18k43K97r7J30k26J20j37L03k59j45L69l55O5O4L87k0m08
$$ plain form
7030 -134 -5 140 -188 320 -78 62 145 51 -74 45 -3 -44 -196 40 257 227 -137 329 -174 127 79 -77
7052 -77 251 375 117 -107 106 105 -22 -54 -138 88 -45 -18 21 161 43 -92 105 -357 -14 324 -51 -129 -260
7075 -260 91 114 9 182 36 -75 -189 27 -348 175 -24 -11 24 -8 176 75 144 74 53 -155 33 188
7097 188 10 174 21 38 -200 8 -109 204 285 16 394 17 -170 -140 115 -148 59 -327 105 17 31 -120
7119 -120 -160 -196 162 259 -131 414 -46 -10 113 119 33 -207 269 -132 -147 -22 -303 -124 72 -66 127 142 -201
7142 -201 -88 -258 -185 217 -183 142 41 -191 172 149 22 -333 62 136 -167 -45 57 195 -232 301 29
7163 29 262 -51 91 188 -15 -73 26 -139 243 -138 327 -107 -189 39 -171 199 141 64 96 -173 187 -212 -236
7186 -236 -67 -399 173 210 254 138 203 8 -70 328 -261 58 -65 -202 145 137 -119 197 -219 -19 -99 -41 178
$$ packed form
7030a34J29J45l28N08l98J40Q3r4j25J19m8m1j52K36K17l0l64M66n03L01m8j56
7052g7L28J24k58k24K13jj27l2q4K26j33K7L9J40j18j35J97m62L43L38l75p8j31
7075b60L51K3j05J73j46j11j14K16l75N23j99J3L5l2J84j01O9p0k1k08J88J55
7097A88j78J64j53J7k38K08j17L13Q1k69L78l77j87L0K55k63K07l86M32q8J4j51
7119a20m0l6L58R7l90N45m60L6J23Oq6k40M76m01j5J25k81J79J96j38J93J5l43
7142b01J13j70P3M02m00L25j01k32L63k3j27l55L95P4l03J22J02J38m27N33k72
7163B9K33l13J42R7k03n8R9j65L82l81M65m34q2K28k10L70n8p7L2k69L60l99k4
7186b36J69l32N72L7M4j16O5j95p8L98n89L19j23j37L47qk56L16m16K00q0N8K19
$$ plain form
7209 178 174 220 157 112 -246 -84 4 50 -371 -269 94 105 -41 -218 48 -228 84 43 74 -194 7 -71 -236 161
7233 161 18 27 -116 153 55 -111 226 57 -130 -128 -169 34 -204 170 -83 -24 43 -11 140 249 -88 85 34
7256 34 13 -56 -151 -102 -190 -121 308 125 -247 303 311 32 21 -254 -88 -265 25 31 75 27 -210 82 194 36 -99
7281 -99 288 -271 134 134 -114 69 10 39 30 80 141 195 229 -18 2 -129 46 11 22 19 -33 -56 258 36 7 17 229
7308 229 -200 -59 53 62 -144 94 -107 -220 49 -59 294 26 6 -39 153 239 441 -358 85 60 -76 -53
7330 -53 61 -292 -27 178 -208 -169 77 138 -4 118 -163 364 122 -193 -178 -109 157 -160 110 295 151 -110
7352 -110 2 75 206 -74 22 152 130 -84 -26 61 -98 108 -120 40 191 182 103 -367 319 138 8 85 -164
7375 -164 176 -72 -230 187 -63 -294 268 136 -48 316 -74 67 -22 39 25 458 94 92 111 -55 98 -4
$$ packed form
7209A78mM6o3m5l58J62Q8M6m21J02L63J1j46j77K66k76L12m1L1k68K01p8j65L97
7233A61j43Rj43K69r8j66L37j69j87Km1K03k38L74k53N9O7n4J51J09l37J73n1
7256C4k1o9r5M9q8O9M29j83l72N50Qk79j1k75J66j77K90OM4m8k37K92J12j58j35
7281i9L87n59M05%k48J83n9K9rN0O1N4L4k47K0j31J75l5J1ln2k3L14k22k9J0K12
7308B29m29J41J12Rk06K38k01j13K69j08L53k68k0m5J92Q6K02p99M43k5j36K3
7330e3J14l53K65K05l86L9K46O1j42J22k81N27k42l15J5O9K66l17K70J85j44k61
7352a10J12P3J31k80R6J30k2k14N8Q7j59K06k28J60J51rp9m70O86j81j30P7k49
7375a64L40k48j58M17k50k31N62j32j84L64l90J41q9O1j4M33l64kJ9j66J53j02
$$ plain form
7397 -4 192 -190 221 -183 218 259 -128 90 -237 99 -38 -200 -35 90 325 55 -47 -86 -56 89 214 115
7419 115 -9 100 -93 22 -80 -144 56 107 9 66 -42 109 -174 -147 -55 305 56 181 -143 -88 58 518
7441 518 -92 50 342 128 172 -46 -229 -99 11 -42 -152 -246 19 8 6 58 -151 -9 -127 10 212 47
7463 47 -309 12 -196 -333 41 -62 220 29 50 94 -59 70 145 134 32 -36 -247 220 -207 158 -124 -265
7485 -265 -69 80 141 84 74 107 60 110 51 59 223 -2 128 -118 -8 134 16 236 -281 -111 -68 68 61 -318
7509 -318 -250 257 13 -201 318 -34 -101 -9 -154 -117 -105 -97 -305 226 222 -109 -138 47 -40 141 52 -306 -124 -48
7533 -48 171 -166 -126 13 159 5 -262 101 217 150 191 139 -22 -74 166 24 -5 40 51 -48 159 -63 -20 124
7557 124 -65 -107 -181 2 199 172 299 -87 -60 135 11 341 55 -264 -15 51 68 -59 38 -182 -111 154 -87
$$ packed form
7397dJ96l82M11m04M01M1l87K18l27L36j37j62J65J25K35k70j02l9L0J45J25r9
7419A15j24J09j93J15j02o4K00N1r8N7j08J51k83K7R2L60k49J25l24N5J46M60
7441E18o10J42K92k14M4k18j83J30J10n3j10r4K65j1kN2k09J42j18J37K02j65
7463D7l56L21k08j37L74j03K82j91K1M4j53J29P5j1j02o8k11M67m27L65k82j41
7485b65J96J49O1n7j0L3m7N0n9QJ64k25J30k46J10J42j18K20n17J70M3J36pl79
7509c18O8N07k44k14N19l52o7R2j45L7J2Qk08N31ml31k9J85q7J81q9l58J82P6
7533d8K19l37M0J39J46j54k67L63J16o7M1n2j61n2K40j42k9M5J1r9K07k22M3J44
7557A24j89m2p4J83J97k7J27l86K7J95j24L30k86l19K49O6J7j27R7k20P1K65k41
$$ plain form
7580 -87 3 -175 129 34 -132 171 46 424 -359 134 -10 234 259 32 -83 -36 299 221 -41 46 -139 179
7602 179 15 -158 318 -76 32 -35 -58 -9 -147 119 -136 -86 172 -36 -40 56 43 243 149 120 -389 14 -201
7625 -201 -40 193 34 -112 130 55 10 403 1 224 -167 -89 217 112 -118 -65 -119 120 103 62 226 -20
7647 -20 -6 18 185 23 -91 -168 26 -34 -179 -64 223 1 -25 69 -107 24 -112 -143 -178 -65 58 179 -116
7670 -116 90 22 -130 75 259 -143 97 -243 260 209 -243 -208 119 -94 25 395 -48 22 -145 -56 284 -82
7692 -82 -201 -27 233 4 -415 -118 132 25 12 -42 123 -45 195 -59 210 7 53 -63 -143 -373 -126 -72
7714 -72 -114 85 90 191 -107 -36 -11 -12 -425 -70 -316 104 -104 0 -62 -267 -53 8 -249 -126 -142 -33 13 -243
7738 -243 -293 -101 92 -375 -159 -36 80 -57 -136 27 129 111 -72 233 -117 -132 -332 -64 1 -120 -106 173
$$ packed form
7580h7R0j78L04r5j66L03j25L78p83M93j44K44K5k27j15M7L35p8k62Q7j85L18
7602A79j64j73M76l94J08o7k3M9j38K66k55N0K58k08mR6j3K00r4k9n09M03k15
7625b01J61K33j59j46K42p5m5L93m02K23l91P8L06j05k30N3n4K39j7m1J64k46
7647b0J4K4J67j62j14p7J94o0j45J15K87k22k6R4j76J31j36l1l5J13J23J21k95
7670a16K06o8j52K05J84m02K40l40N03n1m52L5L27k13J19L70m43P0j67Q9L40l66
7692h2j19J74K60k29m19K97K50j07j3n4J65j68K40k54K69k03M6j16q0k30K47N4
7714g2m2J99NJ01k98P1K5jm13L55k46M20k08J04o2k05K14O1k57J23j6J09M6k56
7738b43n0J92J93m67K16J23J16j37p9J63J02j8j83L05l50j5k00K68O5j21J4K79
$$ plain form
7760 173 -134 -139 -2 -119 221 245 -146 -51 -76 -78 37 -111 -350 45 200 177 -1 -37 141 75 -111 -120 -105 262
7784 262 29 14 78 161 30 180 8 -275 113 -79 -85 -147 97 -54 -31 -154 35 -223 -33 155 -112 -479
7806 -479 183 -98 -114 9 -66 61 -25 131 -60 -221 -43 -192 261 379 85 183 -132 43 61 -123 -149 -329
7828 -329 -69 -45 79 192 -5 -43 -289 -125 -25 517 -275 127 106 -16 38 -116 165 61 -127 301 -99
7849 -99 -39 -13 98 168 16 -132 -247 106 351 2 -65 67 -24 298 -258 -66 -287 48 72 -41 265 -222
7871 -222 -128 -43 -245 78 209 -131 -108 123 199 172 128 -174 83 -325 356 312 -142 -83 -156 170 75 -93 -40 -142
7895 -142 100 273 -65 222 158 -80 -303 46 -93 -134 -17 -202 -263 52 -159 219 176 371 -160 302 51
7916 51 -144 194 -110 338 -179 31 114 -147 -83 -269 -82 -181 -257 21 75 137 44 89 -134 218 -136 154 -204
$$ packed form
7760A73l07nJ37j17L40K4l91R5k5kJ15j48k39L95J55k3j78l6J78o6j86rJ5L67
7784B62k33j5O4Q3j31J50j72k83L88j92oo2K44j51K3j23J89k58J90J88k67l67
7806d79O62k81j6J23p5J27q6J56j91j61J78j49M53J18k94R8l15J75J8j84k6j80
7828c29K60K4J24J13j97l8k46J64J00N42p92M02k1j22N4j54K81j04j88M28m00
7849i9O0K6J11P0j52j48j15L53K45l49o7J32r1L22n56J92k21L35K4j13L06m87
7871b22R4Q5k02L23J31l40K3K31P6k7m4l02K57m08O81m4m54N9p3L26r5j68N3j02
7895a42K42J73l38K87o4k38k23L49j39m1J17j85o1L15k11L78m3J95n31M62k51
7916E1j95L38l04M48n17K10Q3k61O4j86J87r9p6K78N4O2r3M5k23L52l54K90l58
$$ plain form
7939 -204 157 164 -23 -161 -56 -3 -50 263 84 94 -61 353 169 -42 26 -115 207 399 304 8 112 -21
7961 -21 -82 173 -389 137 -119 -132 52 118 246 39 -249 55 -151 18 -102 34 253 -260 -46 -14 -16 -53 129
7984 129 -20 -90 -54 -270 141 21 123 105 25 94 -173 78 -176 -227 136 25 336 130 219 187 66 -260 190
8007 190 214 187 -17 5 121 -145 61 -232 -128 -57 -168 199 -90 -57 218 298 -185 215 232 231 -19 65 -155
8030 -155 -27 12 14 116 -95 -20 -15 66 -28 86 -114 351 6 55 362 -302 197 -67 2 103 7 -185 -231 -148
8054 -148 26 137 -313 143 330 86 -146 57 -57 -62 76 -295 324 -111 -244 -264 -213 127 -169 57 -80
8075 -80 -179 -105 54 30 33 190 -72 22 177 -93 -7 -38 -53 7 -38 50 -180 -349 -173 -8 214 -124 52 10 -23
8100 -23 -135 181 111 299 -33 -22 1 -5 -28 59 -251 -300 -106 368 307 153 11 -398 -9 -73 -185 -274 -77 -55
$$ packed form
7939b04L61Pj87j38J05N3m7L13j79J0j55M14j84k11O8j41L22J92r5k96J04j33
7961b1o1K55n62N26k56j3J84O6J28k07k88L04k06J69j20J36K19n13K14L2kl7J82
7984A29j49p0L6k16M11j20J02j8q0O9k67K51k54n1L63j11L11k06Q9l2j21l26M50
8007A90K4k7k04K2J16k66K06k93J04P1j11L67k89L3K75Q0m83M00J7jk50Q4k20
8030a55J28L9KJ02k11P5NQ1r4J14k00M65l45M9L07o64M99k64O9J01r6j92m6Q3
8054a48J74J11m50M56J87k44k32K03j14nJ38l71O19m35j33k0N1L40k96K26j37
8075h0r9P4J59k4LJ57k62R4J55k70Q6l1j5O0m5Q8k30j69J76J65K22l38J76m2l3
8100b3j12L16p0J88l32J1K3ok3Q7l10m9J94M74o1j54j42m09L89o4j12q9J97K2
$$ plain form
8124 -55 133 32 20 -171 -163 -87 133 225 134 3 39 -355 170 183 -104 -50 -28 234 -178 329 -346 -98 26 17
8148 17 -177 24 78 340 91 7 -96 63 174 -102 -74 -7 -112 -158 78 -297 -6 -2 -97 -310 162 -19 184
8171 184 113 -130 -208 4 -192 -99 154 -41 169 253 217 267 -220 218 17 3 51 15 41 137
$$ packed form
8124e5J88j01j2j91QP6K20R2r1j31L6l94N25J3k87N4K2K62m12N07o75K48J24r
8148A7j94K01N4K62k49q4j03J59J11k76K8O7j05m6K36l75K91Mr5k13M72j81K03
8171A84p1k43p8K12j96R3K53j95K10Q4l6N0m87M38k01j4M8l6K6R6
8191A37
$$ Imaginary data points
##PAGE= N=2
##DATA TABLE= (X++(I..I)), XYDATA
$$ plain form
0 0 0 0 0 0 0 0 0 0 0 0 0 0 -1 7 -8 8 -8 8 -8 14 -16 16 -18 23 -25 31 -33 39 -42 48 -56 62 -69 76 -85 96
36 96 -105 116 -130 143 -158 176 -196 216 -239 266 -295 330 -369 416 -469 536 -618 726 -864 1059
56 1059 -1352 1841 -2801 5394 -25276 -76127 -3065 25841 -30677 -55572 -3508 4571 -40859
69 -40859 -40309 4168 -7234 -48082 -30509 11055 -10604 -48027 -25441 11595 -9371 -38815 -16828
82 -16828 9594 -9773 -28391 -8932 7970 -8195 -18102 411 10326 -7461 -14581 6174 16593
95 16593 -3188 -13146 9059 21235 1116 -8754 11900 19607 -295 -2265 19876 17988 -6229
108 -6229 -1140 26710 18246 -10417 -974 28309 16890 -10816 2315 25493 8869 -10075 11084
121 11084 25300 290 -10991 17414 25008 -4966 -8858 21081 23154 -5076 -4340 21242 19101
$$ packed form
0@%%%%%%%%%%%%jQj5J6j6J6j6K2l0L2l4M1m8N6o4P2q1R0j04J18j31J45j61J81
36I6k01K21k46K73l01L34l72M12m55N05n61O25o99P85q85J005j154J344j590J923
56A059k411L193m642Q195l0670n0851P3062K8906n6518k4895N2064Q079m5430
69d0859N50M4477j1402m0848J7573M1564k1659l7423K2586L7036k0966k9444K1987
82a6828K6422j9367j8618J9459J6902j6165r907J8513R915j7787p120K0755J0419
95A6593j9781r958K2205J2176k0119r870K0654P707j9902j970K2141j888k4217
108f229N089K7850q464k8663R443K9283j1419k7706J3131K3178j6624j8944K1159
121A1084J4216k5010j1281K8405P594k9974l892K9939K073k8230P36K5582k141
$$ plain form
134 19101 -2725 2935 23035 15095 -1947 9945 25657 12465 -1181 14078 27719 13151
146 13151 1054 13844 25211 14585 5339 14471 22189 12982 6462 15758 20092 8640 3517 16408
160 16408 20276 4133 -1961 13164 17913 1216 -4440 9934 11694 -3978 -6078 7420 4231
173 4231 -10373 -6312 7223 -1640 -17300 -8250 5967 -6254 -20227 -8527 3011 -10340 -19857
186 -19857 -6892 -1262 -14498 -17384 -2931 -3111 -17284 -15457 -132 -3192 -16673 -12454 1127
199 1127 -3406 -14246 -8258 1988 -3957 -11346 -3496 3275 -4340 -9118 -363 3993 -4389 -7662 951
214 951 4754 -3336 -6928 569 3636 -3434 -5616 1043 1968 -5488 -5635 2173 960 -7816 -6459 2611
230 2611 527 -9103 -7068 1892 -1016 -9076 -5539 1797 -3149 -9817 -3451 2706 -4650 -8939 -629
$$ packed form
134A9101k1826N660K0100p940j7042J1892J5712j3192j3646J5259J3641j4568
146A3151j2097J2790J1367j0626r246R132P718r207o520R296M334j1452n123J2891
160A6408L868j6143o094J5125M749j6697n656J4374J760j5672k100J3498l189
173D231j4604M061J3535q863j5660R050J4217j2221j3973J1700J1538j3351r517
186a9857J2965N630j3236k886J4453j80j4173J827J5325l060j3481M219J3581
199A127m533j0840N988J0246n945p389P850O771p615m778Q755M356q382l273Q613
214I51L803q090l592P497L067p070k182O659R25p456j47P808j213q776J357R070
230B611k084r630K035Q960k908q060L537P336m946o668O366O157p356m289Q310
$$ plain form
245 -629 3733 -4811 -7434 2098 4722 -3971 -4283 4654 4913 -2763 -853 6829 4381 -1587 2948 9238
261 9238 5083 -245 4475 10082 4965 577 5689 9275 3982 1514 6493 7634 2394 1323 6485
276 6485 6195 392 182 4819 4000 -1320 -1329 2369 1812 -3026 -2901 762 -1145 -5358 -4226 -255 -3456
293 -3456 -7328 -4908 -1255 -4773 -7860 -4289 -1736 -5600 -7875 -3957 -1296 -5434 -6975 -1954 -725
308 -725 -5104 -5569 67 143 -4454 -3321 2032 1036 -3331 -1001 3692 1459 -1794 1454 5028 1647
324 1647 -867 2588 5159 1597 -308 3980 5559 1026 -169 3706 4327 -314 -168 3860 2753 -1329
340 -1329 -808 2673 1029 -2678 -1200 1667 -237 -3645 -2199 739 -1672 -4657 -1800 715 -2235
355 -2235 -4474 -1440 553 -2817 -4105 -104 827 -2641 -2870 692 1266 -1801 -1510 2008 2072 -1210 -317
$$ packed form
245f29M362q544k623R532K624q693l12Q937K59p676J910P682k448n968M535O290
261I238m155n328M720N607n117m388N112L586n293k468M979J141n240j071N162
276F485k90n803k10M637q19n320rL698n57m838J25L663j907m213J132L971l201
293c456l872K420L653l518l087L571K553l864k275L918K661m138j541N021J229
308g25m379m65N636P6m597J133N353r96m367K330M693k233l253L248L574l381
324A647k514L455K571l562j905M288J579m533j195L875O21m641J46M028j107m082
340a329N21L481j644l707J478K867j904l408J446K938k411k985K857K515k950
355b235k239L034J993l370j288M001R31l468k29L562N74l067K91L518O4l282Q93
$$ plain form
372 -317 3352 2772 -502 1104 4733 2958 -74 2507 5049 2573 358 2962 5084 1960 315 3072
388 3072 4085 1058 -474 2602 3254 -477 -1221 1997 1529 -2223 -1720 1002 -245 -3335 -2751 -74
404 -74 -1694 -4414 -2804 -576 -2833 -4631 -2824 -630 -2918 -4624 -1887 -622 -3204 -4067 -879 -298
420 -298 -2889 -2804 539 387 -1973 -948 1529 1351 -698 609 3125 2336 582 1657 4148 2917 1059
437 1059 2617 4663 2683 1394 3055 4468 2244 1228 3185 3411 1662 832 2433 2801 167 -359
453 -359 1604 1784 -804 -750 893 413 -2020 -1468 336 -1204 -2648 -1538 -298 -2033 -2863 -1555 -910
470 -910 -2232 -2836 -1338 -411 -1921 -2664 -852 64 -1834 -1661 732 564 -1441 -370 1814 969 -198
487 -198 1063 2488 1795 587 1656 3210 2270 1231 2544 3297 2245 1256 2635 2878 1529 1023 2545
$$ packed form
372c17L669n80l274J606L629j775l032K581K542k476k215K604K122l124j645K757
388C072J013l027j532L076O52l731p44L218m68l752N03K722j247l090N84K677
404g4j620k720J610K228k257j798J807K194k288j706K737J265k582q63L188N81
420b98k591Q5L343j52k360J025K477j78k049J307K516p89j754J075K491j231j858
437A059J558K046j980j289J661J413k224j016J957K26j749q30J601L68k634n26
453c59J963J80k588N4J643m80k433N52J804j540j444J110J240j735q30J308O45
470i10j322o04J498R27j510p43J812R16j898J73K393j68k005J071K184q45j167
487a98J261J425o93j208J069J554r40j039J313P53j052r89J379K43j349n06J522
$$ plain form
504 2545 2758 537 687 1873 1822 407 -274 1052 807 -974 -409 715 -386 -2003 -787 46 -1110
521 -1110 -2634 -1448 -268 -1870 -2690 -1118 -555 -1564 -2233 -742 -720 -1873 -1085 -170 -81 -1452 -867 1162
539 1162 708 -1348 -139 1932 1241 -292 1035 2097 1050 438 1991 2127 1117 489 2261 2365 513
556 513 331 2043 1910 242 81 1134 817 -455 -191 609 -300 -1951 -662 229 -1096 -2874 -1444
573 -1444 -260 -1908 -3457 -2359 -1109 -2172 -3156 -1993 -1826 -2925 -3309 -1688 -1676 -3322 -3154 -650 -1087
590 -1087 -2950 -2273 -79 -212 -2068 -1213 344 -151 -1615 -6 1389 22 -851 1194 2019 590 -631
607 -631 1470 2421 853 54 1845 2535 644 763 2284 1732 214 576 2067 1242 -934 99 1632
624 1632 678 -1277 -699 927 -531 -1817 -956 59 -1479 -2092 -512 -363 -1820 -2554 -354 188 -1840
$$ packed form
504B545K13k221J50J186n1j415o81J326k45j781N65J124j101j617J216Q33j156
521a110j524J186J180j602q20J572N63j009o69J491K2j153P88R15Q9j371N85K029
539A162m54k056J209K071o91j533J327J062j047o12J553J36j010o28J772J04j852
556E13j82J712j33j668j61J053l17j272K64Q00r09j651J289Q91j325j778J430
573a444J184j648j549J098J250j063r84J163J67j099l84J621J2j646J68K504m37
590a087j863O77K194j33j856Q55J557m95j464J609J395j367q73K045Q25j429j221
607f31K101R51j568p99J791O90j891J19J521n52j518L62J491q25k176J033J533
624A632r54j955N78J626j458j286Q61J015j538o13J580J49j457p34K200N42k028
$$ plain form
641 -1840 -2622 -284 431 -1372 -2173 -149 174 -1078 -1117 558 261 -1339 -379 2078 856 -1154 251
658 251 2543 1808 -56 682 2695 1919 489 1760 2342 1056 622 2576 2507 419 11 2377 2561 581
676 581 -16 1562 1451 -169 -312 995 447 -932 -519 944 -319 -2182 -855 1231 -721 -2568 -1481
693 -1481 -38 -674 -2121 -1476 -249 -1148 -1860 -757 -224 -1868 -1718 37 350 -1717 -1811 443 857 -810
711 -810 -1522 791 1230 -352 -374 1661 882 -341 686 2309 1280 -619 793 2478 1003 -867 500
728 500 1933 696 -939 361 1223 -184 -797 885 795 -1703 -1331 773 26 -1898 -1532 99 92 -2036
746 -2036 -1857 -545 -687 -1852 -1412 -597 -1506 -2362 -1059 -161 -1188 -2070 -462 447 -812 -2150 -207
763 -207 702 -151 -738 286 660 97 -310 1073 1177 17 261 1828 2062 717 547 2226 2259 493
$$ packed form
641a840p82K338P15j803q01K024L23j252l9J675k97j600R60K457j222k010J405
658B51K292p35j864P38K013p76j430J271N82j286m34J954o9k088m08K366J84j980
676E81n97J578j11j620j43J307n48j379M13J463j263j863J327K086j952j847J087
693a481J443o36j447O45J227q99p12J103N33j644J50J755L13k067r4K254M14j667
711h10p12K313M39j582k2K035p79j223J027J623j029j899J412J685j475j870J367
728E00J433j237j635J300Q62j407o13J682r0k498L72K104p47j924L66J631pk128
746b036J79J312j42j165M40Q15r09q56J303Q98j027q82J608R09j259j338J943
763b07R09q53n87J024L74n63m07J383J04j160K44J567K34j345j70J679L3j766
$$ plain form
781 493 1001 1927 1907 673 1385 2055 1226 313 1279 1813 947 -322 988 1681 365 -320 436 1095 -294
800 -294 -504 538 -1 -862 -663 193 -98 -1030 -572 0 136 -1014 -703 -67 -248 -849 -502 -58 -351 -295
820 -295 118 508 -113 -492 395 1020 334 60 445 1433 819 581 764 906 791 407 1225 1399 450 294
840 294 1118 976 -115 245 1094 824 -320 230 486 495 -422 -268 87 -413 -1005 -347 -300 -1179 -1292 -453 -229
861 -229 -1156 -1235 -777 -651 -1094 -1198 -839 -961 -1200 -1172 -639 -1113 -1089 -611 -229 -642 -981 -154 238 -29 -472
882 -472 242 281 -37 203 627 436 294 266 606 834 596 403 819 927 583 555 497 619 517 302 572 450
904 450 88 475 610 200 -366 -36 -27 -250 -520 -359 -147 -368 -918 -451 -520 -842 -421 -395 -639 -940 -721 -381
926 -381 -662 -832 -636 -446 -247 -628 -274 -182 -244 -495 116 495 -25 342 526 351 -15 316 662 713 416
$$ packed form
781D93N08R26k0j234P12O70q29r13R66N34q66j269J310O93j316o85P56O59j389
800b94k10J042n39q61J99Q56k91r32M58N72J36j150L11O36j81o01L47M44k93N6
820b95M13L90o21l79Q87O25o86k74L85R88o14k38J83J42j15l84Q18J74r49j56
840B94Q24j42j091L60Q49k70j144N50K56Rr17J54L55n00n92O58M7q79j13Q39K24
861b29r27p9M58J26m43j04L59j22k39K8N33m74K4M78L82m13l39Q27L92k67m43
882d72P14L9l18K40M24j91j42k8L40K28k38j93M16J08l44k8n8J22j02k15K70j22
904D50l62L87J35m10n66L30Rk23k70J61K12k21n50M67o9l22M21K6k44l01K19L40
926c81k81j70J96J90J99l81L54R2o2k51O11L79n20L67J84j75l66L31L46N1k97
$$ plain form
947 416 871 783 891 873 688 621 509 731 718 653 653 618 555 590 315 328 84 315 174 -309 -48 -16 -172 -413
971 -413 -297 -288 -698 -194 -223 -278 -727 -809 -441 -458 -1002 -833 -495 -49 -810 -324 -117 -144 -799 -38 39 -393 -368
994 -368 244 347 11 105 275 596 143 351 782 649 312 860 617 406 441 723 883 421 579 671 830
1015 830 397 192 172 363 -160 73 310 0 -308 -116 42 -103 -308 -647 -120 -350 -561 -676 -329 -598
1035 -598 -698 -664 -200 -395 -518 -164 -116 -133 -229 -683 -194 -278 -421 -186 250 -37 -162 148 435 -75 -58 301
1057 301 597 161 505 653 506 105 313 657 368 83 135 464 513 283 327 650 384 0 302 376 -157
1078 -157 -174 10 -54 -370 -547 -131 -324 -571 -589 -47 -392 -637 -564 -299 -743 -810 -425 -276 -371 -818 -516 -319
1100 -319 -356 -330 -231 -81 -343 -184 21 18 -45 134 300 348 258 225 553 302 499 413 410 227 431 236 512 663
$$ packed form
947D16M55q8J08j8j85o7j12K22j3o5%l5o3L5k75J3k44K31j41m83K61L2j56k41
971d13J16Rm10N04k9n5m49q2L68j7n44J69L38M46p61M86K07k7o55P61P7m32K5
994c68O12J03l36R4J70L21m53K08M31j33l37N48k43k11L5K82J60m62J58R2J59
1015H30m33k05k0J91n23K33K37l10l08J92J58j45k05l39N27k30k11j15L47k69
1035e98j00L4M64j95j23L54M8j7r6m54M89q4j43K35M36k87j25L10K87n10J7L59
1057C01K96m36L44J48j47m01K08L44k89k85N2L29M9k30M4L23k66l84L02P4n33
1078a57j7J84o4l16j77M16j93k47j8N42l45k45P3K65m44o7L85J49r5m47L02J97
1100c19l7K6R9J50k62J59K05lo3J79J66M8r0l3L28k51J97q6lj83K04j95K76J51
$$ plain form
1124 663 330 497 508 280 427 344 322 238 -20 175 440 -142 -120 43 80 -178 75 76 -261 -285 -463 -97 -359
1147 -359 -336 -366 -201 121 -227 -207 -58 -248 -332 -356 -119 -106 -159 212 99 -119 196 594 236 293 42 381 440
1170 440 479 373 724 696 450 344 656 421 366 703 433 695 270 465 370 346 655 399 354 -118 64 71 326
1193 326 -46 -196 32 458 -93 -79 91 -233 -462 -498 -522 -132 -548 -228 -419 -364 -391 -453 -111 -341 -249 -132
1215 -132 -324 -608 -518 92 -246 -340 -227 -175 51 64 56 372 225 64 326 84 163 300 199 425 352 329 226
1238 226 303 -54 -137 209 455 -40 -108 204 -32 -66 -20 157 201 -277 -448 -93 -107 -299 -368 -137 -197 -755 -535
1261 -535 -264 -277 -676 -395 81 -454 -580 -51 50 -240 -276 -145 -80 -132 -286 31 -77 161 232 227 384 -1
1283 -1 222 578 282 138 -197 403 336 475 306 338 342 84 447 385 299 -231 -8 347 116 -167 127 273 -46
$$ packed form
1124F63l33J67J1k28J47q3k2q4k58J95K65n82K2J63L7k58K53Jl37k4j78L66k62
1147c59K3l0J65L22l48K0J49j90q4k4K37J3n3L71j13k18L15L98l58N7k51L39N9
1170D40L9j06L51k8k46j06L12k35n5L37k70K62m25J95r5k4L09k56m5m72J82PK55
1193C26l72j50K28M26n51J4J70l24k29l6k4L90m16L20j91N5k7o2L42k30R2J17
1215a32j92k84R0O10l38r4J13N2K26J3qL16j47j61K62k42P9J37j01K26p3k3j03
1238B26P7l57q3L46K46m95o8L12k36l4M6J77M4m78j71L55j4j92o9K31o0n58K20
1261e35K71j3l99K81M76n35j26N29J01k90l6J31O5n2j54L17j08K38P1nJ57l85
1283aK23L56k96j44l35O00o7J39j69L2Mk58L63o2q6n30K23L55k31k83K94J46l19
$$ plain form
1306 -46 -179 -269 -151 -113 -484 -214 -249 -138 -428 14 -537 -289 -324 -52 -144 -487 -506 167 -138 -311 -439 -409 96
1329 96 -1 -98 -40 194 4 48 491 -430 -44 132 486 -138 -47 550 278 222 111 240 320 143 122 524 338
1352 338 68 69 431 118 -67 -161 52 -71 -228 108 -150 -402 -277 -25 90 -304 -277 -24 -2 -242 -493 1
1374 1 -219 -440 -319 -12 -357 -385 -187 -115 7 -417 -363 -13 -150 -354 -116 118 181 0 -221 318 121 84
1396 84 -23 396 286 -73 318 117 153 0 668 327 122 432 429 481 237 109 477 256 -33 66 136 120 15
1419 15 139 323 330 -370 172 -61 -35 -213 -38 125 -163 -264 -368 -34 -62 -275 -2 216 -439 -490 -44 -112
1441 -112 -431 -269 126 342 -186 -227 -96 45 -74 43 295 227 112 121 316 -42 109 30 -92 201 184 429
1463 429 -13 -37 -16 167 -280 382 40 -33 96 -214 96 268 -276 -93 -169 -192 -25 -93 -137 -44 -52 -267 -139
$$ packed form
1306d6j33r0J18L8l71K70l5J11k90M42n51K48l5K72r2l43j9O73l05j73j28L0N05
1329I6r7r7N8K34j90M4M43r21L86J76L54o24R1N97k72n6j11J29Q0j77k1M02j86
1352C38k70JL62l13j85r4K13j23j57L36k58k52J25K52J15l94K7K53K2k40k51M94
1374Ak20k21J21L07l45k8J98P2J22m24N4L50j37k04K38K34O3j81k21N39j97l7
1396H4j07M19j10l59L91k01L6j53O68l41k05L10lN2k44j28L68k21k89R9P0j6j05
1419A5J24J84Pp00N42k33K6j78J75J63k88j01j04L34k8k13K73K18o55n1M46o8
1441a12l19J62L95K16n28m1J31J41j19J17K52o8j15RJ95l58J51p9j22K93j7K45
1463D29m42k4K1J83m47O62l42p3J29l10L10J72n44J83p6k3J67o8m4R3qk15J28
$$ plain form
1486 -139 -366 -301 -405 -211 -132 -87 -334 160 -239 -50 -218 -35 99 -246 8 83 31 -228 -115 185 155 456
1508 456 -86 397 90 257 101 235 302 66 67 444 159 -20 504 255 209 415 252 443 67 -14 218 301
1530 301 -198 35 -86 -46 -73 -13 -45 -12 -157 -177 51 -217 -205 -52 -112 -34 -369 -274 -345 -8 45 4 -74 -98 -284
1555 -284 267 -3 -154 16 -377 135 -306 56 200 -12 -236 55 -24 166 -170 154 363 64 302 304 148
1576 148 -65 311 -67 69 230 4 -10 -272 112 90 204 400 50 325 72 37 48 17 -44 -38 -116 -245 -223
1599 -223 -217 -178 -219 40 -77 -202 282 -172 -95 -283 -65 -255 -145 -143 -275 -214 78 -243 362 -109 -87 257 4
1622 4 45 89 328 213 -68 289 15 229 412 79 375 359 144 248 116 9 146 23 -131 267 -68 3
1644 3 80 -40 -192 -52 -11 -178 -171 35 -7 -254 -108 47 26 -249 -55 -117 -183 -307 -25 29 -124 -131 64 -101
$$ packed form
1486a39k27O5j04J94P9M5k47M94l99J89j68J83J34l45K54P5n2k59J13L00l0L01
1508D56n42M83l07J67j56J34O7k36JL77k85j79N24k49m6K06j63J91l76q1K32Q3
1530C01m99K33j21M0k7O0l2L3j45k0K28k68J2J53o0P8l35R5p1L37N3m1p8k4j86
1555b84N51k70j51J70l93N12m41L62J44k12k24K91p9J90l36L24K09k99K38Kj56
1576A48k13L76l78J36J61k26j4k62L84k2J14J96l50K75k53l5J1l1o1Op8j29K2
1599b23OL9m1K59j17j25M84m54P7j88K18j90J10Kj32O1K92l21O05m71K2L44k53
1622DM1M4K39j15k81L57k74K14J83l33K96j6k15J04j32j07J37j23j54L98l35P1
1644CP7j20j52J40M1j67PK06m2k47J46J55k1k75J94o2o6j24K82N4j53pJ95j65
$$ plain form
1668 -101 116 -287 70 254 -232 -183 96 134 346 -401 -185 -251 136 235 41 289 206 -14 -137 305 43 401
1690 401 134 424 75 -85 131 39 6 76 167 254 60 -149 33 56 -187 75 169 17 -310 -144 225 125
1712 125 -130 -97 64 51 -259 -51 -104 -359 -11 66 -26 -197 50 -286 25 -144 -15 24 -20 93 75 30 220
1735 220 298 -222 -28 325 179 74 144 242 -45 -185 297 63 217 74 -173 29 48 67 101 273 -56 12
1757 12 329 -200 25 -190 63 -56 -145 100 103 323 31 100 -37 72 150 37 -147 -237 141 174 -263 -86 -188
1780 -188 -268 166 7 -50 102 -59 181 330 -110 17 -46 213 270 131 288 10 -46 -22 -23 72 233 71 275
1803 275 224 120 28 101 206 -55 110 44 286 -245 -176 62 -180 -136 -101 277 -16 -182 -35 233 -96 31
1825 31 -114 152 -57 24 -161 -294 -208 -126 -128 -77 -48 120 -216 -79 87 27 -99 153 273 10 116 233 -65
$$ packed form
1668a01K17m03L57J84m86M9K79L8K12p47K16o6L87R9j94K48q3k20j23M42k62L58
1690D01k67K90l49j60K16r2l3P0R1Q7j94k09J82K3k43K62R4j52l27J66L69j00
1712A25k55L3J61j3l10K08n3k55L48P7r2j71K47l36L11j69J29L9m4J13j8m5J90
1735B20P8n20J94L53j46j05P0R8k87j40M82k34J54j43k47K02J9J9L4J72l29O8
1757A2L17n29K25k15K53j19q9K45LK20k92O9j37J09P8j13j84r0L78L3m37J77j02
1780a88q0M34j59n7J52j61K40J49m40J27o3K59N7j39J57k78n6K4jR5J61j62K04
1803B75n1j04r2P3J05k61J65o6K42n31O9K38k42M4L5L78k93j66J47K68l29J27
1825C1j45K66k09Q1j85j33Q6Q2kN1K9J68l36J37J66o0j26K52J20k63J06J17k98
$$ plain form
1848 -65 47 -94 70 137 -150 92 221 -26 -16 18 92 29 71 57 102 -343 191 133 92 -68 -275 65 -95 -159
1872 -159 361 -148 -247 -120 27 -217 -91 -365 -219 -141 75 90 55 -97 184 -2 -213 -127 -13 134 99 -154
1894 -154 -59 131 -10 -20 -98 -73 -357 42 -112 88 166 -29 179 -260 130 56 -66 158 94 89 171 56 17 10
1918 10 205 227 -263 21 14 200 -70 84 4 -186 128 -4 43 -116 -31 31 -481 -158 -216 -126 20 20 -128 160
1942 160 42 117 -127 -147 -187 86 -178 -77 -161 -125 52 286 -91 -52 -53 176 -64 204 -265 -277 15 -39 73
1965 73 186 217 -24 60 -11 2 1 140 -115 94 332 123 -20 95 -136 -40 267 -164 -118 -44 376 -195 -56
1988 -56 32 -55 153 -87 111 308 -145 -484 209 3 -316 20 249 103 -35 -264 123 59 -122 -87 40 -11
2010 -11 -10 108 96 -4 -27 -126 -134 146 80 226 171 -256 -9 185 -19 21 201 -6 -34 -111 76 180 161 -52 -48
$$ packed form
1848f5J12j41J64O7k87K42J29k47J0L4P4o3M2j4M5m45N34n8m1j60k07L40j60o4
1872a59N20n09r9J27J47k44J26k74J46P8K16J5l5j52K81j86k11Q6J14J47l5k53
1894a54R5J90j41j0p8K5k84L99j54K00P8j95K08m39L90p4j22K24o4nQ2j15l9p
1918A0J95K2m90K84pJ86k70J54q0j90L14j32M7j59Q5O2n12L23n8R0J46%j48K88
1942A60j18P5k44k0m0K73k64J01q4L6J77K34l77L9jK29k40K68m69j2K92n4J12
1965G3J13L1k41Q4p1J3jJ39k55K09K38k09j43J15k31R6L07m31M6P4M20n71J39
1988e6Q8q7K08k40J98J97m53l39O93k06l19L36K29j46j38k29L87o4j81L5J27n1
2010a1JJ18j2j00k3r9qK80o6J46n5m27K47J94k04M0J80k07k8p7J87J04j9k13M
$$ plain form
2035 -48 134 -195 101 -63 86 -10 -154 -308 -113 116 123 89 -130 -192 -58 45 125 -38 -293 -80 -44 200 -250
2058 -250 406 18 53 -198 -103 88 -200 151 326 -10 -186 15 -199 -153 175 -94 25 -31 221 174 -20 -304
2080 -304 -223 272 0 334 102 -134 6 406 28 29 -188 -225 150 -64 291 52 34 -37 278 -241 -168 41
2102 41 -174 -93 -141 -279 -205 92 -105 -192 -161 -55 57 86 -176 116 -152 -66 -29 40 -97 -2 -94 -46 -69 37 -159
2127 -159 79 23 195 224 114 -1 -70 -62 -144 -4 14 -76 -33 108 -181 54 -266 -50 -145 20 389 122 -91
2150 -91 106 90 -179 56 206 224 -101 -133 262 -265 108 -300 -91 -37 -168 -270 89 128 -137 -32 -95 -122 -317
2173 -317 78 49 -197 22 67 -153 285 143 -77 -72 115 -133 -230 -30 49 -80 -76 96 -31 12 241 190 80
2196 80 127 138 104 86 -267 -123 9 70 -186 114 161 -379 -353 37 17 -174 -37 -62 -32 137 82 -190 -19 120
$$ packed form
2035d8J82l29K96j64J49r6j44j54J95K29Pl4k19o2J34J03Q0j63k55K13L6K44m50
2058b50O56l88L5k51R5J91k88L51J75l36j76K01k14M6L28k69J19n6K52m7j94k84
2080c04Q1M95k72L34k32k36J40M00l78Jk17l7L75k14L55k39j8p1L15n19P3K09
2102D1k15Q1m8j38P4K97j97q7L1J06J12K9k62K92k68Q6L7O9j37R5r2M8k3J06j96
2127a59K38n6J72K9j10j15o9Qq2J40J8r0M3J41k89K35l20K16r5J65L69k67k13
2150i1J97j6k69K35J50J8l25l2L95n27L73m08K09N4j31j02L59L9k65J05o3k7j95
2173c17L95k9k46K19M5k20M38j42k20NJ87k48r7K00P9j29MJ72j27M3K29n1j10
2196H0M7J1l4j8l53J44J32O1k56L00M7n40K6L90k0j91J37k5L0J69n5k72J71J39
$$ plain form
2220 120 -118 72 23 53 -42 -189 -202 -104 -4 153 57 -13 1 24 -165 204 -2 -289 -119 -262 286 66 -91
2243 -91 -179 -97 224 434 59 -151 136 -86 186 -55 -116 -47 103 90 182 240 -311 -131 121 14 -55 174 245
2266 245 -148 20 -109 -318 -81 90 -32 278 -193 24 38 -328 80 274 4 -252 -141 41 -181 -3
2286 -3 167 40 -96 -55 53 240 66 30 -189 -13 187 -122 -224 -48 64 56 -98 171 30 201 86 -43
2308 -43 -116 -6 222 -190 -30 -180 -13 -33 145 -118 164 -72 -42 -145 -48 67 114 -21 -93 296 -91 -82 190
2331 190 -135 356 137 27 325 -130 -284 -285 20 324 223 -221 59 102 -340 -164 -74 361 -157 -109 -105 156
2353 156 -88 72 269 170 9 57 85 -28 27 -205 23 56 -40 -56 116 58 85 316 -150 -59 -35 25 187 28
2377 28 190 -285 -151 -50 421 -54 334 -53 -93 -246 -124 154 102 -8 97 -7 43 -111 -389 -85 -84 77
$$ packed form
2220A20k38J90m9L0r5j47j3R8J00J57r6p0J4K3j89L69k06k87J70j43N48k20j57
2243i1q8Q2L21K10l75k10K87k22K72k41o1O9J50j3R2N8n51J80K52j07o9K29P1
2266B45l93J68j29k09K37J71j22L10m71K17J4l66M08J94k70k56J11J82k22J78
2286cJ70j27j36M1J08J87j74l6k19J76K00l09j02J76J12qj54K69j41J71j15j29
2308d3p3J10K28m12J60j50J67k0J78k63K82k36L0j03R7J15M7j35p2L89l87RK72
2331A90l25M91k19j10K98m55j54jL05L04j01m44K80M3m42J76R0M35n18M8MK61
2353A56k44J60J97r9j61M8K8j13N5k32K28L3r6j6J72n8K7K31m66R1K4O0J62j59
2377B8J62m75J34J01M71m75L88l87m0j53J22K78n2j10J05j04N0j54k78L04JJ61
$$ plain form
2399 77 60 124 -147 109 -74 -331 40 -54 -73 54 83 -373 43 142 16 102 -209 -79 -101 28 150 287 244
2422 244 -99 315 146 29 -123 73 82 -310 11 -50 223 -108 -292 9 99 -132 418 -148 -245 -159 18 232
2444 232 -333 -217 -75 41 -61 -332 374 28 -69 -97 135 14 -429 44 14 -88 63 -82 89 155 -13
2465 -13 206 84 332 59 16 99 267 -40 -280 171 -28 -46 235 -16 160 14 137 41 191 41 144 -326
2487 -326 -34 38 46 73 -224 18 44 149 235 -24 -107 128 138 -27 -65 81 -11 -6 -182 119 -156 -46 87 -164
2511 -164 -144 -229 108 87 29 -294 -65 96 132 133 216 -38 166 -42 52 49 208 22 88 186 279 -195 -276 -54 -57 82
2537 82 265 114 -162 252 123 -26 363 396 -248 -131 199 -119 -95 161 262 17 85 -82 -51 143 -78 47
2559 47 -109 -23 -151 -35 -123 -31 153 172 175 55 -140 142 9 -29 17 -16 118 -2 -166 -166 -24 210 -30 -63
$$ packed form
2399G7j7O4k71K56j83k57L71r4j9J27K9m56M16R9j26Q6l11J30k2J29J22J37m3
2422B44l43M14j69j17j52J96Rl92L21o1K73l31j84L01R0k31N50n66r7Q6J77K14
2444B32n65J16J42J16j02k71P06l46r7k8K32j21m43M73l0j02J51j45J71O6j68
2465a3K19j22K48k73m3Q3J68l07k40M51j99j8K81k51J76j46J23r6J50j50J03m70
2487c26K92P2QK7k97K42K6J05Q6k59q3K35J0j65l8J46r2Nj76L01k75J10J33k51
2511a64K0q5L37k1n8l23K29J61L6JQ3k54K04k08R4lJ59j86O6R8R3m74q1K22lJ39
2537H2J83j51k76M14j29j49L89L3o44J17L30l18K4K56J01k45O8j67L1J94k21J25
2559D7j56Q6j28J16q8R2J84J9Lj20j95K82j33l8M6l3J34j20j64%J42K34k40l3
$$ plain form
2583 -63 138 -9 183 -51 15 47 -55 170 27 -134 -216 46 384 -293 231 -143 238 432 185 -29 30 -59
2605 -59 -236 -100 -145 -9 23 117 92 -17 -44 -31 -119 -91 -224 -190 152 -34 140 194 -127 -60 150 -7 106 139
2629 139 82 35 8 -177 48 242 -291 233 19 204 -48 129 -19 17 72 -27 135 -5 -103 57 27 27 109 222
2653 222 147 -230 28 -151 -168 202 -85 -34 126 -70 262 45 18 -181 -187 -33 -22 -132 -25 -273 -125 -57 200
2676 200 33 -398 -160 -42 57 53 56 -186 56 246 -175 223 -116 -217 -4 -28 218 68 248 1 180 -23
2698 -23 -169 45 -62 88 -48 28 366 -208 112 118 0 108 -185 -75 -328 30 5 -263 42 -297 338 348
2720 348 -50 -231 12 280 67 -178 -71 119 161 -107 162 -116 283 437 -108 148 -36 -91 -124 -45 139
2741 139 14 -76 143 -214 204 -199 -132 113 403 -89 -32 35 34 304 -101 160 -56 138 69 310 186 57
$$ packed form
2583f3K01j47J92k34O6L2j02K25j43j61q2K62L38o77N24l74L81J94k47k14N9q9
2605e9j77J36m5J36L2R4k5j09k7J3q8K8j33L4L42j86J74N4l21O7K10j57J13L3
2629A39n7m7k7j85K25J94n33N24k14J85k52J77j48L6N5r9J62j40r8J60l0%Q2J13
2653B22p5l77K58j79j7L70k87N1J60j96L32k17k7j99oJ54J1j10J07k48J48O8K57
2676B00j67m31K38J18R9mLk42K42J90m21L98l39j01K13k4K46j50J80k47J79k03
2698b3j46K14j07J50j36P6L38n74L20Oj18J08k93J10k53L58k5k68L05l39O35J0
2720C48l98j81K43K68k13k45J07J90M2k68K69k78L99J54n45K56j84n5l3P9J84
2741A39j25r0K19l57M18m03O7K45K90m92N7O7jK70m05K61k16J94o9K41j24j29
$$ plain form
2763 57 -176 -7 -34 -103 -6 207 -84 -101 194 15 -460 -170 -70 150 -30 21 35 -129 33 -119 -154 -50 -37
2786 -37 -12 -186 -53 156 -26 84 -110 -64 25 -205 122 -212 -98 -33 -154 -157 -221 110 111 449 77 35 330 -222
2810 -222 -98 173 -229 -2 -60 -43 37 10 27 411 53 -73 -33 -68 -36 -8 -209 44 -125 -236 217 -169 -243
2833 -243 -164 62 -72 120 77 -278 -234 -108 7 -35 -169 -102 177 -16 101 -210 167 163 91 165 213 -76 -118 -100
2857 -100 -154 93 -97 -124 106 -47 -82 -149 -37 237 133 -87 -137 345 80 -55 -217 -135 -289 185 231 17
2879 17 -152 76 -4 364 184 -120 232 305 -69 68 -78 85 238 -18 105 -223 95 108 -279 -525 -312
2900 -312 153 -265 -91 212 85 84 -59 -10 106 177 15 -59 90 65 214 -268 92 224 74 3 -101 19
2922 19 12 348 122 -11 -215 206 291 -5 207 -67 32 46 219 -398 -36 136 -108 304 333 -92 -56 -155 -116
$$ packed form
2763E7k33J69k7o9R7K13k91j7K95j79m75K90J00K20j80N1J4j64J62j52l5J04J3
2786c7K5j74J33K09j82J10j94M6Q9k30L27l34J14O5j21lo4L31JL38l72m2K95n52
2810b22J24K71m02K27n8J7Q0k7J7L84l58j26M0l5L2K8k01K53j69j11M53l86p4
2833b43P9K26j34J92m3l55M4J26J15m2j34O7K79j93J17l11L77mp2P4M8k89m2J8
2857a00n4K47j90k7K30j53l5o7J12K74j04k20n0M82k65j35j62Q2j54M74M6k14
2879A7j69K28q0L68j80l04L52P3l74J37j46J63J53k56J23l28L18J3l87k46K13
2900c12M65m18J74L03j27jj43M9J16P1j62p4J49k5J49m82L60J32j50p1j04J20
2922A9pL36k26j33k04M21Q5k96K12k74R9J4J73o17L62J72k44M12K9m25L6r9L9
$$ plain form
2945 -116 -27 97 59 160 -30 -19 -55 324 354 103 37 -257 65 -129 84 96 -47 14 29 -294 14 -139 -220
2968 -220 6 -68 149 -283 101 -16 -130 135 114 273 174 -255 -52 121 -57 37 -187 124 -77 -46 42 204
2990 204 253 25 -21 44 245 58 -113 -135 -73 17 99 173 82 -132 -279 95 -133 17 247 178 -114 -49 -80 149
3014 149 -45 89 186 -98 229 213 98 -40 179 -37 -52 115 -75 -146 -129 -178 -31 89 -237 -157 144 -20
3036 -20 -34 1 45 -73 47 -3 14 -21 -73 -41 -234 122 -185 -18 36 -35 -300 35 -118 -199 127 -169 -233 -246 99
3061 99 -68 187 125 74 -189 182 -20 -149 49 -284 -33 -135 62 124 109 59 -60 -213 -86 121 228 201
3083 201 79 150 74 -315 -27 35 -286 -61 -154 -18 -380 68 47 23 -18 195 -98 -247 149 229 187 -125 28
3106 28 146 77 -132 -44 -47 141 53 -21 111 99 163 -136 44 196 186 -58 2 123 -101 -198 241 -45 -173 -127
$$ packed form
2945a16Q9J24l8J01j90J1l6L79L0k51o6k94L22j94K13J2j43O1J5l23L08j53q1
2968b20K26p4K17m32L84j17j14K65k1J59r9m29K03J73j78R4k24L11k01L1Q8J62
2990B04M9k28m6O5K01j87j71k2O2R0Q2P4r1k14j47L74k28J50K30o9k92O5l1K29
3014A49j94J34R7k84L27j6j15j38K19k16j5J67j90p1J7m9J47J20l26Q0L01j64
3036b0j4L5M4j18J20n0J7l5n2L2j93L56l07J67N4p1k65L35j53q1L26k96o4j3L45
3061I9j67K55o2n1k63L71k02j29J98l33K51j02J97O2j5n0j19j53J27K07J07k7
3083B01j22P1p6l89K88O2l21K25r3J36l62M48k1k4m1K13k93j49L96Q0m2l12J53
3106B8J18o9k09Q8lJ88q8p4J32j2O4k99J80J52j0k44O0J21k24r7M39k86j28M6
$$ plain form
3130 -127 -140 24 -100 -268 3 -35 -118 -39 221 98 -151 87 146 74 -36 -54 78 -182 -165 -172 186 133 -24 -166
3154 -166 115 216 -113 -290 90 -12 39 -61 312 -20 -93 12 225 54 -16 -81 17 -7 118 198 -155 -378
3176 -378 -207 -224 59 -88 -208 74 313 147 179 -39 -53 -39 67 219 42 203 -129 64 98 393 257 -55
3198 -55 108 -108 -106 196 201 28 123 124 84 -46 -78 1 -269 -240 -77 63 -70 59 101 -28 -25 -5 -122 58 -115
3223 -115 -265 -353 -289 59 48 -155 20 -34 -62 -99 -41 -393 332 -36 -16 53 132 35 -110 23 182 5 -41 47
3247 47 83 138 -166 255 232 85 -145 46 22 -48 113 83 7 -55 -6 -4 -25 -219 177 63 103 -180 205 -67 -12
3272 -12 -197 41 0 -210 42 -24 63 -33 139 155 -204 266 150 -167 -40 95 70 -142 40 -99 -197 -83 -37
3295 -37 88 -96 -113 43 -30 -85 225 -23 101 -49 103 102 -7 31 -153 210 44 -182 286 -11 -74 5 -84
$$ packed form
3130a27j3J64j24j68K71l8q3P9K60j23k49K38N9p2j10j8J32k60J7pL58n3j57j42
3154a66K81J01l29j77L80j02N1j00L73l32p3J05K13j71p0o5R8k4J25Q0l53k23
3176c78J71j7K83j47j20K82K39j66L2k18j4J4J06J52j77J61l32J93L4K95j36l12
3198e5J63k16KL02Nj73R5Jm0j30l2P9k70K9J63J40j33J29M2j29LK0j17J80j73
3223a15j50q8O4L48j1k03J75n4k8l7N8l52P25l68K0O9P9r7j45J33J59j77m6Q8
3247D7L6N5l04M21k3j47k30J91k4p0J61l0p6o2M9Kk1j94L96j14M0k83L85k72N5
3272a2j85K38m1k10K52o6Q7r6J72J6l59M70j16l17J27J35k5k12J82j39r8J14M6
3295c7J25j84j7J56p3n5L10k48J24j50J52jj09L8j84L63j66k26M68k97o3P9q9
$$ plain form
3318 -84 -47 -263 -194 -175 -88 -270 -57 84 53 -246 -164 94 227 -95 -20 -135 232 -270 231 6 341 -153 -11
3341 -11 -137 -109 -10 239 -373 157 -253 67 158 75 -149 -46 -112 -247 -83 142 77 -255 0 -75 -136 52 2
3364 2 15 -99 -23 -104 -120 159 -236 127 25 159 -308 -38 205 -69 92 59 360 93 20 -155 68 147 7
3387 7 -143 -236 180 -45 228 167 -79 25 70 -93 24 10 230 -14 58 -252 154 141 -118 66 190 47 136
3410 136 -27 126 -32 25 64 -57 2 124 -211 171 285 -84 169 52 86 -106 62 171 200 -198 69 29
3432 29 -164 51 -58 -64 152 -51 -77 -44 109 88 -209 146 219 -235 131 171 -115 -14 -99 313 -9 -145 -345
3455 -345 -184 -123 91 50 -90 -128 -51 103 114 -190 135 134 -165 -124 -62 -37 -148 7 -139 -289 -13 7 68 -274
3479 -274 156 -254 261 -238 103 27 13 -157 -5 205 -87 -94 -319 155 118 -19 -81 -72 148 -108 -88 -90 294 -183
$$ packed form
3318h4L7k16O9J9Q7j82K13J41l1k99Q2K58J33l22P5j15L67n02N01k25L35m94J42
3341a1j26K8R9K49o12N30m10L20R1q3k24J03o6j35J64K25o5l32K55p5o1J88n0
3364BJ3j14P6q1j6K79l95L63j02J34m67K70K43k74J61l3L01k67p3j75K23P9j40
3387Gj50r3M16k25K73o1k46J04M5j63J17j4K20k44P2l10M06j3k59J84J24j43Q9
3410A36j63J53j58N7L9j21N9J22l35L82J14l69K53j17L4j92J68J09K9l98K67m0
3432B9j93K15j09oK16k03k6L3J53k1k97L55P3m54L66M0k86J01q5M12l22j36k00
3455c45J61O1K14m1j40l8P7J54J1l04L25jk99M1O2K5j11J55j46j50K76K0O1l42
3479b74M30m10N15m99L41p6j4j70J52K10k92pk25M74l7j37o2RK20k56K0kL84m77
$$ plain form
3503 -183 77 156 -107 -238 -96 -208 -96 166 -217 373 100 10 324 -27 79 -72 6 13 -156 164 -181 195
3525 195 56 114 22 -126 -28 -54 9 60 279 -160 -35 144 -272 47 -2 -167 -121 80 10 301 -154 -75 -223
3548 -223 -83 68 40 -40 -99 35 -207 -87 -87 126 7 -182 75 174 -260 -92 -186 -19 107 -46 16 20 -71 26
3572 26 334 334 -100 -63 -23 -152 -208 -175 -188 -217 -151 -26 -116 -45 -158 -65 -9 -9 195 -146 -52 148 188 145 80 122 -29
3599 -29 280 191 -122 135 -48 67 -163 -156 13 -215 146 307 47 94 -98 47 -23 -161 183 46 68 -21 226
3622 226 141 -140 -313 39 -53 -53 -21 34 -70 -34 570 -169 11 -305 89 68 -1 82 132 58 205 27 18 -139 -159
3647 -159 -126 247 -309 226 -197 106 218 -95 105 130 -162 30 174 -161 24 229 228 61 -67 84 -154
3668 -154 -8 151 -99 249 41 -109 -162 -53 8 182 -125 60 47 159 58 -96 146 -84 105 -101 60
$$ packed form
3503a83K60P9k63j31J42j12J12K62l83N90k73r0L14l51J06j51P8Pj69L20l45L76
3525A95j39N8r2j48R8k6O3N1K19m39J25J79m16L19m9j65M6K01p0K91m55P9j48
3548b23J40J51k8q0n9J34k42J20%K13j19j89K57R9m34J68r4J67J26j53O2Mr1R7
3572B6L08%m34L7M0j29n6L3j3k9O6J25r0P1j13R3N6%K04l41R4K00M0m3o5M2j51
3599b9L09q9l13K57j83J15k30PJ69k28L61J61k60M7j92J45p0j38L44j37K2q9K47
3622B26q5k81j73L52r2%L2N5j04L6O04p39J80l16L94k1o9Q3N0p4J47j78rj57k0
3647a59L3L73n56N35m23L03J12l13K00K5k92J92J44l35J85K05jj67j28J51k38
3668a54J46J59k50L48k08j50n3J09O1J74l07J85j3J12j01j54K42k30J89k06J61
$$ plain form
3689 60 40 103 -59 -68 -204 -57 244 126 135 99 121 136 -60 -14 -133 -120 -402 225 -209 -178 -15 240 89 -208
3713 -208 280 333 -184 8 1 155 439 98 302 118 -48 62 44 -13 121 81 43 -216 19 -41 37 4 -57 -14
3737 -14 17 -117 -111 -118 -59 85 -258 -181 -83 135 236 231 -206 -25 -105 -118 412 103 -40 -94 -168 -107 0 111 -10
3762 -10 -143 -178 21 -49 -33 116 -72 12 69 41 -4 19 -101 -119 7 -79 69 -142 -87 137 -26 7 18 -81 20
3787 20 207 -115 62 102 173 136 -103 -108 -174 193 48 -90 -143 234 96 141 -210 165 78 -11 -208 -73 227 -141
3811 -141 -4 -97 -114 85 -290 4 130 36 -159 -47 -129 30 -196 45 -266 -104 -222 -244 17 -63 -134 -29
3833 -29 92 148 85 110 12 -55 8 244 202 -96 47 -49 -11 148 9 -257 198 -280 135 48 -36 170 -173 76
3857 76 -287 -102 99 -74 119 297 51 119 -125 -17 -32 202 59 -300 -91 284 42 81 -199 11 -195
$$ packed form
3689F0k0O3j62rj36J47L01j18Rl6K2J5j96M6j19J3k82O27m34L1J63K55j51k97
3713b08M88N3n17J92pJ54K84l41K04j84j66J10j8n7J34m0l8k59K35o0P8l3o1M3
3737a4L1j34OpN9J44l43P7R8K18J01nm37J81q0j3N30l09j43n4p4O1J07J11j21
3762a0j33l5J99p0J6J49j88Q4N7k8m5K3j20j8J26q6J48k11N5K24j63L3J1r9J01
3787B0J87l22J77M0P1l7k39no6L67j45j38n3L77j38M5l51L75q7q9j97J35L00l68
3811a41J37r3j7J99l75K94J26r4j95J12q2J59k26K41l11J62j18k2K61q0p1J05
3833b9J21N6o3K5r8o7O3K36m2k98J43r6L8J59j39k66M55m78M15q7q4K06l43K49
3857G6l63J85K01j73J93J78k46O8k44J08j5K34j43l59K09L75k42L9k80K10k06
$$ plain form
3878 -195 192 131 -127 94 -167 -182 -88 154 13 220 -234 304 55 -44 43 -192 139 2 179 -152 143 -79
3900 -79 127 12 -86 23 10 330 236 -89 -27 -154 124 161 -22 269 98 -91 83 168 193 -23 129 -215 437
3923 437 144 -89 -245 -95 -9 -7 -91 -77 -253 -78 67 -91 218 9 285 -205 48 -68 -22 -123 161 58
3945 58 -132 -45 320 246 -137 -43 198 -157 125 -170 -111 145 334 -241 -251 -5 -20 -73 -99 -132 -160 41 -342 7
3969 7 250 -135 36 -18 59 -130 24 -166 -194 79 73 -72 19 182 -22 -168 5 -8 -37 370 -210 -117 161 -67
3993 -67 118 44 181 -3 197 404 65 83 184 269 -116 125 -379 33 123 -216 -74 -42 39 -30 -166 -213 -276
$$ packed form
3878a95L87o1k58K21k61j5R4K42j41K07m54N38k49r9Q7k35L31j37J77l31K95k22
3900g9K06j15r8J09j3L20r4l25O2j27K78L7j83K91j71j89J74Q5K5k16J52l44O52
3923D37k93k33j56J50Q6Kq4J4j76J75J45j58L09k09K76m90K53j16M6j01K84j03
3945E8j90Q7L65p4l83R4K41l55K82k95N9K56J89n75j0K46j5n3k6l3k8K01l83L49
3969GK43l85J71n4P7j89J54j90k8K73oj45R1J63k04j46J73j3k9M07n80R3K78k28
3993f7J85p4J37j84K00K07l39J8J01Q5l85K41n04M12R0l39J42L2Q1o9j36m7o3
$$ [...]
8191a53
##END NTUPLES=NMR FID
##END=
