##TITLE=1H_BAU-j-28-2
 CDCl3, 8 sc, 
 28.6.2019
##JCAMPDX= 6.0         $$ Bruker NMR JCAMP-DX V2.0
##DATA TYPE= NMR FID
##DATA CLASS= NTUPLES
##ORIGIN= UXNMR, Bruker Analytische Messtechnik GmbH
##OWNER= root
$$ XWIN-NMR		Version 3.5
$$ Fri Jun 28 15:44:42 2019 Russian Standard Time (UT+4h)  she@DPX200
##.OBSERVE FREQUENCY= 200.13155
##.OBSERVE NUCLEUS= ^1H
##.DELAY= (6, 6)
##.ACQUISITION MODE= SIMULTANEOUS
##.ACQUISITION SCHEME= undefined
##.AVERAGES= 8
##.DIGITISER RES= 18
##SPECTROMETER/DATA SYSTEM= spect
##.PULSE SEQUENCE= zg30
##.SOLVENT NAME= CDCl3
##.SHIFT REFERENCE= (INTERNAL, CDCl3, 0, 15.7039)
##AUDIT TRAIL= $$ (NUMBER, WHEN, WHO, WHERE, WHAT)
$$ ##TITLE= Audit trail, XWIN-NMR		Version 3.5
$$ ##JCAMPDX= 5.01
$$ ##ORIGIN= Bruker BioSpin GmbH
$$ ##OWNER= she
$$ F:/spectra/data/she/nmr/H-F/1/audita.txt
$$ ##AUDIT TRAIL=  $$ (NUMBER, WHEN, WHO, WHERE, WHAT)
(   1,<2019-06-28 15:43:36.48 +0400>,<she>,<DPX200>,
      <created by zg, POWCHK disabled, PULCHK disabled
       configuration hash MD5:
       00 E9 B6 7A A2 85 ED C7 34 08 36 98 17 FE 4E 26
       data hash MD5: 16K
       5C F7 90 0C 2D 9C BC 89 94 FF 49 85 5B 3E 45 3D>)
$$ ##END=
$$ 
$$ hash MD5
$$ 91 97 0D AC C5 B1 32 38 57 D1 22 70 5B 5D D3 99
##$RELAX= 
##$RELAX= 
##$RELAX= 
##$RELAX= 
##$RELAX= 
##$RELAX= 
$$ Bruker specific parameters
$$ --------------------------
##$DU= <F:/spectra>
##$EXPNO= 1
##$NAME= <H-F>
##$PROCNO= 1
##$TYPE= <nmr>
##$USER= <she>
##$AMP= (0..31)
100 100 100 100 100 100 100 100 100 100 100 100 100 100 100 100 100 100 
100 100 100 100 100 100 100 100 100 100 100 100 100 100 
##$AQSEQ= 0
##$AQ_mod= 1
##$AUNM= <au_zg>
##$AUTOPOS= <>
##$BF1= 200.13
##$BF2= 200.13
##$BF3= 200.13
##$BF4= 200.13
##$BF5= 200.13
##$BF6= 200.13
##$BF7= 200.13
##$BF8= 200.13
##$BYTORDA= 1
##$CFDGTYP= 0
##$CFRGTYP= 5
##$CHEMSTR= <none>
##$CNST= (0..31)
1 1 145 1 1 1 1 1 1 1 1 1 1 1 1 1 1 1 1 1 1 1 1 1 1 1 1 1 1 1 1 1 
##$CPDPRG= <>
##$CPDPRG1= <>
##$CPDPRG2= <>
##$CPDPRG3= <>
##$CPDPRG4= <mlev>
##$CPDPRG5= <mlev>
##$CPDPRG6= <mlev>
##$CPDPRG7= <mlev>
##$CPDPRG8= <mlev>
##$CPDPRGB= <>
##$CPDPRGT= <>
##$D= (0..31)
0 1.2 0 0 0 0 0 0 0 0 0 0.03 0 0 0 0 0 0 0 0 0 0 0 0 0 0 0 0 0 0 0 0 
##$DATE= 1561722215
##$DBL= (0..7)
120 120 120 120 120 120 120 120 
##$DBP= (0..7)
150 150 150 150 150 150 150 150 
##$DBP07= 0
##$DBPNAM0= <>
##$DBPNAM1= <>
##$DBPNAM2= <>
##$DBPNAM3= <>
##$DBPNAM4= <>
##$DBPNAM5= <>
##$DBPNAM6= <>
##$DBPNAM7= <>
##$DBPOAL= (0..7)
0.5 0.5 0.5 0.5 0.5 0.5 0.5 0.5 
##$DBPOFFS= (0..7)
0 0 0 0 0 0 0 0 
##$DE= 6
##$DECBNUC= <off>
##$DECIM= 24
##$DECNUC= <off>
##$DECSTAT= 4
##$DIGMOD= 1
##$DIGTYP= 9
##$DL= (0..7)
0 120 120 120 120 120 120 120 
##$DP= (0..7)
150 150 150 150 150 150 150 150 
##$DP07= 0
##$DPNAME0= <>
##$DPNAME1= <>
##$DPNAME2= <>
##$DPNAME3= <>
##$DPNAME4= <>
##$DPNAME5= <>
##$DPNAME6= <>
##$DPNAME7= <>
##$DPOAL= (0..7)
0.5 0.5 0.5 0.5 0.5 0.5 0.5 0.5 
##$DPOFFS= (0..7)
0 0 0 0 0 0 0 0 
##$DQDMODE= 0
##$DR= 18
##$DS= 0
##$DSLIST= <SSSSSSSSSSSSSSS>
##$DSPFIRM= 0
$$ [...]
##$SUBNAM2= <"">
##$SUBNAM3= <"">
##$SUBNAM4= <"">
##$SUBNAM5= <"">
##$SUBNAM6= <"">
##$SUBNAM7= <"">
##$SUBNAM8= <"">
##$SUBNAM9= <"">
##$SW= 24.9336996594482
##$SWIBOX= (0..15)
0 0 2 0 0 0 0 0 0 0 0 0 0 0 0 0 
##$SW_h= 4990.01996007984
##$TD= 16384
##$TD0= 1
##$TE= 0
##$TE2= 300
##$TE3= 300
##$TEG= 300
##$TL= (0..7)
0 120 120 120 120 120 120 120 
##$TP= (0..7)
150 150 150 150 150 150 150 150 
##$TP07= 0
##$TPNAME0= <>
##$TPNAME1= <>
##$TPNAME2= <>
##$TPNAME3= <>
##$TPNAME4= <>
##$TPNAME5= <>
##$TPNAME6= <>
##$TPNAME7= <>
##$TPOAL= (0..7)
0.5 0.5 0.5 0.5 0.5 0.5 0.5 0.5 
##$TPOFFS= (0..7)
0 0 0 0 0 0 0 0 
##$TUNHIN= 0
##$TUNHOUT= 0
##$TUNXOUT= 0
##$USERA1= <user>
##$USERA2= <user>
##$USERA3= <user>
##$USERA4= <user>
##$USERA5= <user>
##$V9= 5
##$VALIST= <valist>
##$VCLIST= <CCCCCCCCCCCCCCC>
##$VD= 0
##$VDLIST= <DDDDDDDDDDDDDDD>
##$VPLIST= <PPPPPPPPPPPPPPP>
##$VTLIST= <TTTTTTTTTTTTTTT>
##$WBST= 1024
##$WBSW= 4
##$XGAIN= (0..3)
0 0 0 0 
##$XL= 0
##$YL= 0
##$YMAX_a= 778672
##$YMIN_a= -966973
##$ZGOPTNS= <>
##$ZL1= 120
##$ZL2= 120
##$ZL3= 120
##$ZL4= 120
##$ABSF1= 10
##$ABSF2= 0
##$ABSG= 5
##$ABSL= 3
##$ALPHA= 0
##$AQORDER= 0
##$ASSFAC= 0
##$ASSFACI= 0
##$ASSFACX= 0
##$ASSWID= 0
##$AUNMP= <proc_1d>
##$AZFE= 0.1
##$AZFW= 0.1
##$BCFW= 1
##$BC_mod= 2
##$BYTORDP= 1
##$COROFFS= 0
##$CY= 11.3945322036743
##$DATMOD= 1
##$DC= 2
##$DFILT= <>
##$DTYPP= 0
##$F1P= 18.9103706918063
##$F2P= -1.10871071338519
##$FCOR= 0.5
##$FTSIZE= 0
##$FT_mod= 4
##$GAMMA= 1
##$GB= 0.15
##$INTBC= 1
##$INTSCL= 1
##$ISEN= 128
##$LB= 0.24
##$LEV0= 0
##$LPBIN= 0
##$MAXI= 10000
##$MC2= 0
##$MEAN= 0
##$ME_mod= 0
##$MI= 1.114404
##$NCOEF= 0
##$NC_proc= 0
##$NLEV= 6
##$NOISF1= 3.799351
##$NOISF2= 2.8
##$NSP= 1
##$NTH_PI= 0
##$NZP= 0
##$OFFSET= 15.70392
##$PC= 1
##$PHC0= -8502.617
##$PHC1= 17.20097
##$PH_mod= 1
##$PKNL= yes
##$PPARMOD= 0
##$PSCAL= 0
##$PSIGN= 0
##$REVERSE= no
##$SF= 200.130013532006
##$SI= 16384
##$SIGF1= 3
##$SIGF2= 2
##$SINO= 400
##$SIOLD= 16384
##$SREGLST= <1H.CDCl3>
##$SSB= 0
##$STSI= 0
##$STSR= 0
##$SW_p= 3612.71676300578
##$SYMM= 0
##$S_DEV= 0
##$TDeff= 0
##$TDoff= 0
##$TI= <>
##$TILT= no
##$TM1= 0
##$TM2= 0
##$TOPLEV= 0
##$USERP1= <user>
##$USERP2= <user>
##$USERP3= <user>
##$USERP4= <user>
##$USERP5= <user>
##$WDW= 1
##$XDIM= 8192
##$YMAX_p= 0
##$YMIN_p= 0
$$ End of Bruker specific parameters
$$ ---------------------------------
##NTUPLES= NMR FID
##VAR_NAME=  TIME,          FID/REAL,        FID/IMAG
##SYMBOL=    X,             R,               I
##VAR_TYPE=  INDEPENDENT,   DEPENDENT,       DEPENDENT
##VAR_FORM=  AFFN,          ASDF,            ASDF
##VAR_DIM=   8192,          8192,            8192
##UNITS=     SECONDS,       ARBITRARY UNITS, ARBITRARY UNITS
##FACTOR=    0.0002004,     1,               1
##FIRST=     0,             0,               0
##LAST=      1.6414764,     0,               0
##MIN=       0,             -966973,         0
##MAX=       1.6414764,     778672,          0
$$ Real data points
##PAGE= N=1
##DATA TABLE= (X++(R..R)), XYDATA
0 0 0 0 0 -8 9 -16 16 -24 32 -40 48 -56 80 -96 112 -137 166 -200 234 -272 324 -383 438 -503 582 -667
26 -667 761 -862 979 -1111 1249 -1401 1573 -1763 1967 -2191 2436 -2713 3009 -3332 3692 -4091
42 -4091 4526 -5011 5549 -6158 6842 -7612 8502 -9535 10746 -12196 13967 -16192 19078
55 19078 -22988 28618 -37483 53545 -91918 369084 35474 -704735 145866 438889 -77390
66 -77390 -125424 623647 480232 -343856 -377324 329399 267215 -177851 152087 648755 30859
77 30859 -687406 -165785 636357 273511 -322489 14289 410157 -105063 -497534 34851
87 34851 465665 52206 -225802 129581 153969 -402954 -362424 397286 505510 -235400 -435793
98 -435793 117737 184423 -307659 -201532 386431 294861 -313095 -334395 79455 46149 -160818
109 -160818 131363 358994 -139012 -549534 -80357 402909 59555 -305868 34087 271825
119 271825 -167968 -417969 27093 322055 10307 -195565 14434 31427 -235446 -146678
129 -146678 237774 179831 -227925 -207011 145781 84817 -250816 -146949 226645 177764 -161395
140 -161395 -189886 14896 21551 -63008 55020 158138 -31969 -214384 -52384 146918 29298
151 29298 -103982 66792 190752 -50842 -256474 -42502 238935 161076 -67571 -84095
161 -84095 13789 -1172 -23757 77956 120288 -16440 -92343 18445 59527 -60518 -58771
172 -58771 110670 115666 -97187 -170713 3670 109462 -8606 -106544 -24691 39858 -50606
183 -50606 -109226 -25287 10528 -70460 -64624 39466 -4752 -167608 -143866 54178 87151 -90063
195 -90063 -147833 -4303 37480 -102377 -115827 57908 89357 -73570 -108248 12488 12850
206 12850 -54879 40559 135692 -15408 -161184 -372 194931 77273 -102828 8370 171927
217 171927 48788 -98840 49160 201812 57091 -75007 63260 155790 14804 -34796
227 -34796 122323 141933 -40404 -54437 141563 152844 -58064 -85076 112632 132958 -51078
238 -51078 -57822 94180 48491 -107081 -29757 127337 25584 -142482 -51279 91902 -12614
249 -12614 -142532 -18635 107334 -43653 -194191 -50339 106164 -15656 -144701 -37039
259 -37039 40692 -78256 -109525 38778 55693 -102813 -112221 45315 53062 -86267 -68962
270 -68962 75329 42408 -105339 -50751 113380 62093 -91261 -33573 103507 44505 -55555
281 -55555 27361 110020 9297 -65737 47371 133646 33514 -49848 33436 97014 19784
292 19784 -13311 77999 90301 -19551 -29385 78293 83973 -6275 842 70176 33822 -38651
304 -38651 11536 97545 48673 -52563 -24724 66895 46103 -28285 -1138 52528 3628 -47279
316 -47279 10299 59264 6752 -38916 -5848 19390 -5777 -11852 18210 10551 -38377 -38151 18564
329 18564 26067 -26444 -36319 -115 -10526 -43063 -15179 20534 -15114 -63760 -45486 -4482
341 -4482 -6202 -33780 -42039 -34243 -40437 -49325 -33524 -17151 -36482 -62074 -56443 -42954 -39522 -32186
355 -32186 -34311 -58275 -68104 -44668 -25911 -31940 -43316 -47168 -44573 -38504 -32282 -21079 -12444 -25673
369 -25673 -43892 -30888 -1003 8008 -1989 -13594 -17280 -2394 19001 21206 13213 16378 16825 9952
383 9952 18998 41756 49225 34128 15354 17526 43406 58727 44694 30187 31206 31169 33217 46327
397 46327 48384 32848 22854 21499 20911 30162 40840 28762 2737 -5430 10184 26236 19134 -2766
411 -2766 -8838 -1704 -7533 -13045 4525 10351 -18128 -37724 -20842 -1207 -1604 -11160 -22316 -28126
425 -28126 -21364 -8748 -1358 -4577 -16377 -19528 -10402 -5396 -2190 12895 13833 -13435 -19951 14820
439 14820 36189 18213 2431 9270 17222 18497 24373 35353 33535 14652 7375 27853 42761
452 42761 32944 26236 26368 13724 10670 36407 46141 17873 1084 15772 21967 9305 11950 27869
466 27869 16535 -19624 -22843 19228 32497 -10065 -31783 -5050 1188 -22527 -14767 8878 -12150
479 -12150 -43870 -28460 -1744 -12665 -29038 -15800 -9911 -39566 -47881 -1537 20263 -32424
491 -32424 -63037 -14287 14184 -26272 -36622 5940 1482 -48350 -36576 24078 19418 -39731
503 -39731 -40081 12420 10503 -34130 -16821 32419 2127 -56722 -22330 39360 10261 -35850 -5457
516 -5457 15713 -31479 -38739 33525 46737 -39255 -67479 15584 49607 -26145 -50055 28636
528 28636 40258 -47479 -53493 38127 43122 -35959 -30513 34765 12950 -42585 988 60470 6184
541 6184 -58054 6382 80655 16201 -60093 3308 75189 16917 -32217 35296 62982 -21602
553 -21602 -39590 59143 80285 -12853 -31517 50297 48723 -40729 -24999 87102 77354 -48917
565 -48917 -65071 36195 50587 -16068 -1912 43845 -12730 -72634 -6652 57558 -6379 -63696
577 -63696 1086 42192 -47815 -101088 -1511 68374 -21635 -93490 -23363 23543 -45842 -69788
589 -69788 5759 20819 -47803 -47875 12026 -12171 -81302 -36914 65635 43728 -64360 -69302
601 -69302 14625 23881 -21745 6391 57967 14667 -47977 -19222 32768 26787 25600 63156 47435
614 47435 -38953 -58580 42690 117317 58772 -20611 -81 44359 18813 -6862 37310 77561
626 77561 46493 -1728 -10499 619 11230 36235 61908 38327 -24091 -41390 10786 38402
638 38402 -1057 -16024 32661 44264 -28930 -78075 -29094 39589 40256 2668 -15094 -31829
650 -31829 -61561 -41537 36858 58555 -15449 -54697 -9582 -5254 -64152 -38825 76865 88132
662 88132 -45572 -117560 -32897 46665 21656 4343 36814 3506 -77141 -44188 56902 37935
674 37935 -37617 12916 82295 -18255 -129822 -23906 127512 63761 -73839 -35078 55911
685 55911 -10649 -85629 12970 98669 -354 -74024 15435 36525 -90621 -81255 105434 121948
697 121948 -82937 -142927 18431 67206 -55346 -51044 85653 51656 -115549 -94709 58207
708 58207 37298 -66041 14541 105894 -45603 -181555 -11356 169879 39383 -126987 -20804
719 -20804 101115 -23172 -122351 28824 136045 -6429 -95504 31386 65506 -81327 -65249
730 -65249 129821 108658 -112219 -104766 100990 82058 -109292 -63305 137067 83168 -123473
741 -123473 -85733 84359 33159 -87339 20410 126441 -42433 -176408 3050 149024
751 149024 -10188 -128518 31374 112779 -77079 -157687 44415 144317 -25074 -106473 25848
762 25848 45784 -89799 -47884 129095 72515 -125620 -72179 117342 56612 -114427 -26802
773 -26802 151469 60279 -121171 -44058 117568 49477 -69635 24015 118035 -5909 -93588
784 -93588 43243 120793 -18094 -68924 84827 117615 -60722 -105745 69040 127853 -15583
795 -15583 -60453 51162 48371 -71961 -39791 99001 61415 -79892 -46445 66822 5541
806 5541 -98292 -6227 111439 12508 -126793 -57549 66762 18470 -69829 -15432 44407
817 44407 -32620 -86001 1315 49311 -36612 -64676 28859 40953 -66436 -77326 37522 60198
829 60198 -41039 -61080 30172 43187 -43849 -50767 37043 48200 -22155 -20669 34492 6880
841 6880 -48749 1652 78653 35715 -50995 -29255 43269 29282 -23058 3794 54742 16158
853 16158 -47424 -18606 41632 23903 -13127 9419 22768 -25929 -41660 21995 52665 -9159
865 -9159 -51115 -1868 35942 -11750 -47577 3066 39624 -9865 -45589 -2331 23580 -17756
877 -17756 -33276 13356 24930 -21046 -30567 13512 17506 -28703 -23787 37065 35497 -33781 -41519
890 -41519 22706 33539 -13146 -7889 33601 9546 -40134 -9358 49524 26901 -28889 -9000
902 -9000 36192 4863 -39444 5549 58874 8857 -53012 -12278 42422 6210 -33497 3376
914 3376 27526 -18941 -37976 13867 29025 -26498 -41899 14418 25275 -32850 -38489 21395
926 21395 18315 -44128 -34576 31468 20717 -42981 -32832 22922 11797 -31326 -9140 32301
938 32301 1388 -43807 -8264 44739 15007 -31580 -2459 33909 1333 -22457 20746 42668
950 42668 -3696 -24692 19025 37889 888 -9961 26961 28212 -15246 -12169 37958 35157 -19782
963 -19782 -20166 28648 26587 -15330 -8715 24586 7724 -26168 -7944 26446 9007 -25786 -14565
976 -14565 10259 -3179 -21553 -71 14424 -17729 -36096 -2383 16995 -10500 -24655 -2629
988 -2629 2653 -20175 -17993 10884 12644 -18810 -24724 5543 15927 -6677 -10235 10788 8281
1001 8281 -12333 -3492 21588 15639 -6436 -4206 12977 12967 4890 9023 14640 4581 -4434 9648
1015 9648 24121 10743 -5739 3993 13875 3133 -1008 12818 13332 -6214 -12986 3456 14177
1028 14177 3184 -10298 -6805 -585 -6455 -8372 1966 1573 -14349 -18636 -6110 -803 -5811 -8333
1042 -8333 -8703 -12320 -13309 -5464 1623 -2366 -13060 -13028 -2584 -54 -4486 -541 2901 -5809 -10802
1057 -10802 2165 12799 6413 -3896 -2823 4417 8121 6622 6968 8307 3799 -812 5239 13466
1071 13466 11004 4470 2203 1202 2784 9979 11266 2340 -4194 -2243 2990 4508 2485 -1108 -3321
1086 -3321 -5670 -7624 -2498 4019 -840 -11216 -12409 -6498 -1993 -686 -4757 -10307 -9803 -6161 -5306
1101 -5306 -2305 601 -4538 -10998 -7934 403 4551 2403 -3396 -4802 -410 4404 5683 6904 4871
1116 4871 -5 816 6978 9798 10128 9973 3899 -1020 6017 16108 13803 3681 62 4889 8924
1131 8924 6896 4899 6450 4524 -3664 -3954 5926 7050 -876 -4589 -4990 -6887 -3118 3537 -988
1146 -988 -11816 -13577 -6285 -2032 -5241 -7612 -6424 -9280 -14811 -8150 3165 -1660 -15142 -11613
1160 -11613 -869 -4070 -8233 579 4383 -7123 -12251 -503 9792 4955 -2416 -785 2002 -472
1174 -472 6019 15983 7772 -8079 175 18025 11366 -3250 6070 17364 4051 -7426 6588
1187 6588 20197 7919 -7176 -24 10270 2572 -2915 9189 7403 -13654 -11994 12881 11992
1200 11992 -13586 -14615 4487 663 -14447 -4914 9669 -4769 -23503 -8951 10440 -2543
1212 -2543 -18392 -825 10936 -15503 -26529 8324 24813 -7653 -26399 465 15335 -3596
1224 -3596 -7753 11739 9199 -12015 -4829 20451 12056 -13392 263 27242 8214 -19898 4116
1237 4116 34275 7434 -22558 3156 30313 7475 -15760 3004 17401 -4225 -11235 16710
1249 16710 19065 -19380 -25333 14377 22290 -15432 -20190 11261 5706 -26619 -16491 17125 7521
1262 7521 -22948 -15547 4322 -9255 -22650 4782 22246 -13903 -39949 -3429 27589 -2916
1274 -2916 -27899 964 20397 -7503 -20747 6380 17960 -3749 -6727 13879 10750 -11015
1286 -11015 -2137 24812 14530 -13935 247 31409 15174 -18345 -4411 27689 20666 -2393
1298 -2393 1794 10907 -1458 -5964 15287 24271 -762 -16528 1402 12677 -5334 -11137 12302
1311 12302 16686 -12625 -27126 -6955 9486 4648 -4186 -8473 -14737 -15916 -4997 4473 -3124
1324 -3124 -15164 -9186 1579 -7152 -20673 -10748 8999 7724 -10077 -16550 -6201 4091 1161
1337 1161 -5577 -1008 8346 4342 -7126 -6201 1861 4799 9222 14799 6190 -13745 -13855 10710 25859
1352 25859 9587 -7151 1161 8723 -5626 -10196 14434 24800 1207 -14131 -3785 -1515 -8165
1365 -8165 7141 25601 2971 -32610 -19104 19001 11931 -21885 -11408 22219 4577 -35384
1377 -35384 -20295 18229 8374 -17075 -1139 12358 -16934 -29632 8691 27299 -8919 -22860
1389 -22860 15500 22409 -26969 -33168 27053 44228 -8470 -25185 13197 12980 -21318 310 47595
1402 47595 22585 -33411 -15705 32935 13940 -24247 10731 53169 5652 -50165 -10384 45631
1414 45631 16152 -21656 9613 26888 -21244 -35189 21516 37167 -18429 -28448 24212 20972
1426 20972 -42738 -36989 36864 36847 -34418 -35633 23457 11378 -42973 -17091 41598 14032 -41782
1439 -41782 -15805 26855 -8220 -39802 14525 53004 -7776 -55846 -2520 41737 -1766 -25815
1451 -25815 25684 36914 -27359 -38277 28034 40955 -13755 -13404 36534 18098 -41892 -16845
1463 -16845 53490 36395 -31983 -19669 36165 14722 -35082 -4085 43967 10004 -34777 -3454
1475 -3454 27738 -11352 -33645 14789 36065 -18149 -43423 5812 25319 -24333 -35226 19592
1487 19592 27024 -32046 -43023 9058 16665 -24731 -17627 21755 2946 -43912 -23687 27325
1499 27325 14669 -28266 -14473 20932 -699 -33412 -3434 33816 6896 -26037 -1933 21377
1511 21377 -3849 -16082 16915 27872 -8187 -19489 16082 27421 -7872 -16699 20248 29332
1523 29332 -7466 -16860 15333 19955 -8989 -8360 20302 15942 -13568 -11765 12791 9183 -10886
1536 -10886 -2582 16694 1246 -24117 -9973 17783 7510 -16802 -7300 8821 -6102 -19699
1548 -19699 79 15542 -3981 -20770 -4013 11223 -4707 -16803 2528 14882 -5890 -18728
1560 -18728 2862 16302 -3645 -14213 5009 15162 -1522 -8410 5913 9565 -4382 -3957 14006
1573 14006 13722 -7751 -9654 10865 12281 -5529 -2098 15214 6715 -15560 -7690 16180 11624
1586 11624 -9709 -8767 7347 2354 -13772 -3710 14612 2459 -19756 -9538 10136 448 -14878
1599 -14878 -3095 8360 -6505 -16502 -546 9699 -5649 -14499 1941 10017 -7007 -12490 7026
1612 7026 10421 -9676 -9638 14293 13905 -10290 -9874 13642 15006 -3311 -1830 14747 9760 -7694
1626 -7694 -768 20192 14658 -4510 -585 13758 6438 -3609 9067 18351 1343 -10669 4047
1639 4047 15493 2430 -6530 4963 8992 -7243 -12103 7106 12330 -8285 -16446 1334 6399
1652 6399 -9598 -11778 3313 1708 -14100 -12746 2463 1737 -12583 -11880 690 -728 -11334 -5910
1666 -5910 3793 -4302 -13840 -2339 8673 -1608 -11120 -1085 6543 -2066 -6194 5962 10387 -3143
1680 -3143 -9041 4538 13848 3744 -3495 5360 8159 -1282 -718 10783 10623 -1834 -3622 5174
1694 5174 5939 1190 2042 5253 116 -6644 -1123 7390 2267 -8236 -3929 2787 -3160 -8895 -1406
1709 -1406 2819 -6883 -12832 -4402 2377 -3644 -10365 -7265 -2081 -5547 -7791 -1847 -498 -7466 -9311
1724 -9311 -1589 941 -3319 -2730 -432 -3237 -4769 1099 6181 1887 -3935 -1276 4709 4140 1324
1739 1324 3851 6704 1622 -2133 4486 10097 5493 524 1775 3908 4487 4458 5123 3470 837 448
1755 448 3251 4572 2526 1253 880 -1489 -1692 3097 4287 -1759 -4741 -1751 710 -325 -692 -662
1771 -662 -1781 -3312 -3009 321 2339 357 -2814 -2823 -673 1803 3853 2141 -2140 -1430 3516 3439 1606
1788 1606 3827 5020 1216 -542 4072 8255 5887 1502 863 4001 5053 3951 5048 4161 -310
1803 -310 -217 4504 4434 1025 976 2000 -1875 -3176 2047 3710 -2389 -7047 -3649 409 -2250 -5677 -2984
1820 -2984 -2108 -7777 -9627 -2278 205 -6314 -9591 -5867 -4545 -5665 -3139 -2345 -6071 -8558 -3313
1835 -3313 634 -2265 -5187 -1424 1277 -4078 -4596 4093 7158 -2130 -5151 3113 7208 2202 1964
1850 1964 5921 3540 -233 3196 9758 7113 254 2095 7041 4262 1291 6693 8360 -735 -3462
1865 -3462 5920 7712 -887 -1778 4644 1539 -6766 -2543 6850 2521 -9630 -8143 2501 1253 -7194
1880 -7194 -5026 282 -5649 -9750 -1566 2088 -6691 -9383 -571 -352 -9058 -6394 4497 1449 -11343
1895 -11343 -8462 5869 5344 -6757 -5417 4829 1625 -6228 2214 11136 335 -8233 2430 11051
1909 11051 2334 -3385 6044 9160 -2455 -4613 8780 11531 -1522 -3997 7445 5181 -5845
1922 -5845 919 13364 2673 -12624 -2306 12844 2577 -11724 -2641 8952 -664 -11277 -1259
1935 -1259 7130 -4599 -11280 951 5510 -7509 -8938 4146 2380 -12378 -6171 11050 4687
1948 4687 -13784 -9206 8018 5020 -6695 -639 9403 -973 -11433 1951 14986 3238 -7586
1961 -7586 3572 10279 -2552 -5921 10647 14784 -1441 -7273 5401 9346 38 80 9743 4991
1975 4991 -6707 -624 11550 3315 -9495 334 12401 1321 -11919 -2790 8348 -134 -8721
1988 -8721 -231 6462 -3231 -10665 -2993 2783 -2808 -3859 3165 -1499 -12814 -8033 6862 6083 -4674
2003 -4674 -5190 58 -2669 -5418 2355 8332 2744 -4837 -2147 2749 730 1182 7950 8385 -1321 -4587
2019 -4587 3059 8329 5028 2740 3795 3289 2634 2604 1472 1272 4085 6342 3392 -2440 -2844 1209
2035 1209 2302 -14 377 1892 -2363 -6308 -4767 -3169 -1988 1188 1142 -7993 -14203 -7300 1513 -646
2051 -646 -5586 -4734 -4685 -10737 -10849 -341 3880 -5230 -9386 -2695 -1586 -9810 -5452 8004 4627 -10177
2067 -10177 -8168 4845 3610 -4875 -500 8494 2647 -5658 1888 8985 -756 -5514 9462 15084
2081 15084 -2317 -9359 7331 13278 -2747 -4624 13344 12911 -7777 -9826 8851 11589 -3306
2094 -3306 -1750 10431 1370 -14643 -2573 16415 5327 -13910 -3788 9669 -3631 -14700
2106 -14700 3094 13976 -5023 -16581 1367 9919 -7676 -12272 8214 11111 -12022 -13683 10670
2119 10670 10818 -12810 -10779 13973 10875 -11790 -7500 12538 5989 -10056 1404 17350 3003
2132 3003 -14090 838 17249 2409 -9829 8367 17463 -5896 -15257 9676 20198 -2553
2144 -2553 -11437 7568 10783 -9320 -8965 13438 11559 -12308 -11419 10402 6508 -13418 -6693 12345
2158 12345 2044 -16693 -5630 10945 -1190 -16163 -2567 10682 -3915 -15035 0 9281
2170 9281 -7923 -14052 6149 13043 -8939 -16051 5270 11352 -6102 -7827 9745 8124 -10235
2183 -10235 -7790 11718 10752 -4750 -2985 9625 3881 -7866 2147 15805 5455 -9674 -56
2196 -56 12524 2563 -6910 4379 11471 -2154 -9237 3612 10076 -2693 -9477 2876 7432 -5181
2210 -5181 -9896 2407 4768 -7570 -8764 3137 3304 -8792 -9767 463 1092 -6493 -5037 1661
2224 1661 -2147 -10682 -5644 5526 1830 -8078 -4523 3136 -1467 -7255 1189 8493 428 -8049 -1557
2239 -1557 7266 3819 -2290 2464 6822 854 -3781 4447 9810 2844 -2432 3761 7055 1061 -479
2254 -479 5209 5745 -368 -1418 4976 5855 -2014 -3285 3747 4387 -2985 -3075 3547 908 -7430 -4743
2270 -4743 4392 2588 -6775 -7255 -189 -497 -5664 -4213 1828 -1657 -9372 -5872 2267 272 -5502
2285 -5502 -3176 508 -3706 -5815 911 4767 -1807 -6216 65 5066 -420 -3463 3697 6016 -1870
2300 -1870 -3847 5733 7959 -803 -3216 5374 6946 216 -571 5672 4710 -1703 -689 6823 5300
2315 5300 -2624 -1675 4052 2369 -2286 1587 5060 -1070 -6700 -312 5327 130 -5058 -1223 1463
2330 1463 -3393 -6010 1421 4973 -3500 -8176 -1085 3454 -2339 -4054 1654 1781 -4489 -4026 3310
2345 3310 3581 -2228 -2267 2794 2480 -1381 861 5505 2212 -3011 2134 7499 3336 -2030 1663 6192
2361 6192 2398 -921 3594 6047 709 -2730 2593 6423 2225 -2182 721 2655 -1490 -1376 2639
2376 2639 1912 -3916 -4699 -445 15 -2435 -2593 -844 -3261 -6517 -3400 1003 -1238 -6672 -5067 -814
2392 -814 -3039 -5301 -2144 443 -3410 -6445 -2151 1686 -278 -3334 -1683 339 -420 -863 1457 2325
2408 2325 -988 -984 3027 3399 951 1461 3048 1736 151 3097 5348 2449 -742 1015 4000 3531
2424 3531 1016 1777 2593 205 -1517 1348 3571 985 -2020 -1255 -474 -482 -111 -73 -2025 -3333 -2819 -1337
2442 -1337 -1195 -2369 -2365 -2258 -3534 -3786 -1330 273 -2686 -4735 -2645 -185 -1165 -1562 -858 -1124 -1315 -486
2460 -486 835 1642 370 73 787 1027 1871 3739 3153 301 329 3622 4304 2310 2510 3478 2318 871
2478 871 2771 5479 3527 496 196 2544 2519 997 1568 1591 -927 -1201 1069 1430 -1268 -1739 -81
2495 -81 -1627 -3485 -713 1020 -1777 -5106 -3026 284 -1100 -3264 -2449 -889 -2784 -3926 -509 1248
2511 1248 -2146 -3406 -610 632 -1191 41 2207 123 -2469 -65 3644 2404 -486 795 3100
2526 3100 1283 -455 3303 5574 711 -2132 2364 5152 1726 -301 2350 2480 -635 -382 3376
2541 3376 2390 -1568 -1837 1292 81 -2233 -128 1584 -2855 -5629 -282 2436 -2659 -5430 -1381
2556 -1381 -190 -4035 -4010 783 140 -5047 -5120 299 942 -3128 -2832 1227 -1172 -3952 190 3949 -75
2573 -75 -2915 564 3527 181 -11 4006 3755 -1387 -1239 5434 5734 -71 -743 4776 4427 -702 927
2590 927 6039 2898 -2609 461 5097 1963 -1143 1335 2211 -2140 -2836 2465 3420 -3224 -5554 525
2606 525 1882 -4120 -3862 1727 -416 -7215 -4276 2134 -313 -6403 -3862 911 -2448 -5542 -1499
2621 -1499 2461 -2458 -6004 -803 3318 -1594 -3811 1545 2001 -3175 -1616 4981 3082 -3451 -1336
2636 -1336 5582 3840 -1798 749 5921 2081 -2847 1478 7888 2994 -2764 1050 4931 986 -679
2651 -679 4425 4488 -2280 -3103 3194 3764 -1420 -1818 2213 626 -4535 -2471 3834 401 -5864 -3149
2667 -3149 1985 -1282 -5335 -1441 1495 -2889 -5771 -629 2539 -2043 -5181 -834 1714 -1215 -2253
2682 -2253 1140 1003 -3103 -1172 3996 2267 -1966 -3 3319 846 -919 2905 5872 1881 -1785
2697 -1785 1149 5056 3032 688 2528 3187 -107 -241 3581 3724 475 -112 1801 612 -612 754
2713 754 1666 -653 -2408 -359 931 -1172 -2626 -1236 -441 -2921 -2412 107 -587 -4161 -3473 -827
2729 -827 -544 -2098 -1731 -1723 -3064 -2099 323 775 -1365 -1556 -410 -676 -1223 1075 3452 479 -2495 -284
2747 -284 3363 1887 -83 2326 2732 -419 16 3833 3941 580 18 2733 2446 -259 835 3615
2763 3615 1196 -2301 551 3953 120 -3587 77 2258 -1983 -3742 1338 1944 -3822 -5900 76
2778 76 2127 -2664 -4447 -472 -704 -5086 -3036 2114 198 -6071 -3747 1343 -972 -4290 173 2976
2794 2976 -2360 -5629 784 5062 -105 -3684 1890 4353 -975 -2556 4509 5537 -1863 -2071 5396
2809 5396 5422 -1063 -622 5029 3681 -1670 1507 6535 2397 -3691 -165 5794 1977 -2709 1412 4163
2825 4163 -2446 -5368 2774 5551 -2559 -6368 -66 2479 -3652 -4126 2474 2081 -5863 -5917 1598 1842
2841 1842 -4307 -3615 1926 -418 -5837 -2078 3193 -558 -5291 -723 3915 -415 -4444 550 4249
2856 4249 -363 -3127 3044 5347 -1321 -3642 3350 6123 423 -1086 3978 3185 -2005 -611 5950
2871 5950 5114 -1080 -1897 2293 1867 -1310 1296 4879 79 -5072 -1118 3760 415 -3047 370 1666
2887 1666 -3125 -5309 -99 2557 -2156 -5050 -1218 906 -3133 -4234 -44 674 -3041 -3306 925
2902 925 137 -3317 -2733 1562 1121 -1236 -996 798 -408 -1856 851 4267 2228 -2007 -792 2757
2918 2757 1674 542 3070 4124 276 -2056 1350 4876 3239 331 706 1677 -11 -635 2540 3816
2934 3816 335 -2268 -278 1126 -305 -395 747 -317 -2811 -1973 -56 -16 -2107 -2671 -266 -761 -3322
2951 -3322 -2697 -364 -1021 -3406 -2186 576 -556 -3383 -2576 274 566 -1144 -1019 390 -205 -1751
2967 -1751 333 3086 1586 -739 -225 1259 658 966 3431 2969 98 -1171 1773 3837 1977 545
2983 545 1995 1878 -626 -61 3580 3708 -482 -2115 277 1473 -456 -505 989 222 -2550 -2103 391
3000 391 463 -2213 -1828 -434 -1328 -2706 -1869 -43 -2268 -2835 -539 402 -1922 -3354 -1418 381 -994
3017 -994 -1781 153 565 -2037 -2406 1297 3361 685 -1231 628 721 -3 1387 3382 2550 -275 -495
3034 -495 1714 2651 1815 2089 2549 678 -1462 1212 3830 2230 -350 386 1162 -262 -1006 1129 1962
3051 1962 -526 -2243 -1131 628 -729 -1899 -725 90 -1851 -2239 -956 -1190 -2488 -1943 -24 -625
3067 -625 -2078 -2146 -1139 -1450 -1421 -92 1291 -832 -3220 -1068 1379 849 -222 609 1098 -718 -1111
3084 -1111 1948 3577 1741 17 642 1350 1573 1724 2428 1841 470 -47 1834 1778 658 942 1690 71
3102 71 -1024 721 1895 222 -1531 -763 763 -436 -1926 -848 -469 -1390 -1832 -533 -207 -1774 -3154
3119 -3154 -1725 -1134 -1006 -1010 -933 -1829 -2392 -1182 187 -364 -1423 -991 -668 -716 -586 1288 1768 -369 -1254
3138 -1254 776 1832 1313 1006 1475 1248 431 1334 2158 1890 1102 1032 1099 1350 1420 2060 1547 -356 -505 1665
3158 1665 1834 46 -398 410 -22 -1096 -119 882 -101 -1835 -1821 -300 -77 -1360 -1482 -1543 -2147 -2166 -609
3177 -609 -361 -2109 -2127 -919 -1606 -1551 -324 713 -875 -2554 -1036 1184 965 -990 -332 1079 396
3194 396 -426 1392 2673 390 -458 1293 2125 1256 1131 1885 1225 -232 905 2570 2074 -163 307
3211 307 2130 1152 -519 1103 2092 -178 -1829 455 1610 161 -1438 -690 -191 -1384 -1360 100 -92
3228 -92 -2468 -2506 -378 -774 -1673 -1331 -659 -2165 -3117 -723 1153 -1010 -2741 -753 556 -1136 -1064 817
3246 817 1169 -942 -1372 1304 2307 18 -340 1161 1287 56 1434 3142 1410 -570 1458 2946
3262 2946 1226 415 1880 2069 -349 -668 2152 2704 -337 -1743 1061 1379 -1107 -695 1258 -111
3278 -111 -2770 -1408 1059 -144 -1912 -1268 -579 -1634 -2030 -267 71 -2443 -3199 -315 240 -1888 -2067
3295 -2067 451 3 -3040 -1699 1595 856 -1945 -1476 1294 1097 -806 679 2349 168 -1069 1398
3311 1398 3054 1048 -437 1708 2351 -7 554 3558 2320 -924 37 2390 2133 -624 117 2133
3327 2133 427 -1480 35 2883 456 -2430 -769 1120 -613 -1967 -87 6 -2779 -2385 -17 473
3343 473 -2340 -2239 -541 -603 -2891 -1281 1509 -352 -3803 -1782 1366 316 -2107 -155 1114 -1056
3359 -1056 -1329 879 2363 368 -948 934 1855 837 743 2031 1732 -571 418 3312 1777 -307
3375 -307 799 2380 942 27 1669 2553 -10 -1541 434 2090 396 -1342 -47 413 -1264 -1755
3391 -1755 710 335 -1893 -2021 -544 -770 -1635 -763 -182 -1909 -2938 -1444 324 -1186 -2388 -1021
3407 -1021 -236 -1214 -1715 408 512 -1493 -1348 741 806 134 -145 495 97 188 1300 2114 662 120 834
3426 834 1906 1490 1328 2108 1318 -779 -335 2217 2358 241 330 986 481 -283 665 1455 377 -1163
3444 -1163 -891 234 21 -854 -273 -799 -1810 -1620 -57 -588 -2229 -1375 7 -1108 -2025 -896 -370
3461 -370 -1334 -2306 -450 1114 -348 -2367 -1084 164 -325 9 939 940 -1098 -1018 1208 1643 311 1415
3479 1415 1666 89 -569 1534 3317 1346 -395 856 2068 623 -42 2054 2725 -59 -1280 1115
3495 1115 1807 98 -331 783 583 -921 -1080 257 -202 -1937 -972 612 -509 -2605 -1321 -72
3511 -72 -1134 -2176 194 634 -2059 -3497 -794 1363 -734 -1717 -369 -313 -2161 -1706 1501 2171 -348
3528 -348 -1400 73 468 -4 1205 2370 790 -1277 557 2218 1584 541 1588 2103 88 -679
3544 -679 1641 3018 463 -710 1353 1843 -291 -649 1089 1104 -953 -493 499 385 -1225 -1375 245
3561 245 129 -1039 -824 -259 -1418 -2264 -317 792 -1325 -2641 -1270 -453 -1003 -1124 660 63 -1953
3578 -1953 -2503 -299 1494 271 -851 147 -285 -1063 292 2133 1908 -9 -231 594 783 1017 2108
3595 2108 2166 543 -275 660 1756 1720 454 1074 1277 285 -450 877 1509 371 -451 596 611 -659
3613 -659 -1210 -537 113 -100 -461 -555 -1072 -1966 -1513 -47 117 -964 -1273 -1964 -1857 -1476 378 815 -545
3632 -545 -2237 -1916 -637 478 430 298 202 -810 -1210 -94 1625 1701 329 51 149 201 675 1327 1452
3651 1452 1172 857 361 814 866 1145 1109 1221 689 427 927 65 -2 437 1092 926 -376 -860 -544 104
3671 104 186 -386 335 -655 -1992 -1995 -301 176 139 -984 -1565 -1673 -1212 -508 82 -105 -1085 -1478 -1140 -438
3691 -438 -84 645 279 -528 -984 239 983 847 514 606 927 256 303 932 1633 838 293 1108 1487 1132
3711 1132 12 909 1321 1090 1139 796 758 -23 306 740 854 268 -248 -540 -463 -395 168 872 -294 -2277
3731 -2277 -1541 -251 -312 -599 -341 -617 -1452 -1931 -817 300 -93 -1205 -1633 -789 -870 -542 119 -57 -760
3750 -760 -702 276 382 137 250 506 288 66 833 1490 829 -144 633 1681 1753 431 335 1325 391 372 1224
3771 1224 1685 341 -410 36 829 704 698 146 -400 -1285 -873 618 421 -696 -1196 -614 -970 -1214 -4
3790 -4 335 -1074 -1935 -1123 -282 -466 -1468 -897 -653 -1053 -1461 -222 185 -656 -1257 -496 212 -213 291 500
3810 500 -322 -523 653 1161 616 -197 659 1075 863 402 1586 1711 106 -544 1330 2124 1093 139
3828 139 584 519 -41 604 799 569 -667 -423 190 -466 -256 503 -183 -1658 -1729 121 323 -834 -1873
3847 -1873 -590 -633 -1631 -1020 -169 -720 -1773 -1308 -350 84 -595 -623 -188 -763 -706 606 866 -421 -1016
3866 -1016 629 921 165 416 1396 759 -643 82 1861 1912 -76 -148 1347 1188 360 977 1921 439
3884 439 -820 691 1516 255 256 518 394 -781 -199 808 363 -1193 -1272 67 -235 -1169 -635 284 -1075
3903 -1075 -2490 -882 523 -480 -1786 -978 -57 -965 -1201 -102 172 -1226 -1445 13 670 -637 -427
3920 -427 545 -153 -832 519 2030 392 -951 375 1619 795 195 1055 1476 60 -564 1466 2084
3937 2084 391 -270 690 881 -20 687 1826 357 -1313 -67 1191 576 -983 44 254 -1166 -1547
3954 -1547 144 952 -1293 -2343 -364 3 -970 -1436 27 -226 -1989 -1250 413 28 -1560 -1364 -60
3971 -60 -568 -884 662 636 -696 -1464 387 1390 -271 -591 1018 1331 -632 -190 2138 1651 -465 -396
3989 -396 1342 1537 207 406 1288 612 -614 674 1822 683 -688 457 791 -684 -685 1267 596
4006 596 -1462 -1227 809 256 -1242 -1179 281 -639 -1985 -909 764 -287 -2442 -1339 449 -622
4022 -622 -1363 -413 213 -1303 -1368 313 942 -915 -871 146 594 -631 -35 1647 756 -1236 -139 2056
4040 2056 1466 -447 647 1444 331 -135 1255 2184 794 -318 784 1541 262 122 919 521 -687
4057 -687 -336 1422 1082 -923 -693 662 -25 -1391 55 535 -1136 -2003 -543 908 -389 -1889 -802
4074 -802 -106 -1116 -1139 87 340 -1590 -1505 121 -115 -884 -166 453 -741 -1186 147 1477 122 -854
4092 -854 185 1510 166 -438 1014 1721 251 -502 1221 1592 140 131 863 650 -170 356 1657 607
4110 607 -451 78 1359 311 -468 288 530 -1056 -1103 486 1031 -913 -1951 -391 122 -922 -850 41
4128 41 -437 -1758 -1422 -39 228 -1075 -1131 -424 -1151 -1004 -17 513 -985 -1025 13 593 -429 -349 572
4147 572 810 -596 -149 1164 1621 -179 -329 916 1307 359 375 1296 816 -120 1022 1595 633 128 241
4166 241 685 -30 203 1103 827 -857 -997 428 977 -334 -371 -66 -517 -1093 -585 358 37 -1437 -1528
4185 -1528 -726 -202 -494 -593 -349 -990 -1208 -277 126 -296 -497 -274 -571 -808 -299 744 82 -640 -398 447
4205 447 840 126 355 1063 872 151 624 1380 699 -158 567 987 980 962 997 187 228 230 1176 414 149 -584
4227 -584 -109 -48 -484 78 311 -705 -1444 -914 -35 -181 -502 -662 -605 -1026 -763 -271 -244 -575 -950 -754 -1051
4248 -1051 -406 21 -274 -764 -1029 -106 195 -103 -94 -28 357 -103 125 680 359 369 -97 728 953 977 695
4269 695 489 519 800 1032 1267 812 196 271 379 360 662 863 -68 -505 -257 280 429 -187 -661 -473 -196
4290 -196 -554 -496 -1 -610 -1060 -1202 -506 -260 -376 -271 -826 -1325 -596 296 -374 -708 -693 27 102 -560 -309
4311 -309 210 -33 -660 190 699 913 -243 77 214 579 587 1048 975 241 -176 609 1397 1070 513 550 215
4332 215 -410 695 1566 853 -322 -326 291 156 -115 628 405 -641 -1321 -730 198 -19 -671 -751 -155 -745
4352 -745 -1013 -485 -322 -817 -874 -770 -410 -822 -848 -12 -308 -534 8 431 -220 -1010 -264 1098 708 -637
4372 -637 -19 334 130 -150 778 1324 701 -212 466 492 1158 1184 1354 892 126 -113 749 1337 253 620
4392 620 424 -295 -524 157 1135 212 -476 -368 96 -238 -702 -470 114 -352 -976 -217 -317 -802 -942 -314
4412 -314 -398 -598 -535 -388 -1051 -1059 -337 327 261 -711 -702 155 -231 -14 840 767 -72 -593 13 1048 1165 736
4434 736 474 279 301 523 1008 1195 491 410 269 268 436 661 840 25 -132 609 480 -159 -134 181 110 -350
4456 -350 -299 -76 -521 -617 -508 -293 -142 -475 -722 -680 -950 -646 254 -327 -658 -685 -257 -453 -648 -157 195
4477 195 -142 -1069 -573 405 304 -221 -33 136 109 -185 463 1050 249 -8 613 727 350 535 882 440
4497 440 -222 583 1010 505 -12 238 922 346 -293 371 741 -593 -1125 -3 644 -264 -512 -151 -235 -568
4517 -568 -543 145 -239 -1458 -744 -83 -508 -472 -649 -217 -925 -1506 44 574 -569 -1063 6 150 -729
4536 -729 -253 65 148 -378 -71 747 738 135 119 815 437 82 659 1553 291 -332 789 1224 269 179 807
4557 807 702 -151 -109 1011 1159 -152 -656 271 495 -656 -607 304 -272 -1358 -406 233 -478 -1046 -296
4576 -296 -359 -914 -1184 -130 -15 -1358 -1322 -244 254 -933 -569 194 -344 -1264 -392 738 446 -748 -575
4595 -575 724 168 110 609 754 503 -375 780 1067 503 53 1025 805 -158 496 1556 1086 -513 -162
4614 -162 1124 812 102 -8 797 79 -375 18 798 -54 -758 -397 107 -483 -526 405 -231 -1163 -998 255
4634 255 -185 -1306 -643 83 -626 -1208 -422 433 -358 -1356 -380 702 -125 -499 -131 745 -512 -382 379
4653 379 926 -94 -169 677 607 159 189 1139 405 -413 282 1486 831 -394 607 1097 59 -175 968
4672 968 1101 -301 -277 607 599 106 -397 190 -102 -970 -788 397 237 -1112 -486 -56 -432 -1032 -111 33
4692 33 -1078 -1197 -40 342 -613 -861 -241 169 -480 -358 654 405 -643 -651 540 645 -173 70 631
4711 631 -128 72 557 955 295 245 778 662 181 189 1213 1136 -239 -156 1018 928 -424 -326 548 301 -546
4732 -546 399 509 166 -719 -168 345 -276 -864 -32 -310 -721 -464 114 52 -1178 -902 -16 -238 -722 -472
4752 -472 271 -300 -1068 -624 195 88 -700 -377 242 160 -450 576 599 -259 -23 853 966 269 270 786 392
4773 392 -329 424 1191 682 -146 345 956 417 81 596 769 -235 -502 530 1058 66 -546 147 -120
4792 -120 -584 -29 -78 -394 -932 -604 414 -241 -902 -486 3 -716 -848 122 412 -328 -1494 -161 -27
4811 -27 -270 -483 -147 77 -391 -521 190 410 -217 -188 252 544 -240 749 996 517 -164 576 809 338 -153
4832 -153 341 984 292 -1 729 1263 119 -428 295 830 62 -418 -21 167 -427 -665 107 211 -433 -671
4852 -671 -359 -374 -691 -438 -86 -662 -1432 -467 521 -277 -883 -168 -144 -574 -845 -138 181 -442 -806 95 846
4873 846 382 -353 -3 287 -38 111 488 860 50 40 439 551 651 500 591 238 200 250 887 708 -230
4894 -230 201 625 451 80 484 489 61 -662 20 360 -104 -320 -403 -328 25 -145 -305 -527 -513 -466 -354 0
4916 0 -340 -611 -527 -296 -285 -522 159 -283 -440 -564 50 403 9 -363 -17 55 -531 17 811 692 258 -290
4938 -290 230 556 405 569 627 424 63 304 669 740 494 565 584 269 -61 423 526 140 -177 230 396
4959 396 175 -278 -103 511 -28 -527 -292 -325 -494 -781 58 217 -392 -640 -726 -565 -622 -214 300 230 -698
4980 -698 -1047 -90 25 -60 296 96 -232 -927 -269 790 605 -77 -81 764 118 -52 634 1143 441 -155 95
5001 95 630 376 92 543 647 137 -27 112 636 -34 72 753 562 -205 -654 141 83 -260 -44 203 -452
5022 -452 -1192 -808 324 392 -641 -536 -1 -324 -1071 -453 371 128 -934 -739 36 -390 -585 212 264 -410
5042 -410 -477 -122 351 -132 145 757 617 -95 148 559 797 38 445 929 543 -118 69 889 955 -2 316
5063 316 681 -46 -452 -120 337 397 103 114 130 -585 -588 533 482 -617 -585 -301 -46 -881 -660 220 -247 -961
5085 -961 -760 -243 18 -764 -566 305 -294 -536 -597 293 -136 -509 -71 110 45 -100 255 581 93 -46 542
5106 542 776 -159 -178 558 631 365 369 546 618 67 216 673 699 -2 68 319 51 62 343 519 -121 -372 -91
5129 -91 -108 -218 -256 18 -378 -591 -544 242 -326 -586 -476 -498 -397 -475 -399 -526 -304 -307 -31 -83 15 -273 -197 -191 -64
5154 -64 409 -156 216 -118 172 303 322 619 188 227 -57 162 725 694 186 556 335 456 532 366 248 36
5176 36 90 346 104 -60 -171 271 -241 -594 -61 78 -75 -499 -126 149 -124 -268 -178 -400 -326 -279 -79 -244
5198 -244 -112 -537 -308 -90 -228 -289 -79 -378 -426 -21 48 -39 -453 121 218 -202 -317 222 607 -84 -452 219
5220 219 685 133 31 459 315 89 166 453 469 -111 101 72 339 85 257 633 -129 -41 9 330 -45 -335
5242 -335 91 150 -259 -519 -3 -6 -423 -852 -188 176 -569 -284 39 -200 -734 -323 141 -70 -688 -109 137
5263 137 60 -141 74 494 -217 -369 304 533 -46 -59 357 541 223 38 699 328 -13 -108 641 638 215 331
5285 331 382 42 -110 202 490 375 -351 223 554 -57 -383 415 111 -67 -259 122 347 -434 -264 -215 51
5306 51 -605 -534 -118 -151 -948 -677 48 -8 -414 -271 -67 -254 -158 245 56 -272 -372 274 175 -86 29 633
5328 633 -154 -215 -71 589 573 152 133 326 357 100 436 353 105 -186 344 593 232 174 471 177 -175 -12
5350 -12 450 285 -353 -524 -162 39 -420 -178 163 -424 -831 -421 -100 -371 -586 -158 -287 -471 -268 103
5370 103 -173 -262 -548 49 -2 -259 222 183 -153 -44 256 353 72 -419 126 384 573 177 461 573 469
5391 469 307 646 292 98 59 428 471 281 256 465 -109 70 137 -91 -106 -368 -111 -221 -219 -281 170 -184 -180
5414 -180 -562 -175 -19 -222 -228 -338 -602 -425 -370 -165 -484 -273 -319 -265 -599 30 263 -99 -185 -249 100 456
5436 456 96 -255 224 352 -121 409 534 334 361 153 620 480 -52 309 501 61 100 422 563 188 51
5457 51 126 127 111 -117 242 41 -413 176 278 42 -356 -177 -323 -475 -161 -646 65 -284 -205 -494 -147 -460
5479 -460 -324 -439 -324 -665 -393 -78 87 -282 -256 82 4 -60 409 438 -90 29 422 384 443 86 155 310
5501 310 359 437 208 509 57 -107 333 588 -24 320 309 -2 30 216 454 -30 -136 -241 213 216 -248 83
5523 83 51 -98 -352 -88 205 -186 -666 -315 -53 -319 -113 30 -197 -634 -473 -5 -114 -312 -189 -95 -72
5544 -72 18 169 455 143 -94 160 644 71 258 279 517 63 -27 474 545 459 -70 198 510 300 272 324 112
5567 112 -127 64 328 221 -169 -17 55 -150 244 234 141 -339 -491 -324 72 113 -142 -410 -311 -522 -753 -353
5589 -353 -178 -490 -222 -356 8 -136 -26 -427 -329 -206 -252 35 -76 -128 -129 197 65 20 115 92 287 -48 350
5612 350 443 202 159 0 256 336 413 132 386 226 -241 313 332 536 -48 192 -59 29 -125 354 312 -62
5634 -62 -486 -287 52 112 -342 -91 -333 -453 -346 -224 -98 -514 -513 -341 -79 -76 -656 -246 -370 -229 -387 106
5656 106 -94 -509 -291 104 -29 325 399 71 -103 -364 -59 458 509 -99 -213 259 61 -98 579 637 -128
5677 -128 -323 428 257 651 269 -185 336 -260 -65 61 364 -428 -184 -162 -206 38 78 145 -255 -215 -137 320
5699 320 -208 -369 -512 249 -14 -388 -86 99 -331 -649 -147 116 3 -597 -110 6 -198 -301 181 471
5719 471 175 -402 95 293 558 377 68 248 -42 84 664 543 -201 212 404 394 -136 334 360 30 -309
5740 -309 -35 657 107 -323 -727 -88 -39 -72 -98 94 -317 -422 -196 306 -209 -529 131 -116 -260 -146 -6
5761 -6 -259 -490 -461 -132 29 -19 -163 268 -253 -74 96 283 60 -235 18 230 82 210 580 480 -107
5782 -107 -74 105 683 267 142 377 283 164 221 280 175 -39 -51 400 291 146 -86 16 108 -285 -140 308
5804 308 -334 -274 -201 177 -252 -160 -219 -356 -381 -485 74 235 -313 -637 -326 -339 -287 78 -93 -476 -93 -144 -52
5827 -52 443 -384 55 -249 23 39 201 225 244 181 -150 369 429 69 574 391 46 380 169 219 89 119 187
5850 187 323 141 201 24 82 -225 -195 485 5 -259 -237 -163 107 175 -281 -189 -213 -412 -315 77 -33 -100 -394
5873 -394 -325 -89 -42 -124 -378 -253 231 -328 -204 -1 -41 -139 -87 -10 322 294 270 -3 -244 -90 402 411 417 228
5897 228 -341 26 212 223 584 246 -291 -192 113 454 126 -243 132 -117 -54 130 301 -35 -84 -19 -118 -132
5919 -132 22 46 -211 -452 -380 199 -45 -357 -136 -169 -345 -370 -140 143 -171 -423 -106 229 -5 -94 -94 -60 -140
5942 -140 -124 138 439 355 -46 16 453 359 161 511 135 -347 241 358 476 -195 62 81 178 197 185 228 -174
5965 -174 -64 179 441 318 -151 -62 96 -227 49 99 186 -334 -391 -152 -221 -151 -191 -600 -562 -541 24 151 65
5988 65 -316 -256 -248 4 -54 331 132 -315 195 89 268 40 355 -67 95 245 69 447 3 18 223 185
6010 185 666 47 43 16 -70 265 292 539 218 16 -84 -102 252 -83 -165 59 -286 -95 -132 -52 -239 -79 -608
6033 -608 -18 -96 -19 35 -316 -705 -233 -206 -208 -37 -478 -420 -309 -263 -113 81 -354 -351 -56 -71 -62 15 -41 -182 -145
6058 -145 214 156 110 -264 62 68 153 566 908 438 42 -93 240 219 177 -67 59 -115 -116 -63 154 -76 -105 -82
6082 -82 -341 -78 113 159 -141 -388 -203 145 -66 -338 -603 -79 -580 -406 -20 188 -383 -554 -482 -302 -98
6103 -98 13 -437 -132 -240 -97 -122 154 55 -387 -49 35 53 288 62 -99 -89 421 783 332 264 258 84 -23
6126 -23 159 249 429 234 59 31 22 172 -77 201 -61 306 -15 287 22 2 -92 -201 -270 -84 96 -262 -177
6149 -177 -334 -122 300 -54 -383 -413 -174 -294 -111 203 -286 -278 -121 186 389 153 218 137 -245 148 379 237
6171 237 268 -159 -74 166 10 90 139 295 -307 162 623 676 18 175 -146 77 170 405 257 -36 -614 -360
6193 -360 284 -126 130 144 -191 -308 -305 39 -66 -635 -404 -386 -68 -260 -73 -57 43 -471 -132 70 124 -493
6215 -493 -146 -195 209 -208 186 112 -11 -147 39 55 311 69 -17 227 113 192 447 560 10 -205 323 529
6237 529 270 287 160 -16 -422 158 422 119 -444 -405 67 -10 177 359 -117 -444 -266 -216 330 -236 -111
6258 -111 -154 -133 -202 -192 117 60 -444 -654 30 265 27 -224 -36 -130 -278 -45 177 -17 -176 -291 38 130
6280 130 446 132 218 -115 56 48 451 335 -192 -156 85 19 246 311 159 77 -141 79 447 193 127 120 187 15
6304 15 39 165 130 -601 -539 170 397 -70 40 -98 -162 -334 -125 124 -235 -596 -176 -70 250 -199 -318 43
6326 43 -297 -474 -42 310 101 -26 -434 -2 125 51 221 -56 -191 -132 535 290 222 161 -113 160 14 232
6348 232 406 29 -235 281 194 1 112 -328 -65 83 81 -14 199 262 -177 -272 395 386 202 -671 -69 -78 -49 -83
6372 -83 94 27 -450 -636 -47 -54 142 291 -276 -527 -345 530 327 1 -676 -186 -14 -392 -11 444 290
6393 290 -99 -366 -49 477 281 -35 49 387 285 -27 726 297 6 -127 278 425 -62 -70 134 -114 -26
6414 -26 253 700 -247 -319 -113 366 -244 121 370 1 -387 -777 455 581 -285 -501 -130 -98 -504 -117 149
6435 149 -146 -629 -687 51 68 -232 -202 13 -139 -395 -101 475 12 -512 -166 499 47 -234 584 243 -210
6456 -210 -195 324 524 -7 -258 249 381 279 -39 409 -43 -255 -83 530 470 -217 -83 -93 -81 -173 266 255
6478 255 141 -433 -112 103 -309 -129 -241 126 -62 -159 238 201 -527 -593 -175 -102 12 -215 4 126 -298
6499 -298 -168 109 36 -117 -294 32 101 121 183 321 -75 -528 -85 536 417 -280 8 382 381 19 656 325
6521 325 137 -231 11 545 253 233 36 -228 -70 252 274 -74 -139 -496 -145 -110 -81 -2 164 -349 -424 165
6543 165 404 -95 -363 -322 -164 149 202 -220 -96 -226 -466 -464 -103 343 -70 -544 -135 -42 134 589 321 39
6565 39 -303 57 67 288 -20 84 14 -106 2 363 188 -231 -518 63 506 253 2 121 370 26 73
6586 73 255 28 -229 -283 -287 75 57 -233 -274 -227 -221 34 155 195 -352 -506 -116 -141 90 429 124 -314 -665 -157
6610 -157 435 -74 -234 167 103 -88 117 147 207 198 -386 121 497 399 102 130 -29 -124 -230 493 585 -119 -42
6633 -42 118 -5 178 324 127 355 -186 -51 494 159 -368 -104 34 -225 -315 3 216 -205 -597 -193 -70
6654 -70 349 -406 -308 -221 -583 48 69 52 -556 -428 178 309 -197 -94 22 -385 -415 151 382 251 -246 -288
6676 -288 221 175 0 12 199 -369 -376 229 606 -38 -105 106 -146 -21 465 269 112 140 -266 298 299 121 -53
6699 -53 89 32 76 107 532 185 -165 -616 87 -51 -112 -279 -208 -396 -230 208 319 -190 -175 -6 -318 -307 178
6722 178 -51 -66 -374 -1 208 136 -16 116 -42 -283 -64 346 260 131 -346 97 182 324 89 -10 -27 -355
6744 -355 117 144 275 -35 26 -179 26 47 451 -156 -305 -460 -163 154 -90 -62 -55 -97 -231 132 123 70 -115
6767 -115 -548 -346 -277 -130 93 -11 -417 -486 305 53 -120 -313 -85 -123 -220 306 343 222 -97 -12 379 130
6789 130 132 184 -47 161 193 154 141 175 -286 -123 -147 89 315 98 119 -143 331 424 240 -263 -88 -400 126
6812 126 -172 345 -55 -600 -416 -321 -2 141 -4 18 -271 -293 -12 42 -136 -609 -26 -78 -242 226 -93 -1
6834 -1 -174 -74 -100 620 95 -127 -152 179 94 263 358 398 170 -313 270 477 551 505 -91 -3 38 72 421 -144
6858 -144 -62 164 474 1 -62 342 -189 -99 -95 266 64 -252 -155 -293 -10 -56 101 187 8 -411 -293 150 133
6881 133 136 -305 -354 -608 -175 433 503 -422 -696 -103 454 -180 -89 -22 188 -658 -530 88 574 186 -227 -90
6903 -90 -172 266 96 445 66 120 -67 362 291 -128 73 33 -252 28 467 500 -28 -219 317 267 -307 -196
6925 -196 -161 -75 -182 -264 442 344 -74 -725 -95 -9 9 276 62 -104 -564 150 165 -73 21 -46 140 -213 -8
6948 -8 297 285 -279 -245 108 489 219 -38 542 385 -35 77 200 329 96 63 312 457 21 36 -134 -227
6970 -227 -155 88 621 295 -259 -144 47 -13 -131 464 228 -196 -986 155 560 193 -375 -91 94 -99
6990 -99 -390 263 248 -328 -409 -141 34 -132 -237 -107 -115 -440 29 411 54 -750 -179 227 229 -93 70 473
7012 473 -11 -243 107 620 156 -234 -215 114 307 103 231 234 -74 -21 226 427 63 -218 47 -60 -103 71
7034 71 218 73 -425 -291 250 415 -321 -261 -28 -208 -224 -19 607 109 -645 -451 1 412 36 -183 -30
7055 -30 -432 -277 -354 123 14 -310 -676 7 249 -88 206 241 -189 -484 75 346 126 -246 -47 455 21
7076 21 -18 258 586 -56 -476 506 683 -34 -439 62 49 46 20 506 50 -531 -218 55 132 -415 -116 191
7098 191 -204 -615 366 778 -114 -491 -313 -74 -183 -24 344 361 -305 -928 193 812 84 -720 -212 317
7118 317 -180 -233 440 351 -75 -450 539 246 -161 -115 229 83 -360 225 556 28 -397 -214 721 341 -254
7139 -254 255 490 -418 -411 114 787 -103 -761 -57 589 9 -314 409 144 -373 -707 407 605 -533 -180
7159 -180 278 -252 -507 -295 749 -300 -963 -353 432 -41 -182 352 255 -105 -376 299 543 -465 -479 -88
7179 -88 538 54 -248 104 52 -148 -259 673 495 -227 -311 0 263 -60 220 489 105 -289 -96 825 434
7200 434 -164 -333 221 -37 -218 162 320 -241 -692 -377 -4 -7 -315 16 -58 -240 74 335 78 -173 -361
7221 -361 32 -67 -248 -109 -264 -174 -559 -255 468 316 -565 -226 268 190 102 189 172 167 -266 -294 -30 691 39
7244 39 -62 -343 -6 73 429 439 -148 -187 -62 215 303 155 -83 -6 -315 -153 392 343 -248 -700 -205 340
7266 340 39 -373 -336 -186 -17 -474 -399 79 50 -427 -261 245 190 -116 -106 -245 65 154 127 -34 -84 -343 -62
7289 -62 116 -32 98 212 23 -352 -302 520 331 8 -326 20 103 -276 -120 188 259 -358 -472 -16 281
7310 281 -64 127 -91 91 -238 352 238 -262 -268 -213 251 -246 -21 289 -26 -636 -254 324 270 26 -558
7331 -558 -4 93 -178 31 109 -40 -588 -252 392 7 11 -382 -124 -97 6 186 406 -171 -90 -6 242 -148
7353 -148 -161 392 -79 -156 194 269 321 -420 -31 -8 -163 26 151 48 -43 -446 196 413 56 -212 -97 -475
7375 -475 -382 -58 61 -75 -632 -597 -90 108 -165 -210 68 -81 -495 -121 381 -12 -549 -416 247 181 -97
7396 -97 63 170 -208 -137 -79 -62 -71 -288 187 118 -205 136 314 33 -261 -19 365 354 152 64 332 -10 -132
7419 -132 63 178 190 -344 -291 190 115 291 -9 -329 -355 -177 40 66 12 -224 -66 -254 -32 303 65 -164
7441 -164 -423 -290 275 255 -132 -503 -162 -115 -17 257 -66 -401 -285 -433 143 519 131 -197 -36 110 365
7462 365 179 148 13 -189 97 -4 27 281 310 -94 -247 247 327 391 112 -57 -192 24 296 127 209 -400
7484 -400 -526 97 189 223 -83 -81 -335 -219 31 149 -302 -404 -63 -104 144 422 129 -154 -137 -129 -47 29 171
7507 171 22 2 -240 173 558 363 -276 109 -131 79 233 231 130 -13 -111 232 347 303 -162 -305 33 225
7529 225 198 24 47 -195 -79 114 165 -119 347 74 -322 -176 167 228 -61 -194 -226 130 232 -243 -131 35
7551 35 -417 15 150 214 314 -147 -553 -71 285 -75 -23 97 -140 -123 6 -82 -4 -150 -24 13 133 158 403
7574 403 50 -607 22 -4 216 53 407 388 -158 -253 179 567 234 -489 -71 160 -30 190 391 -350 -525
7595 -525 -83 152 89 -15 -113 -282 -437 -405 282 569 -464 -698 130 274 -124 -434 -102 10 -285 -314 194
7616 194 -52 65 -292 -422 24 105 38 138 -202 -101 73 605 246 -248 -51 95 115 -324 71 528 -217
7637 -217 -538 306 536 45 5 -48 245 -193 23 352 245 8 -372 8 218 285 187 131 148 -400 -315 380
7659 380 352 -353 -365 -120 -309 -246 2 309 -221 -511 194 412 202 -380 -118 -50 77 -218 328 167 -373
7680 -373 -562 -114 306 -221 -68 63 15 -147 -61 479 -4 -333 -260 492 304 -31 141 445 -199 -236 97
7701 97 753 81 -345 49 -25 349 90 127 182 -112 -325 -125 419 35 -536 -340 -283 -321 -173 385 -160 -485
7723 -485 -265 -159 34 -241 -21 -137 139 -518 -352 512 372 -272 -439 156 377 322 -72 -517 -36 -188
7743 -188 78 422 450 -129 -509 18 665 -158 178 344 -136 -185 -64 575 117 -121 -94 403 -104 -384 189
7764 189 277 -436 -631 -285 744 21 -402 -226 104 -202 -71 119 521 -542 -323 -4 318 -355 -275 -12
7784 -12 -240 -362 114 441 10 -802 -471 553 152 -138 300 793 55 -517 66 727 595 -534 -271 -124
7804 -124 159 76 248 793 -406 -291 179 434 -110 -220 279 250 -342 -119 472 421 -428 -67 543 274 -484
7825 -484 -8 412 -177 -555 77 477 49 -578 -77 249 88 -390 224 130 -557 -578 425 650 -183 -345
7845 -345 169 247 -278 -159 590 569 -417 -370 549 531 -201 5 265 10 -238 -106 744 -27 -177 -115 319 71
7867 71 -197 187 99 -96 -179 415 305 -216 -566 234 529 -111 -284 516 330 -751 -396 716 250 -389
7887 -389 -192 -20 68 -95 184 570 -123 -707 -287 352 302 -102 -240 245 -333 -350 351 615 -42 -534 89
7908 89 58 105 -373 120 268 -143 -161 347 286 -140 -173 30 169 -92 129 145 -29 -142 -269 101 406 -214
7930 -214 68 -102 -156 -127 399 186 -274 -380 -61 392 11 -77 -31 -60 -304 -467 183 241 -45 -310 -236 436
7952 436 -229 -189 -107 127 -182 -151 194 182 216 -316 -259 -37 184 90 -56 169 56 -37 458 180 -165 151 40
7975 40 -110 50 313 185 75 -369 -201 251 135 65 -607 133 -140 -247 334 101 74 -346 -120 42 466
7996 466 -126 335 -104 -410 -227 -108 237 -248 -463 23 247 90 -115 31 77 -226 -143 495 291 -199 -275
8017 -275 -123 359 -115 -15 229 249 -283 -162 211 327 91 93 130 71 -64 399 465 94 -528 29 284 97
8039 97 101 126 141 -236 -431 448 6 -372 -682 41 320 -96 -315 -88 12 -554 -189 459 353 -179 -56 -78
8061 -78 55 -191 83 -34 -452 -302 241 297 -172 254 57 174 -56 -116 67 393 -194 -475 -120 424 -14
8082 -14 134 -163 -108 58 54 307 124 -152 -267 82 -99 38 138 352 -233 -265 283 357 -121 -236 -111 -32
8104 -32 -286 -122 -50 219 -272 -73 92 520 -18 -324 -430 -438 64 0 207 9 -119 -85 385 -245 -8 115
8126 115 -132 -339 -445 286 340 88 -57 48 -46 207 36 179 53 -582 -74 248 251 -46 -156 -234 -115 -327
8148 -327 -102 40 -194 -286 24 -342 71 -21 393 -283 -421 -27 145 61 -83 -200 -69 -29 113 26 -253 -63
8170 -63 -575 -85 344 176 72 283 -32 -171 -186 410 160 -238 -136 -86 4 -41 35 -104 -63 -244 -148
8191a48
$$ Imaginary data points
##PAGE= N=2
##DATA TABLE= (X++(I..I)), XYDATA
0 0 0 0 0 8 -8 0 -8 16 -17 24 -24 40 -48 55 -64 80 -97 114 -131 157 -187 214 -242 286 -327 372 -422 479
28 479 -545 613 -686 773 -867 968 -1076 1197 -1334 1483 -1638 1817 -2014 2228 -2466 2731
44 2731 -3029 3365 -3738 4170 -4673 5258 -5950 6796 -7842 9188 -10974 13475 -17244 23534
58 23534 -35922 69464 -342093 -966973 87800 566094 -79360 -347383 256026 176441
68 176441 -542026 -429648 399980 371441 -240368 -108107 350712 -97231 -626344 1837
78 1837 778672 284729 -471912 -149895 381533 16419 -318912 214122 595028 68715
88 68715 -315846 74667 275049 -126474 -90059 543877 520922 -280738 -437261 254721 443521
99 443521 -55786 -58625 427277 276559 -338123 -275371 284894 311985 -11097 94741 247988
110 247988 -172513 -463893 73247 552900 127944 -351564 -62294 219409 -151165 -352742
120 -352742 121801 388989 -29660 -328886 -93238 34721 -159586 -87073 238433 131304
130 131304 -304097 -281442 114268 106895 -206262 -111401 229597 121837 -257688 -243349 60191
141 60191 117843 -5514 38637 99774 -77613 -214435 -8654 217265 96714 -77053 41992
152 41992 146462 -64719 -206817 56596 321127 166291 -119339 -116282 44546 67855 34567
163 34567 102607 123574 -19310 -99191 18424 86410 -12096 -20572 118278 98392 -115240
174 -115240 -163204 38392 141806 2741 -104623 -19200 46220 -48283 -110386 -15372 42270
185 42270 -36630 -59465 16432 -21951 -155873 -109707 85323 94451 -101138 -160485 -8865
196 -8865 43026 -87292 -102423 61127 80631 -99298 -140978 2492 32775 -48127 4753
207 4753 80102 -52983 -176317 -15033 163580 30732 -155669 -42277 127017 7505
217 7505 -148747 -10132 145863 2921 -139668 271 110731 -30080 -100336 51929
227 51929 89418 -77397 -92319 94957 103226 -102301 -119120 92770 122283 -68918 -88358
238 -88358 76177 57703 -91728 -23465 136151 44376 -121738 -26595 129618 35741 -95742
249 -95742 20013 146031 5622 -134885 14450 171843 39655 -105341 7049 110083
259 110083 -3642 -58607 73286 94530 -60312 -73678 83813 89724 -62749 -62351 76313
270 76313 49802 -95906 -53441 98958 40594 -123856 -72205 74400 17146 -103813 -37147
281 -37147 48802 -46487 -124217 -14677 66183 -42496 -130023 -40365 34124 -42684 -88293 -3552
293 -3552 19657 -80196 -88464 25409 36546 -59707 -56089 27128 9398 -55455 -6238 76431
305 76431 29408 -60814 -16814 87109 68496 -12197 13152 79865 46552 280 58571 110896
317 110896 55488 7425 52004 91174 66050 51472 76694 72695 31717 36504 89684 92717
329 92717 34201 20725 62027 59278 22625 39497 69419 31146 -16160 7781 49577 35987
341 35987 -3733 -13263 -370 -2177 -12489 -6083 1825 -21040 -46693 -36155 -17190 -19815 -26520
354 -26520 -33462 -52527 -57217 -31568 -16641 -33022 -50436 -51374 -43886 -36339 -32018 -28474 -28080 -40890
368 -40890 -53862 -37666 -9559 -9701 -29601 -39804 -35299 -19080 -3086 -7164 -21892 -21034 -15160
381 -15160 -17751 -10923 5949 4850 -14822 -27381 -16984 7799 16054 -4782 -21845 -14736 -5553
394 -5553 -3556 3984 3463 -12841 -20172 -11942 -5573 1056 6722 -6063 -25734 -22742 22 13276
408 13276 2972 -17491 -18830 -3017 -304 -4598 7391 12709 -11808 -24147 1561 23100 14893
421 14893 1 -6516 -4066 6877 18268 18929 9827 -719 -831 10908 17050 14323 17832 14772
435 14772 -7435 -10681 22456 36461 7999 -12914 -2268 9618 7793 7239 10457 3745 -12530
448 -12530 -16081 4704 17050 602 -12941 -8820 -11355 -11850 8770 15225 -13136 -27466 -4872
461 -4872 8542 -2465 -3206 10648 3522 -20975 -14406 28372 38469 -3954 -22111 14915 32512
474 32512 10368 12983 37350 22314 -4147 16828 48663 36657 15422 26867 37672 16998
486 16998 11511 50974 64249 12726 -16016 34603 64864 19545 -3005 35363 35425 -12853 -5222
499 -5222 48604 36386 -27690 -29008 24423 22800 -28088 -22046 20859 -6365 -63053 -31623 28123
512 28123 -5342 -63399 -37042 -4696 -43429 -56181 3112 10388 -71171 -92054 -5812 27752
524 27752 -50134 -79640 -2660 15714 -65563 -71920 21289 29068 -55677 -54016 20144 9659 -46944
537 -46944 -11404 47821 456 -58694 3839 75657 12192 -61896 4213 81869 23128 -37205
549 -37205 25116 63469 -11594 -30979 62473 81460 -16578 -38831 47317 57165 -26278 -16510
561 -16510 82534 65476 -58730 -63439 52811 70940 -13803 -18632 32140 -6705 -59095 4617
573 4617 67529 803 -62884 -2357 43501 -34063 -78698 18291 79419 -18408 -93061 -14419
585 -14419 46183 -21108 -55274 17971 36796 -37031 -46366 16403 5787 -54790 -16307 68961
597 68961 32610 -77996 -70585 29354 42622 -19783 -11296 32399 -8058 -66324 -26904 36722
609 36722 23112 -4570 10484 -4134 -66737 -62713 38693 89026 4890 -79944 -44645 18897
621 18897 939 -28660 8397 38995 -3500 -51970 -40961 -6736 10481 21451 26998 -3289
633 -3289 -50851 -46190 16989 45515 3184 -18015 23151 33191 -29168 -55571 13137 79321
645 79321 56429 -2178 -19061 -9592 -8993 18309 77767 77314 -5482 -42499 15111 41810 -2535
658 -2535 13492 99522 83809 -50916 -94953 19539 104303 53762 -623 17545 2181 -55373
670 -55373 -18499 77931 54092 -38660 -11831 53019 -26063 -113855 -4062 131122 42115 -110932
682 -110932 -66650 46586 -2043 -80136 4849 84714 -18540 -104358 -13107 36559 -64636
693 -64636 -63341 95532 93650 -110332 -150724 38500 102416 -33310 -55379 69099 45077
704 45077 -108298 -75863 92365 78621 -47965 -2786 87440 -31211 -139423 31922 195928
715 195928 42787 -138136 -25332 118646 8332 -98322 41743 143878 -8031 -112657
725 -112657 18656 81899 -50067 -55938 112634 88065 -127451 -115637 99377 89008 -108355
736 -108355 -76943 115597 60072 -148349 -103483 88855 49949 -94601 -20150 86202 -56302
747 -56302 -174057 6477 151792 -17829 -153833 1187 98661 -73660 -149125 53173
757 53173 145913 -43395 -139864 9007 64979 -61899 -45457 110526 57441 -133652 -77685
768 -77685 120506 67407 -109698 -34376 138412 46132 -135348 -49509 126132 57201 -82394
779 -82394 -4761 98425 -11318 -101219 31878 116314 -20934 -86416 57014 94944 -72217
790 -72217 -108709 72293 126672 -35416 -92990 30792 53100 -58823 -37887 92360 54940
801 54940 -89692 -56841 71708 27739 -76574 1671 109756 9531 -120948 -34477 102458
812 102458 47356 -59392 -11670 60133 -5119 -59914 25308 77326 -8969 -47829 40116 58352
824 58352 -41877 -50903 62056 78866 -30816 -54444 39930 56248 -32038 -41884 46175 54884
836 54884 -26931 -35311 25382 10995 -42297 -1903 63371 11884 -73779 -42410 38710 23494
848 23494 -38653 -20625 28146 -7160 -65110 -29295 35471 13662 -36900 -18943 4117 -30760
860 -30760 -41463 17732 41349 -22768 -59824 -3632 38638 -8166 -42972 7558 44294 -5271
872 -5271 -41424 6068 39141 -1724 -20436 24281 37588 -8445 -19021 26370 34500 -8765
884 -8765 -7441 45666 40501 -25702 -29407 39064 50061 -5744 -11330 29540 13330 -31567 -3363
897 -3363 51244 22858 -37660 -19088 29897 5176 -38966 -1339 45792 -4668 -64623 -19032
909 -19032 40562 1853 -46264 -11430 19135 -22451 -42588 6630 23518 -30244 -45255 11041
921 11041 24879 -31531 -39907 19447 22101 -38198 -30792 34934 25070 -39918 -28577 32487 23859
934 23859 -24572 -7374 34092 7641 -34276 571 50739 17745 -32688 -4291 37792 7921
946 7921 -21535 16698 38215 -8328 -30036 15037 35320 -5579 -21484 14110 19062 -21297
958 -21297 -20566 25846 22285 -32304 -31597 20609 19948 -25859 -22716 13905 1895 -31304 -12813 21324
972 21324 2996 -32027 -18141 12804 2091 -19085 -1580 14450 -12493 -27007 7517 27343
984 27343 -2901 -20011 4274 15188 -5558 -5509 20899 19948 -10706 -13888 18075 27719 940
997 940 -6143 15109 15463 -5366 693 23826 15647 -9391 -5621 13978 12691 -142 322 6174
1011 6174 -1993 -9263 2702 14157 -892 -17641 -7300 5790 -3804 -10966 127 1387 -15869
1024 -15869 -19481 -172 8900 -5189 -18255 -11465 -652 -3811 -7389 704 2126 -11292 -13059
1037 -13059 3059 9677 1089 -3274 -405 -358 922 8038 12615 6532 -2110 203 11051 13332 6417
1052 6417 6511 10217 3288 -354 11175 18748 8222 -3321 -76 8443 10072 5230 2052 2155 -1312
1067 -1312 -5009 422 6665 1116 -8271 -8899 -6353 -4206 -477 -1514 -11104 -15472 -9755 -4065 -4062 -7567
1083 -7567 -10965 -11435 -10291 -9630 -4420 30 -5570 -14279 -11179 -1664 2224 728 -3638 -6568 -3676
1098 -3676 2010 3878 4827 5527 1333 -2486 2637 11453 12502 7052 1932 1989 7756 12010 10346 8197
1114 8197 5760 2036 3226 9516 10385 6560 3859 -48 -2971 3409 10861 5146 -6095 -7939 -1233
1129 -1233 2587 -961 -4570 -3825 -4899 -10076 -8713 758 533 -9089 -11833 -7754 -6155 -3301 1267
1144 1267 -3559 -12640 -10463 -624 3720 -1019 -4479 -2147 -1643 -4262 1424 11264 5674 -7059 -2542
1159 -2542 10813 8497 1520 7306 10839 912 -2834 9264 17412 8548 -1163 1082 6152 4912
1173 4912 7103 11865 3568 -10476 -2478 14351 6459 -10714 -3413 8170 -3646 -15258 -1934
1186 -1934 10084 -3757 -19207 -9799 2914 -4328 -12255 -3540 -2116 -18222 -16517 7721 6508
1199 6508 -19322 -19656 3596 3687 -12564 -5493 9517 -3053 -18937 -2648 17596 4660 -12917
1212 -12917 2450 16513 -4405 -14109 17293 31552 -2992 -20896 10172 27621 5654 -4233
1224 -4233 14181 14196 -6027 -1263 22493 14356 -11538 -1324 24193 7271 -20960 302 28873
1237 28873 2477 -28513 -2736 25741 760 -25856 -5613 12784 -7291 -17948 5828 8950
1249 8950 -24531 -28387 11881 19335 -20242 -27254 6706 6916 -24308 -15113 18620 8693 -23787
1262 -23787 -15657 10247 1475 -13342 7354 22098 -10598 -31527 6797 36889 3338 -24900
1274 -24900 5011 27222 -833 -16463 11588 24278 168 -7889 12468 12613 -8012 -2213 21815
1287 21815 12096 -16341 -4897 24190 8067 -24098 -9032 24504 12877 -15851 -11740 3539
1299 3539 -3941 -9912 7791 12961 -11577 -25144 -3182 11800 -5806 -13655 6228 10008 -17025
1312 -17025 -25771 672 18116 6038 -7385 -8367 -6914 -3774 6848 13335 3577 -7491 -997
1325 -997 11067 4622 -6751 3795 21231 14880 -5073 -7934 6429 15917 10421 1613 4542 11648
1339 11648 6256 -4847 -2080 8687 10181 7396 6391 -2859 -16020 -10841 12566 20104 -1820
1352 -1820 -20645 -10209 2057 -8429 -13281 6401 12328 -14030 -28570 -11567 -791 -7445 6
1365 6 10358 -10866 -38072 -18464 20354 11637 -24378 -15864 17118 3048 -32930 -15259 26736
1378 26736 15446 -17113 -5203 13715 -7776 -19245 16841 33336 -4315 -21301 15272 25468
1390 25468 -17283 -22214 34225 45541 -13076 -32189 12618 22904 -11505 153 39557 13311
1402 13311 -40648 -19713 34358 17006 -25731 125 37337 -6216 -56333 -10735 47174 13024
1414 13024 -35840 -8599 17318 -22145 -35822 18301 33414 -23647 -38604 14755 18504 -38438
1426 -38438 -31791 38501 35199 -38411 -40272 25058 21688 -33123 -12828 44525 16813 -41157 -14698
1439 -14698 35382 7135 -27558 17747 51190 -8189 -52487 6228 55145 8345 -26156 19708
1451 19708 35013 -23723 -33533 33596 46728 -14585 -22732 27224 16723 -37384 -13681 52014
1463 52014 29808 -41848 -29130 32340 16678 -35007 -8800 39121 5596 -42182 -9886 28151
1475 28151 -6511 -31997 12270 32668 -19522 -43519 8482 32772 -15637 -30336 21020 29356
1487 29356 -28220 -37064 20643 31318 -14841 -15488 23858 10169 -32421 -11145 39420 23325
1499 23325 -24820 -13190 25845 8625 -24646 2386 37320 7870 -28503 -3909 24580 629
1511 629 -17134 11739 22029 -13684 -25230 10846 21841 -14226 -24356 11634 19551 -18508
1523 -18508 -27913 6482 13873 -16526 -19009 10123 6176 -22993 -19689 7590 6096 -15569 -9857
1536 -9857 8858 -2880 -24482 -8464 19394 7829 -18349 -8532 11765 382 -12986 5838
1548 5838 20545 932 -15578 2949 19508 4417 -8339 8933 21503 1193 -11515 10022
1560 10022 23089 2457 -9286 9755 20104 1772 -7396 7192 12564 -1697 -3482 11464
1572 11464 9900 -10629 -12152 8598 10167 -9111 -9149 7418 258 -19840 -10835 11881 5166 -18278
1586 -18278 -16548 2058 -942 -16392 -8187 8616 -2693 -23449 -11764 9967 629 -16708 -5483
1599 -5483 7869 -5223 -15572 826 12218 -3385 -12981 3769 12620 -3388 -10054 8920 13773
1612 13773 -5361 -6885 15469 15193 -9223 -8258 16199 17103 -3922 -4089 12745 8992 -7596 -1543
1626 -1543 17654 10897 -10337 -6135 10944 5742 -7012 2351 11435 -4289 -15287 770 12995
1639 12995 -1181 -12111 -724 5698 -7665 -11879 5810 10382 -9554 -16441 3256 10141 -6601
1652 -6601 -10060 5836 6416 -9147 -7028 9141 8260 -6319 -5373 8070 7423 -3324 519 10169
1666 10169 3755 -5425 4692 15137 4057 -6369 3613 12322 3352 -2521 7586 10540 -2078
1679 -2078 -7389 6034 13637 1378 -7859 701 6021 -2662 -4736 5530 4380 -8284 -9303 1052
1693 1052 2748 -4489 -4757 -1665 -4565 -9681 -4334 3970 -2163 -11647 -6823 2133 -2340 -8390 -1243
1708 -1243 3493 -5477 -9606 -64 7011 -36 -6818 -2090 4328 1782 -1235 3081 5054 -1506 -2437
1723 -2437 5649 7898 2168 931 3714 2269 440 4930 7984 2146 -3644 -606 5358 3735 -857
1738 -857 -99 2130 -2297 -5783 104 4072 -1834 -8135 -5528 -2322 -2797 -4201 -4543 -6146 -7584 -7083
1754 -7083 -4543 -3280 -5403 -7340 -6836 -7115 -6291 -2076 -1318 -6723 -8502 -3393 207 -1560 -2285 -1209
1770 -1209 -1531 -1826 -67 3348 4414 2013 -232 1446 4925 6438 6920 5081 1718 3022 8372 8357
1786 8357 5229 5885 6944 4189 2428 7132 9964 6013 1004 1412 5155 5902 3745 3140 2218 -739
1802 -739 -848 3460 3224 -1699 -2341 -547 -2821 -3848 888 1788 -4719 -7850 -3066 1282 -1637 -5255
1818 -5255 -2833 -939 -4820 -5699 1378 3474 -3724 -6631 -1066 1438 -128 607 1687 -1809 -3098
1833 -3098 1901 5904 2160 -1600 1615 4777 530 -892 6693 8122 -1311 -4922 4571 8470 1476
1848 1476 -1097 2837 1695 -2501 629 5450 1837 -5168 -3383 2610 -57 -3717 -370 1457 -5994
1863 -5994 -8368 1061 3070 -6016 -7766 -267 -1059 -8008 -3958 5085 440 -10611 -7390 4562 3625
1878 3625 -5435 -3619 3191 -417 -4726 2547 7012 -1205 -4541 4899 6432 -2031 -87 9871 6574
1893 6574 -5339 -2024 11955 10115 -3430 -2985 8574 5976 -3060 2743 10874 597 -8639 1768
1907 1768 10660 576 -7165 1474 4808 -5846 -8189 4337 6340 -7692 -10821 658 1289 -9842
1921 -9842 -5780 5618 -3846 -17444 -6635 9237 -1588 -16274 -6726 6787 -2648 -13256 -2872
1934 -2872 6726 -3396 -11036 1391 7674 -4592 -7908 5795 6059 -7136 -2476 13748 7396 -10525
1948 -10525 -4460 13971 10447 -3586 604 10958 2687 -7005 5202 17477 4037 -8488 2513
1961 2513 11370 -1031 -6101 9087 11826 -5783 -11140 3298 8442 -2562 -5263 3468 258 -10317
1975 -10317 -5340 6553 -451 -13085 -4678 7802 -3134 -15865 -5426 6765 -1687 -11289 -3100
1988 -3100 4234 -4448 -10901 -2159 5607 -360 -4031 1750 68 -8317 -2359 11302 8897 -4115
2002 -4115 -4651 3980 3597 466 6547 10789 3332 -3760 765 7437 5954 3774 8168 7191 -1695 -3983
2018 -3983 5578 10130 4158 48 1560 1965 556 921 708 517 2220 3339 -665 -5189 -3856 1279
2034 1279 2058 -1143 -1490 -497 -3324 -6055 -3229 673 758 1109 -271 -6857 -9568 -225 7694 3517
2050 3517 -3789 -3290 -706 -3523 -2561 6292 8907 -1631 -6588 1871 4688 -2016 214 10801 6495
2065 6495 -7986 -5916 8216 7017 -3461 -652 7553 1575 -7366 -624 6747 -1549 -7456 4158
2079 4158 8772 -7907 -15110 2443 9288 -7501 -11369 4732 4769 -14732 -15214 5147 7288 -9831
2093 -9831 -10710 1845 -3092 -16203 -4853 12783 1576 -18040 -7607 8954 -1633 -13129 2991
2106 2991 13719 -4441 -15546 3244 13988 -3031 -9514 9670 13691 -7835 -9613 14153 15728
2119 15728 -8264 -7177 17154 14456 -9624 -6282 15144 10273 -7282 941 16630 3323 -13957
2132 -13957 776 17832 2972 -11987 3480 13322 -7921 -16793 7571 17792 -7093 -17399
2144 -17399 2663 9028 -10543 -11389 9212 7759 -15741 -14745 8432 6290 -14215 -8796 10624
2157 10624 2192 -16644 -5821 12735 1199 -14186 -1049 13329 -737 -12676 2516 12837
2169 12837 -2495 -10126 8996 15795 -5728 -12209 9638 16924 -2270 -6794 10943 10541 -7369
2182 -7369 -5072 13918 12568 -5755 -5059 8919 5419 -6775 1188 13382 2295 -12622 -2672
2195 -2672 10879 1016 -9829 390 7931 -4720 -12117 835 8313 -4927 -11960 419 6130
2208 6130 -6730 -11497 1450 5045 -7051 -8716 3260 4269 -8039 -8054 3618 4844 -3822 -3433
2222 -3433 3495 883 -6247 -750 8962 4497 -5738 -2160 6732 2951 -2986 3838 9933 1214 -6618
2237 -6618 666 9950 4742 -3176 815 5653 128 -4349 2775 7460 -309 -6270 419 4016 -2099
2252 -2099 -4499 935 1657 -4538 -5139 1303 1490 -5686 -6326 784 1700 -5617 -5567 1027 -236 -7242 -4374
2269 -4374 4547 2190 -6809 -6302 2111 2935 -2631 -1896 4057 1662 -5611 -1361 7225 4916 -2432 -109
2285 -109 4583 1351 -984 4548 8068 880 -3473 2847 7696 2009 -2344 3616 6211 -1755 -3668
2300 -3668 4747 6517 -3549 -5354 2930 4598 -3319 -5235 1190 751 -5862 -4688 1802 342 -7454
2315 -7454 -6943 116 -677 -6105 -3584 475 -4706 -8893 -1829 3703 -1774 -7289 -2621 1590 -2549
2330 -2549 -4819 1938 4964 -2443 -6381 1670 6674 842 -1995 3613 4879 -1121 -101 6517 6487
2345 6487 401 30 5475 5599 1340 2412 6666 3679 -1525 2585 7632 3036 -2843 1557 6042
2360 6042 1644 -2181 1966 3790 -1201 -4394 724 4198 -663 -5339 -2008 1259 -2311 -3199 470
2375 470 215 -5197 -4953 186 840 -2763 -2819 -1110 -2188 -3607 -659 3107 597 -4273 -2383 3230
2391 3230 1723 -1394 1137 3654 204 -1953 2186 5708 2479 -625 1380 3752 2612 1240 3321
2406 3321 3486 406 -114 3773 4066 354 212 2069 680 -918 821 2687 -686 -3886 -1760 1437
2422 1437 138 -2822 -2696 -1293 -2588 -4253 -1048 545 -2699 -5663 -3521 -1477 -1911 -1958 -1805 -3177
2438 -3177 -3846 -2224 -607 -633 -1718 -1850 -866 -1168 -1288 1083 2384 -132 -1639 973 3027 2127 898
2455 898 1822 1654 1375 2081 3092 2668 1356 541 1879 2358 1846 2463 1849 -823 -765 2130 2496 -397
2473 -397 -1201 144 -860 -2192 -382 1218 -1141 -4185 -3343 -693 -584 -2556 -2378 -2148 -3362 -3387 -527
2490 -527 -322 -3219 -3342 -1251 -1578 -2715 -438 1304 -1314 -3914 -943 2811 1571 -1115 56 2416
2506 2416 941 339 3293 4541 1266 -317 3022 4443 2130 2516 3845 2320 157 2373 5668
2521 5668 3399 21 748 3403 1651 -503 2266 3699 -936 -3829 916 3466 -720 -3521 -952
2536 -952 26 -2882 -2527 408 -526 -4228 -3888 -892 -836 -3715 -2351 -199 -3853 -5693 -597 2744 -2291
2553 -2291 -5178 -894 1514 -1909 -2314 1937 1861 -2672 -2400 3426 3789 -292 -645 3344 2128 -526
2569 -526 2356 5809 1669 -1591 2051 5276 1635 526 3888 3895 -853 -1063 4900 4823 -2258 -2724 2778
2586 2778 2999 -2457 -1570 2954 281 -4949 -2061 2881 -362 -4160 -2013 81 -3212 -4023 814 1574
2602 1574 -4758 -6288 410 1869 -3635 -3874 1783 524 -5042 -2406 4260 1804 -4363 -1743 4013
2617 4013 1152 -2529 1313 5351 574 -3112 2519 6311 1227 -1889 3161 4515 -472 79 5509
2632 5509 3597 -2999 -994 5871 3561 -2665 -1142 4048 912 -4445 -431 4989 -213 -6176 -2245
2647 -2245 2739 -1554 -3833 233 392 -5384 -5942 840 1580 -4217 -5124 -386 -667 -5184 -2991 2385
2663 2385 -489 -6145 -3070 2947 196 -4151 -500 3153 -620 -3642 1981 4881 -80 -2556 1902
2678 1902 4814 1451 -70 3058 3249 -366 634 5454 3692 -1265 201 3712 1960 -545 2547
2693 2547 4858 57 -3381 263 4426 1330 -1835 -323 710 -1984 -2530 1053 1053 -3037 -3380 -875
2709 -875 -1303 -2604 -1653 -595 -2656 -4014 -1229 50 -1934 -3179 -1138 -28 -1980 -1534 902 449
2725 449 -2309 -1532 2118 2231 92 131 868 375 1532 3239 2966 719 487 2178 2523 1489 2974
2742 2974 4225 1737 -1351 1055 4758 2884 -584 1460 2236 -490 -634 2624 2419 -1449 -2054 704
2758 704 784 -1975 -1986 394 -1166 -4288 -1667 1463 -1645 -5211 -1738 1116 -2605 -4469 -30 990
2774 990 -4216 -5079 773 2899 -2809 -4526 275 1293 -2727 -879 3929 1846 -3627 -1658 4516
2789 4516 2253 -1421 1642 4720 -108 -2949 2900 6813 780 -3104 2561 5475 -109 -2571 3816
2804 3816 5043 -2234 -3265 4162 4219 -2791 -3064 2947 2001 -3728 -1756 3408 -320 -6324 -2457 3511
2820 3511 -172 -5856 -2180 1647 -3686 -6344 970 4341 -4060 -7624 -384 2938 -2627 -4084 2231
2835 2231 2199 -4950 -4544 3351 4387 -2677 -2423 3625 2213 -2960 420 5900 2153 -3019 1664 6243
2851 6243 1702 -2347 2239 6191 1189 -2390 3350 5381 -1183 -3453 3678 6164 -708 -3376 2063
2866 2063 2203 -3144 -1911 3824 2328 -4288 -4511 584 653 -2995 -1422 1245 -2197 -6945 -2505 2963
2882 2963 -485 -4900 -1640 678 -3421 -4682 1097 2980 -2201 -4675 25 2290 -1153 -2549 1946
2897 1946 3093 -918 -1614 2421 2882 -890 -190 3446 3295 95 382 2669 2031 67 2400 4541
2913 4541 1770 -2169 -27 3298 2397 -289 1382 1894 -1358 -3004 872 3470 918 -2627 -2556 -355
2929 -355 -1183 -1784 269 1259 -2415 -4283 -2023 366 -1555 -2078 -949 -1470 -3035 -2146 285 152 -2390
2946 -2390 -2107 276 654 -1616 -1046 1505 1368 -1171 -21 2781 1536 -1263 192 3175 2868 872
2962 872 391 1678 1680 413 1782 3787 1803 -762 275 2372 1697 989 2295 1261 -1265 -1911 1132
2979 1132 3132 294 -1670 -784 -424 -2243 -1780 1589 1076 -3221 -4464 -759 164 -1807 -2145 -542
2995 -542 -1231 -3199 -2560 240 -198 -2032 -2008 124 -330 -1943 -503 1510 -521 -1350 987 1887 -105
3012 -105 -1065 1429 2962 1373 -135 1433 2341 176 -180 2866 4263 1027 -954 730 1788 1118
3028 1118 1632 2844 1133 -1441 -1366 1560 1701 427 -416 54 -1262 -2912 -288 1985 -360 -3388
3044 -3388 -2058 -500 -1524 -2132 -535 19 -2415 -3611 -1405 31 -1372 -2431 -1005 218 -1172
3059 -1172 -1935 -288 367 -1110 -481 1625 878 -795 18 1316 1031 931 1772 2412 746 -885 770
3076 770 3692 2827 641 1247 1880 589 90 2717 3503 1171 -798 -160 1136 1152 753 774 131 -1528
3094 -1528 -1500 349 714 -1024 -1302 -474 -1753 -2390 -912 -91 -1436 -3083 -1981 -288 -1146 -2414 -1687
3111 -1687 -522 -909 -1851 -296 314 -1440 -1760 232 791 116 356 377 -570 -248 1212 2379 1250 602
3129 602 691 1439 1629 1274 2506 2579 -54 -492 1741 2555 1696 408 1025 740 -29 762 1401 762 -634
3148 -634 -616 -194 -73 -12 -457 -484 -1969 -1899 -222 -4 -2077 -2361 -1302 -1032 -1978 -1490 -479 -1320 -2673
3167 -2673 -1907 -121 -192 -1345 -1051 -810 -709 -734 692 1299 -862 -938 614 931 154 1238 2073 655
3185 655 -614 1044 3194 2400 241 364 1863 1800 567 1752 2639 534 -964 848 1947 553
3201 553 164 832 52 -1174 -59 1365 93 -2394 -1498 338 -462 -1769 -1036 20 -2184 -3372 -897
3218 -897 448 -1314 -2978 -1552 -465 -1612 -1747 299 -58 -2171 -1787 559 1020 -606 -295 899
3234 899 -191 -1074 1114 2864 415 -1424 1167 2689 1189 366 2039 2243 -50 17 2346 3363
3250 3363 687 -281 1487 1795 287 990 1863 -15 -1732 167 1987 -93 -1066 -51 164 -1676
3266 -1676 -2045 531 832 -2189 -3041 -281 471 -2081 -2253 -38 -839 -3307 -2051 852 -97 -2386 -1629
3283 -1629 8 -819 -1087 544 1242 -1347 -1767 1273 2505 -358 -822 1680 1644 -1023 593 3697 2376
3300 2376 -1135 -100 2981 2440 454 1102 2458 866 -631 980 3132 759 -1274 387 1397
3315 1397 -552 -558 1864 683 -2399 -1598 1565 710 -2181 -1904 344 -764 -2916 -1196 1070 -867
3331 -867 -3757 -1562 768 -581 -2334 -411 315 -2192 -1755 999 1145 -1371 -1503 643 646 -604 327
3348 327 2601 657 -1718 555 3610 2023 -1058 750 2540 666 -192 2163 3006 622 -844 1046
3364 1046 2251 733 67 1145 998 -1098 159 2122 704 -1884 -713 1033 47 -1813 -154 587
3380 587 -1729 -2885 -575 1075 -1035 -2913 -1689 -658 -1744 -1891 81 -20 -2375 -2151 153 231
3396 231 -665 -435 372 -1033 -1242 315 1965 269 -821 385 1858 617 -74 1759 1705 61 -236
3413 -236 2122 2479 579 189 1484 1218 1078 1585 1848 497 -526 622 1280 776 -226 388 -249 -1520
3431 -1520 -938 1504 701 -1777 -1875 -336 -903 -1732 -778 -157 -1233 -2124 -1561 -142 -615 -1279 -902 -498
3449 -498 -1381 -1115 368 -440 -1673 -671 1188 290 -740 -99 978 55 -568 1218 2214 895 -833
3466 -833 627 2122 1552 987 1725 1572 -537 -180 2055 2583 611 467 1034 -230 -712 1196 2404
3483 2404 502 -1781 -784 862 -52 -1542 -54 739 -1797 -2391 -217 662 -1741 -2019 -580 -432 -1965
3500 -1965 -1638 -482 -747 -2226 -1450 310 -406 -2417 -1012 1215 -72 -1244 716 1393 -854 -2102
3516 -2102 1079 2879 858 -301 868 1390 -6 491 2822 2951 -151 -728 1575 1891 517 1438
3532 1438 2339 203 -1600 276 2141 1084 -457 191 891 -787 -1280 1021 1531 -1004 -2561 -448
3548 -448 539 -1566 -2242 -166 179 -1781 -1746 -508 -628 -2010 -1490 -124 -74 -1493 -1143 -177 -549 -1195
3566 -1195 357 1340 -657 -1947 -381 1373 339 179 1383 1334 -754 -813 1825 3304 1632 -548
3582 -548 574 1231 362 1233 2526 1948 -277 -544 846 1329 900 1091 786 -440 -1207 -211 958 51
3600 51 -845 -536 -19 -1093 -1379 -432 310 -1194 -1639 -844 -791 -1488 -1986 -857 -107 -353 -1213 -1480 -937 -1315
3620 -1315 -285 697 587 -658 -807 -498 -221 601 1803 1678 80 -937 -104 1586 1746 1267 1179 605
3638 605 43 126 1459 2928 1588 16 -150 304 906 959 1073 987 269 -417 -247 224 126 -115 -163 -294
3658 -294 -834 -996 -787 -964 -1462 -402 -331 -777 -1882 -1793 -1504 -343 -613 -1116 -683 -1040 -1765 -1317 814
3677 814 546 52 -1129 -1220 -410 518 1362 1297 894 -103 -294 529 1529 1743 1430 863 -169 107 1511
3696 1511 2161 1565 635 1073 879 376 761 900 1087 659 -331 348 932 -226 -861 -319 245 151 -695 -525
3716 -525 -884 -1259 -837 -383 -234 -839 -1443 -1625 -1195 -784 -81 414 -1088 -2365 -1481 366 -129 -643 -443
3735 -443 28 -875 -816 473 1567 1011 -581 -332 573 1091 591 1195 1156 248 347 1532 1236 1139 870 1059
3755 1059 513 494 1176 1378 694 -714 361 1510 955 -738 -518 484 -296 -758 182 261 -755 -1678
3773 -1678 -1221 329 -268 -794 -1004 -1076 -1535 -1061 -29 -260 -1700 -1442 -481 -628 -789 29 404 -1020 -1488
3792 -1488 -244 1118 670 -403 -8 525 87 -33 968 1396 546 -94 1063 1253 979 1223 1390 365
3810 365 71 1299 1339 715 -566 238 827 485 269 625 682 -797 -1152 483 1057 -365 -1354 -731 -302
3829 -302 -1215 -522 -90 -701 -1736 -1110 -342 -573 -1140 -648 -699 -1663 -1346 130 737 -1163 -1556 33 357
3848 357 -514 -259 467 473 -618 5 1153 1285 251 248 575 742 460 1436 1437 261 -3 1222 1608 439
3868 439 301 1403 365 -620 236 1559 1091 -633 -984 404 589 -480 -301 493 -504 -1741 -576
3885 -576 395 -596 -1123 -663 -814 -1426 -994 267 -538 -1981 -1424 347 110 -1142 -950 508 -493 -1475
3903 -1475 291 1492 126 -1560 -291 795 467 46 759 881 -32 -297 1407 1758 616 667 880
3920 880 906 82 1333 2135 758 -1001 604 1966 481 -534 434 890 -574 -773 710 1371 -525
3937 -525 -1537 -248 330 -919 -579 171 -581 -2166 -1048 352 -595 -1463 -770 -198 -1287 -1343 217 796
3955 796 -1124 -2325 -362 658 -530 -836 441 801 -936 -394 1488 868 -706 -169 1106 718 450
3972 450 1328 1780 311 -640 1199 2071 268 -367 1148 1259 -447 -157 1850 1229 -829 -761 1240 830
3990 830 -542 -689 211 -332 -1357 -333 987 -398 -1863 -1185 272 -953 -1234 182 -33 -2386 -1687
4007 -1687 340 311 -1504 -1529 -120 -78 -1369 -570 1181 108 -1607 -428 1209 506 -576 474 809
4024 809 -24 -308 1534 1478 -118 -323 1297 1338 289 728 2080 864 -891 496 2283 1392 -763
4041 -763 -290 987 129 -748 426 1000 -582 -1251 162 530 -226 -830 -241 -574 -1439 -880 509 -134
4059 -134 -1889 -1156 319 -617 -1564 -580 459 -790 -1848 -332 1065 -41 -1368 -517 850 -125 -211
4076 -211 934 958 -777 -216 1116 1059 242 597 897 4 -138 1444 2366 539 -471 410 1747 749
4094 749 75 1062 1877 -369 -796 1026 1039 -362 -761 136 120 -566 -141 281 -555 -1371 -761 479 -195
4113 -195 -1341 -816 -289 -1208 -1730 222 589 -1428 -1801 -437 310 -559 -685 -91 24 -1213 -306 871
4131 871 923 -263 -476 332 462 79 1045 1453 -25 -515 766 1422 484 135 1132 962 -297 433 1250
4150 1250 1416 -86 -603 1045 832 -57 -111 418 -289 -683 -20 763 -163 -1052 -576 -322 -733 -736 -219 -409
4170 -409 -1584 -1343 255 173 -1082 -1339 -510 -850 -984 -585 481 -135 -1462 -1164 195 558 -103 135
4188 135 -103 99 -165 560 1454 578 -13 646 783 612 724 1156 860 -72 613 1373 865 -20 395 823
4208 823 424 -61 91 841 186 -431 -54 285 114 -159 -560 -667 -638 -169 274 -409 -1001 -964 -485 -513 -565
4229 -565 -233 -133 -981 -1492 -797 414 59 -650 -506 -752 -431 63 440 123 66 -287 -109 534 892 582
4249 582 784 231 -162 854 1363 642 441 892 923 550 504 1020 509 5 259 468 931 298 -358 -101
4269 -101 43 160 97 -103 -166 -899 -287 -279 -493 -2 -45 -1065 -1592 -696 162 -246 -1010 -1168 -997 -524 -464 -606
4291 -606 -150 -372 -915 -787 108 98 -111 64 -153 -206 267 762 662 128 476 883 608 608 615 839 908 76
4313 76 762 1157 649 48 195 1079 701 629 610 202 -199 -232 145 731 -9 -610 -790 -538 -477 137 673 -254
4335 -254 -1294 -1125 -179 -287 -692 -571 -355 -917 -1245 -972 351 -33 -975 -837 -439 -413 -548 268 298 -283
4355 -283 -264 463 92 24 492 657 436 12 527 1019 720 -200 271 1671 1047 1 95 896 455 327
4375 327 1450 1334 181 -762 -348 386 679 586 178 -381 -850 -599 593 77 -319 -599 -424 -904 -1334
4394 -1334 184 575 -692 -1366 -1157 -305 -153 -638 -395 -200 -319 -955 -108 144 50 -346 335 557 80
4413 80 -157 344 220 130 1151 1244 587 35 -85 730 1042 486 589 1067 -32 -58 580 1635 884 147
4433 147 47 -162 -204 274 633 442 176 -589 -303 -309 23 -200 -7 -873 -928 -234 106 -784 -1038 -501 -276
4454 -276 -821 -741 -363 -404 -580 -488 -118 -213 -310 -429 -583 -130 220 384 103 -569 -458 374 516 531 969 821
4476 821 -11 -324 567 1146 1209 151 60 618 679 629 869 957 93 -91 70 285 155 233 345 -374 -627 82
4498 82 305 -407 -918 -277 319 -428 -869 -504 -133 -761 -1452 -314 121 -930 -911 -656 -408 -594 -339 247
4518 247 -493 -1231 -45 498 156 -146 52 213 -43 -235 693 1723 -124 -101 551 1002 609 517 849 722
4538 722 313 39 992 1292 -100 -147 400 562 39 268 920 -425 -792 171 1016 -445 -680 353 208
4557 208 -810 -1000 288 438 -1108 -968 -522 128 -613 -840 -111 -427 -1196 -445 426 -159 -914 -250 -138
4576 -138 -565 -243 687 519 -747 -460 644 946 -140 -58 822 691 -557 79 1466 1101 -401 -93
4594 -93 1168 947 301 456 673 138 -176 329 1348 128 -374 152 257 -415 -107 849 161 -1211 -627
4613 -627 703 55 -1067 -561 96 -566 -1279 -570 217 -481 -1654 -414 194 -436 -645 -27 160 -894
4631 -894 -597 705 60 -603 -337 670 277 -390 253 1264 60 -789 363 1409 769 -238 539 1132
4649 1132 427 275 1340 1061 197 204 685 939 434 -74 453 326 -397 16 879 235 -913 -487 692
4668 692 -537 -731 238 55 -1100 -885 -33 309 -572 -772 -488 -209 -726 -277 365 -151 -1213 -549 362
4687 362 -74 -473 73 240 -809 -481 783 977 -76 -611 256 787 20 224 831 852 -26 -77 1168
4706 1168 1071 260 702 464 303 29 626 609 176 -309 512 357 -158 -189 331 -71 -568 -905 466 322
4726 322 -1031 -959 -143 -201 -602 -586 161 -443 -1184 -495 108 -345 -784 -332 -262 -696 -427 237 164 -673 -875
4747 -875 570 424 -256 -103 517 215 -343 287 1286 702 -242 422 751 597 434 785 725 185 -18 928
4767 928 794 41 42 477 -150 -742 300 872 103 -835 -385 702 -31 -727 -98 228 -632 -961 -150 645
4787 645 -242 -1000 -368 -365 -708 -357 27 -503 -1161 -422 80 -51 -1002 -328 480 -173 -694 405 716 -285
4807 -285 -447 742 985 375 -236 923 726 120 -56 1060 1163 109 -53 526 765 -265 382 982
4825 982 67 -368 128 900 239 -395 11 185 208 -576 -19 246 -185 -1346 -229 216 -342 -867 -418 -261
4845 -261 -776 -727 -57 -327 -837 -859 -111 291 -604 -434 78 -428 -623 20 784 137 -493 -75 616 380 6
4866 6 496 919 230 -114 493 1212 594 275 543 672 8 148 816 526 278 60 561 252 -133 405 187
4887 187 -68 -627 27 579 -87 -695 -600 42 83 -481 -633 101 -417 -671 -535 -238 -322 -784 -600 -673 -296
4908 -296 -400 -29 -89 -502 -142 -37 126 -118 -215 56 274 -140 395 435 62 -75 -6 936 787 462 19
4929 19 400 416 60 323 780 664 -61 -164 -78 804 527 264 168 -126 -466 79 307 7 -77 -469 -321 -502
4951 -502 -755 234 71 -462 -632 -572 -367 -692 -1102 -442 73 -539 -751 -446 -169 -622 -394 352 494 -207
4971 -207 -554 -299 77 350 480 205 122 -69 -425 549 923 646 444 702 -46 -116 420 1283 937 69 24
4992 24 393 623 -60 343 639 467 -730 -153 291 -68 -167 -59 372 -537 -891 -208 -154 -492 -605 25 -305
5013 -305 -969 -919 -248 39 -550 -379 114 -241 -964 -522 559 738 -271 -1 114 105 -269 92 1170 426
5033 426 -755 -127 484 400 393 634 740 -56 -352 412 760 317 275 664 680 -515 50 778 648 -359 -168
5054 -168 582 260 -736 -426 432 263 -713 -443 397 -472 -871 -176 303 -444 -504 -371 -536 -444 -885 22 486
5075 486 -934 -835 -298 31 -631 -191 473 219 -784 -675 480 477 206 -115 170 532 -329 87 886 553
5095 553 -87 306 606 391 -81 456 512 697 504 483 51 -370 272 284 610 13 -458 126 -140 -410 -260
5116 -260 26 92 -656 -492 -107 -497 -498 -373 -125 -439 -387 -377 -400 10 -352 -33 -197 -604 -301 -47 32 -260
5138 -260 -337 -122 68 164 -119 341 218 458 273 350 581 14 284 336 659 447 169 508 261 432 84
5159 84 361 478 436 299 186 128 396 348 -185 -138 274 -62 -222 -91 -133 64 -503 -202 -228 -390 -300 -172 -348
5182 -348 -527 -259 -22 -164 -350 -454 26 -370 -267 -59 99 -348 -295 -114 378 10 -292 320 144 251
5202 251 42 623 186 -41 -53 595 541 -6 282 486 447 -59 819 673 236 -42 9 509 178 -436 348
5223 348 217 -499 -272 -19 486 -275 -400 -71 86 -661 -245 -168 -595 -839 -353 124 -307 -415 -179 346
5243 346 -638 -715 -338 21 -634 -611 -157 594 -59 -320 139 346 -241 6 348 236 221 207 513 165 400
5264 400 308 853 241 -6 785 699 270 -13 301 626 147 -257 381 324 75 -291 171 333 -147 -515 163
5285 163 -440 -665 -416 11 -279 -659 -220 -306 -224 -580 -202 -34 -753 -621 -348 84 -250 -417 334 -118 -304
5306 -304 -208 -74 263 -236 -114 346 441 -138 -43 308 184 28 559 578 -180 115 850 834 276 66 581 625
5328 625 81 77 643 105 -180 18 358 307 -25 -86 225 -333 -237 -24 -4 -23 -383 -218 -349 -223 -256 95 -193
5351 -193 -974 -283 121 -197 -375 -291 102 -34 -551 131 263 -342 -317 188 339 188 272 254 83 -153 -131 212
5373 212 176 65 -79 483 409 263 772 347 260 -89 288 578 680 152 248 84 290 -236 474 -60 -550
5394 -550 -308 -34 171 36 -55 -308 -562 -359 -204 42 -216 -591 -492 -480 -300 -383 -156 -202 -442 -477 -110 30
5416 30 -212 -195 -149 -107 -46 96 74 168 -89 -46 147 270 101 412 217 -68 325 611 298 158 31 347 391
5439 391 6 290 588 371 -185 219 702 17 -130 -99 247 -59 -147 -139 -176 -426 -289 -178 191 -155 -475 -186
5461 -186 91 -451 -445 76 -312 -572 -184 -217 -231 -226 -187 -106 -251 -373 -65 172 233 47 246 219 -71 302 295 587
5485 587 2 233 397 380 244 728 242 256 0 639 510 265 41 250 419 -50 -176 526 202 -278 -487
5506 -487 8 67 -174 -544 -140 -41 -509 -167 -106 -165 -345 -518 -153 -235 -497 -221 -120 -262 -570 306 524 -196
5528 -196 -533 -67 -191 -53 -283 195 -61 -228 45 472 469 -65 -89 111 362 221 449 502 307 -50 323
5549 323 538 451 319 103 445 548 122 157 579 -127 -411 52 386 -372 -238 -517 -200 -315 -124 -99 -140
5570 -140 -658 -546 -309 58 -352 -273 -121 -554 -570 -334 163 -183 -517 -517 4 -404 -279 135 133 -114 -107 -5 498
5593 498 64 -115 71 -67 149 332 417 209 110 363 192 182 -71 -123 343 -18 -85 119 629 577 -319 -318 135
5616 135 54 0 -331 -76 -148 -440 -121 -5 -128 -395 -522 -318 -136 -306 -297 -409 -418 -549 -341 182 -292 -476
5638 -476 -266 -166 -162 -71 87 86 -290 -225 39 207 202 48 331 287 232 255 589 400 -1 -100 549 550 697 146 44
5663 44 -50 -36 315 399 349 23 -43 39 188 -262 40 386 -431 -390 262 147 25 -278 -91 -289 -277 -431 -329
5686 -329 -245 -408 -626 -107 144 -301 -371 70 -136 -233 79 -93 -92 -502 -235 36 213 -42 176 92 141 -202
5708 -202 252 595 326 -6 -253 554 326 287 680 435 194 -160 233 794 252 40 208 141 -91 -112 141
5729 141 48 -544 -219 148 31 -282 -313 54 70 -392 -471 -128 -282 -574 -327 197 -260 -467 -81 -73 -503 -343
5751 -343 -132 -40 -360 -362 -60 9 -46 -188 133 24 60 44 547 168 184 186 397 4 93 209 406 468 -150 -19
5775 -19 254 613 115 87 153 -235 66 336 417 -272 98 345 70 138 125 -259 -399 -602 -268 30 -216 -435
5797 -435 -100 91 -238 -124 -64 289 -144 -448 -393 108 65 -401 -269 165 -3 -29 9 332 -228 -235 -4 85 138
5820 138 438 425 151 46 511 386 333 -8 22 314 391 207 257 303 -186 22 -73 164 292 141 -237 -429
5842 -429 8 156 105 7 6 -175 -118 -233 -296 32 -506 -239 -306 201 66 -206 -403 -334 -569 -116 89 52 -283
5865 -283 -56 -177 274 67 -140 -80 -222 48 -69 142 101 104 -5 -13 306 397 262 14 290 262 251 517 333
5888 333 20 183 122 208 413 174 -21 -53 33 186 -64 30 581 -245 -228 -182 -98 11 -222 -264 -241 -406 -125
5911 -125 -197 7 -396 -344 -383 -162 26 -414 -33 -67 -379 -95 109 443 -326 -297 -6 159 325 31 348 -180
5933 -180 101 214 235 195 78 122 -21 122 156 238 262 95 -253 49 590 309 -10 5 -105 20 202 347
5955 347 228 -298 -273 48 145 -74 259 125 -339 -512 -164 176 -182 -419 -597 -416 -171 -332 -24 -124 -476
5976 -476 -528 -63 42 78 53 153 123 -189 242 384 145 148 103 255 589 450 296 48 -10 241 162 397 371
5999 371 377 192 387 -2 181 216 -51 -224 380 125 378 77 33 79 -362 24 132 243 -274 -356 -137 -90
6021 -90 -355 -239 -648 -466 -151 -116 -109 218 -135 -582 -488 264 83 -41 -71 -54 -355 164 342 -76 -6 -100 -193
6044 -193 -379 269 358 385 -5 -181 257 546 403 -10 146 -100 136 227 403 380 178 -124 -120 194 -32 220
6066 220 -20 -311 -344 43 372 -32 -386 -425 221 -103 -119 -104 -137 -97 -286 30 -81 32 -307 -400 -373 -32 263
6089 263 -99 -314 -174 29 -223 148 60 392 61 -241 163 566 257 383 -28 188 416 122 365 78
6109 78 -51 -163 152 163 654 286 389 136 -253 -47 270 -93 -306 -186 -218 -123 4 -5 -14 -520 -235 -173 6
6132 6 115 -125 -407 -175 -256 74 -45 -320 -170 239 -10 -141 -73 -101 -476 -374 -63 -27 163 131 -48 -187
6154 -187 -52 208 111 252 281 -226 -57 284 161 409 80 -99 273 749 523 30 -145 0 336 -204 164
6175 164 -140 214 -285 -161 146 272 170 -317 -349 -210 -295 115 87 -232 -197 -556 -279 -103 18 -128 8
6196 8 -436 -535 -144 31 -71 -359 -167 59 146 -57 -178 472 -150 -71 -144 136 173 -148 -303 149 277 200 157
6219 157 153 45 198 284 511 -44 -214 136 304 359 224 357 175 -395 -132 146 303 170 -60 -319 -530
6240 -530 -571 -54 400 276 -411 -235 138 -198 -196 -105 -484 -94 -392 -87 -15 -87 -322 -203 39 90 73 44 239
6263 239 -376 -342 159 581 -80 -86 113 126 -107 175 356 357 -132 -70 442 391 665 -99 -5 -4 -19 311 403 -53
6287 -53 -384 -156 0 -51 -431 249 23 -265 -529 -41 293 9 -343 -702 28 -380 -141 -161 -452 -438 -578
6308 -578 -107 285 297 -275 -266 55 12 -96 177 -34 -78 -179 244 163 -7 -112 159 -416 -226 618 542 311
6330 311 -222 -41 281 362 321 220 73 -223 -9 566 618 133 -342 -182 169 -25 342 10 -250 -225 54
6351 54 30 109 -155 -432 -96 -77 -202 53 8 -243 -376 -52 399 430 -161 -120 -141 -222 -131 -157 239 -590 -407 -10
6375 -10 279 313 177 -42 326 -327 -122 408 225 197 -205 104 304 420 29 636 436 -216 -227 297 689
6396 689 -161 -275 163 26 245 39 232 420 -431 -159 97 69 -606 -161 114 -51 -125 -79 230 -200 -694
6417 -694 -254 141 -237 -270 48 -105 -763 -308 587 359 -291 -673 60 123 -38 21 14 91 -681 -333 782 208
6439 208 -409 -131 -74 71 78 302 634 -401 -340 -13 556 139 -20 224 158 -192 -378 -15 521 -148 -709
6460 -709 191 34 -63 21 74 -221 -500 -196 -63 -31 -341 -518 -21 -340 31 136 200 -328 -487 -306 304 387
6482 387 -272 -61 -52 -134 -424 183 344 -349 -685 181 496 83 174 139 -125 167 66 500 389 -340 -192 232
6504 232 97 46 192 122 -65 -309 106 483 145 -245 -24 139 52 145 26 115 -164 -757 40 264 -51 -330
6526 -330 -474 -343 -275 -141 141 -54 -170 -209 -395 -124 56 -259 -352 -291 -18 258 650 135 -513 -156 44
6547 44 120 156 239 410 -219 -15 435 521 430 268 -392 96 383 241 620 280 -250 -24 68 357 61 -177
6569 -177 -222 -28 -141 -126 414 61 -116 -404 -41 106 11 -172 -428 -275 29 -75 -44 29 -291 -382 -220 322
6591 322 288 -277 -240 -150 -96 240 188 44 -364 -392 -113 318 237 158 246 -10 -276 114 858 412 -266 -325 355
6614 355 112 322 129 256 12 -421 276 359 156 -143 -162 -92 -179 25 237 291 -310 -117 -131 280 -100 -163
6636 -163 108 -376 -523 0 173 113 -617 -619 73 274 -318 -119 57 -144 -369 103 369 124 -270 -201 34
6657 34 -43 328 367 -26 -426 -280 -25 367 -327 138 199 7 -109 197 752 -187 -37 -325 447 398 75 18
6679 18 -126 -38 -597 236 372 -81 -350 -302 -321 -171 145 -87 -465 -435 -15 255 91 -257 -612 52 -497 -168
6701 -168 -11 352 -41 -598 -18 113 179 -237 -53 -220 -266 141 406 238 -59 -27 240 55 304 133 196
6722 196 12 -315 238 332 275 6 148 128 123 240 431 146 -123 -208 -140 485 323 287 -105 33 -228 -80 275
6745 275 -61 -577 14 -148 94 43 415 -155 -524 -107 -81 298 233 -191 -460 -108 274 -3 102 -43 -460
6766 -460 -272 50 280 250 355 -114 -149 193 579 245 10 -327 -68 143 -48 128 515 168 -272 -37 455
6787 455 476 214 -76 -159 95 456 113 70 -130 -342 -39 33 71 208 -190 -303 -419 -214 237 -115 -244 -74
6809 -74 -179 30 -109 -40 196 -303 -241 61 33 -173 110 -329 -164 15 217 378 -281 -463 -325 278 -43
6830 -43 396 158 90 -427 -97 -17 547 241 49 -36 151 133 47 281 202 -201 -126 118 269 81 191 -96 24
6853 24 13 -10 289 -191 -634 -323 72 -86 -9 -39 -101 -497 -490 91 343 -186 -280 -68 22 -79 -410 366 -405
6876 -405 -800 310 463 299 -80 -171 80 -169 136 534 439 -74 -370 372 466 367 438 152 426 -209 139
6897 139 582 704 -124 -148 298 228 215 78 434 104 -250 -205 359 211 -167 0 160 -101 -96 124 417 -353
6919 -353 -564 -272 145 -191 -260 -130 -402 -405 -108 26 -157 -176 -434 143 404 -191 -140 -316 -247 -215 -128 683 137
6942 137 -480 134 -111 277 157 217 523 3 -232 221 611 232 -57 250 96 -41 -90 421 195 -67 -105
6963 -105 -17 336 157 104 174 -240 -147 48 536 -48 -599 -417 139 -49 -216 202 -60 -433 -410 486 176 -331
6985 -331 -561 -553 36 -29 -238 341 291 -46 -394 113 375 11 112 17 -87 -57 11 454 -52 -426 -215 464
7007 464 133 63 -237 82 -72 -125 476 865 -41 -463 -182 236 463 -372 -140 -155 -285 -322 84 604 199
7028 199 -163 -654 -88 -80 86 -4 -225 -588 -155 362 -30 -193 -464 52 -190 -340 120 366 54 -241 -259
7049 -259 460 510 -244 -42 -299 361 -376 230 580 210 -539 -365 399 303 61 283 221 -413 -258 153 568
7070 568 11 -619 -137 271 -77 -25 120 453 -99 -628 289 661 -99 -371 -146 91 141 -156 -25 -133 -200
7091 -200 -305 266 81 -472 -587 -64 -186 57 538 525 -325 -662 79 604 365 -450 -49 598 -187 -495
7111 -495 363 568 -79 -580 110 613 95 61 344 232 -130 7 420 342 -294 -221 477 190 -588 67 574
7132 574 -60 -684 66 689 -110 -562 -159 25 -55 -322 353 491 -457 -701 -137 217 0 -56 49 91 -366
7153 -366 -387 432 359 -455 -397 131 287 -160 248 543 -23 -473 -106 616 37 -189 119 373 140 -353 357
7174 357 420 -246 -487 -103 688 280 -206 88 282 -317 -440 471 310 -273 -204 300 311 -26 -197 511 -215
7195 -215 -620 -153 324 -13 -568 -500 129 47 -790 16 112 -210 -653 -164 613 127 -200 227 -230 -188 96
7216 96 289 387 -115 -76 365 302 60 31 210 -51 -202 134 533 566 -197 -317 337 277 169 -145 210 51
7238 51 -207 -3 568 266 -344 -254 -148 316 4 72 89 -395 -461 -11 200 355 -160 -109 84 -55 -79 175
7260 175 235 -404 -611 -235 103 21 -237 -39 -243 -20 118 378 191 -124 -451 -62 356 438 138 28 94
7281 94 -133 314 429 376 -220 -97 436 521 0 69 -86 -126 -386 168 760 461 -469 -531 260 174 -362 103
7303 103 436 -175 -471 -80 360 62 -96 -261 -219 -412 -120 220 121 -540 -168 -84 89 -83 -211 188 -213
7324 -213 -604 -66 403 234 -258 -248 453 198 -215 -274 379 -132 -490 122 528 170 -448 -23 157 -140 278
7345 278 291 238 -218 -453 473 333 128 -126 176 -91 -190 -16 84 70 -386 -193 170 133 -283 -169 -105 -432
7367 -432 -289 43 478 -159 -556 -230 130 168 -71 166 79 -606 -151 462 400 -261 -116 -226 -129 25 123 568
7389 568 -135 -411 -210 496 392 -9 27 151 -181 15 373 325 13 197 53 231 254 53 79 30 -507 -4
7411 -4 374 136 -174 -83 -165 -236 114 -16 -8 -69 -436 -291 284 327 -172 -64 -476 -219 -115 383 -105 -460 -219
7434 -219 29 135 -187 218 91 -141 -338 -267 549 514 -115 -71 -165 -34 1 77 303 -162 -29 34 294 354 218
7457 218 -57 -223 160 218 269 90 -318 245 -104 151 32 -52 25 -331 -318 -132 108 41 2 -331 -211 -47
7479 -47 241 -172 -127 -194 159 -76 113 -2 20 -131 -308 199 441 413 -268 -205 134 109 216 149 13 -99 -341
7502 -341 -173 -59 148 219 -656 -109 -94 123 387 73 16 -121 86 42 101 284 -8 -594 -571 -63 345 237
7524 237 -91 -126 141 184 -22 -10 -91 -373 -157 400 152 -115 -64 -218 -223 -255 355 71 14 -159 -67 208 253 -201
7548 -201 113 -279 -183 -142 334 358 -489 -366 88 -23 139 478 62 -155 -309 255 206 164 -41 194 -114 109
7570 109 23 128 479 -117 -406 187 511 380 -29 408 -35 177 -359 -90 305 -256 -420 -138 342 -12
7590 -12 66 194 -410 2 32 158 -77 -53 -243 -336 -218 -152 77 172 -79 -458 -123 375 -32 -380 -172 131
7612 131 -217 22 316 247 34 -290 -77 171 343 -10 -312 -93 -20 -18 463 282 -161 -367 322 17 53 84
7634 84 382 -380 -534 -81 153 124 -132 -339 198 -103 -166 199 310 -361 -218 24 64 78 -67 -153 -197 -166 -110
7657 -110 316 131 -452 -289 75 11 -292 64 363 -156 -316 107 682 -43 -437 162 177 303 -107 239 239
7678 239 -91 -395 399 450 20 175 58 -60 179 125 476 82 -306 -133 67 251 -422 -108 99 157 -349
7699 -349 259 315 95 -708 -420 197 100 38 -272 148 -252 -385 -269 574 94 -211 -166 340 64 -41 -62 67
7721 67 -182 -296 436 390 -65 -62 216 42 62 -307 455 379 76 -179 254 370 -207 -82 189 142 23 64 163
7744 163 -49 -284 -286 326 215 47 132 94 -24 -222 266 366 156 -590 -258 125 46 -280 -18 572 -310 -428
7766 -428 115 395 -201 -530 -96 10 -275 153 117 344 -324 -262 197 415 -4 -132 215 172 -24 204 785
7787 785 -18 -527 94 600 284 -156 -254 529 -27 -397 263 329 78 -537 -154 562 242 35 81 231 -629
7808 -629 -333 266 392 -258 -390 107 -187 -565 -416 441 -135 -755 -240 831 232 -473 -464 446 202 -664
7828 -664 261 507 -204 -716 -34 636 129 -284 43 220 -78 -206 359 504 -173 -356 128 234 -290 -32
7848 -32 461 184 -418 -96 687 543 -370 -399 415 309 -555 -454 841 224 -621 -288 600 241 -282 152
7868 152 108 -65 -365 103 374 -301 -241 38 121 -281 -584 -27 -51 -462 -77 503 237 -154 -199 89 115 -181
7890 -181 -85 320 -87 -729 -299 124 163 -263 -255 288 167 -174 164 263 -251 -344 -159 458 203 -19 142 85
7912 85 -237 -144 581 267 -511 -391 30 359 -106 -75 -6 -226 -263 124 -23 -156 -212 -343 -105 11 107 68 234
7935 234 -469 -17 -108 62 -15 -340 -394 -79 172 256 32 299 -291 -569 -105 355 154 -195 -41 126 -152
7956 -152 171 374 249 -170 63 210 -56 89 204 -120 -63 -125 181 324 -130 -312 -399 268 187 40 -170
7977 -170 182 -114 -324 -427 411 353 -313 -309 121 364 -106 -132 109 -92 -582 -375 -69 246 -132 -266 202
7998 202 -148 -111 325 132 -337 -366 -223 177 148 12 389 7 -123 198 281 148 -610 -293 164 640 13
8019 13 -367 -210 101 -20 -197 266 523 -94 -421 -62 191 60 221 -2 -553 -566 -75 204 143 -334 266
8040 266 -101 -255 -47 224 52 -518 102 158 301 -128 -636 74 182 -459 171 249 460 89 -634 280 106
8061 106 248 73 248 -272 -227 118 322 -12 -229 292 56 -39 -173 248 246 -290 -261 303 495 142 -333 -151
8083 -151 -98 -53 151 168 56 -286 -224 63 -212 -12 218 126 -386 -143 234 34 39 -309 -174 79 -17 180 6
8106 6 -84 -144 -269 118 327 152 -49 -217 184 228 282 -13 -209 194 -6 262 172 271 144 -44 -136 265 142
8129 142 395 32 -455 -44 179 90 227 202 -1 -327 -422 -278 152 -127 -171 -171 -136 100 215 56 -346 -357 -179
8152 -179 1 -154 67 -263 -162 -470 -102 310 165 83 -537 1 112 -24 -152 -50 -78 -211 8 265 -20
8173 -20 -171 -28 -268 189 268 624 160 -121 39 89 110 -175 -202 125 -83 -6 139 515
8191E15
##END NTUPLES=NMR FID
##END=
