##TITLE=1H_BAU-j-28-1
 CDCl3, 8 sc, 
 28.6.2019
##JCAMPDX= 6.0         $$ Bruker NMR JCAMP-DX V2.0
##DATA TYPE= NMR FID
##DATA CLASS= NTUPLES
##ORIGIN= UXNMR, Bruker Analytische Messtechnik GmbH
##OWNER= root
$$ XWIN-NMR		Version 3.5
$$ Fri Jun 28 15:52:39 2019 Russian Standard Time (UT+4h)  she@DPX200
##.OBSERVE FREQUENCY= 200.13155
##.OBSERVE NUCLEUS= ^1H
##.DELAY= (6, 6)
##.ACQUISITION MODE= SIMULTANEOUS
##.ACQUISITION SCHEME= undefined
##.AVERAGES= 8
##.DIGITISER RES= 18
##SPECTROMETER/DATA SYSTEM= spect
##.PULSE SEQUENCE= zg30
##.SOLVENT NAME= CDCl3
##.SHIFT REFERENCE= (INTERNAL, CDCl3, 0, 15.7039)
##AUDIT TRAIL= $$ (NUMBER, WHEN, WHO, WHERE, WHAT)
$$ ##TITLE= Audit trail, XWIN-NMR		Version 3.5
$$ ##JCAMPDX= 5.01
$$ ##ORIGIN= Bruker BioSpin GmbH
$$ ##OWNER= she
$$ F:/spectra/data/she/nmr/H-F/1/audita.txt
$$ ##AUDIT TRAIL=  $$ (NUMBER, WHEN, WHO, WHERE, WHAT)
(   1,<2019-06-28 15:51:32.28 +0400>,<she>,<DPX200>,
      <created by zg, POWCHK disabled, PULCHK disabled
       configuration hash MD5:
       00 E9 B6 7A A2 85 ED C7 34 08 36 98 17 FE 4E 26
       data hash MD5: 16K
       A8 89 DB 88 20 D9 34 71 A5 68 D5 B2 84 CA 86 02>)
$$ ##END=
$$ 
$$ hash MD5
$$ 4D 06 A0 72 53 70 BE 2C 57 06 47 D0 AA D3 53 76
##$RELAX= 
##$RELAX= 
##$RELAX= 
##$RELAX= 
##$RELAX= 
##$RELAX= 
$$ Bruker specific parameters
$$ --------------------------
##$DU= <F:/spectra>
##$EXPNO= 1
##$NAME= <H-F>
##$PROCNO= 1
##$TYPE= <nmr>
##$USER= <she>
##$AMP= (0..31)
100 100 100 100 100 100 100 100 100 100 100 100 100 100 100 100 100 100 
100 100 100 100 100 100 100 100 100 100 100 100 100 100 
##$AQSEQ= 0
##$AQ_mod= 1
##$AUNM= <au_zg>
##$AUTOPOS= <>
##$BF1= 200.13
##$BF2= 200.13
##$BF3= 200.13
##$BF4= 200.13
##$BF5= 200.13
##$BF6= 200.13
##$BF7= 200.13
##$BF8= 200.13
##$BYTORDA= 1
##$CFDGTYP= 0
##$CFRGTYP= 5
##$CHEMSTR= <none>
##$CNST= (0..31)
1 1 145 1 1 1 1 1 1 1 1 1 1 1 1 1 1 1 1 1 1 1 1 1 1 1 1 1 1 1 1 1 
##$CPDPRG= <>
##$CPDPRG1= <>
##$CPDPRG2= <>
##$CPDPRG3= <>
##$CPDPRG4= <mlev>
##$CPDPRG5= <mlev>
##$CPDPRG6= <mlev>
##$CPDPRG7= <mlev>
##$CPDPRG8= <mlev>
##$CPDPRGB= <>
##$CPDPRGT= <>
##$D= (0..31)
0 1.2 0 0 0 0 0 0 0 0 0 0.03 0 0 0 0 0 0 0 0 0 0 0 0 0 0 0 0 0 0 0 0 
##$DATE= 1561722691
##$DBL= (0..7)
120 120 120 120 120 120 120 120 
##$DBP= (0..7)
150 150 150 150 150 150 150 150 
##$DBP07= 0
##$DBPNAM0= <>
##$DBPNAM1= <>
##$DBPNAM2= <>
##$DBPNAM3= <>
##$DBPNAM4= <>
##$DBPNAM5= <>
##$DBPNAM6= <>
##$DBPNAM7= <>
##$DBPOAL= (0..7)
0.5 0.5 0.5 0.5 0.5 0.5 0.5 0.5 
##$DBPOFFS= (0..7)
0 0 0 0 0 0 0 0 
##$DE= 6
##$DECBNUC= <off>
##$DECIM= 24
##$DECNUC= <off>
##$DECSTAT= 4
##$DIGMOD= 1
##$DIGTYP= 9
##$DL= (0..7)
0 120 120 120 120 120 120 120 
##$DP= (0..7)
150 150 150 150 150 150 150 150 
##$DP07= 0
##$DPNAME0= <>
##$DPNAME1= <>
##$DPNAME2= <>
##$DPNAME3= <>
##$DPNAME4= <>
##$DPNAME5= <>
##$DPNAME6= <>
##$DPNAME7= <>
##$DPOAL= (0..7)
0.5 0.5 0.5 0.5 0.5 0.5 0.5 0.5 
##$DPOFFS= (0..7)
0 0 0 0 0 0 0 0 
##$DQDMODE= 0
##$DR= 18
##$DS= 0
##$DSLIST= <SSSSSSSSSSSSSSS>
##$DSPFIRM= 0
$$ [...]
##$SUBNAM2= <"">
##$SUBNAM3= <"">
##$SUBNAM4= <"">
##$SUBNAM5= <"">
##$SUBNAM6= <"">
##$SUBNAM7= <"">
##$SUBNAM8= <"">
##$SUBNAM9= <"">
##$SW= 24.9336996594482
##$SWIBOX= (0..15)
0 0 2 0 0 0 0 0 0 0 0 0 0 0 0 0 
##$SW_h= 4990.01996007984
##$TD= 16384
##$TD0= 1
##$TE= 0
##$TE2= 300
##$TE3= 300
##$TEG= 300
##$TL= (0..7)
0 120 120 120 120 120 120 120 
##$TP= (0..7)
150 150 150 150 150 150 150 150 
##$TP07= 0
##$TPNAME0= <>
##$TPNAME1= <>
##$TPNAME2= <>
##$TPNAME3= <>
##$TPNAME4= <>
##$TPNAME5= <>
##$TPNAME6= <>
##$TPNAME7= <>
##$TPOAL= (0..7)
0.5 0.5 0.5 0.5 0.5 0.5 0.5 0.5 
##$TPOFFS= (0..7)
0 0 0 0 0 0 0 0 
##$TUNHIN= 0
##$TUNHOUT= 0
##$TUNXOUT= 0
##$USERA1= <user>
##$USERA2= <user>
##$USERA3= <user>
##$USERA4= <user>
##$USERA5= <user>
##$V9= 5
##$VALIST= <valist>
##$VCLIST= <CCCCCCCCCCCCCCC>
##$VD= 0
##$VDLIST= <DDDDDDDDDDDDDDD>
##$VPLIST= <PPPPPPPPPPPPPPP>
##$VTLIST= <TTTTTTTTTTTTTTT>
##$WBST= 1024
##$WBSW= 4
##$XGAIN= (0..3)
0 0 0 0 
##$XL= 0
##$YL= 0
##$YMAX_a= 825748
##$YMIN_a= -967114
##$ZGOPTNS= <>
##$ZL1= 120
##$ZL2= 120
##$ZL3= 120
##$ZL4= 120
##$ABSF1= 10
##$ABSF2= 0
##$ABSG= 5
##$ABSL= 3
##$ALPHA= 0
##$AQORDER= 0
##$ASSFAC= 0
##$ASSFACI= 0
##$ASSFACX= 0
##$ASSWID= 0
##$AUNMP= <proc_1d>
##$AZFE= 0.1
##$AZFW= 0.1
##$BCFW= 1
##$BC_mod= 2
##$BYTORDP= 1
##$COROFFS= 0
##$CY= 11.3945322036743
##$DATMOD= 1
##$DC= 2
##$DFILT= <>
##$DTYPP= 0
##$F1P= 18.9103706918063
##$F2P= -1.10871071338519
##$FCOR= 0.5
##$FTSIZE= 0
##$FT_mod= 4
##$GAMMA= 1
##$GB= 0.15
##$INTBC= 1
##$INTSCL= 1
##$ISEN= 128
##$LB= 0.24
##$LEV0= 0
##$LPBIN= 0
##$MAXI= 10000
##$MC2= 0
##$MEAN= 0
##$ME_mod= 0
##$MI= 1.114404
##$NCOEF= 0
##$NC_proc= 0
##$NLEV= 6
##$NOISF1= 3.799351
##$NOISF2= 2.8
##$NSP= 1
##$NTH_PI= 0
##$NZP= 0
##$OFFSET= 15.70392
##$PC= 1
##$PHC0= -8505.633
##$PHC1= 20.60097
##$PH_mod= 1
##$PKNL= yes
##$PPARMOD= 0
##$PSCAL= 0
##$PSIGN= 0
##$REVERSE= no
##$SF= 200.130013532006
##$SI= 16384
##$SIGF1= 3
##$SIGF2= 2
##$SINO= 400
##$SIOLD= 16384
##$SREGLST= <1H.CDCl3>
##$SSB= 0
##$STSI= 0
##$STSR= 0
##$SW_p= 3612.71676300578
##$SYMM= 0
##$S_DEV= 0
##$TDeff= 0
##$TDoff= 0
##$TI= <>
##$TILT= no
##$TM1= 0
##$TM2= 0
##$TOPLEV= 0
##$USERP1= <user>
##$USERP2= <user>
##$USERP3= <user>
##$USERP4= <user>
##$USERP5= <user>
##$WDW= 1
##$XDIM= 8192
##$YMAX_p= 0
##$YMIN_p= 0
$$ End of Bruker specific parameters
$$ ---------------------------------
##NTUPLES= NMR FID
##VAR_NAME=  TIME,          FID/REAL,        FID/IMAG
##SYMBOL=    X,             R,               I
##VAR_TYPE=  INDEPENDENT,   DEPENDENT,       DEPENDENT
##VAR_FORM=  AFFN,          ASDF,            ASDF
##VAR_DIM=   8192,          8192,            8192
##UNITS=     SECONDS,       ARBITRARY UNITS, ARBITRARY UNITS
##FACTOR=    0.0002004,     1,               1
##FIRST=     0,             0,               0
##LAST=      1.6414764,     0,               0
##MIN=       0,             -967114,         0
##MAX=       1.6414764,     825748,          0
$$ Real data points
##PAGE= N=1
##DATA TABLE= (X++(R..R)), XYDATA
$$ [...]
$$ plain form
3367 6218 -3622 -2808 3830 2010 -877 3955 6150 -1282 -4722 2634 7396 1668 -2489 2462 3187
3382 3187 -2852 -1032 6857 3948 -5752 -4471 4168 3213 -2551 -819 1503 -3330 -5630 1176 5328
3397 5328 -1298 -6440 -2469 459 -2281 -1501 3580 195 -8304 -5382 4135 2825 -3589 -1832 1885
3412 1885 -2573 -4405 2475 5988 -629 -5601 -185 4782 645 -1392 3577 2752 -3159 -550 7399
3427 7399 4117 -3881 -791 5114 2547 -1109 3614 6035 -2936 -5864 3154 8805 1499 -4470 127
3442 127 1780 -4025 -2172 7381 4749 -7234 -6759 1656 1890 -2587 519 3169 -4566 -9614 -1110
3457 -1110 5926 -324 -6760 -1020 2407 -5126 -6612 3503 4920 -5955 -6367 4412 4439 -5833 -4718
3472 -4718 4120 3408 -3234 -169 6039 158 -7180 -354 9470 4681 -3140 680 3646 -3467 -3166
$$ packed form
3367F218r840Q14O638j820k887M832K195p432l440P356M762n728m157M951P25
3382C187o039J820P889k909r700J281Q639r55n764J732K322m833k300O806M152
3397E328o626n142L971K928k740P80N081l385q499K922R517j310o414J757L717
3412A885m458j832O880L513o617m972N416M967m137k037M969q25n911K609P949
3427G399l282p998L090N905k567l656M723K421q971k928R018N651p306n969M597
3442A27J653n805J853R553k632j1983M75Q415K34m477L106K650p735n048Q504
3457a110P036o250o436N740L427p533j486J0115J417j0875m12J0779K7j0272J115
3472d718Q838p12o642L065O208n881p338O826R824m789p821L820K966p113L01
$$ plain form
3487 -3166 9095 10219 -3025 -7631 1500 5126 -573 837 7503 2635 -9377 -6410 6954 6893
3501 6893 -3137 -3319 2473 -2246 -7396 654 7264 -766 -7910 -2020 2444 -2881 -5549 1499 3082
3516 3082 -4297 -6200 2358 2754 -6472 -5648 4963 4557 -4461 -4225 2790 56 -5030 958 8329 2490
3532 2490 -6730 -4200 4311 4049 814 3933 4209 -3596 -6696 3600 9731 3430 -1689 855 284
3547 284 -2711 857 8351 6160 -3731 -6189 1154 3601 -295 301 3902 -701 -6902 -2777 4483
3562 4483 1938 -3464 -2761 535 -1894 -3513 -627 1152 -1865 -4071 -547 1575 -2991 -5057 -163
3577 -163 2502 -777 -2103 600 -788 -4345 -2053 4908 4977 -1081 -4024 -1902 1073 2065 3909 5457
3593 5457 1025 -5067 -3410 3722 6683 4434 1749 -968 -3875 -1836 4031 7165 3871 -1979 -3307
$$ packed form
3487c166J2261J124j3244m606R131L626n699J410O666m868j2012K967J3364o1
3501F893j0030j82N792m719n150Q050O610q030p144N890M464n325k668P048J583
3516C082p379j903Q558L96r226Q24J0611m06r018K36P015k734n086N988P371n839
3532B490r220K530Q511k62l235L119K76p805l100J0296O131o301n119K544n71
3547B84k995L568P494k191r891k458P343K447l896N96L601m603o201M125P260
3562D483k545n402P03L296k429j619K886J779l017k206L524K122m566k066M894
3577a63K665l279j326K703j388l557K292O961O9o058k943K122K975R92J844J548
3593E457m432o092J657P132K961k249k685k717k907K039N867L134l294n850j328
$$ plain form
3608 -3307 -1045 673 1584 4435 3127 -3159 -5091 -1516 2025 919 -734 -679 -393 -2324 -3602 -1533
3624 -1533 648 -387 -1484 -255 -585 -3442 -4209 -915 1725 1849 708 -1158 -4019 -4713 -199 4682
3640 4682 5103 405 -3562 -3377 -1117 1069 5439 7044 1310 -5723 -4039 2358 5781 5096 2810 449
3656 449 -2685 -2785 1714 6693 5293 75 -2307 -1397 -631 585 2778 2645 -883 -2330 -815 -388
3672 -388 -1649 -1075 978 959 -1585 -2963 -1766 -1635 -3299 -1470 3200 1796 -4514 -6221 -2674 155
3688 155 747 1622 1020 -3121 -6258 -3658 2289 5221 1644 -1525 -2673 -3628 -1257 4352 6115 1109
3704 1109 -3127 -1643 775 1438 3019 4114 2232 -2184 -2278 2545 4350 1162 -599 1975 1878 -772
3720 -772 -359 2089 1170 -1633 -218 1972 883 -2370 -2667 -433 119 22 1003 -22 -4303 -5273 -957
$$ packed form
3608c307K262J718R11K851j308o286j932L575L541j106j653N5K86j931j278K069
3624a533K181j035j097J229l30k857p67L294K640J24j141j866k861o94M514M881
3640D682M21m698l967J85K260K186M370J605n734p033J684O397L423o85k286k361
3656D49l134j00M499M979j400n218k382R10P66J216K193j33l528j447J515M27
3672c88j261N74K053j9k544j378J197J31j664J829M670j404o310j707L547K829
3688A55N92Q75o02m141l137K600N947K932l577l169j148r55K371N609J763n006
3704A109m236J484K418O63J581J095j882m416r4M823J805l188j761K574r7k650
3720g72M13K448r19k803J415K190j089l253k97K234N52r7R81j025m281r70M316
$$ plain form
3737 -957 2859 242 -2175 -1942 -2905 -4291 -859 4055 2697 -2960 -5049 -1903 1196 1239 1244 1957 -1103
3754 -1103 -3805 -576 4376 3149 275 502 912 -81 852 3830 3378 -544 -1097 2357 3973 1304
3770 1304 -121 1608 1582 -246 1308 3992 1607 -2926 -1604 2112 2124 248 24 -982 -2938 -1998
3786 -1998 1733 2734 -1005 -3961 -2877 -1287 -1171 566 1904 -1305 -5656 -3579 1950 1535 -1388
3801 -1388 -1343 -1503 -2392 -2186 1199 3036 -524 -3229 -1284 1489 806 831 2227 25 -2177 536 4761
3818 4761 2749 -821 -216 2369 829 642 3110 3089 -1132 -2900 1323 4665 2134 -1175 -296 143
3834 143 -1266 473 3639 1059 -3738 -2753 589 234 -769 653 -28 -4086 -4412 513 2797 -1517
3850 -1517 -4547 -2141 -484 -2403 -1696 2309 376 -5128 -3784 1783 2483 -1577 -1815 237 -1166 -1613
$$ packed form
3737i57L816k617k417K33r63j386L432M914j358n657k089L146L099M3NP13l060
3754a103k702L229M952j227k874K27M10r93R33K978m52l922n53L454J616k669
3770A304j425J729k6j828J554K684k385m533J322L716J2j876k24j006j956R40
3786a998L731J001l739k956J084J590J16J737J338l209m351K077N529m15k923
3801a388M5j60q89K06L385J837l560k705J945K773o83K5J396k202k202K713M225
3818D761k012l570O05K585j540j87K468k1m221j768M223L342k531l309Q79M39
3834A43j409J739L166k580m797R85L342l55j003J422o81m058l26M925K284m314
3850a517l030K406J657j919P07M005j933n504J344N567P00m060k38K052j403m47
$$ plain form
3866 -1613 2099 4015 -518 -3571 248 3552 1201 45 3172 2008 -2993 -924 5861 4676 -1776
3881 -1776 -1814 2736 2185 -111 1798 4139 22 -4072 44 4664 1846 -2294 -151 653 -2660 -1430
3897 -1430 3597 2259 -4740 -4470 1171 1453 -2178 -1399 1342 -2287 -6166 -1057 4514 555 -5765 -2894
3913 -2894 1642 -959 -2321 2125 2367 -4042 -4344 2439 3779 -833 -1849 1207 123 -2388 1243
3928 1243 5874 1392 -4730 -832 5710 2665 -1388 1934 3714 -1768 -2903 4111 6097 -781 -3689
3943 -3689 1228 3091 -556 -230 3624 1073 -4913 -2255 4545 2334 -3659 -1985 1561 -2317 -4019
3958 -4019 2299 3774 -3587 -6770 -409 3608 -1484 -3208 1052 356 -5011 -2856 4491 2886 -4756
3973 -4756 -3413 2045 873 -2073 1629 4000 -2086 -4731 2113 5987 853 -2726 1722 3396 -1394
$$ packed form
3866a613L712J916m533l053L819L304k351j156L127j164n001K069O785j185o452
3881a776l8M550n51k296J909K341m117m094M116M620k818m140K143Q04l313J230
3897a430N027j338o999K70N641K82l631P79K741l629l879N109N571l959o320K871
3913b894M536k601j362M446K42o409l02O783J340m612j016L056j084k511L631
3928A243M631m482o122L898O542l045m053L322J780n482j135P014J986o878k908
3943c689M917J863l647L26L854k551n986K658O800k211n993J674L546l878j702
3958d019O318J475p361l183O361M017n092j724M260o96n367K155P347j605p642
3973d756J343N458j172k946L702K371o086k645O844L874n134l579M448J674m790
$$ plain form
3988 -1394 -701 6084 4709 -3513 -2846 5264 5086 -1084 68 3362 -290 -3496 2012 6128 638 -4576
4004 -4576 -653 3220 -576 -2091 2837 2004 -5370 -4659 3330 3815 -4055 -3925 1010 -456 -4296 -864
4020 -864 4116 -1065 -6541 -2663 3398 778 -3765 -1009 964 -2860 -3665 3523 3870 -3496 -4716 2196
4036 2196 2896 -1595 348 4075 130 -4930 -169 6779 3657 -3242 -1032 3574 703 -2031 3660
4051 3660 5493 -1815 -4584 1957 4310 -145 -1028 1969 27 -3579 -473 4459 1462 -4697 -2941
4066 -2941 2575 100 -3642 -409 2161 -3492 -5917 1531 4515 -2045 -5758 -1550 979 -1796 -1641
4081 -1641 2191 348 -4961 -4003 2651 3041 -1981 -1297 1071 -1761 -3326 2724 5853 -378 -4527 319
4097 319 3522 942 -166 3573 2995 -2706 -2147 4547 5430 -1046 -2055 2469 2309 -1052 959 4066
$$ packed form
3988a394O93O785j375q222O67Q110j78o170J152L294l652l206N508M116n490n214
4004d576L923L873l796j515M928q33p374P11P989M85p870J30M935j466l840L432
4020h64M980n181n476L878O061k620m543K756J973l824q05P188L47p366j220O912
4036B196P00m491J943L727l945n060M761O948l122o899K210M606k871k734N691
4051C660J833p308k769O541K353m455q83K997j942l606L106M932k997o159J756
4066b941N516k475l742L233K570n653k425P448K984o560l713M208K529k775J55
4081a641L832j843n309R58O654L90n022O84K368k832j565O050L129o231m149M846
4097C19L203k580j108L739n78n701N59O694Q83o476j009M524j60l361K011L107
$$ plain form
4113 4066 9 -3225 392 3751 486 -2112 -242 1044 -1867 -1465 2676 2059 -4235 -5090 1015 2928
4129 2928 -1393 -2010 228 -1780 -4746 -771 3796 1329 -3734 -3253 -127 122 -273 1766 1993 -2748
4145 -2748 -3968 1294 3672 335 -802 1389 246 -1815 905 4674 2412 -2072 -1071 2787 2821
4160 2821 244 812 2431 285 -1079 1689 3509 185 -2019 -188 1770 378 469 1322 -944 -3111
4176 -3111 -1175 2255 1698 -1704 -3098 -1435 -982 -1334 553 1826 -1904 -5012 -2317 1265 713 -586
4192 -586 -1126 -2374 -3030 -1453 1635 1540 -807 -2368 -1472 -300 348 1589 1781 -914 -2455 580 2984
4209 2984 2236 177 373 825 373 1201 2318 1812 127 -376 1309 2565 1815 296 -182 -545 -47 2419
4227 2419 2235 -337 -2480 -824 335 388 1228 950 -1618 -3512 -2230 1038 1929 -432 -2272 -2500 -1961
$$ packed form
4113D066m057l234L617L359l265k598J870J286k911M02M141o17o294q55O105J913
4129B928m321o17K238k008k966L975M567k467n063M81L126K49l95K039K27m741
4145b748j220N262K378l337j137K191j143k061K720L769k262m484J001L858L4
4160B821k577N68J619k146j364K768J820l324k204J831J958j392R1Q53k266k167
4176c111J936L430n57l402j394J663M53l52J887J273l730l108K695L582n52j299
4192e86n40j248o56J577L088r5k347j561Q96J172O48J241J92k695j541L035K404
4209B984p48k059J96M52m52Q28J117n06j685n03J685J256p50j519m78l63M98K466
4227B419j84k572k143J656J159N3Q40k78k568j894J282L268Q91k361j840k28N39
$$ plain form
4244 -1961 -1066 824 1274 -1395 -3298 -2042 -591 -62 884 562 -1564 -2963 -632 2237 1673 -630
4260 -630 -948 263 704 31 1029 2220 64 -1652 959 3216 1673 -321 18 702 821 1500 2555
4277 2555 1004 -1403 -1118 1342 2534 1224 -131 -268 -1368 -2354 1053 3442 493 -3618 -2730 -300
4293 -300 398 -12 309 -34 -2838 -4216 -500 2381 331 -2439 -2157 -1367 -1954 -588 1906 301 -2634
4310 -2634 -2024 647 874 -358 -153 722 -65 -1160 1136 2860 525 -2143 80 3363 2222 -308
4326 -308 597 1165 -575 492 3523 3334 44 -2334 -609 1958 2508 1875 1668 -660 -3607 -1447 3064
4343 3064 3244 -489 -1498 -1200 -2091 -1680 1593 2830 -496 -3946 -3437 203 720 -789 -369 -42 -2230
4360 -2230 -2737 -78 1020 -1083 -1667 59 316 -706 -754 -163 -326 -846 1125 2747 1006 -1970 -1902
$$ packed form
4244a961Q95J890M50k669j903J256J451N29R46l22k126j399K331K869n64k303
4260f30l18J211M41o73R98J191k156j716K611K257j543j994L39O84J19O79J055
4277B555j551k407K85K460J192j310j355j37j100r86L407K389k949m111Q88K430
4293c00O98m10L21l43k804j378L716K881k050k770K82P90n87J366K494j605k935
4310b634O10K671K27j232K05Q75p87j095K296J724k335k668K223L283j141k530
4326c08R05N68j740J067L031j89l290k378J725K567N50o33k07k328k947K160M511
4343C064J80l733j009K98q91M11L273J237l326l450N09L640N17j509M20L27k188
4360b230n07K659J098k103n84J726K57j022m8N91j63n20J971J622j741k976O8
$$ plain form
4377 -1902 1759 2497 1682 1940 1385 -1939 -2064 1960 4943 3488 349 -1441 -1141 43 1911 3645
4393 3645 2486 -1128 -3161 -1401 690 1261 1915 825 -1921 -3369 -1278 977 629 -885 -1370 -1173
4409 -1173 -1536 -1620 -1091 -271 -671 -1505 -851 -334 -1471 -2556 -1755 -483 863 1100 -574 -2599 -2141 -624
4427 -624 1451 2587 1731 -775 -2178 -1635 1124 3559 3331 562 -1582 -1988 113 2521 3813 2214
4443 2214 -900 -845 -143 565 2080 2907 970 -2180 -1688 720 1760 435 -590 111 256 -871 -675
4460 -675 696 73 -1948 -1234 846 -138 -1863 -1635 -1197 -1434 -529 1429 580 -2716 -3667 -426 1602
4477 1602 411 -396 579 -1075 -3435 -579 4197 2837 -1808 -1985 747 1351 440 2281 3414 25
4493 25 -2285 404 3334 2131 -179 419 1422 -530 -124 3622 3027 -2065 -1858 2275 2112 -662 -508
$$ packed form
4377a902L661P38q15K58n55l324j25M024K983j455l139j790L00J184J868J734
4393C645j159l614k033J760K091N71O54j090k746j448K091K255l48j514m85J97
4409a173l63q4N29Q20m00q34O54N17j137j085Q01J272J346K37j674k025M58J517
4427f24K075J136q56k506j403N43K759K435k28k769k144m06K101K408J292j599
4443B214l114N5P02P08J515Q27j937l150M92K408J040j325j025P01J45j127J96
4460f75J371o23k021P14K080r84j725K28M38k37R05J958q49l296r51L241K028
4477A602j191q07R75j654k360K856M776j360m645j77K732O04r11J841J133l389
4493B5k310K689K930j203k310N98J003j952M06L746n95n092K07M133j63k774J54
$$ plain form
4510 -508 1571 -396 -3071 -419 3429 686 -3822 -2724 1625 118 -1787 234 412 -3541 -3885 956
4526 956 2359 -1457 -2826 -563 -912 -1910 -173 3034 484 -4467 -2473 2586 1938 -1964 -94 1923
4542 1923 -1203 -2148 2018 4382 290 -2756 215 2618 1231 402 2412 1691 -2110 -791 4110 3565
4558 3565 -1415 -1062 2012 458 -1515 1881 3738 -1116 -3960 -17 3274 771 -2383 -363 233
4573 233 -2369 -2363 1851 2404 -3119 -4096 166 761 -1895 -603 800 -2169 -4288 -360 2953 36 -3318
4590 -3318 -1083 1133 -964 -1401 1978 2448 -2744 -3397 2192 3754 -409 -1267 1583 889 -1444 1781
4606 1781 4380 1487 -2193 -584 2678 1860 97 1829 2293 -1827 -2422 3093 3992 -1216 -2959 738
4622 738 935 -1625 -272 2614 203 -4030 -1867 2050 1691 -2256 -1664 194 -1942 -2749 1575 2393
$$ packed form
4510e08K079j967k675K652L848k743m508J098M349j507j905K021J78l953l44M841
4526I56J403l816j369K263l49r98J737L207k550m951J994N059o48l902J870K017
4542A923l126r45M166K364m092l046K971K403j387q29K010p21l801J319M901n45
4558C565m980L53L074j554j973L396J857m854k844L943L291k503l154K020N96
4573B33k602OM214N53n523r77M262N95k656J292J403k969k119L928L313k917l354
4590c318K235K216k097m37L379M70n192o53N589J562m163q58K850o94k333L225
4606A781K599k893l680J609L262q18j763J732M64m120n95N515Q99n208j743L697
4622G38J97k560J353K886k411m233K163L917l59l947N92J858k136q07M324Q18
$$ plain form
4638 2393 -2753 -4376 -173 1558 -1436 -1211 1285 -358 -3968 -1668 3503 2265 -2905 -2332 1680
4653 1680 751 -1217 1289 3090 -1085 -3076 854 4114 1121 -631 1047 1062 -948 648 4179 2616
4669 2616 -2423 -1960 2701 2329 -977 85 2154 -1228 -3448 1288 4214 -9 -3770 -890 1506
4684 1506 -757 -1161 1206 392 -3617 -3242 1452 1501 -2062 -2328 324 -1368 -3090 458 2907 -1396
4700 -1396 -4568 -964 2504 172 -1857 846 936 -1925 -2122 2719 3510 -1097 -2666 1471 1996 9
4716 9 1429 3104 40 -2625 1100 4726 1542 -575 720 1733 -799 -657 3553 3417 -2014 -3312
4732 -3312 1596 2922 -666 -1143 1420 -157 -3549 -623 3326 672 -3551 -2290 346 -551 -1596
4747 -1596 416 754 -2848 -4169 760 2769 -1805 -3127 101 109 -2632 -679 2885 540 -4385 -2009
$$ packed form
4638B393n146j623M203J731k994K25K496j643l610K300N171j238n170N73M012
4653A680r29j968K506J801m175j991L930L260k993j752J678J5k010J596L531j563
4669B616n039M63M661l72l306J062K069l382k220M736K926m223l761K880K396
4684A506k263m04K367q14m009L75M694M9l563k66K652j692j722L548K449m303
4700a396l172L604L468k332k029K703R0k861j97M841P91m607j569M137N25j987
4716IJ420J675l064k665L725L626l184k117J295J013k532J42M210j36n431j298
4732c312M908J326l588m77K563j577l392K926L949k654m223J261K636q97j045
4747a596K012L38l602j321M929K009m574j322L228Qk741J953L564k345m925K376
$$ plain form
4763 -2009 2402 2219 -933 -659 1261 -224 -1994 1639 4323 460 -2940 445 2663 536 389 3152
4779 3152 1505 -2454 -1356 3438 3109 -809 -1332 1439 974 -1501 469 3357 -67 -4331 -900 2874
4795 2874 340 -1917 -337 544 -1729 -1941 1492 1651 -2433 -3907 -579 1268 -1207 -1432 577 -708
4811 -708 -3833 -1385 3274 1436 -2883 -2216 704 495 -682 887 2286 -407 -2773 155 3521 2022
4827 2022 -804 -14 1488 -191 173 3093 2675 -1209 -1297 1818 2370 691 250 1116 368 -1435 16
4844 16 3100 1453 -2147 -1897 1518 1304 -738 -462 89 -1638 -2354 -302 1880 71 -2256 -2737 -875
4861 -875 -293 -21 429 -145 -2343 -2874 115 1739 -174 -1399 -812 -689 -1127 116 1977 1124 -1224
4878 -1224 -1962 838 2451 975 -616 216 699 -23 864 2490 1815 -610 -1257 720 2490 1755 411
$$ packed form
4763b009M411j83l152K74J920j485j770L633K684l863l400L385K218k127j47K763
4779C152j647l959J098M794l29l918n23K771m65k475J970K888l424m264L431L774
4795B874k534k257J580Q81k273k12L433J59m084j474L328J847k475k25K009j285
4811g08l125K448M659j838m319O67K920k09j177J569J399k693k366K928L366j499
4827B022k826P90J502j679L64K920m18l884q8L115N52j679m41Q66p48j803J451
4844A6L084j647l600K50L415k14k042K76N51j727p16K052K182j809k327m81J862
4861h75N82K72M50n74k198n31K989J624j913j225N87J23m38J243J861q53k348
4878a224p38K800J613j476j591Q32M83p22Q87J626o75k425o47J977J770p35j344
$$ plain form
4895 411 -277 -324 -287 455 2590 1669 -1306 -1207 172 235 32 859 196 -1203 -2233 -476 1706 330 -2488
4914 -2488 -1755 431 -367 -1382 -354 542 -1780 -2942 193 1900 -213 -2980 -1689 434 142 159
4930 159 1377 380 -2969 -2809 1706 3429 1107 -589 482 -779 -1517 1120 4947 2710 -1664 -2323
4946 -2323 920 1845 381 1427 3324 305 -2953 -416 3079 1811 -1060 379 1867 -460 -2035
4961 -2035 -118 1193 -1091 -1436 1304 1636 -2449 -4241 77 1773 -654 -1284 1018 -1123 -5273 -2836
4977 -2836 2990 3479 -1608 -3315 -1385 -1411 -1988 1271 4820 1123 -4869 -3563 1108 1477 429 2660
4993 2660 2568 -2517 -3942 1025 4350 1457 -580 1245 1333 -1868 -2118 3091 3783 -413 -1593 2442
5009 2442 1729 -2716 -1916 2987 3028 -629 -746 913 -1085 -3684 326 4538 1957 -3222 -3392 -964
$$ packed form
4895D11o88m7L7P42K135r21k975R9J379O3k03Q27o63j399j030J757K182j376k818
4914b488P33K186p98j015J028Q96k322j162L135J707k113k767J291K123k92J7
4930A59J218r97l349J60M515J723k322j696J071j261p38K637L827k237m374o59
4946b323L243R25j464J046J897l019l258K537L495j268k871J439J488k327j575
4961b035J917J311k284l45K740L32m085j792M318J696k427o30K302k141m150K437
4977b836N826M89n087j707J930k6n77L259L549l697n992J306M671L69j048K231
4993B660r2n085j425M967L325k893k037J825Q8l201k50N209O92m196j180M035
5009B442p13m445Q00M903M1l657j17J659j998k599M010M212k581n179j70K428
$$ plain form
5025 -964 -1583 -1356 3107 3303 -3044 -6010 -1858 1730 741 -377 1455 -298 -4820 -3915 2211 4151
5041 4151 -492 -2257 -76 -144 -2429 -200 4014 2106 -1885 -1199 2176 991 -1025 1159 3392 1551
5057 1551 -1120 824 2090 -490 -1776 2507 4815 68 -2336 -82 1353 -341 569 3292 1990
5072 1990 -3120 -4026 343 2744 880 -230 -27 -1578 -3977 -1258 2882 1802 -1702 -2431 -1708 -1353
5088 -1353 -1203 890 1438 -1067 -3392 -1147 1379 53 -1568 16 834 -746 -1394 1069 1459 -977
5104 -977 -1523 856 2408 772 -673 -155 935 991 1186 1969 1454 -973 -1474 1069 2322 1789 957 24
5122 24 -1120 -1020 1080 2486 1500 -1028 -1874 -100 991 447 18 567 -460 -2421 -984 1227 949
5139 949 -1904 -2337 -349 -103 -853 -1103 84 -990 -2335 -900 1638 838 -1782 -1529 138 -92 -61
$$ packed form
5025i64o19K27M463J96o347k966M152L588r89j118J832j753m522R05O126J940
5041D151m643j765K181o8k285K229M214j908l991O86L375j185k016K184K233j841
5057A551k671J944J266k580j286M283K308m747k404K254J435j694R10K723j302
5072A990n110r06M369K401j864j110K03j551k399K719M140j080l504p29P23L55
5088a353J50K093N48k505k325K245K526j326j621J584Q18j580o48K463L90k436
5104i77n46K379J552j636j445N18J090N6J95P83n15k427n01K543J253n33q32r33
5122B4j144J00K100J406r86k528q46J774J091n44m29N49j027j961J437K211k78
5139I49k853m33J988K46p50k50J187j074j345J435K538q00k620K53J667k30L1
$$ plain form
5156 -61 1414 1309 -1527 -2273 516 2969 1037 -1155 199 1083 -958 -348 3197 3251 -1191 -2149 1876
5173 1876 2881 231 -290 1237 457 -1204 73 2873 1906 -1799 -1402 1605 900 -1075 478 1407
5189 1407 -1509 -3195 919 3040 -526 -3141 -885 630 -940 -1634 1300 996 -3108 -3845 881 2281
5205 2281 -1516 -2325 168 -510 -2474 -199 2939 729 -2945 -1172 1915 968 -804 930 2097 -929
5221 -929 -2275 1928 4536 24 -2586 1311 2620 36 -243 2398 1567 -2120 -952 3037 2795 -694
5237 -694 -1613 1050 231 -1417 787 2813 -754 -3367 -698 1905 122 -1698 120 224 -2873 -2464
5253 -2464 1922 1943 -2578 -3483 -118 1042 -1533 -1423 884 -516 -3196 -990 2473 807 -2070 -602
5269 -602 910 -977 -656 2186 2020 -1426 -1862 1659 2807 91 -737 1435 942 -1278 181 3655
$$ packed form
5156f1J475j05k836p46K789K453j932k192J354Q84k041O10L545N4m442r58M025
5173A876J005k650n21J527p80j661J277K800r67l705L97L007p05j975J553R29
5189A407k916j686M114K121l566k615K256J515j570o94K934l04m104p37M726J400
5205B281l797q09K493o78j964K275L138k210l674J773L087r47j772J734J167l026
5221i29j346M203K608m512k610L897J309k584k79K641q31l687J168L989k42l489
5237f94r19K663q19j648K204K026l567k613K669K603j783j820J818J04l097M09
5253b464M386K1m521r05L365J160k575J10K307j400k680K206L463j666k877J468
5269f02J512j887L21K842j66l446m36L521J148k716q28K172m93k220J459L474
$$ plain form
5285 3655 1716 -1848 -856 1801 1288 -90 942 1084 -1143 -1543 1029 2160 148 -1642 -224 -117
5301 -117 -1282 109 1859 -161 -3371 -1333 1347 658 -1715 -862 -147 -1560 -2425 77 1827 -878
5317 -878 -2845 -1128 570 -170 -334 748 -269 -2195 -999 2049 1237 -1175 -580 602 264 -50 1650
5334 1650 2340 -479 -2134 819 2760 985 -112 892 548 -504 281 2708 1619 -716 -1206 688
5350 688 1001 234 942 750 -1398 -1949 456 2050 -255 -2427 -521 150 -1429 -1110 1509 261 -2742
5367 -2742 -2306 425 844 -997 -1377 -457 -965 -1460 298 1941 105 -2357 -725 1183 387 -273 1253
5384 1253 235 -1555 -912 2056 2020 -286 -894 545 795 120 1030 2374 520 -1996 -153 2404 1407
5401 1407 -268 269 800 -1042 7 2231 1338 -1300 -1319 613 810 -476 -38 674 -971 -2897 -710
$$ packed form
5285C655j939l564R92K657n13j378J032J42k227m00K572J131k012j790J418J07
5301a17j165J391J750k020l210K038K680o89k373Q53P15j413q65K502J750k705
5317h78j967J717J698p40j64J082j017j926J196L048q12k412N95J182l38l14J700
5334A650O90k819j655K953J941j775j097J004l44j052P85K427j089k335m90J894
5350F88L13p67P08j92k148n51K405J594k305k172J906O71j579L19K619j248l003
5367b742M36K731M19j841l80R20n08m95J758J643j836k462J632J908p96o60J526
5384A253j018j790O43K968l6k306o08J439K50o75R10J344j854k516J843K557r97
5401A407j675N37N31j842J049K224q93k638j9J932J97j286M38P12j645j926K187
$$ plain form
5418 -710 2076 354 -2495 -1984 4 -915 -908 556 485 -2087 -2422 226 1476 -342 -1134 -44 -688 -1259
5436 -1259 189 2401 447 -2268 -908 1910 1296 -705 995 1264 -1062 -1635 1503 3014 832 -1357
5452 -1357 -50 1810 732 251 1921 1571 -1733 -1076 2076 2050 -625 -543 1013 -502 -1150 832 2437
5469 2437 -663 -3103 -1119 1792 403 -1668 -593 452 -1897 -2207 1279 1772 -1643 -2789 -393
5484 -393 713 -334 -889 739 -521 -2672 -1319 2052 1446 -1074 -1370 748 39 -1039 1617 2701
5500 2701 -276 -2430 533 2849 1092 -811 492 1580 197 -697 1675 2558 -492 -1720 1300
5515 1300 2395 213 -240 1054 49 -1452 -203 2229 1139 -1846 -1616 466 896 -310 355 713
5531 713 -1467 -3722 -445 2558 492 -2324 -1750 -535 -1156 -1083 593 1680 -1250 -3140 -652 1449
$$ packed form
5418g10K786j722k849N11J988r19PJ464p1k572l35K648J250j818p92J090o44n71
5436a259J448K212j954k715J360K818o14k001J700K69k326n73L138J511k182k189
5452a357J307J860j078m81J670l50l304O57L152k6k675Q2J556j515o48J982J605
5469B437l100k440J984K911j389k071J075J045k349l10L486M93l415j146K396
5484c93J106j047n55J628j260k151J353L371o06k520k96K118p09j078K656J084
5500B701k977k154K963K316j757j903J303J088j383q94K372Q83l050j228L020
5515A300J095k182m53J294j005j501J249K432j090k985K30K082M30j206O65L58
5531G13k180k255L277L003k066k816N74J215o21P3J676J087k930j890K488K101
$$ plain form
5547 1449 347 -1079 36 480 -909 -840 1733 1601 -679 -631 1340 1688 -12 -314 1166 1223 -548
5564 -548 728 2475 1410 -1651 -1260 2124 2214 373 14 535 -963 -1957 528 3217 1658 -1695 -2195
5581 -2195 -296 -140 -165 1177 1484 -2158 -3490 -506 1117 304 -1116 36 -197 -2379 -2204 975 1612
5598 1612 -1142 -2290 241 1087 -1549 -1773 1038 1504 -893 -441 1786 382 -2033 -873 2475 2506
5614 2506 -279 -790 937 -48 -974 1700 4159 629 -2830 -1083 2149 832 93 2347 2161 -1988
5630 -1988 -3609 650 3661 1123 -1866 -356 788 -1881 -2064 2188 2406 -2124 -2918 335 1060 -2122
5646 -2122 -1608 1021 159 -2792 -1553 1513 -109 -3329 -1343 2780 790 -3167 -1220 1520 -981
5661 -981 -2592 1343 3608 -1147 -3999 -471 3273 1003 -687 1463 1849 -2508 -2974 2876 4411 -266
$$ packed form
5547A449j102j426J115M44j389O9K573j32k280M8J971L48j700l02J480N7j771
5564e48J276J747j065l061L91L384R0j841l59N21j498r94K485K689j559l353n00
5581b195J899J56k5J342L07l642j332K984J623q13j420J152k33k182J75L179O37
5598A612k754j148K531Q46k636k24K811M66k397M52K227j404k415J160L348L1
5614B506k785n11J727r85r26K674K459l530l459J747L232j317p39K254j86m149
5630a988j621M259L011k538k989J510J144k669j83M252K18m530p94L253P25l182
5646b122N14K629q62k951J239L066j622l220J986M123j990l957J947K740k501
5661i81j611L935K265m755k852L528L744k270j690K150L86m357m66N850J535m677
$$ plain form
5677 -266 -1927 1062 1395 -1410 290 4063 2170 -3024 -1909 2766 1756 -1653 -37 2760 26
5692 26 -3435 -509 3666 -94 -3954 -506 2738 -980 -3304 -28 1831 -1644 -3069 1331 2364
5707 2364 -2284 -3920 719 2213 -1294 -1778 1708 264 -3747 -1735 3750 2534 -2610 -2115 1687
5722 1687 772 -1994 1025 3932 400 -3991 -521 4202 2226 -1724 822 2629 -787 -1934 2261
5737 2261 4188 -490 -2654 732 2631 -225 -1304 2004 1692 -2366 -1988 2474 1791 -2647 -2309 1934
5753 1934 938 -2297 -1089 1588 -623 -3583 -895 2519 723 -3475 -1932 1145 -219 -1690 735
5768 735 1514 -2155 -3404 461 2440 -296 -1622 281 405 -1622 -928 2491 2432 -1875 -1925 1272 2024
5785 2024 123 -201 1885 875 -2025 -301 2723 1728 -1151 -1085 1385 961 -594 307 1494 -162
$$ packed form
5677b66j661K989L33k805J700L773j893n194J115M675j010l409J616K797k734
5692B6l461K926M175l760l860L448L244l718k324L276J859l475j425M400J033
5707B364m648j636M639J494l507m84L486j444m011K012N485j216n144M95L802
5722A687r15k766L019K907l532m391L470M723j976l950K546J807l416j147M195
5737B261J927m678k164L386J899k856j079L308l12m058L78M462o83m438L38M243
5753A934r96l235J208K677k211k960K688L414j796m198J543L077j364j471K425
5768G35P79l669j249L865J979k736j326J903J24k027O94L419n9m307n0L197P52
5785B024j901l24K086j010k900J724L024r95k879O6K470m24j555R01J187j656
$$ plain form
5801 -162 -1923 112 1910 309 -1696 -442 358 -615 -1095 403 537 -1491 -2575 -3 1628 -648
5817 -648 -2282 -717 204 -998 -1228 512 704 -1789 -2580 -226 1664 225 -975 -445 -128 -621 124
5834 124 1894 1700 -1468 -1753 1002 1578 317 510 1558 246 -1614 523 2871 1680 -488 -803
5850 -803 1445 791 -453 733 2576 239 -2222 226 2433 850 -1829 -437 1324 20 -1035
5865 -1035 160 1052 -1316 -2252 440 1790 -1246 -1760 384 103 -1888 -705 1868 575 -3226 -2170
5881 -2170 1323 1339 -1177 -1026 1037 -479 -2424 327 3197 867 -2686 -1000 1538 326 -540 1291
5897 1291 2010 -1214 -1852 1454 2973 371 -994 991 1765 -1231 -151 2775 1233 -2207 -924 2385
5913 2385 1405 -1597 -956 1469 360 -1876 34 2333 -290 -2993 -530 1904 142 -1515 81
$$ packed form
5801a62j761K035J798j601k005J254Q00r73m80J498J34k028j084K572J631k276
5817f48j634J565R21j202k30J740J92k493p91K354J890j439j200N30L17m93P45
5834A24J770j94l168k85K755N76j261J93J048j312j860K137K348j191k168l15
5850h03K248o54j244J186J843k337k461K448K207j583k679J392J761j304j055
5865a035J195Q92k368r36K692J350l036n14K144k81j991J183K573j293l801J056
5881b170L493J6k516J51K063j516j945K751K870k330l553J686K538j212q66J831
5897A291P19l224o38L306J519k602j365J985P74k996J080K926j542l440J283L309
5913B385r80l002O41K425j109k236J910K299k623k703K463K434j762j657J596
$$ plain form
5928 81 532 -2267 -1815 1827 1885 -1928 -2147 -2 437 -968 -145 1674 -249 -2629 -897 2389 1526
5945 1526 -1547 -481 1424 -33 -896 1554 2465 -158 -1829 921 2077 721 -6 1215 820 -1203
5961 -1203 -85 2095 1472 -1366 -817 1422 802 -788 106 1368 -273 -1837 419 1640 265 -1164
5977 -1164 -1041 -325 -1025 -575 827 -19 -2399 -1736 152 683 -649 -536 -48 -1085 -1725 261 1296
5994 1296 -540 -1722 -976 478 211 -103 680 297 -1088 -1363 955 1593 146 -376 391 305 490 1368
6012 1368 1267 -125 -665 111 1389 847 320 719 512 -659 -402 1767 1567 -551 -1349 220 241 16
6030 16 335 406 -1157 -1454 -337 637 118 -1050 -1094 -741 -921 -461 628 168 -1629 -1512 -19 172 -452
6049 -452 -244 266 -908 -1494 510 1650 357 -1530 -952 351 606 682 775 602 -409 -390 1332 1572
$$ packed form
5928H1M51k799M52L642N8l813k19K145M39j405Q23J819j923k380J732L286q63
5945A526l073J066J905j457q63K450R11k623j671K750J156j356p27J221l95k023
5961a203J118K180o23k838N49K239o20j590Q94J262j641j564K256J221j375j429
5977a164J23P16p00M50J402q46k380O63J888N31j332J13M88j037o40J986J035
5994A296j836j182P46J454k67l14P83l83j385k75K318O38j447n22P67q6J85Q78
6012A368j01j392n40P76J278n42n27L99k07j171K57K169k00k118p98J569K1k25
6030A6L19P1j563k97J117R74n19j168m4L53j80M60J089m60j797J17J493J91o24
6049d52K08N10j174n86K004J140j293j887N78J303K55P6R3j73j011J9J722K40
$$ plain form
6067 1572 234 149 776 33 -191 1310 2126 235 -1046 34 1539 1174 -1 508 456 -651 -395 1383
6085 1383 1604 -549 -1372 157 466 224 720 648 -1017 -1504 -339 936 57 -887 -711 -167 -761 -782 1074
6104 1074 904 -1484 -1899 330 1072 -167 -638 352 -151 -875 166 1344 766 -1117 -802 638 295
6121 295 297 832 1089 -752 -1250 1064 1857 92 -893 462 304 -270 433 1284 681 -1532 -1069 840 1163
6140 1163 -821 -516 199 -596 -1404 55 1145 -448 -1771 -1143 406 -375 -1024 -228 53 -1807 -1519
6157 -1519 799 831 -1449 -2172 -143 236 -905 -327 940 -240 -1969 -659 1556 1613 -315 -485 380
6174 380 185 -13 1164 2113 66 -1578 283 2025 713 264 939 661 -753 -116 2367 1890 -505
6191 -505 -1131 845 1331 -235 -139 1252 607 -1810 -697 1714 818 -1609 -1368 174 -253 -1406 -194
$$ packed form
6067A572j338q5O27p43k24J501Q16j891j281J080J505l65j175N09n2j107K56J778
6085A383K21k153q23J529L09k42M96p2j665m87J165J275q79r44J76N44n94k1J856
6104A074j70k388m15K229P42j239m71R90n03p24J041J178n78j883L15J440l43
6121B95KN35K57j841m98K314P93j765r85J355j58n74P03Q51o03k213M63J909L23
6140A163j984L05P15p95q08J459J090j593j323O28J549p81o49P96K81j860K88
6157a519K318L2k280p23K029L79j141N78J267j180j729J310K215N7j928j70Q65
6174C80j95j98J177R49k047j644J861J742j312m49O75k78j414O37K483m77k395
6191e05o26J976M86j566R6J391o45k417J113K411q96k427K41J542m27j153J212
$$ plain form
6208 -194 373 -1056 -1957 -652 1257 -270 -1902 -586 313 -1266 -1061 1348 1308 -1733 -2545 226 1581
6225 1581 209 -253 231 220 -1284 -242 1899 1853 -814 -1130 826 1175 -42 776 1800 388 -1074
6242 -1074 403 1973 850 -613 -96 1399 607 -816 637 1567 -590 -1797 593 2073 -131 -1720
6258 -1720 -536 613 -350 -823 600 667 -1381 -2243 94 1760 -385 -1479 -328 -232 -1652 -299 1999
6275 1999 720 -2040 -1600 356 688 -503 372 1392 -238 -2372 -7 2672 1372 -1138 -295 1808
6291 1808 208 -712 622 2174 61 -1207 807 2107 32 -1626 125 1575 -27 -860 1026
6306 1026 1031 -1983 -1559 1993 2402 -953 -1864 685 76 -1539 -257 2402 623 -2969 -2592 1394 1608
6323 1608 -1286 -612 1074 -862 -3180 -266 2734 882 -2031 -908 1027 -577 -1226 1147 2309
$$ packed form
6208a94N67j429r01J305J909j527j632J316Q99j579K05K409m0l041q12K771J355
6225A581j372m62M84j1j504J042K141m6k667l16J956L49j217Q18J024j412j462
6242a074J477J570j123j463N17J495p92j423J453R30k157j207K390J480k204j589
6258a720J184J149r63m73J423O7k048q62K337J666k145j094J151R6j420J353K298
6275A999j279k760M40J956L32j191Q75J020j630k134K365K679j300k510Q43K103
6291A808j600r20J334J552k113j268K014J300k075j658J751J450j602q33J886
6306A026Nl014M24L552M09l355r11K549o09j615J282K659j779l592L77L986K14
6323A608k894O74J686j936k318K914L000j852k913J123J935j604o49K373J162
$$ plain form
6338 2309 -650 -2347 949 2401 -1010 -1893 1784 2268 -1158 -1277 1893 1718 -1521 -1024 2866 2418
6354 2418 -1876 -1804 1961 1405 -1314 -67 2945 -114 -3510 -1104 2850 1064 -1645 -537 961 -2206
6370 -2206 -3128 1068 3118 -959 -3808 -680 1102 -1683 -2421 1357 1499 -3027 -3509 1342 1806 -1996
6386 -1996 -2594 1165 783 -2517 -1502 2309 978 -2952 -1273 2921 1048 -2705 -620 2232 85
6401 85 -1948 840 3001 -441 -2719 860 3722 343 -1554 911 2358 -1373 -1573 3136 3487 -1425
6417 -1425 -2581 1437 2203 -855 -600 2420 992 -2512 -1273 3033 1623 -1990 -1434 1661 -104 -2385
6433 -2385 302 2826 -779 -3481 -213 2650 -8 -2426 224 1282 -1428 -2023 1347 2626 -1495
6448 -1495 -2716 898 2311 -542 -907 1486 1564 -1796 -730 2408 1821 -1301 -1020 2002 1165 -1090
$$ packed form
6338B309k959j697L296J452l411q83L677M84l426j19L170j75l239M97L890m48
6354B418m294P2L765n56k719J247L012l059l396K406L954j786k709J108J498l167
6370b206r22M196K050m077k849L128J782k785p38L778J42m526m82M851M64l802
6386a996n98L759l82l300J015L811j331l930J679M194j873l753K085K852k147
6401H5k033K788K161l442k278L579K862l379j897K465J447l731k00M709L51m912
6417a425j156M018P66l058K55L020j428l504J239M306j410l613N56L095j765k281
6433b385K687K524l605k702L268K863k658k418K650J058k710n95L370J279m121
6448a495j221L614J413k853l65K393P8l360J066L138n87l122K81L022q37k255
$$ plain form
6464 -1090 113 2251 140 -1822 443 2991 495 -2419 -602 1810 309 -968 882 1451 -1353
6479 -1353 -2513 458 2084 470 -1685 -680 -79 -1296 -833 1699 1216 -1821 -2732 118 816 -420
6495 -420 -553 860 -210 -2277 -1391 1375 1177 -1233 -932 998 239 -1541 -327 1563 614 -1446 -43
6512 -43 1810 512 -1308 -281 1544 1421 -135 145 944 -645 -1059 1673 2439 78 -1677 -104 433
6529 433 -379 -344 1721 977 -1816 -2645 230 2095 -81 -1255 115 -364 -2585 -1176 1578 1135 -2150
6546 -2150 -2133 -39 632 -1352 -1027 755 -153 -2040 -1241 1392 100 -1715 -661 1150 -17 -1204
6562 -1204 -4 1307 -840 -1485 1276 2522 -110 -2260 565 1997 83 -622 1873 1666 -1389 -1356
6578 -1356 2089 2544 -171 -521 963 294 -926 325 2816 1089 -2070 -931 1469 810 -1018 454
$$ packed form
6464a090J203K138k111j962K265K548k496k914J817K412j501j277J850N69k804
6479a353j160K971J626j614k155J005O01j217M63K532m83l037r11K850O98j236
6495d20j33J413j070k067Q86K766j98k410L01J930p59j780J214J890r49k060J403
6512d3J853j298j820J027J825j23j556K80P99j589m14K732P66k361j755J573N37
6529D33q12L5K065p44k793q29K875J865k176j174J370m79k221J409K754m43l285
6546b150J7K094O71j984L25J782r08j887P99K633j292j815J054J811j167j187
6562a204J200J311k147o45K761J246k632k150K825J432j914p05K495k07l055L3
6578a356L445M55k715l50J484o69j220J251K491j727l159J139K400o59j828J472
$$ plain form
6594 454 1159 -1107 -2513 447 1758 -679 -2413 -113 565 -1339 -1678 664 749 -1971 -2017 1190 1247
6611 1247 -1751 -1625 373 317 -1134 -11 1092 -613 -1952 -674 2093 264 -1058 -94 958 -446
6627 -446 -1173 1195 2141 -438 -2147 614 1725 493 -62 1276 648 -1228 -406 1864 1591 -684 -913
6644 -913 640 765 -561 300 1219 -587 -1650 -93 1191 205 -606 -133 513 -890 -669 778 934
6661 934 -951 -1392 -108 936 60 -688 54 -155 -526 191 970 280 -632 -284 457 191 303 753 635
6680 635 -812 -759 751 1539 808 -202 13 550 19 764 1519 750 -322 -244 613 678 229 138 -37 -313
6700 -313 -36 188 315 -530 -914 -762 -469 -279 -238 109 -1163 -1631 -1016 345 198 -1200 -1047 -832 -745 -419
6720 -419 -77 -163 -778 -859 -702 -211 -484 -166 -411 -964 -890 28 1048 405 -743 -147 -52 29 739 1053 355
$$ packed form
6594D54P05k266j406K960J311k437j734K300O78j904l39K342Q5k720m6L207N7
6611A247k998J26J998n6j451J123J103j705j339J278K767j829j322R64J052j404
6627d46p27K368R46k579j709K761J111j232n55J338o28j876Q22K270k73k275k29
6644i13J553J25j326Q61R19j806j063J557J284r86q11M73O46j403K21J447J56
6661I34j885m41J284J044q76p48P42k09l71P17P79o90r12L48P41k66J12M50j18
6680F35j447N3J510P88p31j010K15N37n31P45P55p69j072P8Q57O5m49r1j75k76
6700c13K77K24J27q45l84J52K93J90M1L47j272m68O15J361j47j398J53K15Q7L26
6720d19L42q6o15q1J57M91k73L18k45n53P4R18J020o43j148N96R5Q1P10L14o98
$$ plain form
6741 355 -732 -317 670 1370 363 165 228 52 281 763 909 299 -426 94 -33 72 789 309 -284 -760
6761 -760 -265 713 624 -346 -1130 -225 -318 -290 -306 263 -451 -1443 -537 315 133 -585 -669 -508 -867 -288 301 579
6783 579 -1034 -1014 -216 476 343 32 217 -141 -624 44 1068 799 -519 -302 477 515 104 968 1024 47
6803 47 -506 606 1224 580 266 375 198 -54 810 1146 396 -688 -471 404 585 -145 12 331 -245 -868
6823 -868 39 1114 65 -1438 -688 -25 -34 -158 93 205 -1368 -1076 421 404 -242 -642 -261 -166 -215 194
6843 194 1148 146 -1381 -665 1458 624 -380 516 691 58 -583 751 1461 -143 -1030 5 960 600
6861 600 63 464 82 -634 -276 1266 1085 -610 -1059 307 62 -733 411 854 -245 -1586 -965 822
6879 822 80 -1116 -725 -157 -638 -1407 111 967 -464 -1318 -502 439 -316 -549 -311 13 -465 -714 804
$$ packed form
6741C55j087M15R87P00j007j98O3j76K29M82J46o10p25N20j27J05P17m80n93m76
6761g60M95R78q9r70p84R05r3K8j6N69p14r92R06Q52j82p18q4J61l59N79N89K78
6783E79j613K0P98O92j33l11J85l58m83O68J024k69j318K17P79L8m11Q64N6r77
6803D7n53J112O18o44l14J09j77k52Q64L36p50j084K17Q75J81p30J57L19n76o23
6823h68R07J075j049j503P50O63rj24K51J12j573K92J497j7o46m00L81R5m9M09
6843A94R54j002j527P16K123q34j004Q96J75o33o41J334P10j604q87J035R55l60
6861F00n37M01l82p16L58J542j81j695m49J366k45p95J144M43j099j341O21J787
6879H22p42j196L91N68m81p69J518Q56j431q54Q16R41p55k33K38L24m78k49J518
$$ plain form
6898 804 885 -942 -959 698 1081 -42 334 997 203 -1070 422 1941 1210 -829 -579 909 738 242
6916 242 732 1614 19 -1424 19 1767 824 -195 -75 343 -826 -585 1135 1111 -527 -1347 152
6933 152 673 -737 -834 329 -5 -1106 -814 466 301 -1808 -1245 452 346 -944 -1077 195 -736 -1468
6951 -1468 -187 1076 434 -1908 -1155 427 171 -60 459 673 -600 -1586 408 2170 560 -715 294
6968 294 598 -180 -366 1331 1580 -574 -1347 893 1586 107 -582 745 686 -907 -972 922 801 -830
6986 -830 -884 1071 952 -846 -647 711 -15 -1644 -337 1667 68 -2200 -551 919 168 -1025 -64
7003 -64 1112 -733 -2249 189 1898 37 -1395 -46 919 -594 -861 1268 1369 -795 -1220 1257
7019 1257 1683 -183 -469 1118 864 -999 49 2273 1217 -1562 -651 1846 1215 -1223 -160 1589
$$ packed form
6898H04Q1j827j7J657L83j123L76O63p94j273J492J519p31k039K50J488j71m96
6916B42M90Q82j595j443J443J748r43j019J20M18j169K41J720k4j638q20J499
6933A52N21j410r7J163l34j101K92J280j65k109N63J697j06j290j33J272r31p32
6951a468J281J263o42k342P53J582k56k31N19K14j273r86J994J762j610j275J009
6968B94L04p78j86J697K49k154p73K240O93j479o89J327n9j593o5J894j21j631
6986h30n4J955j19j798J99J358p26j629J307K004j599k268J649J470p51j193R61
7003f4J176j845j516K438J709j861j432J349R65j513k67K129J01k164m25K477
7019A257M26j866k86J587k54j863J048K224j056k779R11K497o31k438J063J749
$$ plain form
7035 1589 -44 -1589 828 2655 625 -2151 -664 1547 185 -1396 325 1131 -1343 -2408 319
7050 319 1698 -961 -1944 353 696 -1350 -1044 1157 999 -1981 -1746 1538 1346 -2027 -1359 1288 473
7067 473 -1860 -89 2454 220 -2731 -353 2258 1032 -1652 344 1467 -387 -1478 1262 3006
7082 3006 -258 -1789 545 1783 -360 -499 1964 1523 -1971 -1633 2005 2433 -1143 -1300 1038 736
7098 736 -2123 -869 2350 572 -2282 -1172 1947 -208 -2345 -612 1268 -324 -2133 -470 1543
7113 1543 -1055 -2757 -206 1982 -665 -1942 162 663 -1542 -1416 1837 1806 -1867 -1807 1242 1613 -700
7130 -700 -447 1902 667 -2071 -1074 2299 1792 -909 -327 1413 510 -1017 807 2560 477 -1414
7146 -1414 175 2110 375 -791 797 1300 -317 -1436 1077 1566 -1118 -1601 942 1588 -920 -1376
$$ packed form
7035A589j633j545K417J827k030k776J487K211j362j581J721Q06k474j065K727
7050C19J379k659r83K297L43k046L06K201j58k980K35L284j92l373O68K647q15
7067D73k333J771K543k234k951K378K611j226k684J996J123j854j091K740J744
7082C006l264j531K334J238k143j39K463m41l494L38L638M28l576j57K338l02
7098G36k859J254L219j778k854J110L119k155k137J733J880j592j809J663K013
7113A543k598j702K551K188k647j277K104N01k205J26L253l1l673O0L049L71k313
7130g00K53K349j235k738R97L373n07k701N82J740r03j527J824J753k083j891
7146a414J589J935j735j166J588N03j617j119K513M89k684m83K543O46k508m56
$$ plain form
7162 -1376 411 129 -1126 -725 1475 900 -1782 -1859 721 895 -499 -242 727 -478 -1905 -474 1806
7179 1806 241 -925 -391 755 -183 -1059 474 1677 132 -1677 226 1785 708 -514 414 1097
7195 1097 -172 -808 847 1049 -165 -954 735 1344 -170 -1219 149 712 -352 -415 1153 878 -1279
7212 -1279 -1222 751 901 -331 -475 453 -481 -1857 -323 1728 462 -2273 -1198 912 185 -976 17
7229 17 1213 -474 -1859 -518 1319 293 -908 -135 709 -408 -827 1131 1521 -478 -823 1501 1546
7246 1546 -549 -628 1152 1027 -191 158 1907 846 -1286 -931 1774 1479 -905 -424 1182 -85 -1442
7263 -1442 138 2134 217 -1639 -654 751 86 -660 480 301 -1108 -1833 262 1067 -468 -1312 -116
7280 -116 314 -1587 -1027 1181 537 -1628 -1400 909 822 -1086 -760 613 181 -1520 -22 1571 514
$$ packed form
7162a376J787k82j255M01K200n75k682p7K580J74j394K57R69j205j427J431K280
7179A806j565j166N34J146r38q76J533J203j545j809J903J559j077j222R28O83
7195A097j269o36J655K02j214p89J689O09j514j049J368N63j064o3J568k75k157
7212a279N7J973J50j232j44R28r34j376J534K051j266k735J075K110p27j161R93
7229A7J196j687j385J341J837j026j201P73Q44j117m19J958L90j999l45K324M5
7246A546k095p9J780j25j218L49J749j061k132L55K705k95k384M81J606j267j357
7263a442J580J996j917j856R85J405o65p46J140j79j409p25K095Q05j535q44J196
7280a16M30j901N60K208o44k165K28K309q7j908L26J373m32j701J498J593j057
$$ plain form
7297 514 -1539 -336 1761 422 -797 415 997 -108 -656 1072 1502 -27 -1079 574 879 -201
7313 -201 16 1553 714 -1346 -683 1456 1455 -784 -698 315 64 -733 377 1172 -204 -1479 -477 798
7331 798 -58 -835 -70 252 -1016 -1410 718 795 -1085 -1447 24 290 -87 -86 251 -136 -1021 -458 1042
7350 1042 652 -836 -427 621 546 -572 435 787 51 -561 497 1176 712 -25 25 -83 46 -3 1007
7369 1007 701 -678 -754 94 689 94 -195 340 -81 -579 -89 436 293 -705 -532 -89 202 -236 -35 -161
7389 -161 -838 -917 -90 316 -127 -793 -319 -595 -461 14 410 -191 -449 -488 209 461 70 231 111 -173 -209
7410 -209 235 755 381 -274 -475 -26 864 826 319 -161 -59 502 790 273 422 206 -201 81 468 638
7430 638 654 -247 -227 -227 -67 345 288 -70 -788 -284 63 276 -222 -347 -580 -357 -74 -93 -172 -527 -912 -662
$$ packed form
7297E14k053J203K097j339j219J212N82j105n48J728M30j529j052J653L05j080
7313b01K17J537q39k060O63K139jk239Q6J013k51p97J110P95j376j275J002J275
7331G98q56p77P65L22j268l94K128P7j880l62J471K66l77JL37l87q85N63J500
7350A042l90j488M09J048p5j118J007L52p36o12J058O79m64p37N0j08J29m9J010
7369A007l06j379p6Q48N95n95k89N35m21m98M90N25j43r98J73M43K91m38K01j26
7389a61o77p9Q27M06m43o66M74k76J34M75L96o01k58l9O97K52l91J61j20k84l6
7410b09M44N20l74o55k01M49Q90l8n07m80J02N61K88n17J49k16m07K82L87J70
7430F38J6r01K0%J60M12n7l58p18N04L47K13m98j25k33K23K83j9p9l55l85K50
$$ plain form
7452 -662 304 80 -432 -362 -393 -202 -580 348 350 -296 -439 -251 151 174 493 302 -377 -278 131 809 447 -9
7474 -9 129 522 34 -24 799 927 -73 -409 149 879 475 119 -188 -11 -415 32 793 278 -700 -929 17
7495 17 222 -372 -116 256 -582 -762 38 284 -191 -992 -742 -214 -512 -392 300 -4 -742 -1133 -24 451
7515 451 -270 -505 -159 -169 -364 169 640 263 -416 -120 390 385 146 428 239 -56 -495 794 1280 -14
7535 -14 -354 82 552 210 -40 131 24 -489 -451 546 1040 -268 -470 -84 41 -226 -20 524 -178 -1212
7555 -1212 -316 369 86 -361 -449 -16 -844 -614 544 626 -327 -1044 -754 405 -277 -344 -153 18 -994 -427
7575 -427 676 512 -399 -490 55 289 371 126 876 33 -771 123 1433 556 -184 -95 279 3 -206 802
7595 802 1127 28 -311 246 986 92 -368 236 414 -799 -802 894 802 -726 -667 -296 70 -385 -147 -180
$$ packed form
7452f62R66k24n12P0l1J91l78R28Ko46j43J88M02K3L19j91o79R9M09O78l62m56
7474iJ38L93m88n8Q23J28j000l36N58P30m04l56l07J77m04M47P61n15r78k29R46
7495A7K05n94K56L72q38j80Q00K46m75q01K50N28k98J20O92l04p38l91J109M75
7515D51p21k35L46j0j95N33M71l77o79K96N10nk39K82j89k95m39J289M86j294
7535a4l40M36M70l42k50J71j07n13L8R97M94j308k02L86J25k67K06N44p02j034
7555a212Q96O85k83m47q8M33q28K30J158Q2r53p17K90J159o82o7J91J71j012N67
7575d27J103j64r11r1N45K34Q2k45P50q43q04Q94J310q77p40Q9L74k76k09J008
7595H02L25j099l39N57P40q94m60O04J78j213lJ696r2j528N9L71L66m55K38l3
$$ plain form
7615 -180 -479 -1004 -485 538 81 -1134 -577 -116 -407 -771 5 469 -307 -998 84 889 -25 -620 -487
7634 -487 525 235 -176 605 1012 -303 -968 148 1355 336 -182 329 177 -403 282 1119 882 -562
7652 -562 -269 622 690 -145 -116 682 184 -740 -179 1214 586 -1003 -472 476 -158 -298 -271 256 -416 -962
7672 -962 21 931 -45 -983 -240 178 -339 -501 381 647 -922 -872 448 923 -213 -681 187 729 -536
7691 -536 -458 1223 773 -818 -812 1188 1104 -335 -51 855 260 -631 365 1341 612 -947 -345 809 495
7710 495 -444 433 850 -601 -1271 390 1460 -413 -1175 43 580 -740 -847 366 732 -1404 -1499 307
7728 307 1362 -747 -1357 399 46 -1069 -787 1265 604 -1468 -767 659 504 -1178 -102 777 -167
7745 -167 -1568 174 1919 60 -1623 432 1621 15 -820 892 1291 -734 -971 1240 1914 -470
$$ packed form
7615a80k99n25N19J023m57j215N57M61k91l64P76M64p76o91J082Q05r14n95J33
7634d87J012k90m11P81M07j315o65J116J207j019n18N11j52n80O85Q37k37j444
7652e62K93Q91O8q35K9P98m98r24N61J393o28j589N31R48o34j40K7N27o72n46
7672i62R83R10r76r38P43M18n17j62Q82K66j569N0J320M75j136m68Q68N42j265
7691e36P8J681m50j591OK000q4j439K84R06n95q91R96R76p29j559O02J154l14
7710D95r39Q77M17j451o70J661J070j873p62J218N37j320j07J213L66k136r5J806
7728C07J055k109o10J756l53j115K82K052o61k072P01J426j55j682J076Q79r44
7745a67j401J742J745j859j683K055J189j606q35J712L99k025k37K211O74k384
$$ plain form
7761 -470 -1050 440 1415 -611 -604 1506 852 -1386 -725 1816 922 -1050 -384 941 6 -1570 39 1775
7779 1775 33 -1602 -607 1114 -352 -1803 131 1410 -670 -1869 505 1336 -558 -1840 574
7794 574 910 -821 -896 469 739 -1232 -493 1666 1077 -1561 -951 1036 964 -428 414 1604 -90 -1757
7812 -1757 167 1905 981 -640 -6 993 -420 -822 1128 2184 -260 -1623 -34 1421 36 -821
7828 -821 460 732 -1104 -869 533 820 -855 -951 833 608 -1220 -709 921 113 -1280 -236 834
7845 834 204 -1312 -766 691 395 -1178 -188 798 -688 -1271 369 1611 280 -1014 -182 684 -175
7862 -175 -281 1057 1406 -583 -976 610 906 256 -267 874 692 -932 -666 1252 941 -761 -801 610
7880 610 541 -684 -424 618 497 -859 -571 418 -230 -1340 -935 635 40 -778 -424 396 -359 -1220 270
$$ packed form
7761d70n80J490R75k026PK110o54k238O61K541q94j972O66J325r35j576J609J736
7779A775j742j635R95J721j466j451J934J279k080j199K374Q31j894j282K414
7794E74L36j731p5J365K70j971P39K159n89k638O10J987p2j392Q42J190j694j667
7812a757J924J738r24j621O34R99j413m02J950J056k444j363J589J455j385q57
7828h21J281K72j836K35J402K87j675r6J784k25j828N11J630q08j393J044J070
7845H34o30j516N46J457k96j573R90R86j486n83J640J242j331j294Q32Q66q59
7862a75j06J338L49j989l93J586K96o50n23J141j82j624K66J918l11j702m0J411
7880F10o9j225K60J042j21j356K88R89o48j110M05J570n95q18L54Q20p55q61J490
$$ plain form
7899 270 1067 -315 -1281 -339 234 -357 -582 405 506 -1000 -1334 542 1217 21 -480 33 375 -606 -336
7918 -336 1493 1295 -494 -805 567 887 -125 180 1173 287 -618 161 1406 650 -588 90 1033 66
7936 66 -640 341 840 -199 -1081 234 1024 -114 -1354 -6 767 -493 -726 363 285 -1024 -1310 76
7954 76 901 -820 -1049 -175 -223 -1219 -483 900 -6 -1022 -694 510 360 -709 -180 632 -552 -1035 314
7973 314 997 -31 -1012 -39 997 231 -292 418 814 -328 -636 987 1128 -397 -657 676 627 -32
7991 -32 148 1207 307 -1025 -587 1025 448 -656 -144 576 -158 -1084 486 1122 -13 -1273 -178 1010
8009 1010 137 -701 -88 250 -945 -487 496 933 -437 -756 154 339 -224 -194 727 232 -770 -307 817
8028 817 779 -275 -311 465 144 -292 534 892 272 -754 25 982 293 2 298 357 89 -86 746 659 -69
$$ packed form
7899B70P97j382r66R42N73n91k25R87J01j506l34J876O75j196n01N13L42r81K70
7918c36J829j98j789l11J372L20j012L05R93q86r05P79J245p56j238O78R43r67
7936F6p06R81M99j039q82J315P90j138j240J348P73j260k33J089p8j309k86J386
7954G6Q25j721k29Q74m8r96P36J383r06j016L28J204j50j069N29Q12j184m83J349
7973C14O83j028r81R73J036p66n23P10L96j142l08J623J41j525k60J333m9o59
7991c2J80J059r00j332M38J612n77j104N12P20p34r26J570O36j135j260J095J188
8009A010q73q38O13L38j195M58R83M37j370l19R10J85n63L0R21m95j002M63J124
8028H17l8j054l6P76l21m36Q26L58o20j026P79R57o89k91K96N9k68j75Q32q7p28
$$ plain form
8049 -69 -340 221 505 -116 -177 298 521 -453 102 645 202 -629 -523 -96 93 -527 67 -21 -518 -615 -44
8070 -44 405 194 -281 -738 -100 -583 -6 262 397 -268 -199 226 275 4 194 172 -252 -154 381 750 290 -248
8092 -248 30 293 608 18 459 480 12 -117 -101 677 -10 -246 -167 -305 201 193 188 74 20 -487 -269 -123 -209
8115 -209 -81 -661 -540 -417 106 -23 -135 -932 -486 -407 85 -151 -605 -436 -597 -456 -428 -63 165 -307 -775
8136 -775 25 278 437 120 -335 -145 170 259 76 327 40 -54 206 739 497 221 222 132 458 604 604 420
8158 420 79 -265 391 435 25 160 187 -44 -222 115 457 621 -214 -620 -93 7 270 -56 -176 -339 -504
8179 -504 -103 293 -26 -466 -338 -191 -82 -92 338 159 -224 -325
$$ packed form
8049f9k71N61K84o21o1M75K23r74N55N43m43q31J06M27J89o20N94q8m97r7N71
8070d4M49k11m75m57O38m83N77K68J35o65O9M25M9k71J90k2m24R8N35L69m60n38
8092b48K78K63L15n90M41K1m68j29J6P78o87k36P9j38N06qnj14n4n07K18J46q6
8115b09J28n80J21J23N23j29j12p97M46P9M92k36m54J69j61J41K8L65K28m72m68
8136g75Q00K53J59l17m55J90L15Q9j83K51k87r4K60N33k42k76Jr0L26J46%j84
8158D20l41l44O56M4m10J35K7k31j78L37L42J64q35m06N27J00K63l26j20j63j65
8179e04M01L96l19m40J28J47J09j0M30j79l83j01
8191c25
$$ Imaginary data points
##PAGE= N=2
##DATA TABLE= (X++(I..I)), XYDATA
$$ plain form
0 0 0 0 0 8 -8 0 -8 16 -17 24 -25 40 -48 55 -65 81 -99 115 -133 159 -190 218 -244 290 -332 377 -426 486
28 486 -551 623 -696 785 -880 981 -1091 1215 -1352 1505 -1660 1841 -2044 2261 -2499 2768
44 2768 -3071 3410 -3791 4227 -4738 5331 -6033 6888 -7950 9311 -11121 13650 -17461
57 -17461 23817 -36327 70171 -346777 -967114 93756 579783 -62794 -346575 242942
67 242942 172395 -524877 -403634 418852 376777 -242021 -99167 369678 -91232 -630578
77 -630578 23896 825748 301894 -496797 -158956 413900 43335 -317541 225984 617860
87 617860 67640 -325976 89663 285404 -144038 -84737 593714 537747 -332429 -475415
97 -475415 279336 467935 -69215 -59200 448707 260108 -392196 -294102 311345 329798 -9257
$$ packed form
0@%%%Qj6QqK4l3M1m9O5q8J03j20J46j80K14k48K92l49M08m62N34o22P09q03R12
28D86j037J174j319J481j665J861k072K306k567K857l165L501l885M305m760N267
44B768n839O481p201Q018q965J0069j1364J2921j4838J7261k0432K4771l1111
57a7461M1278o0144J06498m16948o20337J060870M86027o42577k83781N89517
67B42942p0547o97272J21243Q22486m2075o18798J42854M68845m60910n39346
77f30578O54474Q01852n23854p98691L37841N72856l70565l60876N43525L91876
87F17860n50220l93616M15639J95741m29442N9301O78451n5967q70176j42986
97d75415P54751J88599n37150J0015N07907j88599o52304R8094O05447J8453l39055
$$ plain form
108 -9257 104082 234710 -228022 -495122 114325 605641 129790 -375099 -72848 206844
118 206844 -168166 -337755 167615 414817 -41935 -343527 -95071 25279 -161357 -47702
128 -47702 289688 128488 -346264 -291211 139022 111211 -217605 -86590 271624 114683
138 114683 -307451 -267086 76557 135303 8854 60684 92088 -131309 -250144 14254 240498
149 240498 84483 -75526 61653 114091 -136448 -216439 115253 347066 131448 -144855
159 -144855 -114306 27538 43040 53242 138965 114283 -51950 -98173 33320 73924 -24120
170 -24120 1639 141802 92099 -125452 -154329 45259 134159 2335 -83104 6855 55067
181 55067 -56494 -117960 -16720 48714 -11614 -21567 30936 -45939 -179261 -93926 120913
$$ packed form
108i257J13339J30628m62732k67100O09447M91316m75851n04889L02251K79692
118B06844l75010j69589N05370K47202m56752l01592K48456J20350j86636J13655
128d7702L37390j61200m74752N5053M30233k7811l28816J31015L58214j56941
138A14683m22134M0365L43643N8746j26449N1830L1404k23397j18835K64398K26244
149B40498j56015j60009J37179N2438k50539p9991L31692K31813k15618k76303
159a44855L0549J41844J5502J0202Q5723k4682j66233m6223J31493M0604r8044
170b4120K5759J40163m9703k17551k8877J99588Q8900j31824q5439Q9959M8212
181E5067j11561o1466J01240O5434o0328r953N2503p6875j33322Q5335K14839
$$ plain form
192 120913 109956 -100495 -146313 3139 22471 -108834 -75445 105333 79785 -125955 -142090
203 -142090 13722 24198 -54090 16427 80170 -73468 -180217 791 154001 -10154 -173704
214 -173704 -21938 133623 -18117 -162725 -7855 117907 -41039 -135482 36369 106195
224 106195 -73838 -125667 47090 70690 -92292 -68556 118232 66365 -162778 -122596 127541
235 127541 121210 -92687 -79463 84360 23271 -113213 7605 156347 15337 -135124 5622
246 5622 141083 1400 -103479 58803 152602 -31777 -125232 74884 175788 -18315 -114010
257 -114010 59156 129747 -16106 -37638 96784 62253 -91960 -32468 143745 91548 -86044
268 -86044 -51805 88532 31184 -89009 7212 130775 1916 -148842 -37515 98292 3633
$$ packed form
192A20913j0957k10451m5818J49452J9332j31305L3389J80778k5548k05740j6135
203a42090J55812J0476p8288P0517O3743j53638j06749J81008J53210j64155j63550
214a73704J51766J55561j51740j44608J54870J25762j58946r4443J71851O9826
224A06195j80033n1829J72757K3600j62982K3736J86788n1867k29143M0182K50137
235A27541o331k13897J3224J63823o1089j36484J20818J48742j41010j50461J40746
246E622J35461j39683j04879J62282R3799j84379r3455K00116J00904j94103r5695
257a14010J73166P0591j45853k1532J34422l4531j54213N9492J76213n2197j77592
268h6044L4239J40337n7348j20193R6221J23563j28859j50758J11327J35807r4659
$$ plain form
279 3633 -93207 -876 43588 -83407 -119121 26161 68251 -80251 -135467 -7502 37662
290 37662 -76465 -100317 5540 509 -105943 -74040 40988 3293 -106297 -70042 22752
301 22752 -7008 -58934 807 46858 -36918 -94983 5328 100446 35703 -44063 3459 51415
313 51415 5655 3113 87458 97420 8608 -13530 59129 90826 57106 52411 78616 61443 25039
326 25039 51376 105874 87647 29544 38133 82726 71542 44877 62853 68489 27776 18495 64435
339 64435 84237 42732 1766 7948 31949 36490 32564 35384 17668 -22161 -27574 11827 33991
352 33991 14755 -10059 -28957 -40479 -25105 5637 7030 -19534 -42654 -47147 -34329 -17663
364 -17663 -15510 -25656 -38282 -49643 -45902 -24270 -15722 -32553 -49132 -50819 -38873 -17532 -12304
$$ packed form
279C633r6840R2331M4464j26995l5714J45282M2090j48502n5216J27965M5164
290C7662j14127k3852J05857n031j06452L1903J15028l7695j09590L6255R2794
301B2752k9760n1926N9741M6051q3776n8065J00311R5118o4743p9766M7522M7956
313E1415m5760k542Q4345R962q8812k2138P2659L1697l3720m695K6205j7173l6404
326B5039K6337N4498j8227n8103Q589M4593j1184k6665J7976N636m0713r281M5940
339F4435J9802m1505m0966O182K4001M541l926K820j7716l9829n413L9401K2164
352C3991j9236k4814j8898j1522J5374L0742J393k6564k3120m493J2818J6666
364a7663K153j0146j2626j1361L741K1632Q548j6831j6579j687J1946K1341N228
$$ plain form
377 -12304 -37672 -56400 -44416 -28377 -21917 -13074 -15773 -40807 -58479 -42515 -8343 7755 -11923
390 -11923 -42785 -48458 -33117 -17425 -566 4001 -21604 -46933 -34871 -10525 -2692 -1431 -6221
403 -6221 -25733 -36292 -16099 11057 11478 -13976 -28793 -12587 7144 4647 882 6241 -5953
416 -5953 -21849 -456 31980 27319 -916 -13404 -6392 10275 28924 33847 16588 -8462 -14007
429 -14007 9391 33816 29833 15437 8374 -5734 -15416 12501 45094 26031 -15833 -19537 3074
442 3074 10998 7646 8461 2765 -17520 -26940 -3077 20036 1698 -28073 -23960 -8507 -10925 -4087
456 -4087 8928 -12236 -44431 -27651 12126 12140 -11990 -13918 -6839 -21315 -24874 16139 47395
469 47395 6008 -45712 -18134 35717 29004 5094 22264 26918 -7880 -6108 46276 60683 18310
$$ packed form
377a2304k5368j8728J1984J6039O460Q843k699k5034j7672J5964L4172J6098j9678
390a1923l0862n673J5341J5692J6859M567k5605k5329J2062K4346P833J261m790
403f221j9512j0559K0193K7156M21k5454j4817J6206J9731k497l765N359j2194
416e953j5896K1393L2436m661k8235j2488P012J6667J8649M923j7259k5050n545
429a4007K3398K4425l983j4396p063j4108r682K7917L2593j9063m1864l704K2611
442C074P924l352Q15n696k0285r420K3863K3113j8338k9771M113J5453k418O838
456d087J3015k1164l2195J6780L9777J4k4130j928P079j4476l559M1013L1256
469D7395m1387n1720K7578N3851o713k3910J7170M654l4798J772N2384J4407m2373
$$ plain form
482 18310 2443 32550 40054 16339 30852 69269 43294 -14421 10866 80289 63224 687
494 687 12713 52652 25259 734 50015 73517 938 -44727 21680 76881 22220 -28771
506 -28771 14011 35746 -28593 -41249 42491 56091 -36163 -62628 3104 10310 -37348 -12334
518 -12334 36100 -23044 -101289 -39965 57574 8370 -90295 -49891 33006 -16858 -86532 -19023
530 -19023 45256 -32157 -89836 -8297 40844 -36797 -68056 12743 28527 -57419 -54548 53449
542 53449 48584 -77198 -80316 51867 70913 -35461 -43283 33427 5218 -59373 10037 94206
554 94206 15323 -82524 -18757 66988 7968 -50956 35377 91338 -26295 -108718 5635 105386
566 105386 25774 -49015 5857 27111 -40441 -24689 70774 51427 -55190 -40726 60847
$$ packed form
482A8310j5867L0107P504k3715J4513L8417k5975n7715K5287O9423j7065o2537
494F87J2026L9939k7393k4525M9281K3502p2579m5665O6407N5201n4661n0991
506b8771M2782K1735o4339j2656Q3740J3600r2254k6465O5732P206m7658K5014
518a2334M8434n9144p8245O1324R7539m9204r8665M0404Q2897m9864o9674O7509
530a9023O4279p7413n7679Q1539M9141p7641l1259Q0799J5784q5946K871J07997
542E3449m865j25782l118J32183J9046j06374p822P6710k8209o4591O9410Q4169
554I4206p8883r7847O3767Q5745n9020n8924Q6333N5961j17633q2423J14353R9751
566A05386p9612p4789N4872K1254o7552J5752R5463j9347j06617J4464J01573
$$ plain form
577 60847 37461 -65311 -30951 85617 55761 -62592 -42331 58267 31915 -47111 -4315
588 -4315 67032 20416 -39745 272 29800 -25237 -30541 66279 89443 -35786 -109825 -14022
600 -14022 78028 33247 -20322 8078 7586 -57627 -56435 24613 52281 3495 -22090 -20322 -53756
613 -53756 -75437 -2600 83623 35997 -90390 -107708 -11667 26064 -26520 -39920 5347 3104
625 3104 -55997 -76357 -35270 249 739 -1513 -6478 -44705 -80773 -39595 34017 25445 -34844
638 -34844 -22618 26710 -11306 -86630 -46222 76294 99588 1050 -63408 -34053 -4039 8752
650 8752 68584 109704 20734 -81831 -28038 72510 43932 -2686 78622 126988 -12785 -130774
662 -130774 -11688 156112 114860 -11238 -2799 39443 -23858 -38595 83947 118277 -14298
$$ packed form
577F0847k3386j02772L4360J16568k9856j18353K0261J00598k6352p9026M2796
588d315P1347m6616o0161M0017K9528n5037n304R6820K3164j25229p4039R5803
600a4022R2050m4781n3569K8400m92o5213J192Q1048K7668m8786k5585J768l3434
613e3756k1681P2837Q6223m7626j26387j7318R6041L7731n2584j3400M5267k243
625C104n9101k0360M1087L5519M90k252m965l8227l6068M1178P3612q572o0289
638c4844J2226M9328l8016p5324M0408J22516K3294r8538o4458K9355L0014J2791
650H752N9832M1120q8970j02565N3793J00548k8578m6618Q1308M8366j39773j17989
662a30774J19086J67800m1252j26098Q439M2242o3301j4737J22542L4330j32575
$$ plain form
673 -14298 -50083 65589 49291 -102000 -62765 143187 135241 -84419 -121817 45218 59170
684 59170 -77366 -37071 118217 53213 -122395 -73143 60488 -14741 -94773 67230 162966
695 162966 -66556 -235807 -31331 171641 38475 -105030 17596 88249 -90443 -149296
705 -149296 69143 155935 -27592 -81975 64462 26685 -152960 -45170 216989 128118 -166563
716 -166563 -124995 131349 90125 -120723 -35614 173257 64646 -147093 -45984 121939
726 121939 1890 -105997 79733 170356 -78463 -197238 52758 175431 -53358 -139409
736 -139409 98897 150865 -122777 -191549 72058 151056 -52851 -76629 85093 3367 -194486
747 -194486 -51653 207774 77903 -190198 -86511 133243 3946 -184866 -5792 202791
$$ packed form
673a4298l5785J15672j6298j51291L9235K05952p946k19660l7398J67035J3952
684E9170j36536M0295J55288o5004j75608M9252J33631p5229q0032J62003R5736
695A62966k29522j69251K04476K02972j33166j43505J22626P0653j78692n8853
705a49296K18439Q6792j83527n4383J46437l7777j79645J07790K62159q8871k94681
716a66563M1568K56344m1224k10848Q5109K08871j08611k11739J01109J67923
726A21939j20049j07887J85730R0623k48819j18775K49996J22673k28789q6051
736a39409K38306N1968k73642o8772K63607P8998k03907k3778J61722q1726j97853
747a94486J42833K59427j29871k68101J03687K19754j29297j88812J79074K08583
$$ plain form
757 202791 19596 -204046 -60082 116438 -8704 -100663 69675 110367 -119734 -157119
767 -157119 97364 137735 -108114 -126140 122846 122176 -140384 -147024 104706 120089 -87627
778 -87627 -73376 99466 29502 -144922 -40875 140595 32954 -125814 -4717 118172
788 118172 -48742 -172969 27109 188581 9763 -164681 -39782 85683 -21446 -75225
798 -75225 68997 92072 -91022 -121800 58669 85404 -67490 -52280 105226 55700 -133165
809 -133165 -89787 118087 109771 -68890 -68327 71152 48050 -65915 -12635 96267 29964
820 29964 -61874 21575 95601 -13100 -86606 41069 132672 15242 -81325 14376 90409
831 90409 -4880 -62680 47949 107093 -4346 -71956 10745 49726 -16262 -8813 76729 41489
$$ packed form
757B02791j83195k23642J43964J76520j25142r1959J70338M0692k30101l7385
767a57119K54483M0371k45849j8026K48986o70k62560o640K51730J5383k07716
778h7627J4251J72842o9964j74424J04047J81470j07641j58768J21097J22889
788A18172j66914j24227K00078J61472j78818j74444J24899J25465j07129n3779
798g5225J44222K3075j83094l0778J80469K6735j52894J5210J57506m9526j88865
809a33165M3378K07874q316j78661N63J39479k3102j13965N3280J08902o6303
820B9964r1838Q3449P4026j08701p3506J27675R1603j17430r6567R5701P6033
831I0409r5289n7800J10629N9144j11439o7610Q2701L8981o5988P449Q5542l5240
$$ plain form
843 41489 -88088 -77227 61705 83963 -30476 -58646 24396 23646 -63511 -46239 54470 43093
855 43093 -52850 -51939 14384 -2956 -49756 -2148 50119 -14065 -84483 -21273 60255 3389
867 3389 -78685 -21050 63723 11407 -67947 -21340 42796 -2519 -43653 18887 55893 -17812
879 -17812 -61791 9123 56514 -1944 -30978 36154 49914 -42479 -61587 47556 86896 -6886
891 -6886 -47826 17098 31086 -24769 -6358 65324 35962 -55880 -36809 54542 39089 -41863
903 -41863 -14748 60465 13152 -71256 -15692 74686 21166 -66266 -19762 52164 6769 -48730
915 -48730 2036 42561 -20831 -54378 24057 59997 -27132 -67559 16511 53361 -21980 -39888
927 -39888 36047 34911 -50727 -42815 50842 50615 -34455 -36347 31338 20394 -39302 -5563 63218
$$ packed form
843D1489j29577J0861J38932K2258j14439k8170Q3042p50q7157J7272J00709j1377
855D3093r5943R11O6323j7340m6800M7608N2267o4184p0418O3210Q1528n6866
867C389q2074N7635Q4773n2316p9354M6607O4136m5315m1134O2540L7006p3705
879a7812m3979P0914M7391n8458k9034O7132J3760r2393j9108J09143L9340r3782
891f886m0940O4924J3988n5855J8411P1682k9362r1842J9071R1351j5453q0952
903d1863K7115P5213m7313q4408N5564R0378n3520q7432M6504P1926m5395n5499
915d8730N0766M0525o3392l3547P8435L5940q7129m0427Q4070L6850p5341j7908
927c9888P5935j136q5638P912R3657k27q5070j892O7685j0944n9696L3739O8781
$$ plain form
940 63218 17274 -66094 -24514 59328 25912 -42206 -8913 37708 -8526 -45880 11721 48998
952 48998 -12707 -55034 -566 36283 -12896 -37664 13374 21430 -43027 -44578 31515 36118 -40481
965 -40481 -51661 10898 18565 -28182 -19909 22805 1401 -50348 -25802 35273 21416 -33516
977 -33516 -23351 17255 -799 -26934 10560 38806 -7072 -41176 1191 38063 9816 -15343
989 -15343 9086 21563 -9945 -14524 30643 40581 -9693 -27276 17223 35302 2271 -5586 20630
1002 20630 13754 -17081 -5350 31813 25200 -13702 -18667 9164 13494 -3264 2070 13885 -8621
1015 -8621 -30141 -4312 25522 5516 -22783 -14283 -483 -10446 -13003 7120 10752 -19065 -34946
1028 -34946 -7300 18270 2875 -18021 -9201 -1925 -13329 -8730 15167 13562 -13037 -19443 1415
$$ packed form
940F3218m5944q3368M1580Q3842l3416o8118L3293M6621m6234l7354N7601L7277
952D8998o1705m2327N4468L6849m9179k4768N1038Q056o4457j551P6093M603p6599
965d0481j1180O2559P667m6747Q273M2714k1404n1749K4546O1075j3857n4932
977c3516J0165M0606j8054k6135L7494K8246m5878l4104M2367L6872k8247k5159
989a5343K4429J2477l1508m579M5167R938n0274j7583M4499J8079l3031p857K6216
1002B0630o876l0835J1731L7163o613l8902m965K7831M330j6758N334J1815k2506
1015h621k1520K5829K9834k0006k8299Q500J3800r963k557K0123L632k9817j5881
1028c4946K7646K5570j5395k0896Q820P276j1404M599K3897j605k6599o406K0858
$$ plain form
1041 1415 13957 9128 3892 4494 -1032 -6576 7536 26384 17492 -6023 -3650 12392 12859 9411
1055 9411 17374 15566 -3718 -8609 11391 26421 14863 -4634 -6354 3322 6281 5226 10234 6586
1069 6586 -11030 -16030 -647 9706 4938 -4504 -13071 -17012 -8522 4095 4650 -6684 -17879 -17563
1083 -17563 -6791 222 -670 -3440 -9457 -17872 -14038 2821 9822 -884 -12197 -13741 -6520 6400
1097 6400 11207 2852 -5771 -6230 -3012 4555 13933 13347 1090 -8143 -3984 11043 20577 11381 -2220
1112 -2220 -2374 2902 5652 12418 15481 3694 -8007 -4422 5588 9644 10442 3760 -9178 -13930
1126 -13930 -2296 12197 10310 -7790 -17690 -8164 -123 -2898 -316 2027 -11741 -23090 -9256
1139 -9256 6809 1959 -8481 -10274 -11823 -13139 -2685 9948 5474 -13897 -19277 -1748 10362
$$ packed form
1041A415J2542m829n236O02n526n544J4112J8848q892k3515K373J6042M67l448
1055I411P963j808j9284m891K0000J5030j1558j9497j720R676K959j055N008l648
1069F586j7616n000J5383J0353m768r442q567l941Q490J2617N55j1334j1195L16
1083a7563J0772P013q92k770o017q415L834J6859P001j0706j1313j544P221J2920
1097F400M807q355q623m59L218P567R378n86j2257r233M159J5027R534r196j3601
1112b220j54N276K750O766L063j1787j1701L585J0010M056P98o682j2938m752
1126a3930J1634J4493j887j8100r900R526Q041k775K582K343j3768j1349J3834
1139i256J6065m850j0440j793j549j316J0454J2633m474j9371n380J7529J2110
$$ plain form
1152 10362 4279 1858 3675 -7456 -12875 10572 27257 7033 -11222 1195 13641 5848 4946
1165 4946 19001 18114 -4935 -10765 13904 27275 9626 -917 7355 1749 -7499 13570 31680
1178 31680 1320 -27862 -4435 24315 7729 -14046 -420 9272 -13419 -22082 8226 21364
1190 21364 -12687 -30350 -2740 6119 -17724 -10673 19094 -2253 -44988 -23575 27354 16395
1202 16395 -26187 -21403 5653 -5736 -21025 8287 26727 -13607 -38464 5460 31942 -9155
1214 -9155 -24408 22593 27740 -28085 -29881 33201 41067 -17384 -28538 18090 24811 -9696 -2106
1227 -2106 28117 2026 -33416 7521 51708 4071 -45966 -1178 42896 -743 -33966 14311
1239 14311 37604 -20245 -45813 12202 40026 -8505 -28486 10752 7345 -40087 -17672 50861
$$ packed form
1152A0362o083k421J817j1131n419K3447J6685k0224j8255J2417J2446p793r02
1165D946J4055q87k3049n830K4669J3371j7649j0543Q272n606r248K1069J8110
1178C1680l0360k9182K3427K8750j6586k1775J3626R692k2691q663L0308J3138
1190B1364l4051j7663K7610Q859k3843P051K9767k1347m2735K1413N0929j0959
1202A6395m2582M784K7056j1389j5289K9312J8440m0334k4857M3924K6482m1097
1214i155j5253M7001N147n5825j796O3082P866n8451j1154M6628O721l4507P590
1227b106L0223k6091l5442M0937M4187m7637n0037M4788M4074m3639l3223M8277
1239A4311K3293n7849k5568N8015K7824m8531j9981L9238l407m7432K2415O8533
$$ plain form
1251 50861 26036 -56420 -43717 31006 25176 -28672 -12983 27216 -2386 -40691 -4522 34958
1263 34958 987 -28683 9596 27393 -22851 -33542 33361 46962 -26362 -43443 28333 48322
1275 48322 -14775 -33414 16647 30121 -4781 -4251 23374 3564 -31076 -1329 44750 17427
1287 17427 -30463 -9028 25499 -4904 -32422 10473 44285 977 -43283 -23500 9517 7259
1299 7259 1882 10654 -6526 -41329 -30066 20776 26261 -18857 -30132 3154 5952 -25198 -23687
1312 -23687 11871 20678 -6135 -24401 -14494 2016 6562 3547 648 -3174 -2564 6570 9345 -5089
1326 -5089 -12895 8860 33545 24264 -10523 -25881 1080 33051 27425 4130 5337 13608 -4333
1339 -4333 -15249 14446 41318 23713 -3398 -4544 -5319 -14019 8725 53003 39151 -32770 -50462
$$ packed form
1251E0861k4825q2456J2703P4723n830n3848J5689M0199k9602l8305L6169L9480
1263C4958l3971k9670L8279J7797n0244j0691O6903J3601p3324j7081P1776J9989
1275D8322o3097j8639N0061J3474l4902N30K7625j9810l4640K9747M6079k7323
1287A7427m7890K1435L4527l0403k7518M2895L3812m3308m4260J9783L3017k258
1299G259n377Q772j7180l4803J1263N0842N485m5118j1275L3286K798l1150J511
1312b3687L5558Q807k6813j8266R907J6510M546l015k899l822O10R134K775j4434
1326e089p806K1755K4685r281l4787j5358K6961L1971n626k3295J207Q271j7941
1339d333j0916K9695K6872j7605k7111j146p75q700K2744M4278j3852p1921j7692
$$ plain form
1352 -50462 12992 42395 -2042 -16584 24350 19201 -35782 -32262 22540 22868 -16065 -2753 24613
1365 24613 -16273 -55455 -517 55650 1603 -56456 433 52970 -18047 -74905 690 66731
1377 66731 7991 -42831 1593 15589 -43686 -31343 61634 58132 -47037 -58560 30061 28235
1389 28235 -49499 -12533 86244 35350 -89498 -59409 54556 40299 -31052 6208 49406
1400 49406 -33120 -88495 14021 88810 -4905 -74206 14750 59943 -49939 -89102 39790
1411 39790 88739 -32665 -78418 20657 36717 -59331 -45944 63363 42645 -67658 -43072
1422 -43072 52573 4441 -88985 -8319 109882 25512 -108011 -44383 67979 12745 -56558
1433 -56558 28845 82682 -33027 -99384 13719 84475 -4325 -41114 50634 50373 -76480 -73011
$$ packed form
1352e0462O3454K9403m4437j4542M0934n149n4983L520N4802L28l8933J3312K7366
1365B4613m0886l9182N4938N6167n4047n8059N6889N2537p1017n6858P5595O6041
1377F6731n8740n0822M4424J3996n9275J2343R2977l502j05169j1523Q8621j826
1389B8235p7734L6966R8777n0894j24848L0089J13965j4257p1351L7260M3198
1400D9406q2526n5375J02516P4789r3715o9301Q8956M5193j09882l9163J28892
1411C9790M8949j21404m5753R9075J6060r6048J3387J09307k0718j10303K4586
1422d3072R5645m8132r3426Q0666J18201q4370j33523O3628J12362n5234o9303
1433e6558Q5403N3837j15709o6357J13103P0756q8800l6789R1748k61j26853L469
$$ plain form
1445 -73011 80103 99825 -38765 -62112 43770 35229 -60020 -18762 86370 36772 -70515
1456 -70515 -24892 62775 2115 -72842 12970 93621 -4603 -96522 -6089 73881 -14554 -75205
1468 -75205 25574 77376 -30126 -83955 7598 46421 -28787 -32394 52684 32284 -79324
1479 -79324 -65017 56203 58279 -41166 -33084 47007 9720 -74025 -18129 81561 37948 -52293
1491 -52293 -19943 41144 -654 -39768 30126 74982 -6477 -63616 12100 69372 2096 -41507
1503 -41507 28139 61715 -10949 -40047 26739 47326 -13100 -21158 38836 38150 -26699 -26616 32792
1516 32792 26399 -28489 -9920 48958 18047 -55966 -32477 41745 29736 -28684 -18113 18585
1528 18585 -9098 -44632 -4259 40946 3539 -47281 -20702 19608 -8284 -35975 5502 31790
$$ packed form
1445g3011J53114J9722j38590k3347J05882q541r5249M1258J05132m9598j07287
1456g0515M5623Q7667o0660p4957Q5812Q0651r8224r1919R0433P9970q8435o0651
1468g5205J00779N1802j07502n3829R1553L8823p5208l607Q5078k0400j11608
1479g9324J4307J21220K076r9445Q082Q0091l7287q3745N5896R9690m3613r0241
1491e2293L2350O1087m1798l9114O9894M4856q1459n7139P5716N7272o7276m3603
1503d1507O9646L3576p2664k9098O6786K0587o0426q058N9994o86o4849Q3N9408
1516C2792o393n4888J8569N8878l0911p4013K3489P4222j2009n8420J0571L6698
1528A8585k7683l5534M0373M5205l7407n0820K6579M0310k7892k7691M1477K6288
$$ plain form
1540 31790 -18630 -50677 -2233 31966 -7059 -33735 1585 20572 -13405 -24541 13436 20660
1552 20660 -22501 -25426 26690 32903 -21314 -30571 18646 25659 -15553 -10680 32423 21052 -30775
1565 -30775 -25128 28243 33799 -8816 -12730 16482 3720 -27682 1040 43537 13234 -36896
1577 -36896 -15632 26377 7055 -22511 4409 29006 -8041 -38506 560 35468 -1208 -33657
1589 -33657 1814 27015 -11872 -30261 14183 27556 -21132 -30782 20965 31332 -19075 -30868
1601 -30868 13907 23030 -14126 -12037 25815 12915 -33509 -16009 36803 23243 -23540 -10477
1613 -10477 22963 -378 -27507 9655 42911 1112 -41753 -8918 31475 5931 -23173 5228
1625 5228 22209 -20009 -36788 12239 32463 -14172 -35551 1132 12197 -20862 -21673 13867
$$ packed form
1540C1790n0420l2047M8444L4199l9025k6676L5320J8987l3977j1136L7977P224
1552B0660m3161k925N2116O213n4217r257M9217P013m1212M873M3103j1371n1827
1565c0775N647N3371N556m2615l914K9212j2762l1402K8722M2497l0303n0130
1577c6896K1264M2009j9322k9566K6920K4597l7047l0465L9066L4908l6676l2449
1589c3657L5471K5201l8887j8389M4444J3373m8688r650N1747J0367n0407j1793
1601c0868M4775R123l7156K089L7852j2900m6424J7500N2812j3560m6783J3063
1613a0477L3440k3341k7129L7162L3256m1799m2865L2835M0393k5544k9104K8401
1625E228J6981m2218j6779M9027K0224m6635k1379L6683J1065l3059q11L5540
$$ plain form
1637 13867 7639 -34059 -28221 14897 10989 -29643 -24445 11401 -690 -31366 -9515 21724 -6630
1650 -6630 -39324 -9897 26372 3434 -27348 -7532 16155 -4436 -19249 11687 28608 -5959
1662 -5959 -26789 6270 28875 5794 -5288 15716 14211 -10944 -2170 31635 28459 -5214 -8138
1675 -8138 17563 18774 -13 9254 29260 10450 -18255 714 32406 18777 -9788 -659 16623
1688 16623 3438 -7939 9537 20382 -1488 -18049 231 17938 3985 -11419 -451 4495
1700 4495 -9676 -7417 12489 8636 -16190 -16142 5516 8552 -5250 -4273 4347 -3304 -15331 -2968
1714 -2968 18558 9959 -14053 -11624 6958 7084 -823 6602 9987 -4013 -10806 4538 16821 9375
1728 9375 -1482 -1171 2726 1757 4866 13251 9323 -6377 -7477 7610 11343 2492 725 2664 -2835
$$ packed form
1637A3867o228m1698N838M3118l908m0632N198L5846j2091l0676K1851L1239k8354
1650f630l2694K9427L6269k2938l0782J9816K3687k0591j4813L0936J6921l4567
1662e959k0830L3059K2605k3081j1082K1004j505k5155Q774L3805l176l3673k924
1675h138K5701J211j8787R267K0006j8810k8705J8969L1692j3629k8565R129J7282
1688A6623j3185j1377J7476J0845k1870j6561J8280J7707j3953j5404J0968M946
1700D495j4171K259J9906l853k4826M8K1658L036j3802R77Q620p651j2027J2363
1714b968K1526q599k4012K429J8582J26p907P425L385j4000o793J5344J2283p446
1728I375j0857L11L897r69L109Q385l928j5700j100J5087L733q851j767J939n499
$$ plain form
1743 -2835 -5896 3461 10500 2165 -9594 -9801 -488 3806 477 -2969 -5415 -10292 -9187 495 4021
1758 4021 -3604 -9568 -10300 -9472 -3401 3544 185 -10438 -13251 -6993 -656 1604 -875 -5702 -8971
1773 -8971 -8579 -2693 4787 3337 -5433 -8637 -6118 -2810 3006 7091 -1486 -12969 -7819 3771 4210
1788 4210 -1050 -2240 -2914 -7832 -7339 2055 8188 -1708 -13703 -9135 437 -578 -2605 576 -4567
1803 -4567 -15495 -9790 5226 4419 -7794 -10018 -5552 -6312 -5384 3449 5852 -7513 -17311 -3784
1817 -3784 10970 3604 -7095 167 4139 -5927 -4295 13200 14956 -2084 -7365 5111 11319
1830 11319 8128 9558 11466 2202 -4335 9975 24283 12732 -3131 5492 15559 6028 3426
1843 3426 18696 18046 -3322 -6712 13226 19016 4577 -422 7907 3394 -7745 2094 19142 7020
$$ packed form
1743b835l061R357P039q335j1759k07R313M294l329l446k446m877J105R682L526
1758D021p625n964p32Q28O071O945l359j0623k813O258O337K260k479m827l269
1773h971L92N886P480j450q770l204K519L308N816M085q577j1483N150J1590M39
1788D210n260j190o74m918M93R394O133r896j1995M568R572j015k027L181n143
1803d567j0928N705J5016q07j2213k224M466p60R28Q833K403j3365r798J3527
1817c784J4754p366j0699P262L972j0066J632J7495J756j7040n281J2476O208
1830A1319l191J430J908r264o537J4310J4308j1551j5863Q623J0067r531k602
1843C426J5270o50k1368l390J9938N790j4439m999Q329m513j1139R839J7048j2122
$$ plain form
1857 7020 -16354 -10064 8712 3367 -6938 1091 2157 -15563 -15825 6711 9286 -13591 -18135 54
1871 54 497 -16902 -10153 11909 1506 -26373 -17939 12539 8207 -14642 -9099 4225 -7479 -12746
1885 -12746 9841 16497 -9957 -19905 5207 17396 -2896 -7839 13354 10877 -15624 -8941 24208
1898 24208 19860 -11147 -7461 16447 6595 -10039 10163 26682 -1120 -23766 3673 29738
1910 29738 6708 -16856 2027 17547 -4077 -12189 13701 16568 -14585 -15448 15533 12911 -15257
1923 -15257 -7186 17802 1361 -26319 -3331 29886 8040 -29455 -14174 19056 7111 -12920
1935 -12920 4487 15247 -14644 -23323 13659 26784 -6919 -18017 9288 10917 -16037 -9027
1947 -9027 25431 18612 -19037 -18040 14268 13274 -9595 459 17323 -4117 -22603 4683 24758
$$ packed form
1857G020k3374O290J8776n345j0305Q029J066j7720k62K2536K575k2877m544J8189
1871E4M43j7399O749K2062j0403k7879Q434L0478m332k2849N543J3324j1704n267
1885a2746K2587O656k6454r948K5112J2189k0292m943K1193k477k6501O683L3149
1898B4208m348l1007L686K3908r852j6634K0202J6519k7802k2646K7439K6065
1910B9738k3030k3564J8883J5520k1624q112K5890K867l1153q63L0981k622k8168
1923a5257Q071K4988j6441k7680K2988L3217k1846l7495J5281L3230j1945k0031
1935a2920J7407J0760k9891q679L6982J3125l3703j1098K7305J629k6954P010
1947i027L4458o819l7649R97L2308r94k2869J0054J6864k1440j8486K7286K0075
$$ plain form
1960 24758 -4583 -24851 2522 21201 -4584 -22250 -1379 11145 -8778 -15709 6007 8076
1972 8076 -16847 -20056 1073 1129 -12657 -2226 10321 -12667 -34586 -12082 18808 9890 -15504
1985 -15504 -16525 -5597 -8973 -10351 6334 13642 -5687 -18495 -7103 1184 -2828 2570 13718
1998 13718 4332 -14234 -11666 6644 12864 5923 947 980 1199 1958 4491 3546 505 5133 12904
2013 12904 7015 -5836 -6669 2608 6828 8446 8487 381 -7757 -5079 -599 -2281 3830 15601 6732
2028 6732 -20634 -26434 -268 18724 7567 -6748 -5380 -10011 -20348 -6523 18807 11082 -15409
2041 -15409 -12560 3103 -7417 -16954 7829 25235 -1323 -25604 -5427 16632 1164 -10158
2053 -10158 12467 20044 -8020 -13363 17849 18235 -14199 -5541 37047 27149 -20805 -16741 26316
$$ packed form
1960B4758k9341k0268K7373J8679k5785j7666K0871J2524j9923o931K1716K069
1972H076k4923l209K1129N6j3786J0431J2547k2988k1919K2504L0890q918k5394
1985a5504j021J0928l376j378J6685P308j9329j2808J1392Q287m012N398J1148
1998A3718r386j8566K568J8310O220o941m976L3K19P59K533r45l041M628P771
2013A2904n889j2851q33R277M220J618M1q106q138K678M480j682O111J1771q869
2028F732k7366n800K6166J8992j1157j4315J368m631j0337J3825K5330p725k6491
2041a5409K849J5663j0520r537K4783J7406k6558k4281K0177K2059j5468j1322
2053a0158K2625P577k8064n343L1212L86l2434Q658M2588r898m7954M064M3057
$$ plain form
2066 26316 23653 -7540 5548 35985 10713 -27799 -3933 36913 18806 -9286 12858 24932
2078 24932 -17863 -29506 27070 49050 -5928 -31983 9887 22798 -17707 -17482 31480 26302
2090 26302 -31037 -29001 23706 16981 -30558 -12319 34108 5061 -45337 -12391 36297 967
2102 967 -42582 -3774 36745 -3971 -41531 -2771 26487 -13637 -29347 21362 29847 -32110
2114 -32110 -42698 21520 32950 -22942 -23858 28294 14811 -43923 -25012 40070 27789 -32382
2126 -32382 -22399 22993 3255 -34490 826 40610 -2424 -46803 -4201 34967 -6843 -36751
2138 -36751 8316 30833 -18644 -37815 12245 27611 -23440 -33346 19010 24978 -27547 -29427
2150 -29427 20202 14346 -33028 -15625 36006 13448 -41870 -22490 29101 15155 -22842 -2486
$$ packed form
2066B6316k663l1193J3088L0437k5272l8512K3866M0846j8107k8092K2144J2074
2078B4932m2795j1643N6576K1980n4978k6055M1870J2911m0505K25M8962n178
2090B6302n7339K036N2707o725m7539J8239M6427k9047n0398L2946M8688l5330
2102I67m3549L8808M0519m0716l7560L8760K9258m0124j5710N0709Q485o1957
2114c2110j0588O4218J1430n5892r16N2152j3483n8734J8911O5082j2281o0171
2126c2382R983M5392j9738l7745L5316L9784m3034m4379M2602L9168m1810k9908
2138c6751M5067K2517m9477j9171N0060J5366n1051r906N2356N968n2525j880
2150b9427M9629n856m7374J7403N1631k2558n5318J9380N1591j3946l7997K0356
$$ plain form
2162 -2486 26436 -5502 -35037 4558 40084 5149 -26519 4434 24002 -10885 -19334 26380
2174 26380 34990 -14882 -27788 17088 29016 -8072 -13013 21989 19822 -17923 -12831 25157 17713
2187 17713 -19767 -10268 25072 12307 -21345 -8692 18534 3100 -20770 -315 22524 -1689
2199 -1689 -28763 -8641 17585 1727 -16534 407 9690 -17292 -26217 7771 23573 -6961
2211 -6961 -25425 -3874 8639 -9433 -11913 12699 14257 -15920 -22809 7179 18228 -3849 -8885
2224 -8885 9487 7364 -12859 -4659 19728 12890 -11379 -5742 16694 11724 -8554 -1896 17662
2237 17662 8128 -10465 2935 22197 4976 -16925 -519 21868 8539 -10150 1096 12605
2249 12605 -4367 -14297 8104 22817 -721 -21405 -4635 11989 -993 -8684 8385 9301 -16860
$$ packed form
2162b486K8922l1938k9535L9595L5526l4935l1668L0953J9568l4887q449M5714
2174B6380Q610m9872j2906M4876J1928l7088m941L5002k167l7745N092L7988p444
2187A7713l7480R499L5340j2765l3652J2653K7226j5434k3870K0455K2839k4213
2199a689k7074K0122K6226j5858j8261J6941R283k6982q925L3988J5802l0534
2211f961j8464K1551J2513j8072k480K4612J558l0177o889K9988J1049k2077n036
2224h885J8372k123k0223Q200K4387o838k4269N637K2436m970k0278O658J9558
2237A7662r534j8593J3400J9262j7221k1901J6406K2387j3329j8689J1246J1509
2249A2605j6972r930K2401J4713k3538k0684J6770J6624j2982p691J7069R16k6161
$$ plain form
2262 -16860 -19039 9163 16059 -7469 -13235 4018 3181 -14951 -7439 16657 9181 -19061 -13658
2275 -13658 14488 10244 -13666 -5807 15108 3720 -15365 52 19662 3600 -16472 -918
2287 -918 19540 6316 -10220 2546 13379 -3204 -10198 13082 21049 -5797 -16533 5960 14815
2300 14815 -2524 -3988 12745 6940 -16693 -11458 16598 16041 -10030 -13091 6306 3749 -13508
2313 -13508 -2783 16465 1830 -20899 -9778 11446 3500 -11984 -3627 6505 -5871 -14568
2325 -14568 2648 12953 -5455 -17370 842 11757 -4362 -10748 5351 7232 -10880 -8736
2337 -8736 12459 11419 -10362 -12355 6526 9978 -4087 -3707 9052 2436 -13689 -4547 15186
2350 15186 8807 -10436 -7601 4311 -514 -6209 4068 8653 -6556 -16910 -3576 9093 169
$$ packed form
2262a6860k179K8202O896k3528n766J7253q37j8132P512K4096p476k8242N403
2275a3658K8146m244k3910P859K0915j1388j9085J5417J9610j6062k0072J5554
2287i18K0458j3224j6536J2766J0833j6583o994K3280P967k6846j0736K2493Q855
2300A4815j7339j464J6733n805k3633N235K8056n57k6071l061J9397k557j7257
2313a3508J0725J9248j4635k2729J1121K1224p946j5484Q357J0132j2376q697
2325a4568J7216J0305j8408j1915J8212J0915j6119o386J6099J881j8112K144
2337h736K1195j040k1781j993J8881L452j4065L80J2759o616j6125R142J9733
2350A5186o379j9243K835J1912m825n695J0277M585j5209j0354J3334J2669q924
$$ plain form
2363 169 -10369 -3206 613 -10902 -11982 4753 6826 -11570 -16902 -2119 3342 -6460 -8255 -240
2377 -240 -1989 -11814 -7837 5591 3845 -10000 -9535 2866 2850 -4244 636 5557 -3153 -8546 4080
2392 4080 12703 4262 -4942 336 7170 3624 2363 10343 11087 -1501 -5417 8826 16003 7133 1290
2407 1290 5194 4686 1250 6087 13403 8961 -1896 -2168 5252 7473 4240 4302 4124 -2013 -5160 3809
2423 3809 9462 1559 -5653 -2197 1190 -1441 -1040 2878 654 -6465 -6481 659 4346 -305 -5223 -4042
2439 -4042 -2040 -1380 1851 3267 -2848 -6088 -2242 2192 2593 2434 1607 -3018 -4427 1475 7110 6093
2455 6093 -6 -3196 -675 2372 4140 5703 4523 -1957 -4048 1171 5431 4234 2627 -213 -4642
2470 -4642 -3173 4380 5876 -544 -4973 -3063 -424 -1311 -1000 1763 -751 -8684 -7986 1597 3944 -3653
$$ packed form
2363A69j0538P163L819j1515j080J6735K073j8396n332J4783N461r802j795Q015
2377b40j749r825L977J3428j746j3845M65J2401j6p094M880M921q710n393J2626
2392D080Q623q441r204N278O834l546j261P980P44j2588l916J4243P177q870n843
2407A290L904n08l436M837P316m442j0857k72P420K221l233O2j78o137l147Q969
2423C809N653p903p212L456L387k631M01L918k224p119j6P140L687m651m918J181
2439d042K002O60L231J416o115l240L846M434M01j59q27m625j409N902N635j017
2455F093o099l190K521L047J768J563j180o480k091N219M260j197j607k840m429
2470d642J469P553J496o420m429J910K639q87L11K763k514p933O98R583K347p597
$$ plain form
2486 -3653 -6718 -3826 -4687 -5041 951 2496 -5226 -9861 -3894 2112 -100 -2862 -396 -1436 -7389
2501 -7389 -3939 6833 6579 -5073 -6681 2434 3662 -1345 2566 6956 -562 -7622 274 10289
2515 10289 6162 -2712 -1656 2883 716 88 7354 6611 -5120 -6689 4477 7015 -1789 -1545 4214
2530 4214 -1989 -9003 -979 9492 2286 -10511 -7318 2595 396 -4945 144 2465 -8187 -11894
2544 -11894 1951 7287 -4479 -9099 -937 -475 -6817 -1844 7387 633 -11075 -5624 7099 4761
2558 4761 -4570 7 5726 -2845 -7039 7435 13974 -1074 -9574 3384 10585 1266 -32 8413
2572 8413 4969 -6334 -1322 12785 9350 -4273 -2687 7106 1525 -5547 5844 13409 -3077 -14058
2586 -14058 1178 12090 186 -7695 1436 2567 -8830 -7344 7902 6299 -10831 -11502 3550
$$ packed form
2486c653l065K892q61l54N992J545p722m635N967O006k212k762K466j040n953
2501g389L450J0772k54j1652j608R115J228n007L911M390p518p060P896J0015
2515A0289m127q874J056M539k167o28P266p43j1731j569J1166K538q804K44N759
2530D214o203p014Q024J0471p206j2797L193R913k199n341N089K321j0652l707
2544a1894J3845N336j1766m620Q162M62o342M973R231o754j1708N451J2723k338
2558D761r331M577N719q571m194J4474O539j5048q500J2958P201r319j298Q445
2572H413l444j1303N012J4107l435j3623J586R793n581p072J1391P565j6486j0981
2586a4058J5236J0912j1904p881R131J131j1397J486J5246j603j7130o71J5052
$$ plain form
2599 3550 3050 -8874 -4253 6360 -3669 -14993 -2109 11184 -1284 -12891 -2544 5763 -4418
2612 -4418 -6850 7250 8148 -9913 -11786 8680 13963 -3734 -7872 7015 5496 -6920 1020 16225
2626 16225 6811 -9670 -2649 11230 5873 -2162 6612 10217 -4540 -9154 9017 16972 -779
2639 -779 -9683 5018 9030 -4363 -3467 10994 6071 -10801 -6247 9792 5916 -8335 -4447 5469
2653 5469 -104 -8656 666 8723 -3231 -13176 -1205 8654 -690 -6109 1199 339 -9405 -3778 10772
2668 10772 7050 -8771 -8981 3418 4462 -2552 1174 8353 371 -10088 -2082 10555 6322 -2592
2682 -2592 202 1650 -2405 -899 7870 5985 -4116 -4416 3442 3884 -735 -287 2196 -1563 -5202
2697 -5202 798 5315 -2241 -7924 -2495 1160 -2716 -2497 1162 -3393 -10107 -5947 1962 1448 -3957
$$ packed form
2599C550n00j1924M621J0613j0029j1324J2884J3293j2468j1607J0347Q307j0181
2612d418k432J4100Q98j8061j873K0466N283j7697m138J4887j519j2416P940J5205
2626A6225r414j6481P021J3879n357q035Q774L605j4757m614J8171P955j7751
2639g79q904J4701M012j3393Q96J4461m923j6872M554J6039l876j4251L888R916
2653E469n573q552R322Q057j1954r945J1971R859r344n419P308q60r744N627J4550
2668A0772l722j5821k10J2399J044p014L726P179p982j0459Q006J2637m233q914
2682b592K794J448m055J506Q769j885j0101l00P858M42m619M48K483l759l639
2697e202O000M517p556n683N429L655l876K19L659m555o714M160P909n14n405
$$ plain form
2712 -3957 -5050 -5636 -7938 -3823 4966 3339 -8497 -10295 -627 1357 -4330 -336 6141 -2491 -11680
2727 -11680 -2163 9054 3228 -4414 758 3670 -2714 -2568 8535 8539 -5164 -5956 8794 9849 -3268
2742 -3268 -2220 9095 3713 -7165 2572 14855 2716 -11906 -1080 12405 3101 -6603 3519
2755 3519 9020 -7512 -12915 7243 15581 -4528 -13764 1659 5158 -8707 -4684 12139 3694
2768 3694 -17694 -10461 10945 5880 -12174 -4685 10794 -2034 -17099 0 17360 -827 -18159
2781 -18159 589 15442 -2220 -12118 6944 12397 -8288 -9767 14275 15657 -9828 -11624 12113
2794 12113 13079 -6827 -2016 17229 5265 -17076 -2009 23044 9806 -13300 -1635 13983
2806 13983 -1501 -13013 8370 20762 -4341 -20391 1435 16473 -2614 -12579 7196 9801
$$ packed form
2712c957j093n86k302M115Q789j627j1836j798R668J984n687L994O477q632r189
2727a1680R517J1217n826p642N172K912o384J46J1103Mj3703p92J4750J055j3117
2742c268J048J1315n382j0878R737J2283j2139j4622J0826J3485r304r704J0122
2755C519N501j6532n403K0158Q338k0109r236J5423L499j3865M023J6823q445
2768C694k1388P233K1406n065j8054P489J5479j2828j5065J7099J7360j8187j7332
2781a8159J8748J4853j7662r898J9062N453k0685j479K4042J382k5485j796K3737
2794A2113R66j9906M811J9245j1964k2341J5067K5053j3238k3106J1665J5618
2806A3983j5484j1512K1383J2392k5103j6050K1826J5038j9087r965J9775K605
$$ plain form
2818 9801 -13495 -14220 11310 10740 -14036 -12235 9291 4863 -15018 -7474 11658 1246 -18003
2831 -18003 -4141 16455 1143 -20446 -6076 14223 975 -12367 3940 12173 -8841 -17375
2843 -17375 6890 19209 -251 -11948 2629 7403 -7188 -4658 16169 13372 -11287 -12296 9256
2856 9256 9891 -5309 689 13147 834 -15134 -2298 15831 5555 -10840 -2033 10332 -947
2869 -947 -12820 286 11553 -2366 -12655 1673 9564 -6469 -13669 916 8067 -3654 -6980
2882 -6980 2130 554 -11870 -8749 8828 10003 -6753 -10391 377 -159 -6707 1777 13638 2165
2896 2165 -14509 -8253 7888 8096 -189 1436 6280 -2596 -9886 1499 15145 7192 -6079 -2149
2910 -2149 5682 837 -2723 6396 9344 -1045 -6103 2119 6641 -1156 -4398 3486 6519 -2883 -5687
$$ packed form
2818I801k3296p25K5530n70k4776J801K1526m428j9881P544J9132j0412j9249
2831a8003J3862K0596j5312k1589J4370K0299j3248j3342J6307Q233k1014q534
2843a7375K4265J2319j9460j1697J4577M774j4591K530K0827k797k4659j009K1552
2856I256O35j5200N998J2458j2313j5968J2836J8129j0276j6395Q807J2365j1279
2869i47j1873J3106J1267j3919j0289J4328P891j6033p200J4585P151j1721l326
2882f980R110j576j2424L121J7577J175j6756l638J0768n36o548Q484J1861j1473
2896B165j6674O256J6141K08q285J625M844q876p290J1385J3646p953j3271L930
2910b149P831m845l560R119K948j0389n058Q222M522p797l242P884L033r402k804
$$ plain form
2925 -5687 2571 2889 -7078 -4901 7027 5302 -8584 -10450 -334 2403 -3286 -1875 3575 -2177
2939 -2177 -13308 -8515 6335 6826 -4390 -6441 -1722 -4700 -6711 3463 10161 201 -10667 -5005
2953 -5005 3824 3017 -440 4106 5303 -4750 -8381 4594 12371 2146 -4818 2661 5718 -1828
2967 -1828 -1502 7515 7948 -2672 -4088 5378 6803 -1807 -3080 5161 5448 -3258 -1575 4945 215
2982 215 -7019 -1062 8161 2464 -7309 -4993 2123 -633 -3805 2321 5612 -5130 -13092 -3231 8215
2997 8215 3058 -4782 -1901 -769 -7313 -5384 6778 9307 -2881 -9181 -3291 2326 747 2139
3011 2139 6956 2368 -7824 -5344 7214 8285 -380 -379 4535 198 -4985 2463 10249 3858 -4444
3026 -4444 -456 6656 2271 -4288 401 6967 1809 -3936 1660 3922 -3888 -5935 3239 6833 -655
$$ packed form
2925e687Q258L18r967K177J1928j725j3886j866J0116K737n689J411N450n752
2939b177j1131M793J4850M91j1216k051M719k978k011J0174O698r960j0868N662
2953e005Q829q07l457M546J197j0053l631J2975P777j0225o964P479L057p546
2967a828L26R017M33j0620j416R466J425q610j273Q241K87q706J683O520m730
2982B15p234N957R223n697r773K316P116k756l172O126L291j0742p962R861J1446
2997H215n157p840K881J132o544J929J2162K529j2188o300N890N617j579J392
3011B139M817m588j0192K480J2558J071q665JM914m337n183P448P786o391q302
3026d444L988P112m385o559M689O566n158n745N596K262p810k047R174L594p488
$$ plain form
3041 -655 -5289 -2549 -2115 -4811 -890 6453 2243 -9588 -10642 -360 3095 -1459 -146 2053 -5919
3056 -5919 -12284 -2983 8175 4923 -4108 -5110 -1368 -2189 -2563 3959 7215 -573 -6942 -1225 4888
3071 4888 1692 -87 3940 2678 -2459 -613 5672 4190 -1923 -572 5548 4483 -1348 -930 3611
3086 3611 1147 -2543 2645 7261 759 -7330 -3076 3257 2441 366 911 -1402 -6430 -5307 1751
3101 1751 4776 -476 -4743 -4371 -3744 -3632 909 4645 -1153 -8097 -4498 1063 849 -1162 442 -456
3117 -456 -4027 -3847 1593 4605 598 -3112 -895 2136 1632 1926 3064 486 -1830 1696 5608 3107
3133 3107 465 1388 1429 518 2696 6000 3416 -2004 -2692 2309 4839 2599 495 154 -1891 -3258
3149 -3258 1539 5015 1038 -3994 -2924 -1389 -1788 819 2537 -1219 -6330 -4705 1054 1931 -2069
$$ packed form
3041f55m634K740M34k696L921P343m210j1831j054J0282L455m554J313K199p972
3056e919o365R301J1158l252r031j002L742q21l74O522L256p788o369N717O113
3071D888l196j779M027j262n137J846O285j482o113J351O120j065n831M18M541
3086C611k464l690N188M616o502q089M254O333q16k075N45k313n028J123P058
3101A751L025n252m267L72O27J12M541L736n798o944L599N561k14k011J604q98
3117d56l571J80N440L012m007l710K217L031n04K94J138k578k316L526L912k501
3133C107k642R23M1r11K178L304k584n420o88N001K530k240k104l41k045j367
3149c258M797L476l977n032J070J535l99K607J718l756n111J625N759Q77m000
$$ plain form
3164 -2069 -3284 -1588 -3181 -4700 341 4111 -1413 -6893 -2675 2244 612 -857 1584 -217 -4123
3179 -4123 -1309 5026 4491 -1326 -2284 2018 2044 -42 3680 6459 -200 -5183 1304 8301 3481 -1524
3195 -1524 852 2667 -1229 -427 5544 4799 -2922 -5011 1563 3835 -95 -916 2100 -2190 -6746 -373
3211 -373 6153 -267 -7042 -2525 1171 -2881 -3690 2313 1899 -6631 -8291 1248 5104 -2533 -5669 -281
3227 -281 110 -4634 -539 5995 947 -7113 -2542 4680 2027 -1504 2555 3075 -3324 -3512 5514 8806
3243 8806 -999 -4676 2918 5928 -637 522 7468 3460 -6432 -2144 8337 5575 -2887 -1511 3097
3258 3097 -494 -2915 3192 5790 -2887 -7777 110 4622 -1720 -3938 2454 3 -8750 -3878 6739
3273 6739 2764 -8815 -6472 2274 667 -5148 -484 3989 -3261 -9257 -765 7507 336 -6187 -250
$$ packed form
3164b069j215J696j593j519N041L770n524n480M218M919j632j469K441j801l906
3179d123K814O335n35n817r58M302K6k086L722K779o659m983O487O997m820n005
3195a524K376J815l896Q02N971p45p721k089O574K272l930q21L016m290m556O373
3211c73O526o420o775M517L696m052q09O003m14q530j660R539L856p637l136N388
3227b81L91m744M095O534n048q060M571P222k653l531M059N20o399j88R026L292
3243H806r805l677P594L010o565J159O946m008r892M288J0481k762q462J376M608
3258C097l591k421O107K598q677m890P887M512o342k218O392k451q753M872J0617
3273F739l975j1579K343Q746j607n815M664M473p250n996Q492Q272p171o523N937
$$ plain form
3288 -250 2447 -3608 -1972 7251 4475 -6198 -4463 6289 5625 -2291 25 5611 682 -5357 2887
3303 2887 11097 2707 -7217 -31 7919 1718 -2469 4692 5161 -4823 -5251 5761 7444 -2355 -4837
3318 -4837 1508 1092 -4580 -398 6921 -669 -10267 -3542 6289 664 -6457 -660 2680 -5840 -7534
3333 -7534 3321 6296 -4867 -8614 12 3946 -2652 -3201 3476 1049 -6817 -2665 7618 3597
3347 3597 -5480 -1942 4404 567 -2527 4947 6730 -2964 -6600 3302 9086 1402 -2699 2802 3228
3362 3228 -3299 -798 8534 5753 -5134 -3988 4089 3345 -1539 1563 3332 -2817 -6093 1878 5852
3377 5852 -1050 -5878 -793 1214 -3935 -3313 3465 1190 -8039 -5856 3318 2391 -4482 -3575 275 -2716
3393 -2716 -4623 1629 4479 -2327 -7140 -1378 3215 160 -768 2977 608 -6363 -2343 7335 5099
$$ packed form
3288b50K697o055J636R223k776j0673J735J0752o64p916K316N586m929o039Q244
3303B887Q210q390r924P186P950o201m187P161M69r984m28J1012J683r799k482
3318d837O345m16n672M182P319p590r598O725R831n625p121N797L340q520j694
3333g534J0855K975j1163l747Q626L934o598n49O677k427p866M152J0283m021
3347C597r077L538O346l837l094P474J783r694l636R902N784p684m101N501M26
3362C228o527K501R332k781j0887J146Q077p44m884L102J769o149l276P971L974
3377E852o902m828N085K007n149O22O778k275r229K183R174r27o873R07L850k991
3393b716j907O252K850o806m813N762M593l055r28L745k369o971M020R678k236
$$ plain form
3408 5099 -2999 -1158 3521 370 -1755 4316 7394 76 -4426 1773 6736 1803 -1119 2680 3082
3423 3082 -2531 -385 6362 2879 -5141 -2404 4509 1730 -2485 552 2622 -4327 -6703 2918 7354
3438 7354 -1433 -8322 -2518 1535 -3056 -2652 4972 2158 -9223 -7666 3460 4153 -2604 -1338 1593
3453 1593 -3440 -7061 1293 7881 685 -6253 -271 4458 -1516 -3765 5430 6573 -3650 -4742 6303
3468 6303 6722 -3754 -3569 6654 5950 -2294 -501 5390 1257 -5505 965 10182 3723 -5765 -2076
3483 -2076 3217 -1771 -2756 6717 6800 -7197 -10442 1256 6046 -831 -2748 2774 -1109 -10329 -5759
3498 -5759 7227 5880 -6342 -6861 633 -1700 -6449 812 6699 -1842 -8454 -2017 4399 -820 -3849
3513 -3849 2525 4431 -3034 -4405 3768 4977 -3936 -3411 7056 6711 -3420 -3724 4407 3590 -1986
$$ packed form
3408E099q098J841M679l151k125O071L078p318m502O199M963m933k922L799M02
3423C082n613K146O747l483q020K737O913k779m215L037K070o949k376R621M436
3438G354q787o889N804M053m591M04P624k814j1381J557J1126O93o757J266K931
3453A593n033l621Q354O588p196o938N982M729n974k249R195J143j0223j092J1045
3468F303M19j0476J85J0223p04q244J793N891m133o762O470R217o459r488L689
3483b076N293m988r85R473Q3j3997l245J1698M790o877j917N522l883r220M570
3498e759J2986j347j2222n19P494k333m749P261N887q541o612O437O416n219l029
3513c849O374J906p465j371Q173J209q913N25J0467l45j0131l04Q131q17n576
$$ plain form
3528 -1986 1844 8286 1687 -7308 -2712 6450 5708 -168 767 1986 -3974 -5273 4128 8853 196
3543 196 -6137 -2470 -227 -2564 273 5655 2146 -7911 -7743 998 3874 -1309 -2655 444 -2367
3558 -2367 -6740 -2107 4758 1768 -4669 -3464 847 -816 -2536 421 2278 -509 -2850 767 2651
3573 2651 -1157 -2531 2169 4804 665 -1413 1502 1254 -1306 1429 6377 4995 -1792 -3939 491
3588 491 4244 3491 2843 2329 -1396 -5111 -1654 5577 6162 511 -2766 -3726 -3656 -576 4156 4405 -1031
3605 -1031 -6027 -5269 -1092 964 681 936 -694 -5269 -6170 -833 2778 602 -2256 -2075 -897 -2084
3621 -2084 -2400 -23 2028 663 -1272 -273 402 -1722 -1785 2259 4037 2691 196 -897 -2094 -966
3637 -966 3577 6828 4366 -1288 -3884 -1336 2728 4274 5527 4087 -1897 -6297 -2000 4978 6338
$$ packed form
3528a986L830O442o599q995M596R162p42n876R35J219n960j299R401M725q657
3543A96o333L667K243k337K837N382l509j0057J68Q741K876n183j346L099k811
3558b367m373M633O865k990o437J205M311j663j720K957J857k787k341L617J884
3573B651l808j374M700K635m139k078K915k48k560K735M948j382o787k147M430
3588D91L753p53o48n14l725l715L457P231N85n651l277r60P0L080M732K49n436
3605a031m996P58M177K056k83K55j630m575r01N337L611k176k858J81J178j187
3621b084l16K377K051j365j935R99O75k124o3M044J778j346k495j093j197J128
3637i66M543L251k462n654k596K548M064J546J253j440n984m400M297O978J360
$$ plain form
3652 6338 2494 -998 -3119 -3838 -2121 2393 5278 2257 -4139 -5374 -2128 129 437 1509 189
3667 189 -3119 -3801 -1310 62 -1093 -1007 497 517 -2294 -3076 -516 387 -869 482 3169 1399 -3815
3684 -3815 -3871 1439 4158 2936 1930 909 -2123 -2792 1187 5858 6371 562 -2689 -1481 173 1875
3700 1875 5891 5100 -899 -4447 -1258 2407 2287 2395 1806 -732 -4122 -2738 1880 3475 -843 -3463
3716 -3463 -1051 147 -2268 -2629 220 -728 -3540 -2130 693 -1193 -3931 -3145 -253 266 -599 -816
3732 -816 -1308 -3683 -3659 1411 4270 541 -3387 -1659 -506 -1227 1785 5053 2698 -3188 -3855 1532
3748 1532 4544 3171 1387 885 -604 -1946 1365 5497 3229 -1095 -550 1012 523 1053 2850 1594
3764 1594 -1918 -2217 1487 2473 -675 -2222 -452 313 -1344 -778 1367 -1025 -4513 -2708 1754 1072
$$ packed form
3652F338l844l492k121p19J717M514K885l021o396j235L246K257L08J072j320
3667A89l308o82K491J372j155Q6J504K0k811p82K560R03j256J351K687j770n214
3684c815n6N310K719j222j006j021l032o69L979M671N13n809l251J208J654J702
3700A875M016p91n999l548L189L665j20J08n89k538l390J384M618J595m318k620
3716c463K412J198k415l61K849r48k812J410K823j886k738P86K892N19q65k17
3732h16m92k375K4N070K859l729l928J728J153p21L012L268k355n886o67N387
3748A532L012j373j784n02j489j342L311M132k268m324N45J562m89N30J797j256
3764A594l512k99L704R86l148j547J770P65j657N66K145k392l488J805M462o82
$$ plain form
3780 1072 -1604 -2158 -2137 -2696 -1330 1698 1512 -2124 -4626 -1730 605 842 820 1622 -1253 -4388 -803
3797 -803 4700 3686 -471 -1055 427 292 1033 3442 3765 202 -2149 837 3476 2523 863 1362 454
3814 454 -1107 1271 4354 2062 -2528 -758 1789 1072 -197 1135 722 -2767 -3536 919 3295 -333
3830 -333 -4035 -2176 -80 -1532 -122 1565 -703 -5344 -3317 975 863 -1744 -1073 -910 -3223 -2894
3846 -2894 1986 3504 -1317 -4418 -846 2579 177 -551 2897 1399 -3603 -1435 4502 4088 -832
3861 -832 -677 1442 777 297 3071 3803 -211 -2998 1249 4485 1236 -717 1355 1140 -2521 -1136
3877 -1136 4603 3050 -4034 -3911 1314 1873 -1621 -491 1342 -2087 -5183 -1187 3861 171 -4606
3892 -4606 -2420 -78 -2297 -1896 2550 785 -5167 -4218 2318 2572 -1743 -1849 1286 -880 -3546 707
$$ packed form
3780A072k676n54K1n59J366L028j86l636k502K896K335K37k2Q02k875l135L585
3797h03N503j014m157n84J482j35P41K409L23l563k351K986K639r53j660M99r08
3814D54j561K378L083k292m590J770K547p17j269J332m13l489p69M455K376l628
3830c33l702J859K096j452J410J687k268m641K027M292j12k607O71J63k313L29
3846b894M880J518m821l101L572L425k402p28L448j498n002K168N937m14m920
3861h32J55K119o65m80K774P32m014k787M247L236l249j953K072k15l661J385
3877a136N739j553p084J23N225N59l494J130J833l429l096L996N048l690m777
3892d606K186K342k219M01M446j765n952R49O536K54m315j06L135k166k666M253
$$ plain form
3908 707 5681 1345 -4957 -1335 4203 1856 -990 2341 2994 -2296 -2210 4502 5522 -209 -2050 1860
3924 1860 2280 -579 1619 5407 815 -4873 -985 5338 2341 -3285 -489 2169 -2326 -3460 2924
3939 2924 3822 -3196 -5808 -314 2513 -1541 -2614 860 -972 -5710 -2796 3874 1102 -5205 -3253
3954 -3253 1505 -1257 -3247 1525 3337 -3926 -6134 1375 5184 -379 -3448 808 1713 -2531 -1166
3969 -1166 5449 3519 -3987 -2573 4293 3398 -547 1344 3831 -1258 -3255 3393 6674 615 -3745
3984 -3745 683 3824 -629 -1008 4128 2732 -5120 -3825 4517 4037 -3299 -2914 1881 -806 -3926 977
4000 977 4228 -1583 -6657 -1957 3022 -188 -3174 979 867 -5045 -4320 4075 4067 -4065 -4349 2295 1394
$$ packed form
3908G07M974m336o302L622N538k347k846L331O53n290Q6O712J020n731j841L910
3924A860M20k859K198L788m592n688L888O323k997n626K796K658m495j134O384
3939B924Q98p018k612N494K827m054j073L474j832m738K914O670k772o307J952
3954c253M758k762j990M772J812p263k208P509L809n563l069M256R05m244J365
3969a166O615j930p506J414O866q95l945J891K487n089j997O648L281o059m360
3984c745M428L141m453l79N136j396p852J295Q342m80p336L85M795k687l120M903
4000I77L251n811n074M700M979l210k986M153j12n912P25Q395qq132k84O644r01
$$ [...]
8191G04
##END NTUPLES=NMR FID
##END=
