##TITLE=1H_BAU-j-24.07
 CDCl3, 8 sc, 
 24.7.2019
##JCAMPDX= 6.0         $$ Bruker NMR JCAMP-DX V2.0
##DATA TYPE= NMR SPECTRUM
##DATA CLASS= XYDATA
##ORIGIN= UXNMR, Bruker Analytische Messtechnik GmbH
##OWNER= root
$$ XWIN-NMR		Version 3.5
$$ Wed Jul 24 15:52:52 2019 Russian Standard Time (UT+4h)  she@DPX200
##.OBSERVE FREQUENCY= 200.13155
##.OBSERVE NUCLEUS= ^1H
##.ACQUISITION MODE= SIMULTANEOUS
##.ACQUISITION SCHEME= undefined
##.AVERAGES= 8
##.DIGITISER RES= 18
##SPECTROMETER/DATA SYSTEM= spect
##.PULSE SEQUENCE= zg30
##.SOLVENT NAME= CDCl3
##.SHIFT REFERENCE= (INTERNAL, CDCl3, 0, 20.1173)
##AUDIT TRAIL= $$ (NUMBER, WHEN, WHO, WHERE, WHAT)
$$ ##TITLE= Audit trail, XWIN-NMR		Version 3.5
$$ ##JCAMPDX= 5.01
$$ ##ORIGIN= Bruker BioSpin GmbH
$$ ##OWNER= she
$$ F:/spectra/data/she/nmr/H-F/1/pdata/1/auditp.txt
$$ ##AUDIT TRAIL=  $$ (NUMBER, WHEN, WHO, WHERE, WHAT)
(   1,<2019-07-24 15:51:35.04 +0400>,<she>,<DPX200>,
      <created by zg, POWCHK disabled, PULCHK disabled
       configuration hash MD5:
       00 E9 B6 7A A2 85 ED C7 34 08 36 98 17 FE 4E 26
       data hash MD5: 16K
       B8 82 BD 48 9A 9A 97 9A DB EF A0 F7 66 5C 1C 8F>)
(   2,<2019-07-24 15:51:36.78 +0400>,<she>,<DPX200>,
      <Start of raw data processing
       efp BC_mod = 2 LB = 0.24 FT_mod = 6 PKNL = 1 PHC0 = -9018.133 PHC1 = 8.800961 SI = 16K 
       data hash MD5: 16K
       68 DA 59 4A EF 5F E9 58 58 21 4E AA 5D 42 8B B0>)
(   3,<2019-07-24 15:51:54.40 +0400>,<she>,<DPX200>,
      <pk PHC0 = -0.2259157 PHC1 = 4.4 
       data hash MD5: 16K
       5A 83 BA 1D 9A 0F D4 66 FD 2E BF 85 4B 1B 46 E7>)
(   4,<2019-07-24 15:51:57.98 +0400>,<she>,<DPX200>,
      <abs ABSG = 5 
       data hash MD5: 16K
       AC BF 68 E6 69 95 1C 23 19 86 28 EE BD 43 D8 F5>)
$$ ##END=
$$ 
$$ hash MD5
$$ B6 CD F7 ED 83 8D EE 3B DD D8 79 FB 1B 0B 4F 99
##$RELAX= 
##$RELAX= 
##$RELAX= 
##$RELAX= 
##$RELAX= 
##$RELAX= 
$$ Bruker specific parameters
$$ --------------------------
##$DU= <F:/spectra>
##$EXPNO= 1
##$NAME= <H-F>
##$PROCNO= 1
##$TYPE= <nmr>
##$USER= <she>
##$AMP= (0..31)
100 100 100 100 100 100 100 100 100 100 100 100 100 100 100 100 100 100 
100 100 100 100 100 100 100 100 100 100 100 100 100 100 
##$AQSEQ= 0
##$AQ_mod= 1
##$AUNM= <au_zg>
##$AUTOPOS= <>
##$BF1= 200.13
##$BF2= 200.13
##$BF3= 200.13
##$BF4= 200.13
##$BF5= 200.13
##$BF6= 200.13
##$BF7= 200.13
##$BF8= 200.13
##$BYTORDA= 1
##$CFDGTYP= 0
##$CFRGTYP= 5
##$CHEMSTR= <none>
##$CNST= (0..31)
1 1 145 1 1 1 1 1 1 1 1 1 1 1 1 1 1 1 1 1 1 1 1 1 1 1 1 1 1 1 1 1 
##$CPDPRG= <>
##$CPDPRG1= <>
##$CPDPRG2= <>
##$CPDPRG3= <>
##$CPDPRG4= <mlev>
##$CPDPRG5= <mlev>
##$CPDPRG6= <mlev>
##$CPDPRG7= <mlev>
##$CPDPRG8= <mlev>
##$CPDPRGB= <>
##$CPDPRGT= <>
##$D= (0..31)
0 1.2 0 0 0 0 0 0 0 0 0 0.03 0 0 0 0 0 0 0 0 0 0 0 0 0 0 0 0 0 0 0 0 
##$DATE= 1563969094
##$DBL= (0..7)
120 120 120 120 120 120 120 120 
##$DBP= (0..7)
150 150 150 150 150 150 150 150 
##$DBP07= 0
##$DBPNAM0= <>
##$DBPNAM1= <>
##$DBPNAM2= <>
##$DBPNAM3= <>
##$DBPNAM4= <>
##$DBPNAM5= <>
$$ [...]
##$SPNAM4= <gauss>
##$SPNAM5= <gauss>
##$SPNAM6= <gauss>
##$SPNAM7= <gauss>
##$SPNAM8= <gauss>
##$SPNAM9= <gauss>
##$SPOAL= (0..31)
0.5 0.5 0.5 0.5 0.5 0.5 0.5 0.5 0.5 0.5 0.5 0.5 0.5 0.5 0.5 0.5 0.5 0.5 
0.5 0.5 0.5 0.5 0.5 0.5 0.5 0.5 0.5 0.5 0.5 0.5 0.5 0.5 
##$SPOFFS= (0..31)
0 0 0 0 0 0 0 0 0 0 0 0 0 0 0 0 0 0 0 0 0 0 0 0 0 0 0 0 0 0 0 0 
##$SUBNAM0= <"">
##$SUBNAM1= <"">
##$SUBNAM2= <"">
##$SUBNAM3= <"">
##$SUBNAM4= <"">
##$SUBNAM5= <"">
##$SUBNAM6= <"">
##$SUBNAM7= <"">
##$SUBNAM8= <"">
##$SUBNAM9= <"">
##$SW= 24.9336996594482
##$SWIBOX= (0..15)
0 0 2 0 0 0 0 0 0 0 0 0 0 0 0 0 
##$SW_h= 4990.01996007984
##$TD= 16384
##$TD0= 1
##$TE= 0
##$TE2= 300
##$TE3= 300
##$TEG= 300
##$TL= (0..7)
0 120 120 120 120 120 120 120 
##$TP= (0..7)
150 150 150 150 150 150 150 150 
##$TP07= 0
##$TPNAME0= <>
##$TPNAME1= <>
##$TPNAME2= <>
##$TPNAME3= <>
##$TPNAME4= <>
##$TPNAME5= <>
##$TPNAME6= <>
##$TPNAME7= <>
##$TPOAL= (0..7)
0.5 0.5 0.5 0.5 0.5 0.5 0.5 0.5 
##$TPOFFS= (0..7)
0 0 0 0 0 0 0 0 
##$TUNHIN= 0
##$TUNHOUT= 0
##$TUNXOUT= 0
##$USERA1= <user>
##$USERA2= <user>
##$USERA3= <user>
##$USERA4= <user>
##$USERA5= <user>
##$V9= 5
##$VALIST= <valist>
##$VCLIST= <CCCCCCCCCCCCCCC>
##$VD= 0
##$VDLIST= <DDDDDDDDDDDDDDD>
##$VPLIST= <PPPPPPPPPPPPPPP>
##$VTLIST= <TTTTTTTTTTTTTTT>
##$WBST= 1024
##$WBSW= 4
##$XGAIN= (0..3)
0 0 0 0 
##$XL= 0
##$YL= 0
##$YMAX_a= 220141
##$YMIN_a= -153714
##$ZGOPTNS= <>
##$ZL1= 120
##$ZL2= 120
##$ZL3= 120
##$ZL4= 120
##$ABSF1= 20.19487
##$ABSF2= -4.739023
##$ABSG= 5
##$ABSL= 3
##$ALPHA= 0
##$AQORDER= 0
##$ASSFAC= 0
##$ASSFACI= 0
##$ASSFACX= 0
##$ASSWID= 0
##$AUNMP= <proc_1d>
##$AZFE= 0.1
##$AZFW= 0.1
##$BCFW= 0
##$BC_mod= 2
##$BYTORDP= 0
##$COROFFS= 0
##$CY= -3
##$DATMOD= 1
##$DC= 0
##$DFILT= <>
##$DTYPP= 0
##$F1P= 0
##$F2P= 0
##$FCOR= 1
##$FTSIZE= 16384
##$FT_mod= 6
##$GAMMA= 0
##$GB= 0
##$INTBC= 1
##$INTSCL= 8.052554e-10
##$ISEN= 128
##$LB= 0.24
##$LEV0= 0
##$LPBIN= 0
##$MAXI= 10000
##$MC2= 0
##$MEAN= 0
##$ME_mod= 0
##$MI= 1.114404
##$NCOEF= 0
##$NC_proc= -7
##$NLEV= 6
##$NOISF1= 3.799351
##$NOISF2= 2.8
##$NSP= 0
##$NTH_PI= 0
##$NZP= 0
##$OFFSET= 20.11725
##$PC= 1
##$PHC0= -9018.358
##$PHC1= 13.20096
##$PH_mod= 1
##$PKNL= yes
##$PPARMOD= 0
##$PSCAL= 0
##$PSIGN= 0
##$REVERSE= no
##$SF= 200.13001894366
##$SI= 16384
##$SIGF1= 3
##$SIGF2= 2
##$SINO= 5.538805
##$SIOLD= 16384
##$SREGLST= <1H.CDCl3>
##$SSB= 0
##$STSI= 16384
##$STSR= 0
##$SW_p= 4990.01996007984
##$SYMM= 0
##$S_DEV= 0
##$TDeff= 16384
##$TDoff= 0
##$TI= <>
##$TILT= no
##$TM1= 0
##$TM2= 0
##$TOPLEV= 0
##$USERP1= <user>
##$USERP2= <user>
##$USERP3= <user>
##$USERP4= <user>
##$USERP5= <user>
##$WDW= 1
##$XDIM= 16384
##$YMAX_p= 323188859
##$YMIN_p= -512975
$$ End of Bruker specific parameters
$$ ---------------------------------
##XUNITS= HZ
##YUNITS= ARBITRARY UNITS
##XFACTOR= 0.304585238361707
##YFACTOR= 1
##DELTAX= -0.304585238361707
##NPOINTS= 16384
##FIRSTX= 4026.06571215285
##FIRSTY= 0
##LASTX= -963.954247926985
##MAXY= 323188859
##MINY= -512975
##XYDATA= (X++(Y..Y))
$$ [...]
$$ plain form
6925 2257196 2389382 2136662 2027860 1960705 2135980 2091651 2040536 2069106 2126124 2283608
6915 2283608 2172692 2293956 2205709 2248288 2287113 2268248 2085703 1998407 1950037 2121380 2050597
6904 2050597 1990288 2037508 2120232 2145714 2167864 2087978 2195597 2227792 2173730 2107897 2053793
6893 2053793 2119351 2123706 2277928 2239071 2151403 2233012 2206108 2074536 2110910 2165332 2019920
6882 2019920 1821644 2116643 2143959 2096740 2035970 2164325 1818738 1728941 1863446 1842595
6872 1842595 2012045 2072777 1953290 1868034 1851400 1861803 2049067 2101625 1992785 1926458 1984705
6861 1984705 1940470 1963249 1818394 1852310 1771304 1774820 1852256 1806740 1892882 1807547 1718062
6850 1718062 1671515 1726770 1902313 1790948 1802216 1800433 1770183 1924743 2073117 1901483 1805590
$$ packed form
6925B257196J32186k52720j08802o7155J75275m4329n1115K8570N7018J57484
6915B283608j10916J21264q8247M2579L8825j8865j82545q7296m8370J71343p0783
6904B050597o0309M7220Q2724K5482K2150p9886J07619L2195n4062o5833n4104
6893B053793O5558M355J54222l8857q7668Q1609k6904j31572L6374N4422j45412
6882B019920j98276K94999K7316m7219o0770J28355l45587q9797J34505k0851
6872A842595J69450O0732j19487q5256j6634J0403J87264N2558j08840o6327N8247
6861A984705m4235K2779j44855L3916q1006L516P7436m5516Q6142q5335q9485
6850A718062m6547N5255J75543j11365J1268j783l0250J54560J48374j71634r5893
$$ plain form
6839 1805590 1794577 1736488 1829014 1855814 1638433 1849153 1974326 1940465 1787969 1753764 1771243
6828 1771243 1610369 1664276 1856378 1898175 1778165 1890946 1844618 1724669 2003952 1608688
6818 1608688 1676637 1687391 1497555 1626480 1774902 1843338 1731642 1718374 1702710 1672226 1528703
6807 1528703 1741929 1659555 1770112 1990752 1867179 1649100 1647136 1626831 1842746 1828122
6797 1828122 1652307 1614276 1729604 1720268 1598196 1688722 1736278 1674348 1823557 1926049 1697045
6786 1697045 1703781 1825945 1817402 1700712 1605355 1357605 1480234 1542584 1679321 1787695 1821758
6775 1821758 1799304 1673824 1682163 1822241 1739669 1639369 1477378 1496379 1849665 1814605 1610437
6764 1610437 1466439 1567197 1461855 1557081 1593153 1546127 1487840 1603622 1506208 1488488 1741708
$$ packed form
6839A805590j1013n8089R2526K6800k17381K10720J25173l3861j52496l4205J7479
6828A771243j60874N3907J92102M1797j20010J12781m6328j19949K79283l95264
6818A608688O7949J0754j89836J28925J48422O8436j11696j3268j5664l0484j43523
6807A528703K13226q2374J10557K20640j23573k18079j964k0305K15915j4624
6797A828122j75815l8031J15328r336j22072R0526M7556o1930J49209J02492k29004
6786A697045O736J22164q543j16690r5357k47750J22629O2350J36737J08374L4063
6775A821758k2454j25480Q339J40078q2572j00300j61991J9001L53286l5060k04168
6764A610437j43998J00758j05342R5226L6072m7026n8287J15782r7414j7720K53220
$$ plain form
6753 1741708 1756901 1602847 1667601 1681753 1583408 1525267 1489257 1409730 1592792 1558365 1531601
6742 1531601 1499883 1553229 1360928 1594583 1613148 1703730 1775342 1705174 1624773 1479994 1600047
6731 1600047 1502273 1722655 1594628 1474311 1481946 1393073 1609015 1424397 1373663 1357599 1404994
6720 1404994 1271131 1460846 1548350 1460922 1437574 1329661 1417036 1477381 1382120 1387032 1542309
6709 1542309 1449127 1560538 1501371 1511408 1239896 1351740 1440163 1609752 1733913 1640444
6699 1640444 1497664 1415144 1441668 1492266 1635362 1647578 1600135 1733437 1624463 1580997 1628395
6688 1628395 1616252 1683790 1642094 1532478 1728304 1664216 1589465 1655827 1651222 1571440 1494956
6677 1494956 1422098 1467817 1493209 1501187 1529272 1436007 1586989 1630320 1404734 1486423 1404229
$$ packed form
6753A741708J5193j54054O4754J4152r8345n8141l6010p9527J83062l4427k6764
6742A531601l1718N3346j92301K33655J8565R0582P1612p0168q0401j44779J20053
6731A600047r7774K20382j28027j20317P635q8873K15942j84618n0734j6064M7395
6720A404994j33863J89715Q7504q7428k3348j07913Q7375O0345r5261M912J55277
6709A542309r3182J11411n9167J0037k71512J11844Q8423J69589J24161r3469
6699A640444j42780q2520K6524N0598J43096J2216m7443J33302j08974m3466M7398
6688A628395j2143O7538m1696j09616J95826o4088p4751O6362m605p9782p6484
6677A494956p2858M5719K5392P978K8085r3265J50982M3331k25586Q1689q2194
$$ plain form
6666 1404229 1381495 1429187 1425471 1445005 1373504 1406414 1482992 1441503 1497772 1580956 1504724 1278953
6654 1278953 1468004 1403466 1223527 1572187 1540892 1406638 1400644 1316934 1422776 1549967
6644 1549967 1490967 1421967 1410082 1475836 1451052 1615748 1603548 1452717 1674560 1479297 1485528
6633 1485528 1482588 1474890 1462233 1503548 1504849 1418357 1636894 1475134 1502370 1621918 1726255
6622 1726255 1429882 1346611 1426217 1479768 1595213 1500671 1447172 1343436 1437965 1435987 1402734
6611 1402734 1357842 1466811 1384277 1470778 1441583 1581005 1464274 1368206 1399092 1467995 1619481
6600 1619481 1545357 1455045 1451707 1408444 1507922 1397250 1496380 1382437 1388666 1354412 1281270
6589 1281270 1418719 1316439 1353738 1376111 1517771 1451780 1302266 1329975 1299541 1191056
$$ packed form
6666A404229k2734M7692l716J9534p1501L2910P6578m1489N6269Q3184p6232k25771
6654A278953J89051o4538j79939L48660l1295j34254n994q3710J05842J27191
6644A549967n9000o9000j1885O5754k4784J64696j2200j50831K21843j95263O231
6633A485528k940p698j2657M1315J301q6492K18537j61760K7236J19548J04337
6622A726255k96373q3271P9606N3551J15445r4542n3499j03736R4529j978l3253
6611A402734m4892J08969q2534Q6501k9195J39422j16731r6068L0886O8903J51486
6600A619481p4124r0312l338m3263R9478j10672R9130j13943O229l4254p3142
6589A281270J37449j02280L7299K2373J41660o5991j49514K7709l0434j08485
$$ plain form
6579 1191056 1362502 1323875 1331596 1222895 1331523 1445194 1450438 1246309 1462814 1234633
6569 1234633 1248545 1200173 1389707 1276808 1217123 1274256 1357288 1391076 1336807 1275917 1364605
6558 1364605 1320494 1215655 1270782 1195758 1317919 1292868 1381197 1403663 1437187 1403046 1296739
6547 1296739 1371239 1426776 1447108 1442470 1570416 1560193 1366493 1245277 1330259 1285591 1282729
6536 1282729 1444419 1459571 1491971 1566296 1540926 1311935 1257565 1329554 1320006 1336548 1599530
6525 1599530 1561220 1645576 1675343 1644240 1588338 1447933 1440751 1706309 1753105 1782618 1872879
6514 1872879 1885566 1782680 1687293 1844302 1927070 1966170 1869264 1847448 1763936 1966787 1880910
6503 1880910 1900706 1893352 2060357 2144430 2013636 2055105 1971991 2119690 2068924 2111456 2159367
$$ packed form
6579A191056J71446l8627P721j08701J08628J13671N244k04129K16505k28181
6569A234633J3912m8372J89534j12899n9685N7133Q3032L3788n4269o0890Q8688
6558A364605m4111j04839N5127p5024J22161k5051Q8329K2466L3524l4141j06307
6547A296739P4500N5537K0332m638J27946j0223j93700j21216Q4982m4668k862
6536A282729J61690J5152L2400P4325k5370k28991n4370P1989r548J6542K62982
6525A599530l8310Q4356K9767l1103n5902j40405p182K65558M6796K9513R0261
6514A872879J2687j02886r5387J57009Q2768L9100r6906k1816q3512K02851q5877
6503A880910J9796p354J67005Q4073j30794M1469q3114J47699n0766M2532M7911
$$ plain form
6492 2159367 2089209 2208540 2159926 2303812 2322736 2378836 2350052 2139962 2172508 2327106 2191271
6481 2191271 2154534 2098513 2113838 2101403 2117533 1966695 1913428 1943695 1986465 2127594 2075322
6470 2075322 1968902 1865501 1844632 1682681 1601355 1502871 1708076 1606416 1658836 2018341
6460 2018341 2017110 1702578 1808745 1603831 1576602 1687564 1525889 1403555 1539700 1311827
6450 1311827 1383295 1476502 1316392 1259692 1327939 1458312 1301836 1355861 1263834 1186314 1427781
6439 1427781 1407027 1270556 1354245 1390467 1208830 1329427 1266752 1316827 1216185 1086766
6429 1086766 1202870 1176767 1282177 1335670 1158735 1153001 1100506 1149183 1263936 1187330 1340692
6418 1340692 1322783 1158967 1218587 1265428 1126295 1137401 1254044 1174818 1147122 1220151 988282
$$ packed form
6492B159367p0158J19331m8614J43886J8924N6100k8784k10090L2546J54598j35835
6481B191271l6737n6021J5325j2435J6130j50838n3267L0267M2770J41129n2272
6470B075322j06420j03401k0869j61951q1326r8484K05205j01660N2420L59505
6460B018341j231l14532J06167k04914k7229J10962j61675j22334J36145k27873
6450A311827P1468R3207j60110n6700O8247J30373j56476N4025r2027p7520K41467
6439A427781k0754j36471Q3689L6222j81637J20597o2675N0075j00642j29419
6429A086766J16104k6103J05410N3493j76935n734n2495M8677J14753p6606J53362
6418A340692j7909j63816N9620M6841j39133J1106J16643p9226k7696P3029k31869
$$ plain form
6407 988282 1103438 1082105 1215825 1445016 1139911 1149144 1155298 1232009 1159753 1096070 1002202
6396 1002202 1006832 1090897 1039018 1170017 1253721 929932 1244354 1095960 1041163 1221827 1250357
6385 1250357 1245108 1309279 1372180 1256488 1222049 1172670 1176108 1119575 1103330 1158637 1258650
6374 1258650 1171218 1141353 1174398 1160327 1278063 1248738 1067226 1112028 1311167 1371495 1267701
6363 1267701 1277499 1144724 1333568 1270542 1252632 905711 891604 1186112 1120008 1207191 1116496
6352 1116496 1104693 1215050 1327682 1229459 1257887 1031839 1013282 1232012 1134919 1184390 1232050
6341 1232050 1079293 922995 1065022 1126333 1202054 1264195 1288974 1025024 1036215 1053734 956807
6330 956807 863034 896546 1180277 1229690 1169359 1061083 937258 1093434 1011583 1041263 1144522
$$ packed form
6407I88282J15156k1333J33720K29191l05105R233O154P6711p2256o3683r3868
6396A002202M630Q4065n1879J30999Q3704l23789L14422j48394n4797J80664K8530
6385A250357n249O4171O2901j15692l4439m9379L438n6533j6245N5307J00013
6374A258650q7432k9865L3045j4071J17736k9325j81512M4802J99139O0328j03794
6363A267701R798j32775J88844o3026j7910l46921j4107K94508o6104Q7183r0695
6352A116496j1803J10357J12632r8223K8428k26048j8557K18730r7093M9471M7660
6341A232050j52757j56298J42027O1311P5721O2141K4779k63950J1191J7519r6927
6330I56807r3773L3512K83731M9413o0331j08276j23825J56176q1851K9680J03259
$$ plain form
6319 1144522 1007448 905427 984480 1223471 1079925 1037156 1034751 1104107 1004303 968541 1046951
6308 1046951 885518 998931 933349 1080704 994120 966301 760198 955472 893617 916949
6298 916949 1129811 988837 1125413 1206002 1015305 1043174 1047355 1073227 805594 999651 848672
6287 848672 1072643 1160045 1201263 1148603 1034770 888553 1061073 1141348 1073022 998668 953063
6276 953063 879833 1016530 1075464 978166 981061 858610 1055795 1037161 1162289 1094601 1050936
6265 1050936 1084833 1202399 1118295 1058805 1149121 1206034 1110623 1112911 976008 1123885 1251711
6254 1251711 1181575 1057625 1204273 984733 1085538 1077120 1036308 1119405 1173836 1232171 1089281
6243 1089281 872000 999965 1014451 947973 989804 1279076 1206584 1194707 956924 957271 1145022
$$ packed form
6319A144522j37074j02021P9053K38991j43546m2769k405O9356r9804l5762P8410
6308A046951j61433J13413o5582J47355q6584k7819k06103J95274o1855K3332
6298I16949K12862j40974J36576Q0589j90697K7869M181K5872k67633J94057j50979
6287H48672K23971Q7402M1218n2660j13833j46217J72520Q0275o8326p4354m5605
6276I53063p3230J36697N8934r7298K895j22451J97185j8634J25128o7688m3665
6265A050936L3897J17566q4104n9490R0316N6913r5411K288j36903J47877J27826
6254A251711p0136j23950J46648k19540J00805q418m0812Q3097N4431N8335j42890
6243A089281k17281J27965J4486o6478M1831K89272p2492j1877k37783L47J87751
$$ plain form
6232 1145022 1344757 1258992 1169957 948018 1002966 869345 1096423 1054817 1151067 1307873
6222 1307873 1178687 1217516 1241080 1296084 1136388 992895 1117368 1025850 1029366 1017739 1003502
6211 1003502 1033121 1108703 1144405 1153929 1229237 1189811 1224978 1124445 1205134 1196221 1114939 922420
6199 922420 929843 1118617 1201355 1285776 1439376 1061969 1000706 1135751 1322910 1092525 1045795
6188 1045795 1223275 1160865 1155913 1255147 1198420 1135591 1166596 1223183 1131509 1111741 1133126
6177 1133126 1200806 1055333 1156252 1189925 1116536 1290004 1106281 1321552 1022338 971447
6167 971447 1043494 927560 1116916 920523 1126162 1170830 1105808 988767 1178564 1231691
6157 1231691 1185133 1179142 1075613 1112835 1244953 1127821 932070 813014 941980 1093900
$$ packed form
6232A145022J99735q5765q9035k21939N4948j33621K27078m1606R6250J56806
6222A307873j29186L8829K3564N5004j59696j43493J24473r1518L516j1627j4237
6211A003502K9619P5582L5702R524P5308l9426L5167j00533Q0689q913q1282j92519
6199I22420P423J88774Q2738Q4421J53600l77407o1263J35045J87159k30385m6730
6188A045795J77480o2410m952R9234n6727o2829L1005N6587r1674j9768K1385
6177A133126O7680j45473J00919L3673p3389J73468j83723K15271k99214n0891
6167I71447P2047j15934J89356j96393K05639M4668o5022j17041J89797N3127
6157A231691m6558n991j03529L7222J32118j17132j95751j19056J28966J51920
$$ plain form
6147 1093900 1106971 984791 1117236 1184067 1007736 1016797 1078604 1187342 1078405 1149884 1227405
6136 1227405 1173258 1193693 1213243 1334633 1214398 1318639 1352382 1277135 1369151 1383798 1281127
6125 1281127 1345490 1345206 1423622 1279066 1056212 1033065 1022076 1214456 1266075 1257604 1022843
6114 1022843 1084903 1230918 1220134 1229621 1323479 1438240 1345671 1282653 1449586 1207589 1261003
6103 1261003 1327839 1483037 1272852 1184310 1180848 1194230 1416903 1357199 1248695 1250536 1423593
6092 1423593 1411718 1220825 1303021 1281062 1326493 1412004 1514813 1403037 1175079 1194368 1395406
6081 1395406 1489265 1447133 1383521 1217103 1172063 1292445 1413640 1446517 1532207 1412791 1313429
6070 1313429 1452770 1669298 1557699 1419655 1316464 1488702 1507970 1504530 1434594 1547015
$$ packed form
6147A093900J3071j22180J32445O6831j76331R061O1807J08738j08937P1479P7521
6136A227405n4147K0435J9550J21390j20235J04241L3743p5247R2016J4647j02671
6125A281127O4363k84P8416j44556k22854k3147j0989J92380N1619q471k34761
6114A022843O2060J46015j0784R487R3858J14761r2569o3018J66933k41997N3414
6103A261003O6836J55198k10185q8542l462J3382K22673n9704j08504J841J73057
6092A423593j1875j90893Q2196k1959M5431Q5511J02809j11776k27958J9289K01038
6081A395406R3859m2132o3612j66418m5040J20382J21195L2877Q5690j19416r9362
6070A313429J39341K16528j11599j38044j03191J72238J9268l440o9936J12421
$$ plain form
6060 1547015 1357683 1443821 1664114 1672149 1529380 1526147 1590626 1342374 1423551 1530945 1288261
6049 1288261 1360128 1442534 1361567 1561548 1591697 1756339 1588532 1505611 1556340 1489029 1291081
6038 1291081 1298232 1548716 1704464 1793706 1701489 1583242 1489281 1610765 1600722 1609255 1537714
6027 1537714 1661047 1699548 1576359 1562917 1804227 1821743 1752559 1591846 1656786 1624520 1792019
6016 1792019 2078359 1763724 1692172 1825446 1824316 1790077 1733488 1733769 1767396 1816826 1977758
6005 1977758 1911300 1826893 1816136 1865798 1900014 1972891 1884096 2004528 1948748 1907634 1852403
5994 1852403 1826396 2005822 2124782 2029952 1999837 2065491 1917872 1968270 2047906 1962611 2141954
5983 2141954 1896019 1925513 2158625 1885614 1972507 2229837 2221249 2049660 2122726 2277310
$$ packed form
6060A547015j89332Q6138K20293Q035j42769l233O4479k48252Q1177J07394k42684
6049A288261P1867Q2406q0967J99981L0149J64642j67807q2921N0729o7311j97948
6038A291081P151K50484J55748Q9242r2217j18247r3961J21484j0043Q533p1541
6027A537714J23333L8501j23189j3442K41310J7516o9184j60713O4940l2266J67499
6016A792019K86340l14635p1552J33274j130l4239n6589K81L3627M9430J60932
6005A977758o6458q4407j0757M9662L4216P2877q8795J20432n5780m1114n5231
5994A852403k6007J79426J18960r4830l0115O5654j47619N0398P9636q5295J79343
5983B141954k45935K9494K33112k73011Q6893K57330q588j71589P3066J54584
$$ plain form
5973 2277310 2163738 2212667 2108302 2127917 2360619 2271770 2281240 2140379 2163937 2211567 2231975
5962 2231975 2176582 2253511 2421546 2357976 2351765 2387741 2515272 2608831 2617796 2624157 2726304
5951 2726304 2744732 2716805 2652127 2597893 2687769 2831242 2756202 2755006 2840549 2875962 2887027
5940 2887027 2908725 3056384 3038142 3224751 3069989 3079495 3084639 2984433 3133322 3278290 3383596
5929 3383596 3203393 3113138 3183638 3174402 3206181 3252112 3469744 3650777 3486793 3505497 3462678
5918 3462678 3632174 3746387 3831480 3610417 3612455 3716079 3820460 3763448 3794508 3841055 4041628
5907 4041628 3840435 4018591 4238133 4020738 4083007 4154048 4149307 4258942 4368531 4116967
5897 4116967 4203355 4289312 4264285 4287360 4378363 4487290 4360348 4379819 4476105 4361052 4452367
$$ packed form
5973B277310j13572M8929j04365J9615K32702q8849R470j40861K3558M7630K0408
5962B231975n5393P6929J68035o3570o211L5976J27531R3559Q965O361J02147
5951B726304J8428k7927o4678n4234Q9876J43473p5040j196Q5543L5413J1065
5940B887027K1698J47659j8242J86609j54762R506N144j00206J48889J44968J05306
5929C383596j80203r0255P0500r236L1779M5931K17632J81033j63984J8704m2819
5918C462678J69496J14213Q5093k21063K038J03624J04381n7012L1060M6547K00573
5907D041628k01193J78156K19542k17395O2269P1041m741J09635J09589k51564
5897D116967Q6388Q5957k5027K3075R1003J08927j26942J9471R6286j15053R1315
$$ plain form
5886 4452367 4421731 4497043 4365505 4475143 4342445 4497281 4577668 4497298 4494478 4559094 4792802
5875 4792802 4652933 4725219 4701622 4668276 4650658 4878754 4928522 4855893 4741044 4782948 4942877
5864 4942877 5162336 5291938 5134254 5085018 5123424 5314213 5268852 5417334 5546245 5351892
5854 5351892 5595782 5624741 5621459 5392463 5420467 5543437 5644294 5946983 5807106 5976928
5844 5976928 5880458 5879620 6054027 6114846 6114207 6244228 6279398 6323559 6239868 6352382 6530055
5833 6530055 6265244 6192084 6238277 6375137 6348150 6536624 6902266 6782677 6548729 6691300
5823 6691300 6653198 6610219 6712153 7002173 7054647 7219469 7303780 7293896 7577111 7596377 7547617
5812 7547617 7654635 7695874 7641006 7826147 7736815 7731057 7876493 7844095 7944438 7999293 7903831
$$ packed form
5886D452367l0636P5312j31538J09638j32698J54836Q0387q0370k820O4616K33708
5875D792802j39869P2286k3597l3346j7618K28096M9768p2629j14849M1904J59929
5864D942877K19459J29602j57684m9236L8406J90789m5361J48482J28911j94353
5854E351892K43890K8959l282k28996K8004J22970J00857L02689j39877J69822
5844E976928r6470q38J74407O0819o39J30021L5170M4161q3691J12514J77673
5833F530055k64811p3160M6193J36860k6987J88474L65642j19589k33948J42571
5823F691300l8102m2979J01934K90020N2474J64822Q4311r884K83215J9266m8760
5812G547617J07018M1239n4868J85141q9332n758J45436l2398J00343N4855r5462
$$ plain form
5801 7903831 8097767 8206537 8315393 8468621 8660133 8481241 8468144 8443046 8737086 8861494
5791 8861494 8781310 8813168 8899669 8924732 8896937 8775529 8847516 8825418 8850470 9084665 9209220
5780 9209220 9223499 9209119 9143296 9178326 9225830 9253732 9289086 9178851 9072437 9155709 9159101
5769 9159101 9141657 9275993 9301169 9242843 9396143 9425605 9459602 9511584 9506447 9561304 9655710
5758 9655710 9533657 9480601 9498569 9584356 9716452 9595911 9459020 9458470 9797684 9836665 9849069
5747 9849069 9747515 9814002 9975487 10036831 9938987 10077064 10137066 10047374 10027921 10344712 10399359
5736 10399359 10530863 10535233 10632237 10764761 10908755 11078037 11332055 11451702 11496578 11564078
5726 11564078 11872148 11819117 11923924 12215868 12414503 12785837 13104527 12913512 13045648 13255592
$$ packed form
5801G903831J93936J08770J08856J53228J91512j78892j3097k5098K94040J24408
5791H861494q0184L1858Q6501K5063k7795j21408P1987k2098K5052K34195J24555
5780I209220J4279j4380o5823L5030M7504K7902L5354j10235j06414Q3272L392
5769I159101j7444J34336K5176n8326J53300K9462L3997N1982n137N4857R4406
5758I655710j22053n3056J7968Q5787J32096j20541j36891n50L39214L8981J2404
5747I849069j01554O6487J61485O1344r7844J38077O0002q9692j9453L16791N4647
5736A0399359J31504M370R7004J32524J43994J69282K54018J19647M4876O7500
5726A1564078L08070n3031J04807K91944J98635L71334L18690j91015J32136K09944
$$ plain form
5716 13255592 13484168 13777118 13945619 14268138 14539969 14722644 15013787 15531763 15903764
5707 15903764 16325730 16692616 17134159 17636895 18406531 18833683 19281608 19800737 20602648
5698 20602648 21417364 22150843 23052222 24143598 25298616 26432282 27382174 28818461 30450867
5689 30450867 32183073 34405469 36284065 38134339 39705053 40280272 39958835 39161915 38160880
5680 38160880 36905260 35494940 34126248 33268287 32422592 31628457 31000840 30410543 29840266
5671 29840266 29653656 29548185 29316359 29361850 29286944 29331711 29367182 29674598 29686230 29962548
5661 29962548 30380308 30526946 31188100 31749234 32265729 32823899 33390166 34101743 34782248
5652 34782248 35581372 36365845 37087808 38121268 39101375 39909572 41004032 42136613 43366595
$$ packed form
5716A3255592K28576K92950J68501L22519K71831J82675K91143N17976L72001
5707A5903764M21966L66886M41543N02736P69636M27152M47925N19129Q01911
5698B0602648Q14716P33479R01379J091376J155018J133666R49892J436287J632406
5689C0450867J732206K222396J878596J850274J570714N75219l21437p96920j001035
5680C8160880j255620j410320j368692q57961q45695p94135o27617n90297n70277
5671B9840266j86610j05471k31826M5491p4906M4767L5471L07416J1632K76318
5661B9962548M17760J46638O61154N61134N16495N58170N66267P11577O80505
5652C4782248P99124P84473P21963J033460R80107Q08197J094460J132581J229982
$$ plain form
5643 43366595 44522737 45918518 47263257 48502614 49923333 51499020 53077209 54602169
5635 54602169 56237225 58102341 60066241 62112647 63941179 65824010 67982305 70119848
5627 70119848 72468443 74882682 77238082 79405530 81989148 84512135 86934416 89392223
5619 89392223 91926295 94351043 96767765 99140738 101327227 103526270 105476423 107186468
5611 107186468 108957913 110252621 111595090 112571699 113504660 114247080 114774568 115269214 115817179
5602 115817179 116455369 116787387 117124958 117582517 117808830 118045240 118500347 119094249 119650925
5593 119650925 120126786 120801796 121361733 122049970 122987391 123787377 124874863 126152521 127109154
5584 127109154 128538218 129885721 131081231 132294238 133669296 134979952 136282226 137254042
$$ packed form
5643D3366595J156142J395781J344739J239357J420719J575687J578189J524960
5635E4602169J635056J865116J963900K046406J828532J882831K158295K137543
5627G0119848K348595K414239K355400K167448K583618K522987K422281K457807
5619H9392223K534072K424748K416722K372973K186489K199043J950153J710045
5611A07186468J771445J294708J342469R76609R32961P42420N27488M94646N47965
5602A15817179O38190L32018L37571M57559K26313K36410M55107N93902N56676
5593A19650925M75861O75010N59937O88237R37421P99986J087486J277658R56633
5584A27109154J429064J347503J195510J213007J375058J310656J302274R71816
$$ plain form
5576 137254042 138328310 139465120 140494905 141469884 142333605 143100358 143789530 144697683 145582199
5567 145582199 146673686 147646847 148587261 150046614 151739462 153360747 155362301 157353828
5559 157353828 159325344 160970401 162027260 161604409 159601342 157085205 153767714 150007549
5551 150007549 145926917 141528698 137365866 133384430 129491998 125865654 122135079 118718476
5543 118718476 115400098 112124494 108799058 105590112 102629562 99674378 96815883 94096172
5535 94096172 91438683 88803503 86371829 83645334 81324667 79094706 76474377 73966839
5527 73966839 71649357 69614594 67382286 64935550 62969266 60771009 58645482 56627028
5519 56627028 54574841 52735767 51072983 49178492 47477582 45806313 44329109 42651009
$$ packed form
5576A37254042J074268J136810J029785R74979Q63721P66753O89172R08153Q84516
5567A45582199J091487R73161R40414J459353J692848J621285K001554J991527
5559A57353828J971516J645057J056859m22851k003067k516137l317491l760165
5551A50007549m080632m398219m162832l981436l892432l626344l730575l416603
5543A18718476l318378l275604l325436l208946k960550k955184k858495k719711
5535I4096172k657489k635180k431674k726495k320667k229961k620329k507538
5527G3966839k317482k034763k232308k446736j966284k198257k125527k018454
5519E6627028k052187j839074j662784j894491j700910j671269j477204j678100
$$ plain form
5511 42651009 41223133 40136157 38716721 37167791 35910523 34801907 33621289 32801756
5503 32801756 31833088 30758041 29722959 28978738 27889918 27200492 26353749 25477449 24771229
5494 24771229 24140111 23492660 23005729 22443850 21689855 21094629 20680165 20022626 19543817
5485 19543817 19146718 18652474 18231029 17802264 17394016 17011009 16496626 16097642 15885454
5476 15885454 15451029 15139227 14702818 14563885 14195756 13818367 13802039 13679680 13566778 13241565
5466 13241565 12752665 12534347 12475208 12281582 11950288 11686316 11552927 11317495 11252017 11062882
5456 11062882 10784580 10657339 10470447 10466783 10264495 10049993 10094946 10107868 9872403 9583027
5446 9583027 9441434 9398245 9203860 8898524 8980928 8756891 8430700 8283471 8416553 8247593
$$ packed form
5511D2651009j427876j086976j419436j548930j257268j108616j180618q19533
5503C2801756r68668j075047j035082p44221j088820o89426q46743q76300p06220
5494B4771229o31118o47451m86931n61879p53995n95226m14464o57539m78809
5485A9543817l97099m94244m21445m28765m08248l83007n14383l98984k12188
5476A5885454m34425l11802m36409j38933l68129l77389j6328j22359j12902l25213
5466A3241565m88900k18318n9139j93626l31294k63972j33389k35432o5478j89135
5456A1062882k78302j27241j86892l664k02288k14502M4953J2922k35465k89376
5446I583027j41593m3189j94385l05336Q2404k24037l26191j47229J33082j68960
$$ plain form
5436 8247593 8121588 8000483 7970661 7986731 8007536 7665531 7521986 7534515 7365761 7343414
5426 7343414 7153127 7155618 7038853 6866346 6952182 6896320 6521010 6640317 6408372 6178890
5416 6178890 6239675 6260706 6101634 5998713 6000122 5944057 6045743 6084683 5870831 5863909 5728138
5405 5728138 5697950 5705370 5667564 5683015 5810911 5619405 5465803 5370667 5283005 5253706 5367937
5394 5367937 5239493 5296996 5170368 5023284 4858260 5023399 5135346 4904663 4795292 4748771
5384 4748771 4811542 4647908 4677253 4750179 4802515 4755504 4642311 4643306 4647500 4576418 4603670 4506389
5372 4506389 4483728 4420826 4357357 4541298 4533621 4471032 4471834 4283407 4400984 4310837 4361204
5361 4361204 4240774 4396074 4353322 4136336 4051219 4012246 3968719 3958118 3965091 3861716 3924759
$$ packed form
5436H247593j26005j21105k9822J6070K0805l42005j43545J2529j68754k2347
5426G343414j90287K491j16765j72507Q5836n5862l75310J19307k31945k29482
5416F178890O0785K1031j59072j02921J409n6065J01686L8940k13852o922j35771
5405E728138l0188P420l7806J5451J27896j91506j53602r5136q7662k9299J14231
5394E367937j28444N7503j26628j47084j65024J65139J11947k30683j09371m6521
5384D748771O2771j63634K9345P2926N2336m7011j13193R95M194p1082K7252r7281
5372D506389k2661o2902o3469J83941p677o2589Q02j88427J17577r0147N0367
5361D361204j20430J55300m2752k16986q5117l8973m3527j0601O973j03375O3043
$$ plain form
5350 3924759 4010421 3897525 3735185 3831303 3961197 3951093 3903849 3783104 3671927 3786392
5340 3786392 3832311 3848257 3737819 3603465 3616740 3804044 3643033 3627657 3607932 3710865
5330 3710865 3664383 3742163 3682535 3512334 3439544 3493321 3437410 3326073 3354397 3233115 3282141
5319 3282141 3264309 3087064 2951192 3149454 3033122 3085052 2965713 2994541 2811476 2966410
5309 2966410 2998387 2913830 2935228 2824622 2775092 2764295 2681688 2873115 2840331 2781399 2842702
5298 2842702 2622752 2589815 2693672 2750756 2795050 2770470 2509529 2347359 2392214 2402136 2285260
5287 2285260 2378357 2305774 2345860 2270447 2329623 2276964 2253020 2163963 2205026 2169032 2073996
5276 2073996 2090652 1885664 1828080 1822805 1990308 2229069 2148493 2045831 2047532 1979156 2036965
$$ packed form
5350C924759Q5662j12896j62340R6118J29894j0104m7244j20745j11177J14465
5340C786392M5919J5946j10438j34354J3275J87304j61011j5376j9725J02933
5330C710865m6482P7780n9628j70201p2790N3777n5911j11337K8324j21282M9026
5319C282141j7832j77245j35872J98262j16332N1930j19339K8828j83065J54934
5309B966410L1977q4557K1398j10606m9530j0797q2607J91427l2784n8932O1303
5298B842702k19950l2937J03857N7084M4294k4580k60941j62170M4855R922j16876
5287B285260R3097p2583M0086p5413N9176n2659k3944q9057M1063l5994r5036
5276B073996J6656k04988n7584n275J67503K38761q0576j02662J701o8376N7809
$$ plain form
5265 2036965 1972079 1948454 1886529 1958061 1944562 2005363 1910235 1849485 1889330 1842764 1822786
5254 1822786 1883262 1888696 1589470 1651783 1759006 1770607 1790028 1691182 1587876 1701379 1800322
5243 1800322 1776366 1871642 1841933 1857460 1722733 1719445 1698392 1737622 1741322 1580513 1666056
5232 1666056 1659173 1683044 1669987 1716606 1547508 1659717 1603523 1433787 1660677 1771982 1629039
5221 1629039 1668872 1591995 1524396 1501896 1517827 1534166 1443136 1556789 1597734 1584600 1505225
5210 1505225 1724272 1605451 1561692 1557010 1496471 1552584 1536120 1593263 1640388 1753395 1612904
5199 1612904 1649599 1555044 1498777 1520234 1570808 1485322 1671611 1558414 1515416 1411629 1500361
5188 1500361 1410358 1395059 1489511 1310628 1391664 1378134 1410278 1342075 1446056 1392808 1435022
$$ packed form
5265B036965o4886k3625o1925P1532j3499O0801r5128o0750L9845m6566j9978
5254A822786O0476N434k99226O2313J07223J1601J9421r8846j03306J13503R8943
5243A800322k3956R5276k9709J5527j34727l288k1053L9230L700j60809Q5543
5232A666056o883K3871j3057M6619j69098J12209n6194j69736K26890J11305j42943
5221A629039L9833p6877o7599k2500J5931J6339r1030J13653M0945j3134p9375
5210A505225K19047j18821m3759m682o0539N6113j6464N7143M7125J13007j40491
5199A612904L6695r4555n6267K1457N0574q5486J86289j13197m2998j03787Q8732
5188A500361r0003j5299R4452j78883Q1036j3530L2144o8203J03981n3248M2214
$$ plain form
5177 1435022 1588644 1559288 1509309 1532046 1544642 1409921 1383795 1371825 1286777 1082358 1319977
5166 1319977 1453301 1268025 1211749 1088704 1257851 1225958 1126187 1182797 1247600 1212798 1188537
5155 1188537 1275121 1422414 1511858 1321528 1179449 1236789 1117875 904584 1098553 1331372
5145 1331372 1166225 1214589 1148607 1022858 1020682 1186669 1270291 1005088 1047868 1036759 944541
5134 944541 1141456 1270849 1283155 1106010 1084666 845793 805469 1061757 920999 993873
5124 993873 997064 1006376 1085043 893616 968887 965487 957067 779479 877532 1099004 1110905 1124434
5112 1124434 1136130 1188164 1003691 1132195 1101637 1070857 1142032 934078 1113833 1063915 1042088
5101 1042088 1266080 1134293 982914 965930 1017279 975693 930920 844924 864808 938670 1049670
$$ packed form
5177A435022J53622k9356m9979K2737J2596j34721k6126j1970q5048k04419K37619
5166A319977J33324j85276n6276j23045J69147l1893r9771N6610O4803l4802k4261
5155A188537Q6584J47293Q9444j90330j42079N7340j18914k13291J93969K32819
5145A331372j65147M8364o5982j25749k176J65987Q3622k65203M2780j1109r2218
5134I44541J96915J29393J2306j77145k1344k38873m0324K56288j40758P2874
5124I93873L191R312P8667j91427P5271l400q420j77588R8053K21472J1901J3529
5112A124434J1696N2034j84473J28504l0558l0780P1175k07954J79755m9918k1827
5101A042088K23992j31787j51379j6984N1349m1586m4773q5996J9884P3862J11000
$$ plain form
5090 1049670 1025040 956372 1011192 1067139 1004977 844873 988387 1186121 1179714 1195262 1186539
5079 1186539 1017537 1038730 1084435 1030895 1018795 1139209 1085477 890502 804026 983947 933905
5068 933905 1054091 1104206 1039062 990998 888342 817118 873192 1078519 872165 857937 1211800
5057 1211800 1121225 888246 975440 940341 707035 889292 949662 1033846 1187970 1102946 1029105
5046 1029105 935052 961064 1131306 999596 817419 942869 1039003 953868 1021685 926490 1047001
5035 1047001 901121 935511 938834 957007 1180862 1092617 968795 1041122 1096874 1078006 1068985
5024 1068985 1094673 987293 898399 818422 776001 941404 894942 964012 937080 980789 994911
5013 994911 1073314 1085414 1211919 1133856 1122194 1142755 1010895 893577 960388 1044664 1141926
$$ packed form
5090A049670k4630o8668N4820N5947o2162j60104J43514J97734o407J5548q723
5079A186539j69002K1193M5705n3540j2100J20414n3732j94975q6476J79921n0042
5068I33905J20186N0115o5144m8064j02656p1224N6074K05327k06354j4228L53863
5057A211800r0575k32979Q7194l5099k33306J82257O0370Q4184J54124q5024p3841
5046A029105r4053K6012J70242j31710j82177J25450R6134q5135O7817r5195J20511
5035A047001j45880L4390L323J8173K23855q8245j23822P2327N5752j8868r021
5024A068985K5688j07380q8894p9977m2421J65403m6462O9070k6932M3709J4122
5013I94911P8403J2100J26505p8063j1662K0561j31860j17318O6811Q4276R7262
$$ plain form
5002 1141926 1165095 1144536 1028589 1018282 842273 797213 873310 1029150 991759 1075033 956816
4991 956816 1088522 1088725 896743 987673 1002492 895674 917351 1085042 982760 782102 820768
4980 820768 891686 914127 793807 785756 1032083 901361 660165 736344 669457 907767 997325
4969 997325 923419 970376 895055 920287 1074948 1015283 1097196 1213831 1162267 977017 977138
4958 977138 994955 991893 914295 920547 947947 979712 1053850 1108353 997187 986256 973344 967350
4946 967350 1099183 1062671 837100 830057 967277 1068526 1036246 1036030 1060656 964040 864343
4935 864343 915265 977951 989722 1219783 1197700 1082034 1097551 1142180 844909 869433 1010861
4924 1010861 950961 924714 990333 1015295 880169 843694 919011 857415 947162 803808 1141750
$$ packed form
5002A141926K3169k0559j15947j0307j76009m5060P6097J55840l7391Q3274j18217
4991I56816J31706K03j91982R0930J4819j06818K1677J67691j02282k00658L8666
4980H20768P0918K2441j20320q051K46327j30722k41196P6179o6887K38310Q9558
4969I97325p3906M6957p5321K5232J54661n9665Q1913J16635n1564j85250J21
4958I77138J7817l062p7598O252K7400L1765P4138N4503j11166j0931j2912n994
4946I67350J31833l6512k25571p043J37220J01249l2280k16K4626r6616r9697
4935H64343N0922O2686J1771K30061k2083j15666J5517M4629k97271K4524J41428
4924A010861n9900k6247O5619K4962j35126l6475P5317o1596Q9747j43354L37942
$$ plain form
4913 1141750 1202719 1129598 1012204 1048320 1234654 1032401 919044 1022085 838122 1016081
4903 1016081 1103954 940027 975018 1031953 980693 1179938 1122960 969041 863059 947525 919002
4892 919002 1040790 912248 861148 984149 989127 951031 921932 1079785 1015250 1000211 967903
4881 967903 983590 1165259 1109906 1176124 1136927 1173228 1052502 1001475 933232 1040568 1235578
4870 1235578 1191400 1070185 1021959 928809 882832 924448 995076 1096701 1159408 1227222 1134523
4859 1134523 1155384 1232989 1113410 1084747 1158303 1371744 1279398 1095252 1150324 1102313 1216653
4848 1216653 1159123 1096981 1050653 1055990 1018725 1239037 1195095 1317212 1263524 1350685 1106685
4837 1106685 1110317 1148961 1116159 982327 1088887 1083323 1107329 1206296 1205061 1251622 1255023 1035483
$$ packed form
4913A141750O0969p3121j17394L6116J86334k02253j13357J03041j83963J77959
4903A016081Q7873j63927L4991N6935n1260J99245n6978j53919j05982Q4466k8523
4892I19002J21788j28542n1100J23001M978l8096k9099J57853o4535j5039l2308
4881I67903J5687J81669n5353O6218l9197L6301j20726n1027o8243J07336J95010
4870A235578m4178j21215m8226r3150m5977M1616P0628J01625O2707O7814r2699
4859A134523K0861P7605j19579k8663P3556K13441r2346j84146N5072m8011J14340
4848A216653n7530o2142m6328N337l7265K20312m3942J22117n3688Q7161k44000
4837A106685L632L8644l2802j33832J06560n564K4006R8967j235M6561L401k19540
$$ plain form
4825 1035483 1134314 1290090 1328926 1252337 1193334 1293992 1416907 1378513 1285536 1469352 1386706
4814 1386706 1327549 1221541 1222347 1286276 1196289 1268888 1438530 1474272 1439125 1395754 1347067
4803 1347067 1398941 1506480 1451472 1550129 1495669 1520925 1351249 1521892 1471239 1508103 1620706
4792 1620706 1505399 1393527 1480487 1539771 1541888 1509370 1574743 1488741 1495458 1633490 1418862
4781 1418862 1564551 1555289 1607222 1525771 1501897 1551855 1747050 1580510 1521606 1506614 1538870
4770 1538870 1632881 1408934 1406690 1734090 1778034 1769384 1751539 1651176 1585619 1550907 1545788
4759 1545788 1640498 1803816 1798215 1665298 1811902 1937345 1787944 2014150 1702354 1590062
4749 1590062 1759486 1631306 1734639 1677066 1639800 1803838 1707903 1790516 1969859 1621491
$$ packed form
4825A035483R8831J55776L8836p6589n9003J00658J22915l8394r2977J83816q2646
4814A386706n9157j06008Q06O3929q9987P2599J69642L5742l5147m3371m8687
4803A347067N1874J07539n5008R8657n4460K5256j69676J70643n0653L6864J12603
4792A620706j15307j11872Q6960N9284K117l2518O5373q6002O717J38032k14628
4781A418862J45689r262N1933q1451k3874M9958J95195j66540n8904j4992L2256
4770A538870R4011k23947k244L27400M3944q650j7845j00363o5557l4712n119
4759A545788R4710J63318n601j32917J46604J25443j49401K26206l11796j12292
4749A590062J69424j28180J03333n7573l7266J64038r5935Q2613J79343l48368
$$ plain form
4739 1621491 1483774 1764278 1713698 1877167 1817972 1798708 1920990 1843660 1738247 1720829
4729 1720829 1854368 1773082 1678748 1572821 1711355 1695738 1707856 1869828 1927835 1770162
4719 1770162 1626846 1594085 1565956 1793744 1733742 1798716 1778183 1737982 1873804 1885881 2031315
4708 2031315 1977701 2128067 1819785 1657312 1878057 1943209 1997129 1975808 1976983 1688583 1899666
4697 1899666 2093080 2047307 2006952 2018163 2050429 1964988 2117534 1960721 2015778 2004176 2043208
4686 2043208 1973176 1950686 1920046 1807348 1970474 2166566 2247969 2126219 2155986 2225911 2216972
4675 2216972 2132691 2258153 2125058 2114073 2269376 2352318 2334738 2443940 2337466 2361809
4665 2361809 2484929 2391380 2585673 2614118 2644415 2518812 2386834 2469564 2537245 2421682
$$ packed form
4739A621491j37717K80504n0580J63469n9195j9264J22282p7330j05413j7418
4729A720829J33539q1286r4334j05927J38534j5617J2118J61972N8007j57673
4719A770162j43316l2761k8129K27788o0002O4974k0533m0201J35822J2077J45434
4708B031315n3614J50366l08282j62473K20745O5152N3920k1321J175k88400K11083
4697A899666J93414m5773m0355J1211L2266q5441J52546j56813N5057j1602L9032
4686B043208p0032k2490l0640j12698J63126J96092Q1403j21750K9767O9925q939
4675B216972q4281J25462j33095j0985J55303Q2942j7580J09202j06474K4343
4665B361809J23120r3549J94293K8445L0297j25603j31978Q2730O7681j15563
$$ plain form
4655 2421682 2365898 2470792 2433305 2360269 2365299 2511234 2474859 2669423 2508603 2524684 2548137
4644 2548137 2510828 2692193 2500175 2436349 2425516 2603306 2587324 2568075 2488607 2624116 2726631
4633 2726631 2629784 2740909 2521825 2482052 2661476 2553400 2367234 2555675 2487641 2515945
4623 2515945 2665829 2760872 2625922 2664401 2636608 2343647 2373991 2499557 2561854 2473467 2451578
4612 2451578 2542315 2396229 2283702 2496360 2652839 2566130 2536060 2582154 2523457 2336001
4602 2336001 2547578 2386320 2521939 2438566 2302262 2363166 2443162 2355486 2269192 2414939
4592 2414939 2470273 2416290 2515902 2629048 2548088 2641818 2496364 2407956 2567829 2784617 2610518
4581 2610518 2597088 2572789 2516855 2649201 2914980 2911974 2922883 2927165 3310326 3084397 3005373
$$ packed form
4655B421682n5784J04894l7487p3036N030J45935l6375J94564j60820J6081K3453
4644B548137l7309J81365j92018o3826j0833J77790j5982j9249p9468J35509J02515
4633B726631r6847J11125k19084l9773J79424j08076j86166J88441o8034K8304
4623B515945J49884R5043j34950L8479k7793k92961L0344J25566O2297q8387k1889
4612B451578R0737j46086j12527K12658J56479q6709l0070M6094n8697j87456
4602B336001K11577j61258J35619q3373j36304O0904P9996q7676q6294J45747
4592B414939N5334n3983R9612J13146q0960R3730j45454q8408J59873K16788j74099
4581B610518j3430k4299n5934J32346K65779l006J0909M282L83161k25929p9024
$$ plain form
4570 3005373 3086133 3311128 3405715 3525854 3878082 4012329 3932248 3812049 4177439 4559885
4560 4559885 4660139 4666845 4859602 5394395 5730029 6067107 6453216 6820392 7085015 7204214
4550 7204214 7324950 7100939 6969216 6742823 6416376 6018936 5584292 5308630 4938545 4756009
4540 4756009 4768100 4479254 4534086 4612860 4363954 4030291 4100622 4128851 4015942 4027119 4000101
4529 4000101 3909150 3785751 3788311 3835574 3847584 3588671 3688352 3698534 3626287 3925251 4240399
4518 4240399 4003466 3792222 3611345 3595224 3759422 3882202 3904682 4007071 3994680 4107418
4508 4107418 4277524 4300842 4420944 4465775 4547491 4729655 4795193 4880171 4814805 4818264 4975500
4497 4975500 5052369 5330250 5464625 5524411 5568813 5800126 6021822 6062229 6346498 6555111
$$ packed form
4570C005373Q0760K24995R4587J20139L52228J34247q0081j20199L65390L82446
4560D559885J00254O706J92757N34793L35634L37078L86109L67176K64623J19199
4550G204214J20736k24011j31723k26393l26447l97440m34644k75662l70085j82536
4540D756009J2091k88846N4832P8774k48906l33663P0331K8229j12909J1177k7018
4529D000101r0951j23399K560M7263J2010k58913R9681J0182p2247K98964L15148
4518D240399k36933k11244j80877j6121J64198J22780K2480J02389j2391J12738
4508D107418J70106K3318J20102M4831Q1716J82164O5538Q4978o5366L459J57236
4497D975500P6869K77881J34375N9786M4402K31313K21696M0407K84269K08613
$$ plain form
4487 6555111 6857878 7185815 7121706 7531990 7735637 8039302 8400074 8758894 9073217 9399889
4477 9399889 9784376 10080948 10690985 10952129 11510608 12172977 12547123 13031287 13301946 13559009
4467 13559009 13826451 13976751 14099395 14109522 13993134 13732121 13821375 13905628 13663628 13761958
4457 13761958 13868521 13714400 13955895 13928681 13710310 13635812 13639274 13752385 13858410 14059140
4447 14059140 14452317 14980908 15257950 15371910 15235431 14641933 13869090 13057448 12203038
4438 12203038 11673320 10980812 10134314 9402471 8887995 8407039 8072878 7816982 7487179
4429 7487179 7171426 6893642 6575455 6166245 5903680 5979085 5594896 5453100 5360832 5240103
4419 5240103 4996361 4857148 4797266 4653515 4435214 4683297 4563310 4473989 4326777 4241593
$$ packed form
4487F555111L02767L27937o4109M10284K03647L03665L60772L58820L14323L26672
4477I399889L84487K96572O10037K61144N58479O62369L74146M84164K70659K57063
4467A3559009K67442J50300J22644J0127j16388k61013Q9254Q4253k42000R8330
4457A3761958J06563j54121K41495k7214k18371p4498L462J13111J06025K00730
4447A4059140L93177N28591K77042J13960j36479n93498p72843q11642q54410
4438A2203038n29718o92508q46498p31843n14476m80956l34161k55896l29803
4429G487179l15753k77784l18187m09210k62565P5405l84189j41796r2268j20729
4419E240103k43742j39213n9882j43751k18301K48083j19987q9321j47212q5184
$$ plain form
4409 4241593 4227475 4096968 4018056 4099018 4083305 3976335 3757793 3768469 3727880 3892640 3939339
4398 3939339 3723719 3774278 3634779 3766432 3704926 3720024 3454096 3654563 3773240 3738356
4388 3738356 3793415 3742652 3752623 3486437 3572954 3571712 3382812 3601451 3538618 3427357 3308415
4377 3308415 3491108 3428907 3558604 3628342 3669810 3592264 3583818 3564306 3541312 3371457 3565426
4366 3565426 3664831 3514402 3420336 3593433 3540612 3656610 3784785 3527228 3695357 3667468
4356 3667468 3683386 3658428 3765080 3684523 3659055 3745760 3689667 3774554 3817532 3813183 3885863
4345 3885863 3726421 3686377 3917985 3766974 3601157 3820091 3951284 3956600 4046501 3786117
4335 3786117 3910665 4107399 3999986 3981515 4063932 4017248 3919693 3986307 4053007 4042893 3906629
$$ packed form
4409D241593j4118j30507p8912Q0962j5713j06970k18542J0676m0589J64760M6699
4398C939339k15620N0559j39499J31653o1506J5098k65928K00467J18677l4884
4388C738356N5059n0763R971k66186Q6517j242j88900K18639o2833j11261j18942
4377C308415J82693o2201J29697O9738M1468p7546q446j9512k2994j69855J93969
4366C565426R9405j50429r4066J73097n2821J15998J28175k57557J68129k7889
4356C667468J5918k4958J06652q0557k5468Q6705n6093Q4887M2978m349P2680
4345C885863j59442m0044K31608j51011j65817K18934J31193N316Q9901k60384
4335C786117J24548J96734j07413j8471Q2417m6684r7555O6614O6700j0114j36264
$$ plain form
4324 3906629 4093196 4178479 4184632 4090237 3952542 4208797 4293261 4255302 4132897 4188661 4395291
4313 4395291 4369312 4376662 4281087 4480029 4529295 4354211 4419120 4606402 4556697 4651172 4814383
4302 4814383 4677806 4692271 4902625 4922141 4998697 4928743 4924277 4970948 5052106 5156604 5154036
4291 5154036 5098102 5259916 5137790 5244447 5300179 5141031 5333129 5574863 5668483 5398257
4281 5398257 5423886 5507102 5730759 5758277 5896658 5744860 5721574 5900564 5958154 5943508 5922126
4270 5922126 6028840 6316661 6394271 6454873 6308746 6382159 6365349 6558660 6590804 6646609 6861851
4259 6861851 6715127 6887336 7069114 6903346 6985922 6930667 6869040 7121689 7352365 7595439
4249 7595439 7467246 7541189 7731431 7857929 7881782 8013179 8071070 8245859 8276844 8426949
$$ packed form
4324C906629J86567Q5283O153r4395j37695K56255Q4464l7959j22405N5764K06630
4313D395291k5979P350r5575J98942M9266j75084O4909J87282m9705R4475J63211
4302D814383j36577J4465K10354J9516P6556o9954m466M6671Q1158J04498k568
4291E154036n5934J61814j22126J06657N5732j59148J92098K41734R3620k70226
4281E398257K5629Q3216K23657K7518J38381j51798k3286J78990N7590j4646k1382
4270E922126J06714K87821P7610O0602j46127P3413j6810J93311L2144N5805K15242
4259F861851j46724J72209J81778j65768Q2576n5255o1627K52649K30676K43074
4249G595439j28193P3943J90242J26498K3853J31397N7891J74789L0985J50105
$$ plain form
4239 8426949 8671822 8677582 8759570 9053454 9182729 9493784 9929545 9934694 10316416 10522570
4229 10522570 10670268 11254583 11763464 11915925 12177268 12495919 12676283 12811798 12791008 12774793
4219 12774793 12807228 12403136 12100042 12051266 11653620 11440118 11127280 10921813 10596717 10492914
4209 10492914 10308237 10071670 9677909 9404966 9530079 9538500 9482228 9381447 9261509 9338821
4199 9338821 9110773 9145212 9063556 8769194 8771575 8935414 8794006 8732211 8627004 8827619
4189 8827619 8856366 8769869 8689319 8895711 8690005 8759930 8694667 8571865 8678811 8737188 8573097
4178 8573097 8634945 8802333 8870415 8957243 8968810 8920225 8771760 8885526 8807747 9094657 9014128
4167 9014128 8929549 8987171 9056013 9231559 9324548 9345221 9386077 9510548 9613932 9548380 9610936
$$ packed form
4239H426949K44873N760Q1988K93884J29275L11055M35761N149L81722K06154
4229A0522570J47698N84315N08881J52461K61343L18651J80364J35515k0790j6215
4219A2774793L2435m04092l03094m8776l97646k13502l12838k05467l25096j03803
4209A0492914j84677k36567l93761k72943J25113Q421n6272j00781j19938P7312
4199I338821k28048L4439q1656k94362K381J63839j41408o1795j05207K00615
4189H827619K8747q6497q0550K06392k05706O9925o5263j22802J06946N8377j64091
4178H573097O1848J67388O8082Q6828J1567m8585j48465J13766p7779K86910q0529
4167I014128q4579N7622O8842J75546R2989K0673M0856J24471J03384o5552O2556
$$ plain form
4156 9610936 9778776 9773012 9647388 9832061 9849761 9692485 9863298 9897738 9925935 10047887
4146 10047887 10328736 10484825 10225758 10548171 10524522 10730716 10895179 10835017 10792529 10857325
4136 10857325 10974061 10956305 10899729 11051231 11337137 11197207 11162385 11243513 11368924 11519361
4126 11519361 11409147 11626906 11516729 11633379 11539229 11857479 11722105 11680691 11905932 12031917
4116 12031917 11875475 11859473 11995762 12218931 12448964 12236756 12246386 12374501 12483283 12598961
4106 12598961 12750581 12618092 12762640 12648007 12703001 12950316 12895416 13075451 12999853 12936411
4096 12936411 13053819 13232892 13413942 13375540 13478113 13645026 13869671 13832674 13819494 13993606
4086 13993606 14075950 14283036 14380504 14507540 14898968 14901567 14869898 14937925 15269347 15498446
$$ packed form
4156I610936J67840n764j25624J84673J7700j57276J70813L4440K8197J21952
4146A0047887K80849J56089k59067L22413k3649K06194J64463o0162m2488O4796
4136A0857325J16736j7756n6576J51502K85906j39930l4822Q1128J25411J50437
4126A1519361j10214K17759j10177J16650r4150L18250j35374m1414K25241J25985
4116A2031917j56442j6002J36289K23169K30033k12208R630J28115J08782J15678
4106A2598961J51620j32489J44548j14633N4994K47315n4900J80035p5598o3442
4096A2936411J17408J79073J81050l8402J02573J66913K24645l6997j3180J74112
4086A3993606Q2344K07086R7468J27036L91428K599l1669O8027L31422K29099
$$ plain form
4076 15498446 15625889 15811295 16032251 16259658 16323984 16539515 16714076 16957905 16968863 17074558
4066 17074558 17408453 17523561 17850602 18159060 18257398 18485587 18911999 19137505 19235505 19610243
4056 19610243 19764524 19837386 20077121 20465582 20937330 20969920 21216847 21670263 21923527 22395506
4046 22395506 22709755 23008721 23464320 23776907 24208327 24609450 24983366 25302444 25685828
4037 25685828 26217864 26597284 27078573 27489419 27809569 28305199 28717755 29141957 29449583
4028 29449583 29966894 30623074 31162082 31649743 32138958 32662804 33291530 33972992 34367275
4019 34367275 34985106 35745641 36019246 36744542 37389045 38187041 38704115 39616256 40328637
4010 40328637 40913748 41622953 42458122 43506037 44384411 45172588 45964558 46986153 48123045
$$ packed form
4076A5498446J27443J85406K20956K27407O4326K15531J74561K43829J0958J05695
4066A7074558L33895J15108L27041L08458R8338K28189M26412K25506R8000L74738
4056A9610243J54281P2862K39735L88461M71748L2590K46927M53416K53264M71979
4046B2395506L14249K98966M55599L12587M31420M01123L73916L19078L83384
4037B5685828N32036L79420M81289M10846L20150M95630M12556M24202L07626
4028B9449583N17311O56180N39008M87661M89215N23846O28726O81462L94283
4019C4367275O17831P60535K73605P25296O44503P97996N17074R12141P12381
4010D0328637N85111P09205Q35169J047915Q78374P88177P91970J021595J136892
$$ plain form
4001 48123045 49021996 49858156 51045011 52075574 53105640 54198811 55513703 56884795
3993 56884795 58191033 59643590 60986568 62510004 64266257 65748238 67376207 69290510
3985 69290510 71184483 73142119 75268945 77184805 79641038 81955401 84268766 86811803
3977 86811803 89581700 92360262 95022442 98144179 101309591 104699113 108275106 112303621
3969 112303621 116545056 120734331 125154030 129872845 134982566 140178256 145539266 151627309
3961 151627309 157715651 164361095 171638590 179094187 186885820 195070506 203982893 213418346
3953 213418346 222922117 232941804 243194421 253849722 264671717 275520145 286287165
3946 286287165 296446573 305478073 313132439 318861979 322043846 323188859 322638746 321084168
$$ packed form
4001D8123045Q98951Q36160J186855J030563J030066J093171J314892J371092
3993E6884795J306238J452557J342978J523436J756253J481981J627969J914303
3985F9290510J893973J957636K126826J915860K456233K314363K313365K543037
3977H6811803K769897K778562K662180L121737L165412L389522L575993M028515
3969A12303621M241435M189275M419699M718815N109721N195690N361010O088043
3961A51627309O088342O645444P277495P455597P791633Q184686Q912387R435453
3953B13418346R503771J0019687J0252617J0655301J0821995J0848428J0767020
3946B86287165J0159408R031500P654366N729540L181867J145013n50113j554578
$$ plain form
3938 321084168 319209966 317151007 314870836 313190784 312052949 311566837 311431285 311728690
3930 311728690 312354068 313025105 313452513 313765808 313665807 312899359 311227466 308642109 305430918
3921 305430918 301357083 296647195 291739499 286443061 280990248 275232127 269429417 263575609
3913 263575609 258131863 252828386 247602963 242698596 237789777 232848439 227821720 222815241
3905 222815241 217781473 212794556 207554518 202165126 196443917 190409201 184216452 177767781
3897 177767781 170995103 164233421 157601149 150997788 144607713 138057248 131961238 126152021
3889 126152021 120604332 115072384 109902645 105404046 100741633 96486110 92526129 88675689
3881 88675689 84740871 81514402 78440181 75384592 72542745 69823899 67347122 64932944
$$ packed form
3938C21084168j874202k058959k280171j680052j137835m86112j35552K97405
3930C11728690O25378O71037M27408L13295j00001p66448j671893k585357l211191
3921C05430918m073835m709888m907696n296438n452813n758121n802710n853808
3913B63575609n443746n303477n225423m904367m908819m941338n026719n006479
3905B22815241n033768m986917n240038n389392n721209o034716o192749o448671
3897A77767781o772678o761682o632272o603361o390075o550465o096010n809217
3889A26152021n547689n531948n169739m498599m662413m255523l959981l850440
3881H8675689l934818l226469l074221l055589k841847k718846k476777k414178
$$ plain form
3873 64932944 62736117 60716573 58651611 56846489 54939694 53358911 51779044 50093352
3865 50093352 48783138 47515221 46180522 44555619 43483672 42366453 41446085 40314469
3857 40314469 39322229 38414485 37507849 36679076 35819602 35161627 34285728 33642103 33094548
3848 33094548 32460295 31810576 31257901 30651333 29961903 29463532 29000165 28638043 27981571
3839 27981571 27550422 27073612 27004339 26493860 25975151 25604892 25122164 24813979 24404893 24217039
3829 24217039 23712532 23281181 22874732 22636416 22294162 22011146 21744559 21384462 21162659
3820 21162659 20931557 20642482 20197723 20079531 20063381 19704523 19546793 19159980 18724584 18691623
3810 18691623 18453374 18228228 17932072 17856264 17661290 17388920 17310736 16861798 16967715 16782251
$$ packed form
3873F4932944k196827k019544k064962j805122j906795j580783j579867j685692
3865E0093352j310214j267917j334699j624903j071947j117219r20368j131616
3857D0314469r92240r07744r06636q28773q59474o57975q75899o43625n47555
3848C3094548o34253o49719n52675o06568o89430m98371m63367l62122o56472
3839B7981571m31149m76810o9273n10479n18709l70259m82728l08185m09086j87854
3829B4217039n04507m31351m06449k38316l42254k83016k66587l60097k21803
3820B1162659k31102k89075m44759j18192j6150l58858j57730l86813m35396l2961
3810A8691623k38249k25146k96156p5808j94974k72370p8184m48938J05917j85464
$$ plain form
3800 16782251 16520851 16401579 16164367 16091422 15926937 15509736 15269289 15392110 15385552 15188275
3790 15188275 14819028 14634621 14566045 14439789 14511287 14289193 14161778 14128696 14066262 13977433
3780 13977433 13958094 13882672 13649376 13543009 13439150 13364637 13423205 13369716 13385771 13339168 13452938
3769 13452938 13385768 13301129 13277678 13351357 13505465 13459806 13369926 13415971 13470676 13559156 13904544
3758 13904544 13758864 13924218 14024828 14037607 14066111 14244952 14244851 14435321 14581968 14788359
3748 14788359 14857294 14812966 15057450 15326568 15412041 15320815 15446312 15674446 15864147 15892509
3738 15892509 16099306 16201281 16512528 16794743 17037116 17347340 17755830 17756412 17886204 18289923
3728 18289923 18713736 18824292 19246271 19664971 20257014 20393914 20662436 20920623 21306944
$$ packed form
3800A6782251k61400j19272k37212p2945j64485m17201k40447J22821o558j97277
3790A5188275l69247j84407o8576j26256P1498k22094j27415l3082o2434q8829
3780A3977433j9339p5422k33296j06367j03859p4513N8568n3489J6055m6603J13770
3769A3452938o7170q4639k3451P3679J54108m5659q9880M6045N4705Q8480L45388
3758A3904544j45680J65354J00610J2779K8504J78841j01J90470J46647K06391
3748A4788359O8935m4328K44484K69118Q5473r1226J25497K28134J89701K8362
3738A5892509K06797J01975L11247K82215K42373L10224M08490N82J29792M03719
3728A8289923M23813J10556M21979M18700N92043J36900K68522K58187L86321
$$ plain form
3719 21306944 21741188 22237828 22663944 22960259 23224838 23550762 23849772 24255728 24674062
3710 24674062 24707847 25221724 25591859 25913926 26385750 26718482 26989176 27472901 28135741 28642581
3700 28642581 29196846 29668806 30204676 30720047 30776072 31021039 30691105 30472543 30461969 30301729
3690 30301729 30186149 29789822 29696508 29719300 29834477 29948940 30071495 29963006 29852879 29879903
3680 29879903 29858219 30066096 29765458 29410953 29329038 29214953 28718651 28224116 27546437 26868865
3670 26868865 26683858 26056683 25374933 25075561 24451339 24030201 23518231 23237293 22724776
3661 22724776 22233333 21679197 21010013 20532081 19912625 19267084 18864585 18253233 17501657
3652 17501657 16711002 16267162 15548788 15117297 14448759 13993518 13774496 13491205 12842382
$$ packed form
3719B1306944M34244M96640M26116K96315K64579L25924K99010M05956M18334
3710B4674062L3785N13877L70135L22067M71824L32732K70694M83725O62840N06840
3700B8642581N54265M71960N35870N15371N6025K44967l29934k18562j0574j60240
3690C0301729j15580l96327r3314K2792J15177J14463J22555j08489j10127K7024
3680B9879903k1684K07877l00638l54505q1915j14085m96302m94535o77679o77572
3670B6868865j85007o27175o81750k99372o24222m21138n11970k80938n12517
3661B2724776m91443n54136o69184m77932o19456o45541m02499o11352p51576
3652A7501657p90655m43840p18374m31491o68538m55241k19022k83291o48823
$$ plain form
3643 12842382 12537190 12339004 11751958 11370555 11045160 10733193 10383566 10150714 9883096
3634 9883096 9581583 9369436 9345081 9079730 8774323 8606419 8295791 8024227 8060970 7866419
3624 7866419 7584577 7272254 7425574 7197595 6846593 6770978 6585335 6496638 6297725 6318526
3614 6318526 6020798 5936445 5730564 5638447 5797964 5623253 5400517 5298680 5401707 5245402
3604 5245402 5282811 5133289 4949252 4985370 4777270 4753968 4719248 4665407 4583191 4512909 4253603
3593 4253603 3915958 3966786 3938537 4104978 4094961 3965362 3768480 3872517 3698318 3650124
3583 3650124 3477656 3564979 3562757 3298383 3329754 3306312 3433474 3306288 3286041 3273207 3283394
3572 3283394 3147303 2926535 2853451 2963982 2769627 2890074 2750236 2661921 2687885 2649148
$$ packed form
3643A2842382l05192j98186n87046l81403l25395l11967l49627k32852k67618
3634I883096l01513k12147k4355k65351l05407j67904l10628k71564L6743j94551
3624G866419k81842l12323J53320k27979l51002p5615j85643q8697j98913K0801
3614F318526k97728q4353k05881r2117J59517j74711k22736j01837J03027j56305
3604E245402L7409j49522j84037L6118k08100k3302l4720n3841q2216p0282k59306
3593D253603l37645N0828k8249J66441j0017j29599j96882J04037j74199m8194
3583C650124j72468Q7323k222k64374L1371k3442J27162j27186k0247j2834J0187
3572C283394j36091k20768p3084J10531j94355J20447j39838q8315K5964l8737
$$ plain form
3562 2649148 2761852 2425583 2554864 2281500 2365972 2367947 2445279 2513802 2358483 2091551
3552 2091551 2033120 2125224 2213771 2096719 2270584 2224175 2228490 2015844 2091622 2192686 2127132
3541 2127132 1975409 1798832 1925131 1733080 2049215 2003134 1852761 1929996 1888172 1858583
3531 1858583 1866883 1839631 1855003 1773179 1671405 1683934 1709038 1709243 1603764 1584760 1804912
3520 1804912 1636445 1500201 1643763 1659488 1721960 1810037 1839397 1643956 1440435 1417021
3510 1417021 1342687 1296574 1405447 1591957 1527460 1405917 1391333 1389503 1267397 1350935 1328522
3499 1328522 1332551 1321490 1398137 1397481 1186763 1327182 1273191 1349181 1323019 1301215 1184996
3488 1184996 1167033 1259355 1343070 1330178 1490132 1408464 1305373 1423799 1220295 1343632
$$ packed form
3562B649148J12704l36269J29281k73364Q4472J975P7332O8523j55319k66932
3552B091551n8431R2104Q8547j17052J73865m6409M315k12646P5778J01064o5554
3541B127132j51723j76577J26299j92051L16135m6081j50373P7235m1824k9589
3531A858583Q300k7252J5372q1824j01774J2529K5104K05j05479j9004K20152
3520A804912j68467j36244J43562J5725O2472Q8077K9360j95441k03521k3414
3510A417021p4334m6113J08873J86510o4497j21543j4584j830j22106Q3538k2413
3499A328522M029j1061P6647o56k10718J40419n3991P5990k6162k1804j16219
3488A184996j7963R2322Q3715j2892J59954q1668j03091J18426k03504J23337
$$ plain form
3478 1343632 1171567 1306280 1178954 1303533 1174955 1242785 1209900 1359526 1175433 1238787
3468 1238787 1455476 1208671 1051068 874886 1059402 1090028 1124436 1067182 944987 1009146
3458 1009146 1211066 1047650 1085834 1043917 846134 910986 959925 1027071 997635 882271 903202
3447 903202 931878 779908 887841 888377 839883 855667 750442 814583 859068 930955 897797
3436 897797 719378 638614 579678 721798 685668 458893 674319 545560 669719 854424
3426 854424 858610 850420 759239 778116 780365 774068 825825 765815 747232 653418 641210 644557 605150
3413 605150 623366 726746 815457 636316 530658 618539 627076 554682 609748 516496 663377
3402 663377 847524 762470 835856 743247 745502 545603 635714 584648 520233 490211 522722
$$ packed form
3478A343632j72065J34713j27326J24579j28578O7830l2885J49626j84093O3354
3468A238787K16689k46805j57603j76182J84516L0626L4408n7254j22195O4159
3458A009146K01920j63416L8184m1917j97783O4852M8939O7146k9436j15364K0931
3447I03202K8676j51970J07933N36m8494J5784j05225O4141M4485P1887l3158
3436H97797j78419q0764n8936J42120l6130k26775K15426j28759J24159J84705
3426H54424M186q190r1181J8877K249o297N1757o0010j8583r3814j2208L347l9407
3413F05150J8216J03380Q8711j79141j05658Q7881Q537p2394N5066r3252J46881
3402F63377J84147q5054P3386r2609K255j99899R0111n1066o4415l0022L2511
$$ plain form
3391 522722 560163 670873 655307 610493 671402 502742 493197 411433 682364 605660 710061
3380 710061 430831 585255 673711 311096 506830 741792 647628 561066 535193 505871 533108
3369 533108 538095 728370 704523 551262 491541 607095 573454 541765 455515 548118 523751
3358 523751 595207 547200 396484 339634 426396 549521 523346 381342 616045 556084 441385
3347 441385 613878 482794 430188 501539 514410 572974 632659 585039 517870 505050 615226
3336 615226 528106 399737 300567 324482 345741 520713 330014 613826 555494 542409 544138
3325 544138 503560 497873 470685 575704 561260 546351 521078 539406 609311 546114 515249 527035
3313 527035 371334 316805 495532 541341 316776 276825 226589 475504 491345 514826 516012
$$ packed form
3391E22722L7441J10710j5566m4814O0909j68660r545q1764K70931p6704J04401
3380G10061k79230J54424Q8456l62615J95734K34962r4164q6562k5873k9322K7237
3369E33108M987J90275k3847j53261n9721J15554l3641l1689q6250R2603k4367
3358E23751P1456m8007j50716n6850Q6762J23125k6175j42004K34703n9961j14699
3347D41385J72493j31084n2606P1351J2871N8564N9685m7620o7169j2820J10176
3336F15226q7120j28369r9170K3915K1259J74972j90699K83812n8332j3085J729
3325E44138m0578n687k7188J05019j4444j4909k5273J8328O9905o3197l0865J1786
3313E27035j55701n4529J78727M5809k24565l9951n0236K48915J5841K3481J186
$$ plain form
3302 516012 524850 356107 340565 419508 430768 450839 221549 283551 400217 396147 593986
3291 593986 647521 363827 247944 436097 332991 222172 496786 512630 384774 424127
3281 424127 446301 287642 539196 607160 199740 244826 472621 575903 505943 413353 507790
3270 507790 369729 409686 359690 443211 489497 566595 261644 145243 317003 214503 371437
3259 371437 264531 582552 434667 469416 422640 463551 634809 519261 471282 446909 451167
3248 451167 305242 298462 283016 444245 457649 195568 282540 403497 360501 528971 343091
3237 343091 343547 430701 234331 449404 389337 355583 415120 394987 290575 453427 520829
3226 520829 467626 461199 696250 748544 756541 613140 533826 568612 335844 393126 578582
$$ packed form
3302E16012Q838j68743j5542P8943J1260K0071k29290O2002J16666m070J97839
3291E93986N3535k83694j15883J88153j03106j10819K74614J5844j27856L9353
3281D24127K2174j58659K51554O7964m07420M5086K27795J03282o9960r2590R4437
3270E07790j38061L9957m9996Q3521M6286P7098l04951j16401J71760j02500J56934
3259C71437j06906L18021j47885L4749m6776M0911J71258j15548m7979k4373M258
3248D51167j45925o780j5446J61229J3404k62081Q6972J20957m2996J68470j85880
3237C43091M56Q7154j96370K15073o0067l3754N9537k0133j04412J62852O7402
3226E20829n3203o427K35051N2294P997j43401p9314L4786k32768N7282J85456
$$ plain form
3215 578582 560615 498302 469300 565332 740643 544505 406208 684232 693904 552468 729698
3204 729698 880777 799372 720730 701982 693440 847219 832148 693008 671483 701359 651075
3193 651075 675900 667168 840701 932736 1082518 1188083 1347867 1290630 1133921 1139198 1501472
3182 1501472 1524371 1462007 1668859 1434794 1539271 1768000 1817501 1922400 2066944 2026489
3172 2026489 2110860 2598901 2850016 2951490 3015543 3228386 3241350 3183477 3084813 3034743 2680146
3161 2680146 2446082 2144411 1985402 1892569 1790278 1808934 1657002 1742371 1511941 1277539
3151 1277539 1226504 1188243 1131666 1004696 979746 990581 1092787 1068561 866469 837335 916645
3140 916645 741592 575604 700112 538908 804372 804625 728407 587449 367305 536262
$$ packed form
3215E78582j7967o2313k9002R6032J75311j96138j38297K78024R672j41436J77230
3204G29698J51079q1405p8642j8748q542J53779j5071j39140k1525K9876n0284
3193F51075K4825q732J73533R2035J49782J05565J59784n7237j56709N277L62274
3182A501472K2899o2364K06852k34065J04477K28729M9501J04899J44544m0455
3172B026489Q4371M88041K51115J01474O4053K12843J2964n7873r8664n0070l54597
3161B680146k34064l01671j59009r2833j02291J8656j51932Q5369k30430k34402
3151A277539n1035l8261n6577j26970k4950J0835J02206k4226k02092k9134P9310
3140I16645j75053j65988J24508j61204K65464K53p6218j40958k20144J68957
$$ plain form
3130 536262 500191 616273 493920 546138 582321 584801 555232 501641 466347 704002 583375
3119 583375 547783 773652 669219 666916 510704 537963 398844 460350 388755 390584 401178
3108 401178 419881 315656 385931 644900 600603 405574 382796 325089 531810 424385 279736
3097 279736 215908 280940 380595 132230 109701 131156 299762 340545 388348 339816 249615
3086 249615 195661 271223 296329 163410 175217 313957 397731 267135 360079 186332 134175
3075 134175 198696 -5476 108605 186424 275182 261749 323276 167303 238826 139166 127714
3064 127714 183372 130239 262017 170731 260004 354388 159837 336464 385880 157010 262101
3053 262101 146282 345617 312394 200320 204773 58947 9881 128173 250901 219727 308666
$$ packed form
3130E36262l6071J16082j22353N2218L6183K480k9569n3591l5294K37655j20627
3119E83375l5592K25869j04433k303j56212K7259j39119O1506p1595J829J0594
3108D01178J8703j04225P0275K58969m4297j95029k2778n7707K06721j07425j44649
3097B79736o3828O5032R9655k48365k2529K1455J68606M0783M7803m8532r0201
3086B49615n3954P5562K5106j32919J1807J38740Q3774j30596R2944j73747n2157
3075A34175O4521k04172J14081P7819Q8758j3433O1527j55973P1523r9660j1452
3064A27714N5658n3133J31778r1286Q9273R4384j94551J76627M9416k28870J05091
3053B62101j15819J99335l3223j12074M453j45826m9066J18292J22728l1174Q8939
$$ plain form
3042 308666 -3741 69880 202435 97240 49737 -46567 76726 166044 104289 149954 -2329
3031 -2329 -114124 -3389 -61476 212275 255585 83633 47999 20047 -47800 97919 213728
3020 213728 221740 190314 125037 -14981 -76619 164580 250017 185193 135739 113799 -30392
3009 -30392 159640 -14828 30182 5236 36755 35494 195557 169539 105056 165066 86689
2998 86689 112884 49385 179397 36397 -72742 -21957 31833 62454 109534 91420 272801
2987 272801 103288 -2066 42660 37816 171034 258017 78209 87577 79443 134604 39514
2976 39514 172895 39643 -115284 20673 193399 156871 200021 186301 79695 -41868
2966 -41868 -27000 130282 151543 162374 154595 139330 49088 146312 20370 110879 175229 -13551
$$ packed form
3042C08666l12407P3621J32555j05195m7503r6304J23293Q9318o1755M5665j52283
3031b329j11795J10735n8087K73751M3310j71952l5634k7952o7847J45719J15809
3020B13728Q012l1426o5277j40018o1638K41199Q5437o4824m9454k1940j44191
3009c0392J90032j74468M5010k4946L1519j261J60063k6018o4483O0010p8377
2998H6689K6195o3499J30012j43000j09139N0785N3790L0621M7080j8114J81381
2987B72801j69513j05354M4726m844J33218Q6983j79808R368q134N5161r5090
2976C9514J33381j33252j54927J35957J72726l6528M3150j3720j06606j21563
2966d1868J4868J57282K1261J0831p779j5265r0242R7224j25942R0509O4350j88780
$$ plain form
2954 -13551 43451 166356 55476 -36428 182313 165834 200322 187859 61134 265843 91979
2943 91979 -24960 33765 178776 77644 19756 241642 199639 224230 359535 215781 134404
2932 134404 104195 304740 291580 35103 114836 171318 -56766 -153836 -116725 8804 -68294
2921 -68294 118410 -1650 99132 184326 213510 335185 -71650 122222 202046 248576 166870
2910 166870 175304 188198 81411 105142 202990 192607 246423 148444 118309 151662 116231 -49397
2898 -49397 86790 63381 55118 57237 203382 328883 114621 1827 65226 148952 165158
2887 165158 183314 18940 47281 29902 263841 416427 384748 137327 165124 43381 195296
2876 195296 282698 322974 162280 167661 -59673 -63211 213055 174892 14791 -4561 21228
$$ packed form
2954a3551N7002J22905j10880r1904K18741j6479L4488j2463j26725K04709j73864
2943I1979j16939N8725J45011j01132n7888K21886m2003K4591J35305j43754q1377
2932A34404l0209K00545j3160k56477P9733N6482k28084r7070L7111J25529p7098
2921f8294J86704j20060J00782Q5194K9184J21675m06835J93872P9824M6530q1706
2910A66870Q434J2894j06787K3731R7848j0383N3816r7979l0135L3353l5431j65628
2898d9397J36187k3409q263K119J46145J25501k14262j12794O3399Q3726J6206
2887A65158J8156j64374K8341j7379K33939J52586l1679k47421K7797j21743J51915
2876A95296Q7402M0276j60694N381k27334l538K76266l8163j60101j9352K5789
$$ plain form
2865 21228 -145865 55410 97409 163746 48641 75988 10953 -160394 -137064 -77572 -107517
2854 -107517 -29105 49969 83980 10797 -63523 -89929 -87057 -97966 -41528 -13872 -149340 -32610
2842 -32610 64535 178562 118989 93572 189794 96291 119694 -95855 103201 65665 34030
2831 34030 61653 -4268 -41887 -114918 -190728 -167056 20685 134647 105030 80727 98761
2820 98761 20363 105848 180335 153241 59933 188510 76176 58186 -48875 -104826 156700
2809 156700 145985 186914 51333 -127439 -92253 -124416 -31472 35061 33227 -59672 -49548
2798 -49548 51201 -86521 -45458 -61755 106613 228872 138509 90783 -11496 109433 -11382
2787 -11382 -33948 82876 123953 137122 55512 167349 61969 72135 -22047 -2004 103640
$$ packed form
2865B1228j67093K01275M1999O6337j15105K7347o5035j71347K3330N9492k9945
2854a07517P8412P9074L4011p3183p4320k6406K872j0909N6438K7656j35468J16730
2842c2610R7145J14027n9573k5417R6222r3503K3403k15549J99056l7536l1635
2831C4030K7623o5921l7619p3031p5810K3672J87741J13962k9617k4303J8034
2820I8761p8398Q5485P4487k7094r3308J28577j12334j7990j07061n5951K61526
2809A56700j0715M0929j35581j78772L5186l2163R2944O6533j834r2899J0124
2798d9548J00749j37722M1063j6297J68368J22259r0363m7726j02279J20929j20815
2787a1382k2566J16824M1077J3169q1610J11837j05380J0166r4182K0043J05644
$$ plain form
2776 103640 87371 69636 47848 2076 43609 152736 77296 154956 207835 305147 107576
2765 107576 58101 119468 -59294 -60162 14408 -86749 92616 114531 80647 -36293 103927
2754 103927 274186 37244 41943 42855 122689 272035 99699 140376 193551 210210 216109 178309
2742 178309 101705 175975 230939 99910 150598 84865 -151099 193579 108284 201667 132708
2731 132708 81408 179786 64070 130717 -100422 -58744 81352 13017 -2959 -41448 65508
2720 65508 255614 -32688 -40639 -70663 51956 -49386 71393 108426 224324 217264 -41035
2709 -41035 54813 -256536 -94874 87827 31848 3951 -138401 52571 -24011 -240596 -252256
2698 -252256 -90950 217650 39458 40021 117797 141638 91791 -76488 89961 168721 186470
$$ packed form
2776A03640j6269j7735k1788m5772M1533J09127p5440P7660N2879R7312j97571
2765A07576m9475O1367j78762q68P4570j01157J79365K1915l3884j16940J40220
2754A03927J70259k36942M699R12P9834J49346j72336M0677N3175J6659N899l7800
2742A78309p6604P4270N4964j31029N0688o5733k35964L44678q5295R3383o8959
2731A32708n1300R8378j15716O6647k31139M1678J40096o8335j5976l8489J06956
2720F5508J90106k88302p951l0024J22619j01342J20779L7033J15898p060k58299
2709d1035R5848l11349J61662J82701n5979k7897j42352J90972p6582k16585j1660
2698b52256J61306L08600j78192N63P7776K3841m9847j68279J66449P8760J7749
$$ plain form
2687 186470 -114857 -126316 -247048 -104566 30710 -165318 -25997 77603 34082 131463
2677 131463 9403 -46488 -122502 610 124897 117501 180331 193438 244795 122933 119213
2666 119213 15308 -33764 -32718 -110234 32212 -79845 203356 239061 161061 88294 -27892
2655 -27892 -82699 -25205 144357 303386 119173 -49303 -77028 -54841 47400 54899 -43397
2644 -43397 -55313 92166 -87573 -147232 -130240 -55570 -8718 -43051 -145143 -95739 -79180
2633 -79180 -15014 -100291 24211 -59306 19042 14641 -70651 -67753 -58536 49748 193138 124478
2621 124478 20561 -120037 -6170 180908 168473 70202 81337 -5114 -137599 -65775 -14670
2610 -14670 -143402 87685 -23777 -29175 112030 17827 2896 152018 176424 198244 376468
$$ packed form
2687A86470l01327j1459j20732J42482J35276j96028J39321J03600m3521R7381
2677A31463j22060n5891p6014J23112J24287p396O2830J3107N1357j21862l720
2666A19213j03905m9072J046p7516J42446j12057K83201L5705p8000p2767j16186
2655b7892n4807N7494J69562J59029j84213j68476k7725K2187J02241P499r8296
2644d3397j1916J47479j79739n9659J6992P4670M6852l4333j02092M9404J6559
2633g9180O4166q5277J24502q3517P8348m401q5292K898R217J08284J43390o8660
2621A24478j03917j40598J13867J87078j2435r8271J1135q6451j32485P1824N1105
2610a4670j28732K31087j11462n398J41205r4203j4931J49122K4406K1820J78224
$$ plain form
2599 376468 -44510 -5384 164247 98765 66740 109125 48425 103477 -18791 -5195 -182449
2588 -182449 -102002 -68600 -44179 94106 92074 73115 152873 196433 125404 15226 46957
2577 46957 10722 118333 -54691 -90866 -161241 3473 46818 151798 4976 -105008 154942
2566 154942 -92718 44954 21859 23288 66130 177609 -49663 92974 -19759 -63024 34466
2555 34466 -23165 -19183 37497 33584 69823 -14634 42243 91759 121065 84818 191009 82842
2543 82842 155062 154187 -129683 -14037 -112784 50633 53640 17341 108079 30670 -53312 16840
2531 16840 206920 6356 -104242 -133167 -86528 -125239 -45400 -101288 2094 128682 -6163
2520 -6163 6386 57274 2482 49653 -28312 47156 -75640 -166002 26239 -12158 -35389 -59736
$$ packed form
2599C76468m20978L9126J69631o5482l2025M2385o0700N5052j22268J3596j77254
2588a82449Q0447L3402K4421J38285k032j8959P9758M3560p1029j10178L1731
2577D6957l6235J07611j73024l6175p0375J64714M3345J04980j46822j09984K59950
2566A54942k47660J37672k3095J429M2842J11479k27272J42637j12733m3265R7490
2555C4466n7631L982N6680l913L6239q4457N6877M9516K9306l6247J06191j08167
2543H2842P2220q75k83870J15646r8747J63417L007l6299R0738p7409q3982P0152
2531A6840J90080k00564j10598k8925M6639l8711P9839n5888J03382J26588j34845
2520f163J2549N0888n4792M7171p7965P5468j22796r0362J92241l8397k3231k4347
$$ plain form
2508 -59736 -37063 -31411 115222 191387 -18665 42083 89246 -141539 -79106 -127344 -135280 -93022
2496 -93022 39831 208770 146513 -11288 -79557 -31814 149429 12343 30494 186148 93988
2485 93988 3662 -223950 -145229 -46754 -92788 -154925 -180920 68983 55757 -147272 -141351
2474 -141351 30729 -89090 -36801 72799 85424 89266 239424 234073 128803 3436 -25236
2463 -25236 27564 41943 53527 -4846 -45415 -100028 -73310 -76767 -230729 -117290 35834
2452 35834 50725 219024 -14413 -139557 -41586 25310 101577 -63399 -33688 -85029 -99344
2441 -99344 -221706 103056 47474 3843 147941 -3496 -27094 -46448 -109524 -75291 79163
2430 79163 -15724 2523 -4174 105186 -19798 -9907 21809 -23968 97403 49350 52380 78629
$$ packed form
2508e9736K2673N652J46633P6165k10052O0748M7163k30785O2433m8238p936M2258
2496i3022J32853J68939o2257j57801o8269M7743J81243j37086J8151J55654r2160
2485I3988r0326k27612P8721R8475m6034o2137k5995K49903j3226k03029N921
2474a41351J72080j19819N2289J09600J2625L842J50158n351j05270j25367k8672
2463b5236N2800J4379J1584n8373m0569n4613K6718l457j53962J13439J53124
2452C5834J4891J68299k33437j25144R7971O6896P6267j64976K9711n1341j4315
2441i9344j22362L24762n5582m3631J44098j51437k3598j9354o3076L4233J54454
2430G9163r4887J8247o697J09360j24984R891L1716m5777J21371m8053L030K6249
$$ plain form
2418 78629 -6713 30923 101745 51104 149028 94739 -19529 -114721 -55347 61663 43653
2407 43653 130439 363822 -79084 -285265 -22218 177912 239470 109160 74438 -75132
2397 -75132 112476 185791 182865 93514 -122915 32245 164400 10339 -24808 145478 226843
2386 226843 142398 101346 171683 13471 -17530 62947 -105793 -17609 65522 -145308 -191579
2375 -191579 -105340 -69819 -73375 -141028 -265496 -118219 -73258 -137732 89027 -222122 -81216
2364 -81216 22172 -139357 -274926 -372412 -186061 -9497 -38512 -11372 140669 29596
2354 29596 -121250 -87168 -111707 -29918 4934 154707 7532 -57621 -169260 -261872 28008
2343 28008 78384 43576 13474 -13346 -45891 -32207 -71749 -158435 -222518 -38002 76421
$$ packed form
2418G8629q5342L7636P0822n0641R7924n4289j14268r5192N9374J17010j8010
2407D3653Q6786K33383m42906k06181K63047K00130O1558j30310l4722j49570
2397g5132J87608P3315k926q9351k16429J55160J32155j54061l5147J70286Q1365
2386B26843q4445m1052P0337j58212l1001Q0477j68740Q8184Q3131k10830m6271
2375a91579Q6239L5521l556o7653j24468J47277M4961o4474K26759l11149J40906
2364h1216J03388j61529j35569r7486J86351J76564k9015K7140J52041j11073
2354B9596j50846L4082k4539Q1789L4852J49773j47175o5153j11639r2612K89880
2343B8008N0376l4808l0102k6820l2545J3684l9542q6686o4083J84516J14423
$$ plain form
2332 76421 81245 -126675 104197 -120548 -76415 144509 -86719 -196724 50087 191551
2322 191551 52381 36268 127360 83435 -39846 -83428 -113435 -11290 8719 92675 193136
2311 193136 119603 78367 178209 126969 202437 381309 52833 -114555 -5561 -146307 -83235
2300 -83235 131549 -15263 -284532 -79254 2730 -3701 -51414 109782 87672 79334 137269
2289 137269 87220 8283 69718 45521 37768 82995 -17571 29618 58807 125107 164753 146891
2277 146891 42281 47771 93098 -54489 -158310 135318 5747 119462 139386 58654 15184
2266 15184 -99229 -517 -11651 36553 113114 79092 137401 266511 105741 -43084 16746
2255 16746 120884 69791 16251 -52467 146695 192044 283398 107642 121872 72296 -17302
$$ packed form
2332G6421M824k07920K30872k24745M4133K20924k31228j10005K46811J41464
2322A91551j39170j6113R1092m3925j23281m3582l0007J02145K0009Q3956J00461
2311A93136p3533m1236R9842n1240P5468J78872l28476j67388J08994j40746O3072
2300h3235K14784j46812k69269K05278Q1984o431m7713J61196k2110q338N7935
2289A37269n0049p8937O1435k4197p753M5227j00566M7189K9189O6300L9646j7862
2277A46891j04610N490M5327j47587j03821K93628j29571J13715J9924q0732m3470
2266A5184j14413R8712j1134M8204P6561l4022N8309J29110j60770j48825N9830
2255A6746J04138n1093n3540o8718J99162M5349R1354j75756J4230m9576q9598
$$ plain form
2244 -17302 -103507 -53793 -130582 -127800 -61740 15790 38696 135742 104665 84574 -63101 19378
2232 19378 -36098 42469 -32334 -146714 -24330 246499 -10084 -200796 -34495 10860 186502
2221 186502 79692 100063 18091 -65018 -159536 94667 55068 61824 -72027 -45259 160646
2210 160646 100538 194274 85186 10546 79374 1058 -109061 97272 86554 -261868 -41291
2199 -41291 65263 34022 -102930 -49711 84974 141098 -23804 112156 167533 88478 -248290
2188 -248290 -143034 -31846 -71325 16296 -13768 15099 110706 -129442 -153396 -288181 -119874
2177 -119874 109316 -50758 -125531 -3588 -112322 -129077 53634 -55387 -99748 47232
2167 47232 -63648 -52809 10806 -12483 71849 -49028 -5441 138030 84709 -24147 106784
$$ packed form
2244a7302q6205M9714p6789K782O6060P7530K2906R7046l1077k0091j47675Q2479
2232A9378n5476P8567p4803j14380J22384K70829k56583j90712J66301M5355J75642
2221A86502j06810K0371q1972q3109r4518K54203l9599O756j33851K6768K05905
2210A60646o0108R3736j09088p4640O8828p8316j10119K06333j0718l48422K20577
2199d1291J06554l1241j36952N3219J34685N6124j64902J35960N5377p9055l36768
2188b48290J05256J11188l9479Q7621l0064K8867R5607k40148k3954j34785J68307
2177a19874K29190j60074p4773J21943j08734j6755J82711j09021m4361J46980
2167D7232j10880J0839O3615k3289Q4332j20877M3587J43471n3321j08856J30931
$$ plain form
2156 106784 107008 -90823 52019 96320 -57509 -28138 8938 65157 -74679 -51129 -3862
2145 -3862 74011 122175 140178 -58816 -134823 -168855 33130 27534 -235767 -120572 -178721
2134 -178721 -127774 -101692 -2682 57596 -18432 -142483 58611 18458 -157478 -154989 -183970
2123 -183970 -18960 -52235 4315 25898 -31301 -45463 -132243 -215494 -167023 -52561 20742
2112 20742 13709 -26272 21233 -104502 224 -147060 -152593 -40668 -67151 76601 152302
2101 152302 -23037 35454 92704 89724 72070 39692 296013 96800 -32664 -110887 68587
2090 68587 4557 -195666 18566 -81761 2605 137055 128161 88995 12842 8233 -158445
2079 -158445 -104814 -125747 -314431 -73257 231056 108759 36310 152819 -80496 -138414
$$ packed form
2156A06784K24j97831J42842M4301j53829K9371L7076N6219j39836K3550M7267
2145c862P7873M8164J8003j98994p6007l4032K01985n596k63301J15195n8149
2134a78721N0947K6082R9010O0278p6028j24051K01094m0153j75936K489k8981
2123a83970J65010l3275N6550K1583n7199j4162q6780q3251M8471J14462P3303
2112B0742p033l9981M7505j25735J04726j47284n533J11925k6483J43752P5701
2101A52302j75339N8491N7250k980j7654l2378K56321j99213j29464p8223J79474
2090F8587o4030k00223K14232j00327Q4366J34450q894l9166p6153m609j66678
2079a58445N3631k0933j88684K41174L04313j22297p2449J16509k33315n7918
$$ plain form
2069 -138414 -104150 -136751 30995 -196719 -174549 34743 161180 20645 -18786 -3794 19852
2058 19852 -123835 -112287 -21885 -57752 -38951 22197 -81956 -564 125585 -21647 -196230
2047 -196230 147290 34702 332 -85304 -163598 -41593 -201617 -61479 -3747 -62823 -37935
2036 -37935 -67559 45890 143506 20335 -64244 14384 -4440 27973 71769 -9530 49625
2025 49625 205441 304015 164044 242386 162597 11827 197756 130115 140704 -119238 -169530
2014 -169530 -114444 -296207 -72134 -124119 -157316 36037 34592 4210 -24446 63437 148559
2003 148559 185642 -19983 -9163 -150716 -113354 91568 76784 -5344 170962 -89675 -249103
1992 -249103 -93619 -76665 60909 42129 1358 56731 37444 77654 135348 -5804 -82277
$$ packed form
2069a38414L4264l2601J67746k27714K2170K09292J26437j40535l9431J4992K3646
2058A9852j43687J1548R0402l5867J8801O1148j04153Q1392J26149j47232j74583
2047a96230L43520j12588l4370q5636p8294J22005j60024J40138N7732n9076K4888
2036c7935k9624J13449R7616j23171q4579P8628j8824L2413M3796q1299N9155
2025D9625J55816R8574j39971P8342p9789j50770J85929o7641J0589k59942n0292
2014a69530N5086j81763K24073n1985l3197J93353j445l0382k8656Q7883Q5122
2003A48559L7083k05625J0820j41553L7362K04922j4784q2128J76306k60637j59428
1992b49103J55484J6954J37574j8780m0771N5373j9287M0210N7694j41152p6473
$$ plain form
1981 -82277 4177 89078 -119394 -129057 108601 52016 -103666 4333 102305 -26039 -103284
1970 -103284 287171 129873 110530 26919 28858 -116491 -52737 -7775 115302 139156 -26528
1959 -26528 30735 -143777 -258433 88930 134945 282772 346592 291380 190478 -58160 1562
1948 1562 -116382 -96794 -66188 -269213 -60259 139148 158906 124739 -79646 -88046 -61690
1937 -61690 79854 63594 231602 22998 -58661 -60666 -34781 23002 -8864 19693 -170790
1926 -170790 -77445 -53665 117753 36489 126857 135577 147361 -146089 -28521 -72482 -80048
1915 -80048 59873 152541 94845 69980 120700 92897 -20830 -146943 2707 210401 43653
1904 43653 -129599 42392 -62107 -10563 123392 98464 51682 -156617 -254164 -151001 -185737
$$ packed form
1981h2277Q6454Q4901k08472r663K37658n6585j55682J07999R7972j28344p7245
1970a03284L90455j57298j9343q3611J939j45349O3754M4962J23077K3854j65684
1959b6528N7263j74512j14656L47363M6015J47827O3820n5212j00902k48638N9722
1948A562j17944J9588L0606k03025K08954J99407J9758l4167k04385q400K6356
1937f1690J41544j6260J68008k08604q1659k005K5885N7783l1866K8557j90483
1926a70790R3345K3780J71418q1264R0368Q720J1784k93450J17568m3961p566
1915h0048J39921R2668n7696k4865N0720k7803j13727j26113J49650K07694j66748
1904D3653j73252J71991j04499N1544J33955k4928m6782k08299r7547J03163l4736
$$ plain form
1893 -185737 -54880 20571 -133899 -107091 -100875 -249120 -216854 -138242 -111019 -131784 -54769
1882 -54769 -53626 -194545 -40566 -21047 -84717 -261494 -130650 85504 248912 182974 201747
1871 201747 123807 8401 -22965 133057 92882 -24475 -56848 -91685 48533 -73081 150262
1860 150262 -58071 -31335 18803 53168 97755 101695 -27511 -65475 26492 31522 42867 34962
1848 34962 -102673 -80244 -125734 77913 -24102 -88735 -22880 -40075 -68672 -143558 -120367
1837 -120367 -76503 -5318 -41586 -113331 -113683 -166260 264118 282739 42103 -205692 -45080
1826 -45080 -72570 -60369 351982 88207 112891 63797 -15993 99842 -52481 71107 153495
1815 153495 51333 6171 -77757 11905 166305 58845 97393 105745 57315 -95889 -58133
$$ packed form
1893a85737J30857P5451j54470K6808O216j48245L2266P8612K7223k0765P7015
1882e4769J143j40919J53979J9519o3670j76777J30844K16154J63408o5938J8773
1871B01747p7940j15406l1366J56022m0175j17357l2373l4837J40218j21614K23343
1860A50262k08333K6736N0138L4365M4587L940j29206l7964R1967N030J1345p905
1848C4962j37635K2429m5490K03647j02015o4633O5855j7195k8597p4886K3191
1837a20367M3864P1185l6268p1745l52n2577M30378J8621k40636k47795J60612
1826d5080k7490J2201M12351k63775K4684m9094p9790J15835j52323J23588Q2388
1815A53495j02162m5162q3928Q9662J54400j07460L8548Q352m8430j53204L7756
$$ plain form
1804 -58133 -108008 -295297 -213990 -241489 -158285 -163946 10818 54285 36544 256377 125097
1793 125097 -5481 135656 8028 -33844 2264 -45598 -83441 -103911 -167674 -211186 -154782
1782 -154782 -202055 14538 -47384 -49204 127495 -548 -74071 -86581 -176106 11021 -136799
1771 -136799 -60543 860 -71622 118111 67929 40372 120078 87426 146298 -1762 108800
1760 108800 61952 69713 153526 61813 148230 228793 13393 -8370 57710 112013 103460 -15564
1748 -15564 97029 61539 283345 44136 46243 -57827 -154170 25734 -35998 -108424 -260704
1737 -260704 -154684 22254 20481 173132 101232 -70645 -209398 -73218 -117599 -380275
1727 -380275 -268055 31631 -204476 -81759 34034 -117546 -55958 36409 118262 4509
$$ packed form
1804e8133m9875j87289Q1307k7499Q3204n661J74764M3467j7741K19833j31280
1793A25097j30578J41137j27628m1872L6108m7862l7843k0470o3763m3512N6404
1782a54782m7273K16593o1922j820J76699j28043p3523j2510q9525J87127j47820
1771a36799P6256O1403p2482J89733n0182k7557P9706l2652N8872j48060J10562
1760A08800m6848P761Q3813r1713Q6417Q0563k15400k1763O6080N4303q553j19024
1748a5564J12593l5490K21806k39209K107j04070r6343J79904o1732p2426j52280
1737b60704J06020J76938j773J52651p1900j71877j38753J36180m4381k62676
1727c80275J12220K99686k36107J22717J15793j51580O1588R2367Q1853j13753
$$ plain form
1717 4509 29980 37774 -910 30610 16790 103274 30818 -77059 -101918 -54908 -366252 -70246
1705 -70246 -28069 -122799 -103756 -76741 28774 -42713 82582 73013 7521 120599 -38726
1694 -38726 -82912 -123230 -109518 61964 39794 41313 -63630 -54937 18557 82612 -30870 -56253
1682 -56253 38564 122190 203847 149588 13648 -280428 -14052 93829 -33372 243992 158608
1671 158608 5273 -47508 -25102 -158637 -51438 2221 -52283 153936 29779 -73440
1661 -73440 66336 91173 -155722 -21223 -31932 -376607 -89939 82740 78917 -105184 -187600
1650 -187600 36492 18963 -223652 -79681 195036 236111 -82976 -240074 -261310 -53666
1640 -53666 25957 -18340 -173678 -204985 165473 -148193 -92218 18155 23752 -25693 -3771
$$ packed form
1717D509K5471P794l8684L1520j3820Q6484p2456j07877k4859M7010l11344K96006
1705g0246M2177r4730J9043K7015J05515p1487J25295r569o5492J13078j59325
1694c8726m4186m0318J3712J71482k2170J519j04943Q693P3494O4055j13482k5383
1682e6253R4817Q3626Q1657n4259j35940k94076K66376J07881j27201K77364q5384
1671A58608j53335n2781K2406j33535J07199N3659n4504K06219j24157j03219
1661g3440J39776K4837k46895J34499j0709l44675K86668J72679l823j84101q2416
1650a87600K24092j7529k42615J43971K74717M1075l19087j57098k1236K07644
1640e3666P9623m4297j55338l1307L70458l13666N5975J10373N597m9445K1922
$$ plain form
1629 -3771 -57509 94305 -75789 -62787 94084 87433 70966 240682 164825 -15174 -21911
1618 -21911 -176627 -143054 -15769 56387 2363 40891 63116 -416 -67168 -64703 -118167 105988
1606 105988 678 -212467 -104652 18541 16125 147350 154078 3763 -184123 -44582
1596 -44582 39988 128142 -71613 -89216 -77269 33005 -93309 -8180 -107943 115823 16983
1585 16983 -324791 -291391 -155618 -1241 39521 -151481 -54753 206712 -21980 -79262 -184119
1574 -184119 -191365 -96468 -92185 -39625 -21065 15383 73961 -129924 13676 78332 65245 -74383
1562 -74383 70734 21510 237995 131150 -88775 -94031 75135 90642 7495 96677 83213
1551 83213 -17035 152733 -130336 -46741 126017 -25192 106998 192989 89750 -160217
$$ packed form
1629c771n3738J51814j70094J3002J56871o651j6467J69716p5857j79999o737
1618b1911j54716L3573J27285P2156n4024L8528K2225o3532o6752K465n3464K24155
1606A05988j05310k13145J07815J23193k416J31225O728j50315j87886J39541
1596d4582Q4570Q8154j99755j7603J1947J10274j26314Q5129r9763K23766r8840
1585A6983l41774L3400J35773J54377M0762j91002R6728K61465k28692n7282j04857
1574a84119p246R4897M283N2560J8560L6448N8578k03885J43600O4656j3087j39628
1562g4383J45117m9224K16485j06845k19925n256J69166J5507q3147Q9182j3464
1551H3213j00248J69768k83069Q3595J72758j51209J32190Q5991j03239k49967
$$ plain form
1541 -160217 -145247 -63115 73402 14281 -35003 -20649 124647 40975 91466 73552 103619
1530 103619 68712 -33866 79742 159394 72166 219229 65318 -161499 -51954 221490
1520 221490 132010 89146 159463 75218 28236 156371 -5504 95954 65049 90219 -111364
1509 -111364 -53439 -73347 -167021 -81387 -112776 73261 -3990 -28679 95841 70223 154169
1498 154169 158729 103681 180387 131793 60619 91822 55793 -74757 -57129 42314 69672 -282164
1486 -282164 -357020 -36812 -198409 -102072 -79751 -33946 -109834 67128 -38551 -109523 32776
1475 32776 -13620 4423 -99749 -160837 -76281 -35060 -174967 -124737 -32349 104705 132726
1464 132726 305192 45152 24714 26189 -97127 -27388 -42347 -108241 -120667 -196974 -45678
$$ packed form
1541a60217J4970Q2132J36517n9121m9284J4354J45296q3672N0491j7914L0067
1530A03619l4907j02578J13608P9652q7228J47063j53911k26817J09545K73444
1520B21490q9480m2864P0317q4245m6982J28135j61875J01458l0905K5170k01583
1509a11364N7925j9908r3674Q5634l1389J86037p7251k4689J24520k5618Q3946
1498A54169M560n5048P6706m8594p1174L1203l6029j30550J7628R9443K7358l51836
1486b82164p4856L20208j61597R6337K2321M5805p5888J76962j05679p0972J42299
1475C2776m6396J8043j04172o1088Q4556M1221j39907N0230R2388J37054K8021
1464A32726J72466k60040k0438J475j23316O9739j4959o5894j2426p6307J51296
$$ plain form
1453 -45678 3954 93250 -109919 -16793 16851 43167 -36986 -15002 5231 -59658 -175728
1442 -175728 -133618 -156864 -71840 -38874 -71532 -166662 -135362 -32453 -134750 -196457 -502
1431 -502 28227 46424 -24365 -8647 -51383 -125665 -206885 27130 173603 132083 292660 150080
1419 150080 112797 204932 51360 -3653 -71635 -64705 48664 -78378 -26756 70443 167942
1408 167942 119224 90844 54444 -69447 -124930 12980 36441 -243475 -261150 -220013 -16660
1397 -16660 46662 -139170 -95162 -46710 -73348 -160981 -885 54651 -95580 -70154 -170306
1386 -170306 -135133 -91927 -46664 -115139 -105201 -108334 30537 129910 -27416 66226 106821 14534
1374 14534 -3178 -69518 -268564 -23924 78150 11713 -101754 -144228 25758 30159 58563
$$ packed form
1453d5678M9632Q9296k03169R3126L3644K6316q0153K1984K0233o4889j16070
1442a75728M2110k3246Q5024L2966l2658r5130L1300J02909j02297o1707J95955
1431e02K8729J8197p0789J5718m2736p4282q1220K34015J46473m1520J60577j42580
1419A50080l7283R2135j53572n5013o7982O930J13369j27042N1622R7199R7499
1408A67942m8718k8380l6400j23891n5483J37910K3461k79916j7675M1137K03353
1397a6660O3322j85832M4008M8452k6638q7633J60096N5536j50231K5426j00152
1386a70306L5173M3206M5263o8475R938l133J38871R9373j57326R3642M0595r2287
1374A4534j7712o6340j99046K44640J02074o6437j13467m2474J69986M401K8404
$$ plain form
1363 58563 106028 95261 51492 -22884 -66171 -145210 -213170 -181539 88140 -77130 -178567
1352 -178567 109631 24430 37676 2597 -71792 86188 -138362 -186235 -174805 -322109 -129006
1341 -129006 63706 -47332 16662 -122969 -213248 -67684 80982 -15431 87000 115891
1331 115891 51589 49838 -37258 1816 -14395 -47850 79191 116924 -58473 -58680 -76069 -36188
1319 -36188 49725 -94165 -63222 37565 -37896 -14219 135128 25609 -5334 68042 48910
1308 48910 68155 -99578 -258041 10422 -61809 16258 -84682 74308 57288 37561 51628
1297 51628 11101 112348 123269 30618 137896 180717 44368 24628 198305 241042 -12409
1286 -12409 -25526 106010 -20200 -215040 -113002 -24921 447 112163 48631 187954 171418
$$ packed form
1363E8563M7465j0767m3769p4376m3287p9039o7960L1631K69679j65270j01437
1352a78567K88198q5201J3246l5079p4389J57980k24550m7873J1430j47304J93103
1341a29006J92712j11038O3994j39631r0279J45564J48666r6413J02431K8891
1331A15891o4302j751q7096L9074j6211l3455J27041L7733j75397k07j7389L9881
1319c6188Q5913j43890L0943J00787p5461K3677J49347j09519l0943P3376j9132
1308D8910J9245j67733j58463K68463p2231P8067j00940J58990j7020j9727J4067
1297E1628m0527J01247J0921r2651J07278M2821j36349j9740J73677M2737k53451
1286a2409j3117J31536j26210j94840J02038Q8081K5368J11716o3532J39323j6536
$$ plain form
1275 171418 16773 -190039 -106816 122960 -92729 65362 128708 39873 45366 42786 -218336
1264 -218336 4551 -93546 -60744 32198 -81252 5379 -76513 76924 73655 -40857 29212
1253 29212 139204 -151696 -178589 -61112 -50573 -119888 -125668 77102 91119 -88001 -31549
1242 -31549 57710 11521 -44677 -72869 6441 -39004 33550 -66679 22529 123871 63208
1231 63208 123849 153270 46112 -54816 -91779 15133 111012 24823 -146020 -44259 -37117
1220 -37117 -89817 -46801 2265 -2670 -114611 -131937 -87053 -167879 39280 43725 -176811 -39658
1208 -39658 -58064 -89804 37434 14659 51517 -90717 -16176 -5849 -17861 -177919 -123492
1197 -123492 -99058 -27939 63471 69161 13312 -117143 -215555 -171726 -83051 -188711 -4744
$$ packed form
1275A71418j54645k06812Q3223K29776k15689J58091O3346q8835N493k580k61122
1264b18336K22887r8097L2802R2942j13450Q6631q1892J53437l269j14512P0069
1253B9212J09992k90900k6893J17477J0539o9315n780K02770J4017j79120N6452
1242c1549Q9259m6189n6198k8192P9310m5445P2554j00229Q9208J01342o0663
1231F3208O0641K9421j07158j00928l6963J06912R5879q6189j70843J01761P142
1220c7117n2700M3016M9066m935j11941j7326M4884q0826K07159M445k20536J37153
1208c9658j8406l1740J27238k2775L6858j42234P4541J0327j2012j60058N4427
1197a23492K4434P1119R1410N690n5849j30455r8412M3829Q8675j05660J83967
$$ plain form
1186 -4744 -84549 -57512 -82819 60490 -123921 -127999 63274 67950 32452 -118525 -68160 -163543
1174 -163543 40280 69598 -69948 185994 67142 -54319 51591 263049 303957 105113
1164 105113 38754 -111951 -10809 -92153 83905 6364 -175382 -266030 -41824 27474 53481
1153 53481 -93082 61254 35275 28782 48667 -99802 -151223 -183162 -143505 -164306 -100570
1142 -100570 -5530 80250 230339 259573 9498 76997 48452 79229 21882 -59132 19166
1131 19166 237044 124876 4813 213437 -28104 -81204 60151 -96492 42920 331120
1121 331120 81881 -66101 -111378 -193108 -126490 -117565 -71283 -125968 -50476 12811 44806
1110 44806 -206744 -97889 -139221 -133275 8855 -48378 -106111 -134377 -83726 -146325 -52768
$$ packed form
1186d744p9805K7037k5307J43309j84411m078J91273M676l5498j50977N0365r5383
1174a63543K03823K9318j39546K55942j18852j21461J05910K11458M0908j98844
1164A05113o6359j50705J01142q1344J76058p7541j81746r0648K24206O9298K6007
1153E3481j46563J54336k5979o493J9885j48469n1421l1939L9657k0801O3736
1142a00570R5040Q5780J50089K9234k50075O7499k8545L0777n7347q1014P8298
1131A9166K17878j12168j20063K08624k41541n3100J41355j56643J39412K88200
1121C31120k49239j47982m5277q1730O6618Q925M6282n4685P5492O3287L1995
1110D4806k51550J08855m1332N946J42130n7233n7733k8266N0651o2599R3557
$$ plain form
1099 -52768 175224 287679 40957 89522 71672 -61029 -231728 -184972 121842 -97466
1089 -97466 3601 182527 47624 -173649 95827 30271 26206 -39384 422 203034 -82871
1078 -82871 -43128 15803 -35810 26252 161935 75462 139445 205718 -17724 130401 -27359
1067 -27359 -143468 140749 47895 -113669 42467 -108986 -32192 157161 66408 -73607
1057 -73607 -45446 -7213 -66464 110294 3275 -219591 -123711 -91163 -29077 146843 99360
1046 99360 -101857 -160306 -133469 -67614 -139993 -25539 45614 179002 31316 126152 233478
1035 233478 134600 -69648 -8559 218918 313466 387122 48955 -212559 64990 92338 88684
1024 88684 58085 58475 -81048 72196 61502 -63963 -118989 -173178 19632 46864 -4392
$$ packed form
1099e2768K27992J12455k46722M8565j7850j32701j70699M6756L06814k19308
1089i7466J01067J78926j34903k21273K69476o5556m065o5590L9806K02612k85905
1078h2871L9743N8931n1613O2062J35683q6473O3983O6273k23442J48125j57760
1067b7359j16109K84217r2854j61564J56136j51453P6794J89353r0753j40015
1057g3607K8161L8233n9251J76758j07019k22866R5880L2548O2086J75920m7483
1046I9360k01217n8449K6837O5855p2379J14454P1153J33388j47686R4836J07326
1035B33478r8878k04248O1089K27477R4548P3656l38167k61514K77549K7348l654
1024H8684l0599L90j39523J53244j0694j25465n5026n4189J92810K7232n1256
$$ plain form
1013 -4392 -40705 191826 151088 10909 48313 -58301 -14982 -60813 -52323 -24783 -41545 29361
1001 29361 -19740 -119140 -59322 167416 -46448 -11792 10556 -26612 119890 241266 112007
990 112007 8322 -196504 61205 146935 111564 144413 -41113 98952 100325 -87924 22074
979 22074 71133 45802 29930 -68977 -67962 -131433 -263232 -91961 -198076 -256754 -213807 58614
967 58614 196152 71296 -202689 -54399 60077 160009 157221 124827 21366 22784 -98709
956 -98709 -9488 11429 -2524 76313 214637 345903 266773 24538 1936 34293 -55193
945 -55193 171227 -39294 -43486 95236 58861 40814 -45681 3415 91027 -158645 -120441
934 -120441 -63908 -55047 222717 208671 185486 73643 -50889 32857 98228 43625 33564
$$ packed form
1013d392l6313K32531m0738j40179L7404j06614M3319m5831Q490K7540j6762P0906
1001B9361m9101r9400N9818K26738k13864L4656K2348l7168J46502J21376j29259
990A12007j03685k04826K57709Q5730l5371L2849j85526J40065J373j88249J09998
979B2074M9059k5331j5872r8907J015o3471j31799J71271j06115n8678M2947K72421
967E8614J37538j24856k73985J48290J14476R9932k788l2394j03461J418j21493
956i8709Q9221K0917j3953P8837J38324J31266p9130k42235k2602L2357q9486
945e5193K26420k10521m192J38722l6375j8047q6495M9096Q7612k49672L8204
934a20441N6533Q861K77764j4046k3185j11843j24532Q3746O5371n4603j0061
$$ plain form
923 33564 43241 38275 -62209 -167529 4454 255342 35987 199247 11299 38207 157742
912 157742 190982 -40075 -164678 -62348 -29448 64956 -57979 -186281 -109217 14538 -126517
901 -126517 -106516 65376 167571 88712 191386 -38541 -23086 -142300 -11832 141651
891 141651 33166 133595 93613 11106 -27292 45025 83914 -25204 66560 -31847 44389
880 44389 32 19401 -83116 -104922 -4360 70728 -135357 -192369 -118675 35444 -134854
869 -134854 -179514 -111706 75692 -49230 -79158 15991 -166908 -215909 -141068 13242 67171
858 67171 153374 119450 -47 154042 33293 -99851 -76419 -27699 43873 -55127 -53625
847 -53625 -52817 -44673 78946 167910 286935 189517 48365 -28242 -23862 127185 97059 5172
$$ packed form
923C3564R677m966j00484j05320J71983K50888k19355J63260j87948K6908J19535
912A57742L3240k31057j24603J02330L2900R4404j22935j28302P7064J23755j41055
901a26517K0001J71892J02195p8859J02674k29927J5455j19214J30468J53483
891A41651j08485J00429l9982q2507l8398P2317L8889j09118R1764r8407P6236
880D4389m4357J9369j02517k1806J00562P5088k06085n7012P3694J54119j70298
869a34854m4660O7808J87398j24922k9928R5149j82899m9001P4841J54310N3929
858F7171Q6203l3924j19497J54089j20749j33144K3432M8720P1572r9000J502
847e3625Q08Q144J23619Q8964J19025r7418j41152p6607M380J51047l0126r1887
$$ plain form
835 5172 -2658 -26531 70705 40916 -119576 -20652 -124361 -18587 196741 134873 204435 176937
823 176937 -57323 -105607 -126652 -91480 -12798 86814 8084 -42196 -121309 47858 91980
$$ packed form
835E172p830k3873R7236k9789j60492R8924j03709J05774K15328o1868O9562k7498
823A76937k34260m8284k1045L5172P8682R9612p8730n0280p9113J69167M4122
$$ [...]
##END=
