##TITLE=1H_BAU-j-1NO2
 CDCl3, 8 sc, 
 1.7.2019
##JCAMPDX= 6.0         $$ Bruker NMR JCAMP-DX V2.0
##DATA TYPE= NMR FID
##DATA CLASS= NTUPLES
##ORIGIN= UXNMR, Bruker Analytische Messtechnik GmbH
##OWNER= root
$$ XWIN-NMR		Version 3.5
$$ Mon Jul  1 14:25:08 2019 Russian Standard Time (UT+4h)  she@DPX200
##.OBSERVE FREQUENCY= 200.13155
##.OBSERVE NUCLEUS= ^1H
##.DELAY= (6, 6)
##.ACQUISITION MODE= SIMULTANEOUS
##.ACQUISITION SCHEME= undefined
##.AVERAGES= 8
##.DIGITISER RES= 18
##SPECTROMETER/DATA SYSTEM= spect
##.PULSE SEQUENCE= zg30
##.SOLVENT NAME= CDCl3
##.SHIFT REFERENCE= (INTERNAL, CDCl3, 0, 15.7039)
##AUDIT TRAIL= $$ (NUMBER, WHEN, WHO, WHERE, WHAT)
$$ ##TITLE= Audit trail, XWIN-NMR		Version 3.5
$$ ##JCAMPDX= 5.01
$$ ##ORIGIN= Bruker BioSpin GmbH
$$ ##OWNER= she
$$ F:/spectra/data/she/nmr/H-F/1/audita.txt
$$ ##AUDIT TRAIL=  $$ (NUMBER, WHEN, WHO, WHERE, WHAT)
(   1,<2019-07-01 14:20:10.75 +0400>,<she>,<DPX200>,
      <created by zg, POWCHK disabled, PULCHK disabled
       configuration hash MD5:
       00 E9 B6 7A A2 85 ED C7 34 08 36 98 17 FE 4E 26
       data hash MD5: 16K
       8A 08 88 B5 AD 67 80 0E CF A3 12 67 C7 69 80 00>)
$$ ##END=
$$ 
$$ hash MD5
$$ 4A AE 38 6E BC 1B 6D E6 C1 C8 F7 5B 79 FF 7F BB
##$RELAX= 
##$RELAX= 
##$RELAX= 
##$RELAX= 
##$RELAX= 
##$RELAX= 
$$ Bruker specific parameters
$$ --------------------------
##$DU= <F:/spectra>
##$EXPNO= 1
##$NAME= <H-F>
##$PROCNO= 1
##$TYPE= <nmr>
##$USER= <she>
##$AMP= (0..31)
100 100 100 100 100 100 100 100 100 100 100 100 100 100 100 100 100 100 
100 100 100 100 100 100 100 100 100 100 100 100 100 100 
##$AQSEQ= 0
##$AQ_mod= 1
##$AUNM= <au_zg>
##$AUTOPOS= <>
##$BF1= 200.13
##$BF2= 200.13
##$BF3= 200.13
##$BF4= 200.13
##$BF5= 200.13
##$BF6= 200.13
##$BF7= 200.13
##$BF8= 200.13
##$BYTORDA= 1
##$CFDGTYP= 0
##$CFRGTYP= 5
##$CHEMSTR= <none>
##$CNST= (0..31)
1 1 145 1 1 1 1 1 1 1 1 1 1 1 1 1 1 1 1 1 1 1 1 1 1 1 1 1 1 1 1 1 
##$CPDPRG= <>
##$CPDPRG1= <>
##$CPDPRG2= <>
##$CPDPRG3= <>
##$CPDPRG4= <mlev>
##$CPDPRG5= <mlev>
##$CPDPRG6= <mlev>
##$CPDPRG7= <mlev>
##$CPDPRG8= <mlev>
##$CPDPRGB= <>
##$CPDPRGT= <>
##$D= (0..31)
0 1.2 0 0 0 0 0 0 0 0 0 0.03 0 0 0 0 0 0 0 0 0 0 0 0 0 0 0 0 0 0 0 0 
##$DATE= 1561976410
##$DBL= (0..7)
120 120 120 120 120 120 120 120 
##$DBP= (0..7)
150 150 150 150 150 150 150 150 
##$DBP07= 0
##$DBPNAM0= <>
##$DBPNAM1= <>
##$DBPNAM2= <>
##$DBPNAM3= <>
##$DBPNAM4= <>
##$DBPNAM5= <>
##$DBPNAM6= <>
##$DBPNAM7= <>
##$DBPOAL= (0..7)
0.5 0.5 0.5 0.5 0.5 0.5 0.5 0.5 
##$DBPOFFS= (0..7)
0 0 0 0 0 0 0 0 
##$DE= 6
##$DECBNUC= <off>
##$DECIM= 24
##$DECNUC= <off>
##$DECSTAT= 4
##$DIGMOD= 1
##$DIGTYP= 9
##$DL= (0..7)
0 120 120 120 120 120 120 120 
##$DP= (0..7)
150 150 150 150 150 150 150 150 
##$DP07= 0
##$DPNAME0= <>
##$DPNAME1= <>
##$DPNAME2= <>
##$DPNAME3= <>
##$DPNAME4= <>
##$DPNAME5= <>
##$DPNAME6= <>
##$DPNAME7= <>
##$DPOAL= (0..7)
0.5 0.5 0.5 0.5 0.5 0.5 0.5 0.5 
##$DPOFFS= (0..7)
0 0 0 0 0 0 0 0 
##$DQDMODE= 0
##$DR= 18
##$DS= 0
##$DSLIST= <SSSSSSSSSSSSSSS>
##$DSPFIRM= 0
$$ [...]
##$SUBNAM2= <"">
##$SUBNAM3= <"">
##$SUBNAM4= <"">
##$SUBNAM5= <"">
##$SUBNAM6= <"">
##$SUBNAM7= <"">
##$SUBNAM8= <"">
##$SUBNAM9= <"">
##$SW= 24.9336996594482
##$SWIBOX= (0..15)
0 0 2 0 0 0 0 0 0 0 0 0 0 0 0 0 
##$SW_h= 4990.01996007984
##$TD= 16384
##$TD0= 1
##$TE= 0
##$TE2= 300
##$TE3= 300
##$TEG= 300
##$TL= (0..7)
0 120 120 120 120 120 120 120 
##$TP= (0..7)
150 150 150 150 150 150 150 150 
##$TP07= 0
##$TPNAME0= <>
##$TPNAME1= <>
##$TPNAME2= <>
##$TPNAME3= <>
##$TPNAME4= <>
##$TPNAME5= <>
##$TPNAME6= <>
##$TPNAME7= <>
##$TPOAL= (0..7)
0.5 0.5 0.5 0.5 0.5 0.5 0.5 0.5 
##$TPOFFS= (0..7)
0 0 0 0 0 0 0 0 
##$TUNHIN= 0
##$TUNHOUT= 0
##$TUNXOUT= 0
##$USERA1= <user>
##$USERA2= <user>
##$USERA3= <user>
##$USERA4= <user>
##$USERA5= <user>
##$V9= 5
##$VALIST= <valist>
##$VCLIST= <CCCCCCCCCCCCCCC>
##$VD= 0
##$VDLIST= <DDDDDDDDDDDDDDD>
##$VPLIST= <PPPPPPPPPPPPPPP>
##$VTLIST= <TTTTTTTTTTTTTTT>
##$WBST= 1024
##$WBSW= 4
##$XGAIN= (0..3)
0 0 0 0 
##$XL= 0
##$YL= 0
##$YMAX_a= 226603
##$YMIN_a= -182779
##$ZGOPTNS= <>
##$ZL1= 120
##$ZL2= 120
##$ZL3= 120
##$ZL4= 120
##$ABSF1= 10
##$ABSF2= 0
##$ABSG= 5
##$ABSL= 3
##$ALPHA= 0
##$AQORDER= 0
##$ASSFAC= 0
##$ASSFACI= 0
##$ASSFACX= 0
##$ASSWID= 0
##$AUNMP= <proc_1d>
##$AZFE= 0.1
##$AZFW= 0.1
##$BCFW= 1
##$BC_mod= 2
##$BYTORDP= 1
##$COROFFS= 0
##$CY= 11.3945322036743
##$DATMOD= 1
##$DC= 2
##$DFILT= <>
##$DTYPP= 0
##$F1P= 18.9103706918063
##$F2P= -1.10871071338519
##$FCOR= 0.5
##$FTSIZE= 0
##$FT_mod= 4
##$GAMMA= 1
##$GB= 0.15
##$INTBC= 1
##$INTSCL= 1
##$ISEN= 128
##$LB= 0.24
##$LEV0= 0
##$LPBIN= 0
##$MAXI= 10000
##$MC2= 0
##$MEAN= 0
##$ME_mod= 0
##$MI= 1.114404
##$NCOEF= 0
##$NC_proc= 0
##$NLEV= 6
##$NOISF1= 3.799351
##$NOISF2= 2.8
##$NSP= 1
##$NTH_PI= 0
##$NZP= 0
##$OFFSET= 15.70392
##$PC= 1
##$PHC0= -8659.702
##$PHC1= 15.80097
##$PH_mod= 1
##$PKNL= yes
##$PPARMOD= 0
##$PSCAL= 0
##$PSIGN= 0
##$REVERSE= no
##$SF= 200.130013532006
##$SI= 16384
##$SIGF1= 3
##$SIGF2= 2
##$SINO= 400
##$SIOLD= 16384
##$SREGLST= <1H.CDCl3>
##$SSB= 0
##$STSI= 0
##$STSR= 0
##$SW_p= 3612.71676300578
##$SYMM= 0
##$S_DEV= 0
##$TDeff= 0
##$TDoff= 0
##$TI= <>
##$TILT= no
##$TM1= 0
##$TM2= 0
##$TOPLEV= 0
##$USERP1= <user>
##$USERP2= <user>
##$USERP3= <user>
##$USERP4= <user>
##$USERP5= <user>
##$WDW= 1
##$XDIM= 8192
##$YMAX_p= 0
##$YMIN_p= 0
$$ End of Bruker specific parameters
$$ ---------------------------------
##NTUPLES= NMR FID
##VAR_NAME=  TIME,          FID/REAL,        FID/IMAG
##SYMBOL=    X,             R,               I
##VAR_TYPE=  INDEPENDENT,   DEPENDENT,       DEPENDENT
##VAR_FORM=  AFFN,          ASDF,            ASDF
##VAR_DIM=   8192,          8192,            8192
##UNITS=     SECONDS,       ARBITRARY UNITS, ARBITRARY UNITS
##FACTOR=    0.0002004,     1,               1
##FIRST=     0,             0,               0
##LAST=      1.6414764,     0,               0
##MIN=       0,             -182779,         0
##MAX=       1.6414764,     226603,          0
$$ Real data points
##PAGE= N=1
##DATA TABLE= (X++(R..R)), XYDATA
0 0 0 0 0 0 0 0 -8 8 -8 10 -16 16 -24 32 -32 40 -49 60 -72 81 -97 114 -130 153 -177 201 -229 259 -293 334
30 334 -375 422 -472 528 -592 657 -730 814 -902 999 -1105 1226 -1358 1502 -1664 1847
46 1847 -2051 2283 -2551 2863 -3230 3669 -4209 4889 -5775 6984 -8743 11548 -16733 29522
60 29522 -126357 -104398 180632 19109 -118523 -15739 65897 -126864 -181433 23856 131611
71 131611 -31138 -82179 37204 2040 -182779 -97365 170208 154559 -108690 -133378 47796
82 47796 39846 -99862 -15568 157487 80457 -106512 -68780 56387 7729 -50278 90053
93 90053 169050 -25621 -174219 -11767 149394 42726 -57949 59500 116455 -44327 -123357
104 -123357 26965 122058 31022 -11094 59362 19341 -109417 -54199 130288 116882 -56875
115 -56875 -64436 61537 29848 -93225 -32748 116544 80485 -58805 -60420 13208 -8154 -36317
127 -36317 46139 91406 -20201 -104015 -16400 63194 -6893 -54354 36444 80431 -28240 -100386
139 -100386 -20480 56896 25869 -8366 13866 4533 -49105 -37424 38626 47852 -16406 -21934
151 -21934 32440 15943 -55727 -37952 54191 66844 -9602 -43465 -6215 13986 -2644 3337
163 3337 30381 18771 -18629 -15557 13217 3541 -17785 12784 48225 11392 -46662 -30428 28455
176 28455 35411 -5306 -15443 11881 13359 -17713 -19280 13917 20276 -3140 -2364 11056 -10601
189 -10601 -32007 1866 40685 11921 -36209 -19854 24553 10037 -33644 -16609 31122 15381
201 15381 -33345 -23046 13172 -2856 -26135 4088 23130 -21065 -45377 1483 28355 -19186
213 -19186 -46535 4373 33554 -20585 -54371 -3162 29195 -15525 -36696 7779 15978 -31476
225 -31476 -30380 20971 16053 -34232 -22185 31792 16907 -41547 -25600 37844 26793 -31364
237 -31364 -17216 35188 15922 -29925 -1376 41534 10253 -25392 11187 40938 -1393 -28554
249 -28554 19948 50375 1181 -30214 16342 43416 -3582 -25077 23261 38560 -10314 -21032
261 -21032 22657 22888 -20097 -12734 30697 17701 -30018 -19700 24910 12557 -30825 -15902 25152
274 25152 4441 -38023 -17687 19184 -3361 -32422 -6639 14866 -16986 -37208 -4082 16162
286 16162 -14455 -31723 -1240 12768 -19454 -31285 4353 17331 -14584 -21682 8067 9456
298 9456 -17254 -10284 19135 13202 -11815 -4182 19159 11701 -7596 4826 28319 17783 -4857
311 -4857 5858 26295 15804 2102 17866 29565 12325 1815 16891 25000 12987 8690 20306
324 20306 22092 7666 2472 15549 21047 8635 4162 13841 11775 -1246 536 11523 8261 -1192
338 -1192 198 3414 -1952 -6818 -3299 1598 -1519 -8624 -9165 -5427 -8493 -12670 -7846 -4028 -10142
353 -10142 -14635 -11761 -11336 -13422 -11282 -9122 -10773 -13046 -14296 -14505 -11989 -9902 -10443 -10245 -10645 -12870
369 -12870 -12682 -9871 -8739 -7995 -6373 -8491 -10752 -8171 -6130 -7079 -4713 -1963 -4570 -6857 -4569 -2905
385 -2905 -2827 -1187 123 -95 -1126 -2536 -1291 2561 2777 916 3264 4392 -141 -459 5325 6346
401 6346 3299 4188 5908 3648 1887 3835 7025 7684 5031 3465 5295 5193 2321 4548 9055 5992
417 5992 1484 3731 5350 2175 2651 6172 5502 2086 1159 2450 2690 1410 1455 4141 3693 -1560 -2106
434 -2106 2936 2432 -2129 438 4214 -63 -4156 -735 2034 -237 -1014 1455 1549 -2271 -3572 954
450 954 4116 -320 -2427 3146 3642 -3559 -2085 6379 5139 -1405 1265 6414 2232 -1622 4194 9776
466 9776 4739 -1441 3626 10432 4166 -2396 5879 13012 3449 -2883 6442 9939 108 -696 9373
481 9373 7876 -3491 -2664 8066 6114 -6473 -4826 8501 4739 -11500 -8723 6741 1481 -13292
495 -13292 -6772 4652 -6200 -16713 -4977 3906 -10088 -19267 -4446 4560 -12431 -22668 -4058
508 -4058 6539 -12947 -22417 -2376 4925 -14505 -17562 2296 1600 -17168 -11295 9478 2174 -19311
522 -19311 -9947 14211 5751 -18282 -7361 18383 7557 -16620 -3783 18614 5426 -10854
534 -10854 6616 18901 -2190 -11940 13110 23400 -2160 -12159 14999 24312 -5307 -15139 15439
547 15439 26147 -2159 -10626 12842 13496 -9144 -2927 21008 10704 -15253 -4936 18710 4893
560 4893 -19422 -2637 25144 7420 -25046 -12589 15369 4764 -14481 -32 11937 -9889
572 -9889 -21606 1568 11900 -9470 -14907 8709 10221 -20949 -26887 7717 21857 -5949 -19866
585 -19866 -625 4416 -13409 -10184 11656 8707 -10048 -7004 4881 -5484 -16046 4006 25603
598 25603 8365 -21988 -15762 10784 11457 -4304 1646 14313 3558 -12470 -6622 6836 7896
611 7896 7974 12959 6149 -12898 -15885 8018 26245 12791 -7048 -2351 8596 462 -8705 4961
625 4961 22617 17151 -2344 -11357 -5539 3477 11218 18356 15045 -4426 -16805 -1527 15416 6966
639 6966 -2884 11311 19567 -5607 -27963 -8678 23795 22337 -1657 -8313 -2958 -10796 -13372 9760
653 9760 22205 -1711 -18300 -1045 2876 -23214 -20869 22517 32487 -15337 -43280 -12400 12676
666 12676 -4584 -11476 12295 8645 -29303 -30198 7174 8161 -18819 -2411 28399 -4832 -54632
679 -54632 -25179 36823 25627 -25072 -17658 17584 -2757 -36279 -4153 37330 9817 -24822
691 -24822 1247 17856 -23898 -31309 33509 53660 -14999 -47930 7533 35849 -11012 -24090
703 -24090 30173 39382 -21538 -35618 16332 23604 -16724 -518 44513 8723 -55055 -21401
715 -21401 50212 26782 -35720 -11877 40084 4548 -51096 -12876 46272 15879 -31562 -2631
727 -2631 22853 -24060 -40445 26944 50701 -21397 -50942 13581 35569 -27683 -39736 32047
739 32047 46232 -25861 -45450 13921 25520 -21033 -9358 41655 13486 -49254 -18508 47685
751 47685 19745 -38220 -2610 52618 8462 -52741 -11012 52934 22410 -27665 1311 32314
763 32314 -9779 -32474 23719 47991 -10984 -33636 22544 34808 -26549 -33531 35780 47792
775 47792 -20602 -40144 14066 26753 -17495 -15146 29706 15395 -35274 -19833 27885 8133
787 8133 -33382 -3924 38034 259 -50458 -17385 35388 12938 -30315 -10473 20191 -7096
799 -7096 -33378 336 26720 -5906 -25863 6820 16216 -23560 -28820 20436 32822 -15092 -33571
812 -33571 5016 20730 -10880 -17923 15634 19126 -15339 -18688 11104 9624 -14432 -1926 24776
825 24776 5631 -28856 -13229 23983 15577 -16474 -9549 17419 6988 -20301 -9452 17862
837 17862 10412 -10838 -2597 9710 -6180 -16468 6968 22537 -853 -20596 -1894 16131
849 16131 -991 -16722 3346 21207 1097 -18996 -3652 12784 1015 -6552 8378 11248
861 11248 -9493 -14071 8944 16292 -4205 -10798 10024 14656 -10067 -16131 10218 19776 -2874
874 -2874 -11670 5731 8419 -8522 -6259 13206 10077 -10945 -8905 10479 6076 -14379 -6831 16914
888 16914 8770 -18185 -12594 11763 6368 -13817 -5356 12008 -9 -17677 -4803 12154 -669
901 -669 -15368 -236 13567 -5688 -20772 1011 18297 -2597 -17919 2107 14022 -6115
913 -6115 -14294 7272 14759 -5770 -11168 8898 12106 -8324 -8372 15059 14433 -10085 -8831 15413
927 15413 12835 -9567 -4535 16987 10101 -10303 -2826 15182 6613 -9588 540 15648 3058
940 3058 -12939 369 15649 1153 -13434 1620 13737 -3039 -14108 2046 10897 -4826
952 -4826 -12374 2338 7417 -7745 -12146 3399 6849 -9335 -11725 4627 5277 -11262 -10231 6263
966 6263 4238 -10894 -7596 6086 2016 -9920 -4746 7402 2427 -8927 -3282 7986 1829 -8396
980 -8396 -218 9981 1225 -7826 1231 9046 582 -5239 3264 8145 -274 -4897 3142 7736 -271
995 -271 -4359 3657 6659 -2442 -4668 4574 5705 -3439 -4093 3892 3146 -4136 -3540 3185 2171 -4547
1011 -4547 -4063 2175 1213 -5351 -3847 2784 316 -5971 -3321 2528 -615 -5117 -1821 2183 -757
1026 -757 -4287 -1495 2369 189 -3337 -621 3084 218 -2929 1172 4265 132 -1729 2413 3953
1041 3953 471 -270 2996 3835 906 -198 2847 4112 970 -311 2857 3651 -289 -445 2994 2153
1057 2153 -1003 -205 1862 817 -1115 -634 724 33 -1744 -1603 103 -461 -2671 -1715 48 -1420
1073 -1420 -2825 -1188 -433 -1931 -2180 -877 -802 -1459 -1412 -1129 -385 -482 -1138 -483 587 -131 -429 605 966
1092 966 282 698 1064 628 1248 1494 1031 1067 1715 993 841 1841 1596 660 1055 1436 1070 392 406 855
1112 855 824 128 -719 151 814 -822 -1342 69 -473 -1926 -1022 -87 -1767 -2426 -827 -496 -2051 -2643
1130 -2643 -1260 -350 -1424 -2745 -1235 219 -1609 -2429 -13 181 -2042 -910 1692 92 -2189 186
1146 186 2633 736 -1300 585 2994 1607 -435 1311 3310 1212 -178 3024 3601 -488 47 4693
1162 4693 3336 -2070 -139 4863 3018 -1870 -857 3324 2045 -1961 -334 3152 4 -3529 443
1177 443 3301 -2536 -5195 1743 3690 -4145 -6175 1335 3065 -3869 -5172 913 1454 -4467 -3840 2257
1193 2257 641 -6015 -2321 5121 -234 -8290 -1416 7479 573 -7666 -800 6455 182 -5356 1362
1208 1362 6020 -751 -4260 3615 5548 -3773 -3955 7924 7380 -6486 -6076 7884 7243 -5392 -4044
1223 -4044 7211 4341 -5818 -2674 6100 1881 -5908 518 7567 -2375 -10622 1446 10822 -1913
1237 -1913 -11189 634 8358 -3477 -9687 1596 6849 -3105 -6559 2380 2757 -6913 -4184 8570
1251 8570 5000 -10157 -6620 8878 5289 -8650 -3889 9729 4576 -7904 -3567 6458 2680
1264 2680 -3273 2723 6771 -3070 -7894 4240 10913 -1296 -7733 4219 9225 -3583 -8610 3766
1278 3766 9094 -194 -4636 801 949 -3886 -779 6469 2078 -7286 -4138 5212 958 -8152 -2646
1293 -2646 7628 2870 -8206 -6874 1110 2199 -575 -217 -270 -3538 -4339 170 2669 -965 -2402
1308 -2402 2487 3429 -3907 -6806 896 7950 4977 -1970 -4044 -363 3151 2805 1473 2864 3679 1118
1324 1118 -872 194 1559 3040 5950 6134 -316 -6276 -2141 7517 8002 -749 -3383 3486 3662 -5127
1340 -5127 -4915 5814 7344 -1553 -4041 -672 -3424 -5882 2832 9493 -1004 -12676 -5125 6098
1354 6098 -1056 -10596 285 11154 -1856 -16171 -6165 6378 -42 -5081 4062 3832 -11973
1367 -11973 -12595 6735 10422 -6849 -8572 8779 6676 -15240 -12683 13130 14910 -7274 -9021
1380 -9021 6412 1416 -11828 671 17859 4191 -14655 -2739 12941 -1889 -15069 6311
1392 6311 23096 -711 -22046 -3129 15549 162 -9645 8922 13068 -11582 -16722 8359 13672
1405 13672 -8135 -8090 14757 8401 -21273 -15864 17965 17281 -11750 -10739 11536 3270 -18140 -3901
1419 -3901 20415 6948 -15546 -3078 13043 -4480 -17781 7934 25557 -1125 -22924 -776
1431 -776 17726 -2288 -12987 11187 18803 -8731 -17646 7123 13693 -6767 -5553 17003 9589
1444 9589 -19490 -13957 17507 15437 -11511 -7791 14957 4840 -19213 -6859 18666 8365 -12831
1457 -12831 -2973 10539 -5392 -16956 5281 20421 -2025 -19584 -493 13307 -5706 -15146
1469 -15146 8096 17049 -6840 -17517 2513 9728 -6134 -6237 11801 8016 -14107 -11621 11153
1482 11153 10247 -9211 -5524 13067 6006 -14936 -7798 13490 9163 -7899 -2697 8942 -501
1495 -501 -11364 1173 13724 1742 -10471 -222 9287 -2971 -11624 3071 13364 -1434 -12568
1508 -12568 -1111 7007 -3225 -7444 3725 6537 -6281 -9743 1855 4703 -6003 -6712 5364
1521 5364 5017 -9291 -10142 4173 6393 -5545 -6262 4328 3145 -7367 -5612 5248 4435 -4498
1535 -4498 -2768 5589 1938 -7249 -1934 9504 5196 -6099 -2078 7725 3148 -5398 386 9389
1549 9389 4088 -4618 -393 6766 1944 -3924 2875 9211 640 -6968 1326 8366 179 -5651 3075
1564 3075 7897 -2062 -7801 1041 6572 -1113 -5702 1741 4521 -5074 -7711 2899 5559 -4935
1578 -4935 -7023 2912 2860 -7670 -6662 4800 4386 -6469 -6505 2943 2127 -6543 -3557 6340 2681 -7914
1594 -7914 -3932 6275 1821 -6585 -168 8108 623 -7675 -223 8179 1778 -4995 1772 7600 -299
1609 -299 -5903 3067 8933 -140 -4995 4097 7020 -2833 -4488 5905 7329 -2777 -4402 4558 5065
1624 5065 -3605 -3093 5890 4793 -5126 -4045 5239 3384 -5082 -1887 6024 1316 -6698 -1960 5790
1639 5790 1366 -5545 -1025 4940 -519 -6301 -147 5815 -188 -5897 263 4731 -1911 -5093 2265
1654 2265 5140 -2259 -4818 1932 3803 -2278 -3407 3044 3610 -3269 -3962 2886 3209 -3383 -2795 3477
1670 3477 1557 -4604 -2696 3283 1098 -4302 -2172 2334 -416 -4788 -2013 2628 -276 -5073 -2026
1685 -2026 1801 -1691 -4946 -634 2345 -2177 -4725 -577 1442 -2226 -3461 402 1648 -2232 -3550
1700 -3550 777 2192 -1587 -2119 2020 1886 -2048 -1324 3024 2450 -1159 -9 2834 1952 -805 520
1716 520 3643 2395 -346 803 3303 1637 -613 1474 3534 1084 -675 1415 2325 273 -319 1318
1732 1318 1812 -75 -1023 471 1134 -382 -1114 532 417 -1508 -1435 338 49 -1420 -922 0 -629 -1225
1750 -1225 -787 -87 -146 -747 -592 -45 -29 -552 141 655 300 25 793 776 586 1139 1335 845 1014 1830 1359
1771 1359 1057 1666 1861 1605 1292 1555 1568 1434 1200 1443 1628 716 317 1335 1234 -266 -131 1090 292
1790 292 -1278 -502 433 -687 -1664 -976 -446 -1420 -2203 -1416 -637 -2112 -3190 -1549 -774 -2793 -3412 -1208
1808 -1208 -953 -3116 -2915 -832 -1104 -2851 -1979 -479 -1112 -2443 -1400 437 -581 -2398 -785 1834
1824 1834 -103 -2072 406 2116 -88 -1039 1595 2120 -145 -43 2108 2001 -373 331 2952 2180
1840 2180 -807 15 3299 2071 -1175 375 2999 875 -1187 979 2309 -442 -1465 1517 1950
1855 1950 -1467 -2010 1387 1941 -2084 -2448 1445 1591 -2265 -2151 1841 484 -2779 -540 2235 -677
1871 -677 -3258 326 2854 -913 -3347 804 3197 -821 -3035 1114 3149 -1050 -2089 2231 2232 -2238
1887 -2238 -808 3563 1644 -3056 -604 4221 1439 -3447 -612 4176 1314 -3297 -486 3496 -102
1902 -102 -3205 1194 3260 -2142 -3571 2170 2841 -3233 -3375 2671 2617 -3673 -3872 2237 2239 -2914 -2220
1919 -2220 2509 649 -4077 -781 3944 144 -4110 659 4345 -1170 -4510 1341 5579 235 -3485
1934 -3485 1049 3966 -346 -1850 3317 4092 -1386 -1401 4045 2851 -2705 -141 6036 3162 -3601 -1584
1950 -1584 4266 2605 -1829 0 3468 234 -3348 -116 2875 -688 -2668 1634 2131 -3923 -4999
1965 -4999 1372 2941 -2050 -3916 -471 -113 -3403 -3011 361 297 -2638 -2319 -697 -2460 -3892 -319
1981 -319 2809 -816 -4386 -2240 584 -501 -1429 453 1337 -448 -1606 -799 72 465 2081 2745 249
1998 249 -2300 -800 2122 2238 1202 1151 1002 -185 -397 588 819 1524 2919 1589 -2037 -2705 774
2015 774 2726 1034 -425 295 -612 -2344 -1604 1397 898 -1444 -237 524 -3176 -4790 590 4213
2031 4213 -373 -4231 -1348 648 -2312 -2917 1943 3129 -1999 -3419 730 551 -3219 -219 5985
2046 5985 2626 -5159 -2898 4344 2742 -2422 929 5968 1262 -4630 -105 5699 2146 -1557 3792
2061 3792 5713 -2399 -5101 4276 8168 -409 -3546 4177 4929 -3714 -3808 5384 6069 -2693 -3024 3907
2077 3907 1623 -5883 -1279 7603 2248 -7563 -2812 5702 -36 -7383 -89 7210 -831 -8504 -1335
2092 -1335 4810 -2076 -5861 2556 5257 -4879 -7968 2850 5542 -4543 -5521 5045 4422 -7128
2106 -7128 -5982 5364 5014 -4985 -3184 5483 1698 -7149 -2002 7483 2244 -6645 -831 6744 -740
2121 -740 -7875 852 8326 -204 -7181 257 5501 -2501 -5808 2831 5912 -3605 -6588 2399 4107
2136 4107 -4832 -4821 5012 4167 -6470 -5921 4020 3245 -5062 -2921 4964 1583 -6485 -2934 5131 1693
2152 1693 -4863 -288 5472 -488 -6415 550 6939 679 -4764 1273 5472 -1116 -4185 2907 6311
2167 6311 -385 -3324 2630 4454 -1981 -2295 4954 5017 -2618 -3086 3633 3409 -2568 -1420 4539 2659
2183 2659 -3662 -2587 2999 2049 -2700 -920 3103 1 -4658 -1829 3265 566 -3749 -1160 2131
2198 2131 -1384 -4544 -640 2898 -205 -3815 -1299 1491 -1388 -3178 649 2858 -1089 -3423 267
2213 267 2404 -853 -2024 1868 3000 -1144 -2568 1312 3233 130 -984 2208 2844 -1064 -1504 2643
2229 2643 3493 -284 -624 2669 2048 -1531 -804 3322 2850 -1416 -1510 1876 1410 -2051 -862 2841 1208
2246 1208 -3009 -1824 1732 239 -2860 -689 2123 -607 -3963 -1464 1921 -332 -3233 -793 1808
2261 1808 -1360 -3966 -443 2430 -842 -3169 176 1748 -1792 -2818 1238 2860 -1105 -2464 1266
2276 1266 2316 -1353 -1657 2683 2841 -1436 -1683 2512 2340 -1396 -389 3213 1834 -2182 -888 2863
2292 2863 1731 -1669 -297 2773 496 -2840 -461 2890 395 -2655 -272 1807 -1081 -3203 62
2307 62 1966 -1228 -3086 -183 1246 -1923 -2878 463 1510 -2243 -3047 444 1120 -2177 -2021 1442
2323 1442 876 -2467 -1870 1495 1136 -1643 -895 1956 731 -1961 -589 2619 1288 -1418 145 2335
2339 2335 510 -1416 754 2818 641 -1273 592 2253 221 -939 1274 2446 -163 -1489 847
2354 847 1876 -415 -1023 1355 1347 -1120 -1481 826 955 -1012 -1074 903 490 -1626 -1153 1099 649 -1477
2372 -1477 -939 831 20 -1528 -361 1373 263 -1200 -204 1093 156 -803 611 1636 351 -788
2388 -788 586 1745 301 -155 1419 1515 -107 -343 1222 1601 258 62 1127 1015 -240 -187 1085
2405 1085 907 -364 -251 509 151 -940 -356 423 -274 -1231 -621 -221 -771 -1222 -583 -446 -1046 -1507 -1133
2424 -1133 -528 -1011 -1329 -788 -582 -1440 -1165 -770 -615 -838 -597 -365 -474 -739 -433 32 -3 -148 -18 303
2444 303 125 202 540 766 396 480 684 551 476 943 993 493 723 849 643 537 676 936 449 373 452 531
2466 531 309 -157 241 528 5 -566 -40 211 -596 -594 96 -285 -1137 -817 -99 -496 -1166 -794 -133 -650 -1023
2487 -1023 -658 162 -451 -1052 -204 496 -455 -814 355 723 -270 -461 696 795 -54 79 1051 978 107 456
2507 456 1326 1149 133 658 1518 786 -258 743 1545 537 -282 611 1280 55 -404 583 903 -289
2525 -289 -697 437 390 -881 -953 492 46 -1343 -927 395 -303 -1492 -861 203 -596 -1497 -590 180
2543 180 -746 -1486 -80 538 -967 -1205 352 651 -848 -1024 867 789 -889 -243 1289 659 -605 102
2561 102 1447 710 -543 488 1686 419 -671 964 1857 259 -551 1136 1460 -280 -559 1134
2577 1134 1106 -699 -516 1227 543 -1228 -560 926 141 -1780 -764 737 -442 -1952 -361 847
2593 847 -836 -1888 -273 425 -1270 -1659 159 697 -1373 -1554 667 754 -1315 -1009 1101 736 -1272
2610 -1272 -482 1451 611 -957 137 1654 291 -910 739 2049 327 -737 1026 1766 -53 -794
2626 -794 1296 1715 -326 -611 1189 888 -868 -249 1356 629 -1162 -518 976 73 -1587 -605 935
2643 935 -355 -1978 -680 451 -858 -1570 -165 308 -1561 -1589 35 208 -1223 -1024 454 39 -1402
2660 -1402 -1102 668 404 -824 -294 832 -32 -687 406 1195 239 -222 980 1264 -21 -22 1437 1548
2678 1548 406 228 1121 933 332 676 1489 777 -130 530 1032 240 -298 757 920 -288 -553 167 317
2697 317 -438 -250 214 -157 -1150 -650 60 -583 -1252 -306 210 -1000 -1550 -276 164 -920 -988 162 -200
2716 -200 -1224 -786 525 274 -1050 -370 882 -31 -1196 179 1616 386 -889 703 1364 -33
2732 -33 -629 1365 1630 -387 -321 1415 1225 -689 -178 1919 1239 -1054 -403 1528 708 -1187 -28 1692
2750 1692 -78 -1809 -260 1270 -657 -1881 201 1103 -1382 -2299 243 1004 -1386 -1931 489 612
2766 612 -2137 -1807 890 587 -1932 -1139 1191 188 -2124 -670 1905 455 -1856 -191 1775 150
2782 150 -1603 690 2351 129 -1593 1014 2267 -324 -1052 1826 2397 -580 -1026 1646 2001 -778
2798 -778 -513 2118 1518 -1370 -865 1924 1071 -1604 -332 1783 69 -2221 -405 1693 -160 -1988
2814 -1988 -246 1301 -978 -2447 -116 1388 -1023 -2201 29 678 -1490 -1870 889 1118 -1478 -1805
2830 -1805 757 673 -1360 -806 1585 931 -1298 -943 1520 983 -823 223 1985 561 -1377 314
2846 314 2169 772 -573 810 1886 73 -1062 824 1992 421 -681 594 1135 -576 -902 985
2862 985 1268 -566 -1043 227 280 -1257 -910 770 388 -1453 -1362 -144 -144 -1229 -617 385 -330 -1778
2880 -1778 -1269 415 -57 -958 -231 381 -529 -1325 -325 930 415 -576 -49 607 -82 -591 617 1529
2898 1529 568 -279 411 886 338 219 1274 1588 310 -483 409 1046 409 295 854 925 -356 -672 573
2917 573 814 -81 -266 250 31 -967 -833 447 434 -657 -1013 -277 -447 -1128 -686 394 -215 -1325 -1133
2936 -1133 -232 -434 -797 -256 320 -434 -1111 -631 371 186 -474 194 491 -286 -732 456 1282 449 -95
2955 -95 432 745 142 -35 1009 1353 353 -367 509 898 135 255 1226 1032 -336 -507 643 619 -12
2974 -12 161 551 -48 -1065 -667 527 329 -628 -551 -47 -646 -1430 -395 394 -58 -1219 -840 -342 -697
2993 -697 -876 5 565 -418 -1164 -450 214 -89 -369 529 536 -628 -700 337 853 340 255 594 374 -317 91
3014 91 1153 1178 427 222 766 299 -143 389 1489 931 -296 -93 484 142 -58 600 937 57 -878 -396
3034 -396 105 -39 -369 155 124 -838 -1325 -399 102 -419 -797 -390 -604 -1173 -991 -42 186 -457 -719 -341
3054 -341 -470 -777 -199 551 238 -480 -388 185 -100 -51 546 872 372 -250 234 717 663 376 811 900 218
3075 218 -158 555 923 512 419 447 436 -197 -27 496 642 74 -136 71 -160 -500 -229 97 -111 -531 -413
3096 -413 -209 -540 -691 -276 -240 -596 -755 -480 -443 -556 -538 -378 -223 -525 -711 -130 -25 -239 -39 59 -29 -146
3118 -146 149 434 318 131 436 392 202 283 551 582 583 483 492 557 275 531 659 544 251 293 427 261 124
3141 124 315 364 -63 -171 112 -82 -294 -297 -104 -249 -482 -425 -239 -510 -621 -268 -247 -668 -687 -380 -269 -605
3163 -605 -653 -69 -239 -700 -405 -123 36 -309 -177 290 177 -279 63 468 176 -32 370 556 260 269 578
3184 578 720 492 233 717 642 256 226 669 667 56 186 624 321 -229 124 525 -109 -450 -27 203 -344
3205 -344 -557 -120 -67 -586 -713 -252 -252 -810 -800 -243 -209 -884 -593 -28 -342 -854 -340 67 -376 -660 -203 305
3227 305 -103 -550 68 516 -80 -137 591 683 79 38 732 710 27 255 1061 620 -20 460 831 588 -94
3248 -94 400 747 155 -276 516 721 36 -429 317 210 -425 -460 149 117 -719 -526 -33 -176 -949 -720 -41
3269 -41 -401 -973 -447 141 -513 -1037 -334 224 -527 -864 -36 257 -609 -547 271 379 -435 -334 584 518 -133
3290 -133 50 933 537 -224 172 1019 495 -95 574 979 366 -159 587 860 298 -238 605 708 -162 -197
3310 -197 446 406 -467 -295 375 99 -868 -345 240 -232 -987 -318 100 -439 -1105 -412 2 -669 -922 -247
3330 -247 64 -741 -890 -63 91 -810 -511 254 93 -808 -376 513 204 -304 25 690 273 -193 337 895
3350 895 260 -152 574 896 182 -46 866 827 146 148 755 659 45 212 682 383 -256 -14 383 147 -521
3371 -521 -84 411 -346 -682 -31 137 -488 -710 -77 3 -688 -650 -201 -341 -641 -667 -25 -212 -783 -446 44
3392 44 -295 -639 11 258 -248 -453 183 470 -15 46 432 512 -66 100 760 615 132 341 803 434 8
3413 8 437 1045 458 -80 608 699 -8 -43 428 710 10 -234 178 215 -472 -284 308 40 -694 -498 -4 -350
3435 -350 -885 -305 145 -397 -953 -472 -94 -483 -737 -108 219 -773 -828 -122 291 -436 -443 384 197 -602 -235
3456 -235 724 462 -164 167 602 208 -308 325 1045 507 -88 375 813 226 -45 683 958 216 -239 461
3476 461 585 -131 -78 663 445 -523 -586 248 284 -525 -126 432 -216 -1057 -585 87 -327 -773 -326 9 -755
3497 -755 -1079 -220 140 -388 -749 -176 -31 -545 -619 160 462 -333 -600 242 140 -343 -5 872 517 -335
3517 -335 44 511 433 152 440 900 300 -177 373 977 509 181 475 628 -87 -172 528 733 155 -134 88
3538 88 126 -426 -172 414 165 -552 -656 -170 -224 -542 -393 112 -294 -897 -645 -225 -272 -409 -306 -85 -450
3559 -450 -820 -337 121 91 -302 -53 -12 -351 -307 268 457 239 -23 161 254 147 374 751 762 253 -54 331
3581 331 447 482 406 683 302 -87 -36 274 536 363 264 12 -94 -243 -88 252 225 -127 -421 -357 -475 -458
3603 -458 -114 -39 -302 -636 -761 -604 -300 -114 -105 -200 -473 -751 -558 -34 4 -33 -6 -43 -334 -403 37 437 354
3626 354 159 56 1 -52 120 524 836 498 94 149 262 306 434 796 515 89 19 148 364 420 427 383 109
3649 109 -347 -313 90 346 26 -102 -165 -483 -673 -495 -2 26 -341 -531 -493 -648 -561 -260 4 -176 -555 -595
3671 -595 -395 -308 -270 152 143 -233 -343 -338 1 128 254 348 320 -152 -125 352 490 505 382 452 240 3 210 755
3695 755 770 401 319 232 128 160 318 554 310 -143 -26 162 77 -181 161 249 -331 -549 -253 -162 -322 -255 -129
3718 -129 -272 -513 -750 -272 -131 -361 -453 -176 -397 -692 -318 167 6 -262 -103 16 -21 -180 41 280 295
3739 295 -100 -20 177 313 108 417 614 318 133 355 489 242 469 622 462 70 4 268 311 283 211 213
3761 213 -11 -182 -202 173 -31 -232 -161 -115 -549 -545 -167 -230 -369 -494 -272 -410 -552 -426 -249 -269 -410 -511
3783 -511 -267 -375 -503 -159 25 -38 -327 -137 -34 102 2 164 310 -62 35 287 402 296 186 572 362
3804 362 138 289 549 427 239 312 466 163 150 451 401 162 -5 130 219 -38 -99 151 91 -265 -333 -109
3826 -109 -228 -485 -334 -62 -351 -664 -368 -312 -336 -505 -269 -235 -480 -498 -258 -72 -410 -301 -26 -69 -260 -149
3848 -149 338 196 -111 93 449 305 -4 248 623 261 -99 420 554 317 113 543 634 -68 142 492
3868 492 412 32 133 342 210 -135 10 285 49 -313 -187 195 -231 -509 -27 44 -438 -550 -152 -218 -705
3889 -705 -605 -173 -151 -565 -482 -111 -169 -448 -355 166 -91 -471 -99 297 -7 -395 -6 465 145 -184 475
3910 475 466 189 50 653 613 102 147 578 579 97 194 744 530 -151 158 653 127 -273 295 496 -112 -214
3932 -214 272 337 -257 -490 -41 123 -427 -486 -55 54 -584 -614 89 -124 -824 -490 74 -305 -820 -109 9
3953 9 -312 -648 -236 141 -241 -577 90 344 -260 -275 312 362 -217 -127 547 400 -127 96 746 417 -53 283
3975 283 658 348 -155 345 659 252 -204 458 532 -110 -214 344 339 -392 -288 124 225 -548 -386 216 49
3996 49 -707 -408 130 -251 -853 -326 175 -456 -833 -185 101 -465 -562 15 93 -439 -608 74 152 -387 -319 295
4018 295 373 -294 -84 741 339 -213 222 755 266 -103 314 727 206 -70 530 731 133 -38 482 742
4038 742 46 -66 536 584 -162 -123 576 215 -375 -116 121 -190 -631 -180 288 -283 -570 -348 117 -564 -691
4059 -691 -189 -88 -464 -571 -79 -100 -693 -387 204 -65 -503 -202 265 -57 -363 57 459 129 -354 132
4079 132 566 78 -123 526 597 79 -10 512 633 132 171 503 391 -183 120 559 382 -194 23 460 83
4100 83 -402 81 322 -82 -406 120 129 -410 -365 -61 -31 -558 -650 -142 -47 -552 -481 32 -135 -744 -404 87 -200
4123 -200 -531 -209 123 -262 -464 2 235 58 -184 236 291 -86 -77 380 502 124 13 523 385 36 369
4144 369 650 370 102 319 457 340 224 327 418 223 -229 70 504 -9 -189 119 -20 -324 -225 63 -92
4165 -92 -277 -255 -79 -270 -493 -421 -210 -209 -525 -330 -158 -315 -411 -87 140 -264 -342 -127 -163 -129 -42 219 122 -98
4189 -98 -92 248 224 104 259 358 128 -170 366 515 213 194 545 392 12 94 293 477 271 220 170 59 -37
4212 -37 -101 252 83 -224 -164 -37 -203 -506 -29 -30 -324 -496 -407 -222 -370 -205 -54 -219 -495 -479 -195 -153 -281
4235 -281 -97 63 -189 -562 -152 113 59 -91 158 120 -16 0 262 368 277 305 244 281 74 228 562 429
4257 429 178 96 401 293 46 241 579 250 -96 42 204 69 9 79 174 -121 -403 -183 59 -160 -158 32
4279 32 -172 -552 -576 -282 -45 -389 -382 -251 -450 -640 -293 79 0 -261 -262 -38 -292 -351 185 483 58 -158 -85
4302 -85 128 210 214 432 458 106 -127 262 520 410 280 476 502 -118 -55 359 564 182 236 196 95 -173 141
4325 141 408 141 -47 -137 -147 -242 -346 -150 307 -65 -443 -348 -217 -447 -216 19 72 -404 -697 -490 -116 -47
4347 -47 -141 52 -98 -455 -561 33 247 46 223 147 -95 -242 77 460 341 246 83 133 56 112 258 682
4369 682 392 46 138 240 132 303 708 424 94 -108 -125 -107 79 243 124 65 -311 -484 -192 -27 -13 53
4391 53 -120 -452 -614 -320 -197 -197 -120 -284 -484 -410 -450 -323 41 -7 -127 -295 -300 -320 -208 158 271 25 -115
4414 -115 -206 -32 318 380 291 290 148 34 17 305 510 601 470 98 -8 -4 229 379 574 216 -97 -160 56
4437 56 -5 73 335 119 -287 -291 -143 -10 -141 -27 -15 -259 -495 -468 -39 -49 -196 -131 -101 -362 -667 -93 220
4460 220 -174 -246 -122 29 -255 -245 59 333 45 -191 124 181 25 63 681 394 -34 60 559 294 97 330
4482 330 716 254 -124 118 582 296 21 273 529 -60 -371 144 465 -146 -302 217 184 -481 -473 191 45
4503 45 -517 -489 -27 -137 -679 -521 211 -136 -707 -390 148 -278 -717 -183 197 -217 -479 -10 170 -306 -216
4524 -216 288 333 -145 -205 330 408 -118 -91 641 358 -97 198 670 326 -81 235 491 303 -36 238 601
4545 601 127 -283 196 411 -68 -493 288 424 -433 -289 234 -24 -549 -311 131 -232 -550 -391 68 -215
4565 -215 -749 -301 218 -275 -618 -135 225 -381 -490 119 185 -405 -450 238 198 -312 -151 370 175 -235 -53
4586 -53 693 372 -144 255 642 187 -220 404 554 43 -71 494 564 84 114 415 440 -94 -47 453 361 -420
4608 -420 -122 475 -11 -564 -109 119 -226 -705 29 106 -422 -509 -106 -19 -419 -495 105 88 -606 -492 198 103
4630 103 -665 -361 361 11 -515 -20 439 15 -346 114 394 128 -237 321 570 98 -175 513 649 -72
4650 -72 -40 752 549 -203 -75 681 349 -252 200 545 127 -332 93 646 74 -421 137 489 -110 -530 -29
4671 -29 212 -394 -561 126 11 -432 -534 186 26 -649 -435 134 -101 -556 -244 308 -172 -639 84 435
4691 435 -247 -388 292 296 -152 -267 372 441 -154 -128 436 400 -300 71 628 500 -282 96 758 215 -232 318
4713 318 683 -27 -349 285 389 -166 -441 103 327 -280 -471 228 117 -583 -501 172 43 -694 -567 245
4733 245 -284 -679 -293 245 -233 -652 -230 198 -322 -610 -28 259 -227 -506 211 318 -219 -276 564 314
4753 314 -324 -10 644 391 -104 51 661 452 -174 132 735 291 -298 235 752 144 -350 476 592 -59
4773 -59 -244 239 421 -195 -120 201 246 -355 -305 237 127 -514 -300 224 -170 -571 -295 68 -256 -576 -135
4794 -135 26 -263 -524 -169 106 -143 -427 -69 274 -188 -298 259 341 -234 -208 431 284 -276 64 424 432
4815 432 89 58 491 359 84 94 519 195 -185 183 418 106 -44 127 273 -42 -224 102 234 -74 -352
4836 -352 -26 52 -181 -361 -110 108 -358 -455 -100 -111 -360 -351 -121 -339 -262 -280 -127 -156 -286 -384 -161 108 -61
4859 -61 -312 86 129 -11 -3 37 130 109 103 17 359 126 165 324 490 233 -86 418 296 77 136 398 382 42
4883 42 39 86 360 97 -5 317 200 -397 -450 226 153 -247 -103 -27 -104 -488 -256 123 1 -369 -349 -148 -210
4906 -210 -552 -111 350 -71 -510 -330 20 -183 -315 223 477 -277 -440 12 266 167 -41 454 586 -365
4926 -365 -441 360 692 282 143 647 234 -495 -264 629 753 0 -74 138 12 -429 63 914 551 -423 -439
4947 -439 153 -214 -477 401 683 -138 -1045 -513 92 -48 -338 315 356 -791 -1241 -246 448 -82 -362 311
4967 311 -106 -1057 -786 366 669 -32 -161 160 -159 -803 -155 1063 978 -152 -312 263 -31 -256 586
4986 586 1276 364 -509 -261 317 245 32 942 946 -258 -1017 -61 664 136 14 542 448 -1022 -972 252 618
5007 618 11 -205 129 -341 -1088 -633 672 648 -445 -712 -131 -449 -919 -81 878 208 -820 -511 -25
5026 -25 -369 -353 643 932 -109 -955 -321 406 298 -73 742 738 -451 -809 330 918 331 54 737 345
5046 345 -611 -435 711 886 305 -98 378 25 -548 -69 839 518 -334 -306 56 -251 -572 221 583 22
5066 22 -811 -573 -163 -74 -303 44 288 -402 -940 -408 117 -266 -179 184 36 -534 -619 105 422 184 -52
5087 -52 120 73 -212 -334 421 675 75 -37 97 193 -105 214 574 622 66 -147 185 384 268 37 329
5108 329 373 -349 -289 290 254 -15 43 190 94 -478 -203 113 199 -288 -321 34 -183 -814 -442 276 -32 -580
5130 -580 -257 -32 -289 -492 -85 341 -10 -369 -226 339 -141 -466 153 470 -80 -516 78 675 5 -248
5150 -248 394 577 -203 -212 273 519 -91 -193 710 595 -294 -244 723 562 -365 -62 625 173 -479 -116 550
5171 550 65 -592 -133 442 -175 -704 70 468 -242 -845 65 370 -498 -767 186 249 -578 -848 40 321
5191 321 -598 -561 231 300 -505 -478 530 290 -608 -176 728 154 -576 57 851 178 -483 201 722 43 -379
5212 -379 256 875 47 -382 450 638 -178 -521 624 471 -279 -287 586 279 -483 -116 532 140 -547 -410
5232 -410 459 -71 -736 -172 287 -283 -834 11 322 -416 -633 -26 168 -495 -545 145 122 -462 -299 318 294
5253 294 -454 -217 358 187 -422 -104 505 -38 -422 261 703 7 -59 436 511 102 -175 529 651 19 -76
5274 -76 538 548 -239 -152 587 224 -384 50 400 -5 -306 3 312 -273 -324 -5 133 -351 -557 155 106 -572
5296 -572 -396 74 -150 -635 -149 205 -137 -643 -96 205 -51 -394 -38 274 -160 -480 147 409 -172 -211
5316 -211 223 305 -110 -8 538 247 -169 153 481 310 -80 161 636 230 -246 165 573 48 -281 234
5336 234 486 -141 -319 434 216 -377 -283 423 106 -408 -262 228 -50 -437 -449 108 -132 -587 -226 315 -142
5357 -142 -528 3 234 -347 -344 124 59 -437 -306 247 200 -260 -195 507 205 -253 -82 570 188 -377 122 588
5379 588 144 -334 374 585 -82 -132 393 578 -10 -106 426 501 -296 -191 456 235 -543 -127 375 -52 -522
5400 -522 -93 291 -68 -489 37 364 -284 -551 -87 127 -359 -690 125 207 -532 -559 173 176 -630 -267 323
5421 323 88 -525 -165 344 24 -463 51 558 91 -357 132 612 -14 -411 307 810 -194 -331 502 508
5441 508 -161 -167 456 432 -199 -106 473 303 -260 -209 414 159 -604 -121 495 23 -647 20 406 -222 -606 101
5463 101 287 -349 -647 -153 158 -387 -501 171 252 -550 -423 204 206 -515 -367 178 297 -409 -134 275 372
5484 372 -251 -106 348 194 -371 50 770 268 -261 84 493 54 -138 304 656 -4 -236 106 477 5
5504 5 -179 296 296 -347 -494 314 236 -99 -301 55 93 -480 -526 133 77 -423 -407 -104 -63 -489 -284 260 116
5527 116 -442 -417 13 -148 -356 -16 236 53 -236 -303 57 228 27 58 433 -52 -438 -82 403 289 61
5548 61 312 377 -113 -303 182 600 420 -145 -97 168 -108 -322 397 818 100 -475 -129 200 -230 -188 393
5569 393 490 -299 -657 -293 308 -184 -240 295 199 -769 -841 174 430 -165 -192 342 -130 -961 -582 432 429 -241
5591 -241 -260 232 -66 -700 -136 1015 518 -579 -221 477 -24 -480 579 1097 102 -748 -250 571 231
5610 231 -150 533 938 -370 -933 216 846 -65 -427 584 403 -918 -818 446 655 -258 -531 356
5628 356 100 -1085 -659 763 703 -835 -643 407 -103 -1082 -154 960 131 -1198 -614 475 -191 -657
5646 -657 302 1158 -147 -1227 -67 913 48 -509 634 1011 -432 -840 738 1087 12 -311 719
5663 719 754 -646 -562 1006 1191 -354 -454 599 263 -952 -173 1349 509 -957 -552 829 136 -925
5681 -925 64 1124 79 -1211 -315 778 -196 -998 234 979 -685 -1315 101 809 -325 -745 243
5698 243 520 -758 -1097 428 870 -540 -769 548 536 -878 -510 1008 729 -765 -396 884 332 -682
5716 -682 -64 1114 440 -845 -265 1034 291 -727 209 1136 -72 -1097 124 980 1 -658 241 720
5734 720 -397 -973 255 851 -333 -665 135 495 -704 -775 504 541 -712 -729 263 350 -794 -459 532
5753 532 364 -747 -708 418 303 -610 -350 737 171 -777 -252 728 227 -529 1 760 72 -468 109
5772 109 761 231 -328 216 829 -17 -513 277 863 -64 -373 329 521 -120 -432 384 580 -109 -421 235
5792 235 519 -148 -600 261 518 -409 -663 353 325 -600 -407 278 263 -430 -699 364 239 -624 -479 412
5812 412 395 -670 -426 450 354 -564 -131 660 168 -486 -186 623 183 -579 65 792 101 -688 151 812
5832 812 80 -650 301 820 -196 -620 295 765 -81 -560 202 521 -420 -667 513 709 -609 -813 295
5851 295 386 -725 -501 600 287 -872 -545 548 166 -838 -334 657 41 -1055 -308 820 139 -999
5869 -999 -25 652 -316 -944 146 974 -179 -630 210 768 -315 -571 546 903 -293 -619 623 735
5887 735 -583 -246 973 701 -701 -323 794 350 -415 151 762 73 -717 -95 927 169 -801 -41
5905 -41 692 -253 -927 54 689 -297 -698 141 112 -663 -629 341 345 -677 -732 204 196 -691 -332 565 78 -753
5927 -753 -326 460 -38 -415 237 562 -126 -519 92 495 98 -415 328 673 -210 -377 628 672 -70 -208
5947 -208 377 309 -329 90 719 413 -210 57 281 132 -208 19 459 55 -456 -140 206 -226 -192 174 38
5968 38 -252 -328 149 -26 -201 -136 110 -34 -433 -195 130 38 -332 -155 255 -279 -263 163 137 -91 -114 236
5990 236 261 -169 -83 311 171 139 1 221 111 -52 114 438 34 -26 365 509 -228 -135 375 176 -292 -125
6012 -125 174 57 -106 -122 206 170 -279 -95 243 -208 -479 -22 189 -366 -415 184 157 -420 -287 56 46 -297
6034 -297 -385 155 24 -478 -191 206 -20 -472 -32 350 5 -390 98 336 -170 -218 272 279 30 4 368 280
6056 280 -87 -238 469 354 -176 -163 345 276 -375 -46 507 -27 -352 -41 462 -196 -229 113 237 -215 -374
6077 -374 145 238 -298 -573 248 111 -373 -331 182 48 -391 -176 341 -72 -314 -7 230 33 -306 107 412
6098 412 98 -318 224 500 -29 -236 474 590 -148 -54 587 354 -176 86 452 386 -91 -25 579 409 -287
6119 -287 52 577 172 -460 92 408 22 -461 117 384 -221 -357 86 372 -354 -497 -99 152 -431 -720
6139 -720 35 -2 -583 -425 140 -128 -765 -295 143 -55 -547 -200 269 -39 -531 -135 403 -62 -457 35
6159 35 455 -194 -446 223 407 -124 -289 232 392 13 -200 329 575 61 -304 452 401 -213 -16 366 378
6180 378 -221 -130 396 208 -213 16 393 113 -334 -165 272 117 -438 -67 282 -143 -554 -241 259 -166
6200 -166 -410 -35 123 -277 -471 50 214 -51 -441 -146 246 -184 -420 164 497 -93 -319 265 248 -233
6220 -233 -171 233 297 -172 -249 147 359 -61 -166 409 380 -263 -256 512 306 -131 43 358 113 -402 -166 474
6242 474 238 -279 -179 346 39 -567 -97 574 61 -663 -112 389 -183 -390 28 395 -135 -561 -183 412
6262 412 -167 -371 127 489 -211 -601 267 753 -82 -364 472 369 -395 -482 534 804 -153 -529 432 412
6282 412 -433 -302 892 663 -440 -308 516 204 -484 -5 877 206 -759 -285 595 293 -657 63 711
6301 711 -189 -1259 -147 833 -53 -790 176 547 -486 -1008 111 794 -209 -1019 68 404 -666 -726
6319 -726 576 884 -635 -877 405 451 -663 -381 1032 619 -833 -648 802 533 -611 -25 1186
6336 1186 206 -1116 -382 1159 350 -773 120 1082 -153 -1268 208 1253 175 -957 153 740
6352 740 -591 -1085 463 1212 -570 -1125 220 584 -761 -846 766 704 -1032 -1002 513 425 -876 -641
6370 -641 923 396 -1252 -762 888 213 -1168 -338 1039 -61 -1358 -223 1115 229 -890 183
6386 183 1075 -209 -1016 313 1430 36 -952 492 1130 -330 -562 940 1208 -365 -546 761 892
6403 892 -484 -522 996 1022 -475 -667 1013 576 -790 -278 941 432 -941 -323 837 187 -964 -152
6421 -152 1003 131 -993 -321 787 -172 -998 54 1000 -202 -1233 39 785 -310 -835 428 617
6438 617 -598 -929 107 836 -288 -569 520 510 -834 -882 717 710 -326 -644 443 132 -619 -405 837
6457 837 587 -641 -714 405 137 -775 -48 1068 273 -919 -483 529 201 -623 203 589 -275 -1093 -280
6476 -280 632 124 -537 63 434 -472 -1068 257 943 -2 -568 108 279 -465 -585 479 851 -206 -696
6495 -696 -6 467 -371 -433 932 861 -614 -927 471 777 -434 -163 708 359 -716 -541 610 747 -403
6514 -403 -92 660 7 -1043 -182 969 389 -648 -218 649 -304 -928 94 1032 13 -857 -266 419
6532 419 -244 -685 389 974 -477 -1120 191 744 -430 -665 746 643 -800 -903 668 769 -263
6549 -263 -318 813 357 -769 -355 1041 679 -762 -131 894 -16 -853 16 1198 368 -680 -76 873
6567 873 44 -707 413 1067 -106 -859 299 879 -332 -707 666 678 -797 -848 411 721 -544 -595
6585 -595 378 355 -756 -691 595 300 -796 -344 481 -125 -1035 -119 758 30 -849 -161 591 -177 -710 241
6605 241 733 -326 -776 177 550 -307 -461 575 617 -502 -476 669 646 -236 -158 534 402 -367 -6 679
6625 679 304 -311 124 526 134 -388 209 566 92 -450 120 391 -201 -317 35 182 -189 -388 -36 133
6645 133 -360 -234 49 -21 -614 -237 149 -32 -379 -188 102 -145 -324 -305 -54 -38 -191 -53 0 -182 -239 -87
6667 -87 131 -132 -221 100 83 -187 12 53 75 -99 -45 48 -3 150 178 97 -50 -38 160 149 -148 -73 175 89 -100
6692 -100 106 223 -26 40 369 50 -135 5 46 80 -180 -70 16 132 -32 -47 181 92 -11 55 231 -86
6714 -86 -225 305 359 -103 -45 177 419 23 -163 170 259 74 63 119 137 -55 56 428 9 -226 122 343
6736 343 58 -245 16 243 -9 -240 18 103 -76 -121 171 205 -240 -246 134 60 -444 -385 216 -75 -435 -254
6758 -254 77 21 -341 -382 -17 -59 -283 -134 190 -96 -339 27 271 -245 -382 175 164 -161 -186 187 234 -199
6780 -199 -80 291 148 -86 5 445 37 -246 -81 542 137 -316 96 308 58 -148 89 202 63 -222
6800 -222 102 207 -242 -309 229 203 -289 -329 63 59 -372 -259 180 -10 -375 -166 300 19 -448 -196 63 -70
6822 -70 -450 -28 324 -168 -455 103 266 -74 -315 119 243 4 -204 121 258 -62 -197 284 434 -167
6842 -167 -89 440 351 -210 158 310 275 -402 30 441 103 -136 58 413 17 -228 121 336 64 -411 -13
6863 -13 385 -103 -342 128 304 -304 -290 60 162 -340 -244 238 -63 -314 -427 240 227 -294 -258 90 -51 -446
6885 -446 -191 320 17 -431 -115 234 -38 -381 -36 375 234 -253 -34 368 0 -327 186 679 42 -325
6905 -325 -25 333 35 -159 269 471 -31 -345 66 343 -13 -208 158 402 -307 -406 166 290 -31 -155
6925 -155 202 130 -497 -362 166 405 -177 -373 189 131 -455 -197 471 234 -379 -269 280 92 -329 -32 555
6946 555 295 -380 -161 289 113 -348 -27 549 -59 -687 -132 427 -25 -262 211 504 -303 -631 61 466
6966 466 -75 -442 113 372 -411 -651 315 586 -352 -529 133 215 -565 -512 290 474 -538 -598 268 234 -564
6987 -564 -493 648 340 -756 -371 478 68 -484 -58 668 112 -835 -212 807 166 -491 194 856 -8
7006 -8 -858 305 960 42 -541 424 975 -280 -783 467 913 -78 -485 596 651 -562 -690 772 933
7025 933 -583 -558 655 428 -776 -358 991 424 -993 -480 709 202 -827 -197 999 110 -1307
7042 -1307 -342 676 -136 -897 182 944 -379 -1229 51 942 -224 -784 278 732 -703 -1110 422
7059 422 1066 -417 -753 625 606 -853 -536 1169 948 -693 -509 570 345 -737 -147 1259 489 -899
7077 -899 -439 850 59 -808 253 1169 -118 -1174 -130 1015 -11 -793 326 774 -639 -1194 155
7094 155 1005 -301 -833 384 519 -909 -915 571 812 -570 -772 323 185 -885 -404 796 522 -724
7112 -724 -617 468 131 -772 -2 1111 231 -902 -376 788 263 -507 143 854 41 -981 -120 934
7130 934 213 -497 295 619 -460 -782 415 979 -48 -558 213 580 -303 -512 488 797 -275 -627
7148 -627 407 478 -537 -405 637 572 -675 -667 546 350 -552 -168 560 398 -757 -487 624 397 -557
7167 -557 -203 707 -12 -812 -134 768 295 -534 63 527 -116 -652 75 1061 296 -680 -78 642 -34 -510
7187 -510 350 829 -241 -771 127 579 -316 -477 477 680 -609 -1036 327 636 -384 -494 492 381 -698
7206 -698 -598 574 426 -665 -473 488 -16 -974 -417 711 234 -925 -310 644 167 -902 12 1043
7224 1043 10 -805 8 803 -66 -653 385 922 -226 -726 350 961 -253 -575 464 903 -576
7241 -576 -716 659 792 -371 -404 750 449 -774 -285 905 480 -734 -302 628 192 -901 -75 931
7259 931 85 -772 -124 554 -141 -745 201 664 -353 -968 136 526 -433 -771 245 608 -534 -912 325
7278 325 665 -476 -417 476 326 -660 -329 753 259 -546 -267 552 164 -581 -58 791 264 -730 -198 631
7298 631 -33 -571 202 694 -259 -406 151 526 -89 -386 320 499 -314 -498 249 446 -144 -302 264 230
7318 230 -426 -279 479 96 -457 -104 303 36 -440 -155 490 -30 -491 -240 484 9 -284 -11 306 -153
7338 -153 -185 81 319 -134 -61 193 139 -78 -357 137 251 -92 -122 240 77 -229 18 198 82 24 47 119
7360 119 73 -65 30 -7 -26 -47 -126 125 22 -177 -152 -22 -76 -13 19 -186 19 5 1 -60 -55 54 -188 28 20 -114
7386 -114 -75 16 0 -74 -161 -91 54 7 -142 -148 122 57 -12 41 184 8 25 60 120 -115 -107 189 94 44 -107 124
7412 124 225 -40 -229 177 156 -118 -37 234 66 -50 -42 121 -30 -154 -35 193 -132 -254 -85 194 -71
7433 -71 -257 -12 149 -126 -242 59 149 -265 -97 41 -28 -244 -146 112 87 -130 -120 212 129 -237 -138 101 114
7456 114 -58 -10 300 42 -182 88 170 -76 5 166 302 -16 -171 203 118 -123 -238 158 82 -188 -45 106
7478 106 19 -268 -177 226 61 -197 -73 178 -69 -179 -61 178 71 -248 -43 189 -165 -303 8 71 -163
7499 -163 -295 134 156 -158 -157 96 221 -93 -91 249 94 -87 -44 427 166 -160 83 336 113 -139 -7 134
7521 134 82 -220 33 203 45 -28 218 229 44 -284 143 143 -182 -190 116 175 -129 -154 154 21 -126 -111 202
7544 202 57 -223 -271 133 102 -266 -99 84 -21 -285 -11 342 -13 -212 -39 206 -13 -281 99 308 -48
7565 -48 -344 32 342 -125 -263 276 247 -138 -81 307 209 30 -154 311 162 -68 -247 166 202 -144 -165 184
7587 184 81 -356 9 204 15 -134 -82 226 -67 -376 39 326 9 -317 -243 237 -56 -211 -117 182 -71
7608 -71 -242 -70 166 -132 -262 203 145 12 -422 46 333 -30 -183 241 326 -75 -261 242 270 -57 -231
7629 -231 229 188 -125 -197 295 398 -49 -172 105 273 -243 -314 481 224 -273 -161 277 87 -259 -50 348
7650 348 68 -457 -239 202 44 -392 -147 294 -138 -617 -142 363 -134 -443 95 243 -178 -564 116 513
7670 513 -207 -560 161 348 -430 -439 402 327 -286 -442 324 296 -492 -231 488 474 -336 -341 555 340 -438 -154
7692 -154 626 305 -528 -14 723 95 -702 26 782 57 -515 -126 763 36 -518 104 578 -234 -668 343
7712 343 677 -227 -589 373 375 -499 -562 460 506 -500 -425 522 475 -561 -524 712 491 -730 -211 565 306
7733 306 -587 -6 836 150 -820 -47 740 208 -525 60 769 136 -714 146 764 -22 -720 295 671 -363
7753 -363 -532 346 667 -366 -519 410 504 -649 -569 631 523 -653 -548 451 262 -760 -332 649 222
7772 222 -781 -328 471 7 -714 -72 614 180 -804 -135 650 59 -563 176 698 -278 -683 271 692 -76
7792 -76 -513 444 580 -421 -569 434 777 -85 -402 396 481 -535 -379 637 396 -446 -376 392 162 -417
7812 -417 -167 699 311 -717 -389 458 298 -472 -143 551 -114 -780 -138 502 25 -451 85 436 -273 -697
7832 -697 144 759 81 -628 50 490 -296 -481 316 639 -229 -422 102 382 -291 -151 564 564 -397 -577 173
7853 173 596 -193 -196 589 500 -549 -446 464 695 -266 -152 485 181 -513 -202 694 545 -433 -229 435 67
7874 67 -673 -67 629 141 -621 -194 360 -123 -534 158 553 -232 -821 -20 513 -219 -608 185 568 -474
7894 -474 -712 262 609 -302 -379 247 283 -578 -475 482 387 -520 -386 497 306 -592 -264 785 449 -603
7914 -603 -303 630 276 -517 -33 614 -26 -710 21 715 27 -644 75 743 -145 -821 329 752 -282
7933 -282 -676 286 487 -293 -448 312 456 -525 -459 541 418 -517 -397 671 314 -649 -280 550 355 -604
7953 -604 -200 554 44 -630 -81 687 15 -585 68 619 -205 -641 185 606 -340 -695 218 373 -315 -538
7973 -538 290 337 -256 -421 293 451 -426 -372 454 246 -608 -271 503 135 -569 -217 312 210 -373 -213 378
7994 378 22 -495 -47 426 -102 -467 151 372 -100 -433 137 397 -141 -357 284 203 -201 -198 208 333 -69
8015 -69 -141 234 237 -192 -2 472 332 -168 -18 490 211 -3 -23 335 272 -138 -55 212 86 -158 31 113 33
8038 33 -140 50 242 71 -127 -34 99 -65 -194 39 -8 -47 -69 27 77 -182 -197 6 50 -169 -145 88 -41
8061 -41 -323 -110 93 103 -115 -90 22 94 -93 -46 19 32 -11 -67 16 118 -58 -42 169 32 17 -16 214 78
8085 78 90 -55 -7 201 17 -166 82 81 -31 -24 95 -60 -85 -181 -52 -89 5 -137 -86 99 -220 -176 -108 14 -279
8110 -279 -123 56 -40 -165 -88 -32 -125 -160 -76 87 -7 -296 -36 38 -177 -133 5 117 -100 -139 68 96 137 -3
8134 -3 133 105 -1 -119 188 205 -77 -103 246 76 -177 61 264 162 -63 39 162 61 18 -77 173 81 -193
8157 -193 92 197 -29 -57 30 252 -206 -133 68 89 -11 -138 13 69 -46 -22 210 13 -162 -7 25 104 -102
8180 -102 45 178 -104 -172 33 96 70 -73 67 32 -4
8191d
$$ Imaginary data points
##PAGE= N=2
##DATA TABLE= (X++(I..I)), XYDATA
0 0 0 0 0 0 0 0 0 0 0 0 0 0 4 0 6 -8 8 -8 8 -11 14 -14 16 -21 22 -25 29 -31 37 -39 44 -50 54 -60 68 -76 84
37 84 -92 102 -112 126 -139 153 -171 188 -208 231 -261 298 -336 386 -447 527 -636 782 -1003 1361
57 1361 -2008 3419 -7729 45587 226603 40577 -159182 -24311 100690 -46498 -120784 61338
69 61338 132472 -53266 -123206 26624 38976 -118703 -68677 145997 90707 -170760 -163188
80 -163188 68515 75953 -96543 -63391 87702 13234 -154455 -87039 69166 17993 -83959
91 -83959 4368 75669 -80573 -181656 2897 152621 5194 -134694 -19064 73067 -52186
102 -52186 -114444 36651 113281 -15067 -82806 7475 22254 -67710 -21390 124637 78777
113 78777 -102993 -89697 75747 73146 -54330 -19231 106235 54555 -82931 -53241 62727
124 62727 53248 -7026 31446 60308 -32138 -83597 27301 109298 19149 -58690 14625 63948
136 63948 -25351 -73870 22473 88973 20023 -45374 -18849 3611 -21758 -7336 49342 33887
148 33887 -46334 -53062 16469 22387 -36710 -24713 45983 33428 -52479 -67139 2108 36824
160 36824 6742 -11699 -1007 -11031 -33813 -13626 27148 18502 -15697 -4483 21650 -5605
172 -5605 -40579 -4236 54850 41817 -18460 -31098 9050 27187 7472 6215 30441 24827 -8181
185 -8181 -7346 20670 18403 3040 24610 43790 5151 -36508 -5037 50372 36962 -13910 -9036
198 -9036 29209 13450 -28147 -7426 38083 20101 -19650 -5059 14315 -17335 -30147 19519
210 19519 40978 -16133 -51664 -4118 29560 -14994 -42248 8329 33997 -22052 -51951 -3073
222 -3073 19717 -20030 -24007 18414 7526 -46385 -33744 26400 19106 -36524 -26025 27994 11156
235 11156 -47110 -27689 35151 20621 -32795 -15470 24826 -3396 -35791 5423 40487 -2131
247 -2131 -36476 4670 33796 -9523 -33623 17733 45143 -7627 -37264 10048 33168 -9200
259 -9200 -18386 26402 26479 -22380 -20170 26451 21891 -19621 -8626 32523 15448 -31087 -15241
272 -15241 32292 18727 -23275 -7319 26714 1997 -29773 -900 28338 -202 -24557 2463
284 2463 18573 -13165 -27957 6828 23679 -10697 -29173 774 12695 -17631 -23497 9320
296 9320 11310 -21623 -22999 4233 568 -22097 -12654 10260 -1356 -26448 -17800 6276 -627
309 -627 -20419 -9778 8707 -5430 -23828 -8207 8958 -3631 -13713 403 6403 -8433 -12375
322 -12375 3791 11171 77 -4823 6251 10083 -1030 -2134 13669 17200 4985 4080 14388
335 14388 12556 5722 12515 21385 17094 10274 12337 16948 16210 13936 17310 21677 17482 10209 12785
350 12785 18169 15448 12897 16459 15468 9040 7570 10020 9644 8799 8183 5629 3535 1633 -461 -108
366 -108 1323 -580 -3298 -4470 -7306 -9052 -7353 -7071 -8987 -8730 -9595 -14345 -14822 -11257 -11545 -12880 -11309
383 -11309 -11872 -15215 -15563 -12984 -11079 -10180 -10696 -11356 -10444 -11034 -11752 -7644 -3588 -6454 -8325 -4471 -4030
400 -4030 -6894 -3949 1274 466 -2121 -1403 155 586 516 1595 4843 4839 640 517 4652 3806 1255 4930
418 4930 6945 2177 -192 2959 3550 1706 2622 3809 2089 -1051 -2175 485 2129 -1179 -2145 1072
434 1072 -914 -6884 -4619 1000 -1363 -5652 -3383 -1802 -5460 -6469 -2765 -895 -3671 -5278 -2714
449 -2714 -1120 -4999 -5886 1107 3133 -3738 -4553 2798 1943 -3871 177 7199 3556 -1802 2336 7193
465 7193 3558 -435 5787 12237 5586 -2260 4922 13115 5741 1 9448 13237 2408 -163 10190
480 10190 10990 1495 2578 12380 9136 -3218 -955 12848 11115 -4042 -2010 12396 7250 -7943
494 -7943 -1268 12758 4050 -7843 1872 10352 -2875 -11141 4361 13589 -3038 -13990 2288
507 2288 12520 -5796 -14933 5329 13312 -7754 -14530 4680 6391 -11565 -7613 11715 3724
520 3724 -18760 -10871 12488 4553 -18604 -9283 14606 2517 -23504 -11138 13593 1511 -17859
533 -17859 -3646 9359 -10589 -21035 3407 14460 -10567 -21334 4132 13069 -14812 -23208
545 -23208 8459 19633 -10450 -21105 4124 9379 -12040 -7531 16584 7758 -18046 -8075 16884
558 16884 6237 -16023 487 26520 7919 -23295 -8022 23890 14196 -8805 3183 17604
570 17604 -1603 -13611 9948 22452 924 -7530 13356 15199 -12836 -15864 18561 29471 -2781
583 -2781 -19222 2475 11562 -6564 -6230 13884 9876 -12445 -11415 2613 -3726 -13475 2796 17950
597 17950 -3182 -31637 -20564 9270 8065 -12353 -10423 2176 -7838 -22994 -13604 3249 2530
610 2530 -3852 -3682 -9116 -21372 -17621 6819 19286 766 -19738 -11864 3892 -820 -8458 4721
624 4721 18920 8385 -11728 -13979 405 12577 16111 15295 8111 -7033 -11806 7186 24233
637 24233 14102 842 10865 17809 -3237 -17583 6722 36292 25815 -4760 -10257 2904
649 2904 3481 1581 18202 25243 -516 -17653 1253 11732 -8528 -7682 27281 28855 -20071 -41007
663 -41007 -1275 27623 5451 -11088 7020 6410 -25886 -23961 15301 18115 -13527 -7027 19225
676 19225 -7495 -47385 -13493 44982 25225 -32995 -26174 15961 2910 -29346 -1365 37062
688 37062 6481 -33595 -8327 17619 -14460 -23794 30785 43252 -26128 -54158 8822 41653
700 41653 -7603 -27945 21486 31122 -27902 -39835 17953 30967 -14161 -10687 29556 1472
712 1472 -52850 -16073 53648 25358 -42922 -21179 34784 4875 -47899 -9362 49129 14436
724 14436 -40891 -13241 22880 -13420 -32230 26031 44949 -26870 -54826 14083 41038 -21570
736 -21570 -37520 29895 41772 -31532 -49254 17807 35652 -16021 -16377 30553 9082 -47681
748 -47681 -16662 49492 20671 -41679 -10762 44788 4274 -53427 -8644 55338 19203 -39449
760 -39449 -11377 28932 -5542 -30748 19463 42272 -16615 -40956 16572 34418 -23461 -31895
772 -31895 33965 42467 -28031 -44581 17702 35742 -12389 -17923 25256 16153 -31756 -16120 34097
785 34097 17447 -27103 -3003 37902 3253 -42699 -5825 47284 19762 -29546 -9808 26867
797 26867 3926 -23461 7815 33831 -245 -24362 7557 22169 -13433 -19869 25068 32849
809 32849 -17715 -34008 9690 27663 -6900 -18715 12741 16909 -17717 -21225 11248 12765 -14047
822 -14047 -7588 16305 -610 -31259 -12654 23994 11923 -23547 -16734 12196 3701 -22636 -11461
835 -11461 16378 7098 -17818 -10690 6222 -5009 -15013 5358 18113 -6035 -23928 -2571
847 -2571 17177 359 -15988 2620 19097 -1251 -20195 -1823 17607 4940 -7173 5564
859 5564 10130 -7533 -10268 12431 18567 -3408 -10824 9401 14683 -7811 -12759 13209 20937 -4393
873 -4393 -14438 5358 11300 -5538 -5496 12293 8704 -12170 -9842 10343 7173 -12461 -6469 14912
887 14912 6224 -19679 -12734 13624 8484 -14220 -7713 10514 -139 -17356 -4482 13114 525
900 525 -15646 -1966 12270 -4801 -18973 2158 18642 -2770 -19432 937 15011 -4674
912 -4674 -14226 6780 14392 -6663 -13088 7501 12051 -7964 -9173 12654 12182 -11991 -10972 13648
926 13648 12118 -11367 -7576 14375 8179 -12809 -5584 13757 5771 -11403 -2349 12997 1757
939 1757 -13767 -659 15034 1005 -14063 532 13957 -2028 -13551 2985 13141 -3038
951 -3038 -11321 3774 10148 -4699 -9136 6228 10020 -5836 -8847 7650 9214 -7149 -6976 9665
965 9665 7980 -7800 -5004 9323 5723 -7190 -2566 9393 4161 -7590 -2283 8973 3214 -7715
979 -7715 -903 9306 675 -8889 -89 8454 -610 -7551 737 5933 -2440 -7312 964 5253 -2891
994 -2891 -7182 702 4189 -4288 -6859 2410 3791 -5526 -6312 2522 2272 -5214 -4310 2617 1781 -4906
1010 -4906 -3957 2679 2212 -4092 -2884 3753 2153 -4391 -1733 4544 1683 -3319 -31 4356 1183
1025 1183 -2535 625 4391 1861 -1774 491 4042 1268 -2113 1501 4467 128 -2555 1440 3281
1040 3281 -714 -1777 1399 1906 -1515 -2492 427 1758 -1483 -3145 65 991 -2611 -3127 554 83
1056 83 -3238 -2617 140 -790 -2676 -1663 15 -615 -2000 -1565 352 80 -1711 -749 1375 445 -1166
1073 -1166 515 1823 390 134 1665 1800 900 1004 1533 1775 1752 1204 1402 2327 1456 737 1795 2090
1091 2090 1149 828 1381 1083 857 1066 427 14 760 -23 -623 73 118 -1134 -923 -304 -823 -1496 -1257 -971
1111 -971 -970 -1480 -2000 -1104 -505 -1766 -2258 -627 -684 -2030 -1301 82 -1151 -1825 118 625 -814 -1196 280
1130 280 1153 -87 -969 602 1971 555 -850 1485 2125 -208 294 2768 1287 -1005 1066 3381
1146 3381 1007 -1219 719 2781 1097 -1122 67 2137 216 -1625 875 1734 -1932 -2122 2095
1161 2095 1016 -3950 -2442 2713 742 -4366 -2904 1529 483 -3479 -2127 1489 -574 -4017 -599
1176 -599 2830 -2040 -4695 1728 4168 -3149 -4978 2997 4995 -2039 -3520 2995 4212 -1748 -1682 4556
1192 4556 3509 -2783 -44 7021 2328 -5485 1041 9635 2466 -6386 136 8120 1525 -4877 1411
1207 1411 6374 -721 -4973 2124 4758 -3822 -4840 5378 5043 -8407 -7920 6021 5399 -7786 -7059
1222 -7059 4582 2521 -8233 -5262 4521 636 -7611 -2303 4902 -3156 -10551 764 9830 -2492
1236 -2492 -11979 329 9223 -2489 -9290 2732 8573 -2024 -6423 2997 5071 -3546 -2240 9085
1250 9085 5672 -8294 -4688 10903 7739 -7134 -3025 10642 5429 -7699 -2965 8485 4744
1263 4744 -3491 989 5487 -2565 -6866 4207 10082 -2554 -9510 2353 8038 -4563 -9469 3312
1277 3312 8420 -2898 -8187 -1093 1321 -3290 -1569 4175 -69 -8571 -4803 4637 1300 -7576 -2707
1292 -2707 6962 1532 -9385 -6076 4019 4475 -727 -1489 -535 -2231 -2308 2087 4051 246 -1846 2013
1308 2013 3019 -3021 -4378 3635 8969 3095 -4486 -4287 1089 4542 2998 331 801 1678 -777 -2400
1324 -2400 -146 2077 2481 2908 1564 -3794 -6838 -813 7373 5672 -4110 -6305 1132 2836 -4493
1339 -4493 -4072 5933 6463 -3808 -6616 -358 179 -1862 4431 8600 -1764 -11258 -2110 10034 3456
1354 3456 -6604 2290 12106 -589 -13300 -1322 13284 5503 -3635 3241 4822 -7646 -7062 11278
1368 11278 13643 -5147 -8606 8046 7566 -11889 -8963 15624 14788 -10291 -13172 5251 4295 -9400
1382 -9400 -301 14360 288 -18591 -6019 11501 -1228 -15124 2997 17205 -6568 -26021
1394 -26021 -4169 16888 418 -13980 2305 8518 -13405 -17499 8433 14596 -8828 -11841 9770
1407 9770 6025 -19686 -12579 20278 17597 -14676 -14792 10816 6818 -13938 -1873 21116 6824
1420 6824 -17287 -4800 14902 724 -13010 8884 23728 -3480 -24186 679 21721 1471
1432 1471 -12944 8249 16685 -9894 -18439 8395 16805 -5778 -8869 11606 6334 -19732 -12472
1445 -12472 18803 15187 -14789 -12877 11368 4445 -18543 -6406 18874 7199 -16939 -7677 9576
1458 9576 -2667 -14291 5590 18740 -4498 -21383 -699 15904 -2122 -13177 7795 16651
1470 16651 -7372 -17370 5139 14960 -2358 -5970 10666 8073 -12215 -8455 14757 13390 -7784
1483 -7784 -5936 12598 6962 -12766 -5127 16499 10761 -8987 -4970 9000 1642 -9142 2242
1496 2242 13636 998 -12079 -1318 9517 -1600 -10420 3189 12280 -3046 -14382 -1354
1508 -1354 8676 -1821 -7934 2605 5375 -6711 -9769 2536 5923 -4882 -6569 4374 4393 -8793
1522 -8793 -8993 5878 7771 -5319 -6984 4108 4005 -6307 -4544 6213 5141 -4739 -3638 4803
1536 4803 2218 -6165 -1451 8907 3977 -7573 -3703 6996 2898 -5983 -865 7862 2009 -7011
1550 -7011 -2363 5625 1370 -5099 716 6431 -1507 -8684 -62 7599 -554 -7175 1152 6287 -3139
1565 -3139 -8548 1100 7008 -1140 -6454 1051 4536 -3762 -6223 4016 6953 -3753 -6369 3863
1579 3863 4957 -5026 -4180 6966 6082 -5128 -5034 5157 5007 -3884 -2059 7143 3656 -6673 -2805
1594 -2805 7579 3492 -5936 -569 7587 415 -7984 -428 7997 1079 -6757 -616 5535 -1879 -7711
1609 -7711 969 6803 -2570 -8266 725 4485 -4793 -6964 3097 4720 -5763 -7432 2269 3671
1623 3671 -5065 -4951 3969 3172 -6370 -5091 4966 3595 -5248 -2447 5867 1855 -5952 -830 7379
1638 7379 3024 -4213 397 6654 1918 -3553 2191 8146 2168 -3619 2467 7486 1232 -2421 4570
1653 4570 7346 -355 -2956 4077 6065 -252 -1907 4144 4693 -2157 -3054 3675 4248 -2773 -2723 3319
1669 3319 1905 -4490 -2608 3422 1130 -4706 -2746 1901 -579 -4979 -2186 2217 -737 -5588 -2590
1684 -2590 1841 -1421 -4932 -867 2076 -2413 -4827 -573 1976 -1704 -3408 461 1753 -1962 -3238
1699 -3238 1149 2580 -1282 -2175 1733 2144 -2047 -1382 2954 2034 -1583 -788 2274 1280 -1503 -286
1715 -286 2544 1243 -1739 -873 1841 608 -1968 -191 1777 -491 -2517 -497 860 -1159 -1940 -276
1731 -276 192 -1549 -2238 -674 174 -1481 -2029 -454 -118 -2053 -1788 183 69 -1629 -1087 237 -359
1748 -359 -905 -93 523 133 -249 -96 622 589 134 672 1305 826 362 1058 1316 821 1239 1590 927 1124
1768 1124 1486 1360 843 1171 1563 1131 730 1007 1112 800 545 821 1103 334 -63 830 1109 -366 -175
1787 -175 1047 587 -851 -207 1029 208 -807 54 800 -64 -780 202 1084 -62 -1034 578 1555 -369
1805 -369 -1111 1055 1590 -656 -810 1600 1173 -619 -145 1481 662 -728 158 1696 438 -1426 18
1822 18 1997 128 -2076 8 1762 -648 -1981 223 735 -1593 -2101 124 -25 -2411 -2086 437
1838 437 -377 -3253 -2574 663 -398 -3666 -2351 663 -1012 -3412 -1195 631 -1917 -2988 112 929
1854 929 -2171 -2597 1032 1555 -1983 -2309 1839 2273 -1546 -1303 2678 1918 -1319 525 3664 1017 -1527
1871 -1527 1897 4359 731 -1668 2213 4593 685 -1833 2260 4318 43 -1611 2441 3000 -1478
1886 -1478 -967 3421 1563 -3125 -1039 3499 826 -4239 -1446 3258 189 -4786 -1901 2296 -865
1901 -865 -4338 -460 1799 -2992 -4813 760 1805 -4008 -4350 1930 1924 -4379 -4250 2155 2472 -3180 -3051
1918 -3051 2215 1030 -3430 -674 4189 702 -3717 701 4679 -323 -3747 2158 5944 470 -3575
1933 -3575 1388 4859 380 -1693 3112 4052 -1158 -1769 3806 3177 -2353 -401 5269 2274 -4333 -1726
1949 -1726 4494 2658 -2571 -845 2942 248 -3365 -120 3218 -362 -2672 872 1950 -3096 -3747
1964 -3747 2474 4016 -1794 -3844 308 1462 -1698 -1437 1936 1645 -1547 -1460 840 115 -1286 1593
1980 1593 3750 -172 -3533 -525 2820 1351 -466 1024 1582 -213 -1268 -78 1257 1268 1392 1205
1996 1205 -995 -2752 -629 2348 1750 -538 -785 -655 -1499 -1270 100 77 33 293 -1086 -3712 -3206 634
2014 634 2042 -523 -2431 -1709 -1313 -2464 -1307 1323 672 -2034 -1473 -57 -2376 -3146 1900 4462
2030 4462 -744 -4775 -1249 2068 -515 -1557 2573 3277 -1852 -3418 1216 2294 -1424 253 5056
2045 5056 1756 -5602 -2904 5095 3363 -2852 -647 4120 45 -5519 -907 5180 1270 -3617 526
2060 526 3074 -3654 -5759 3291 6442 -2629 -6199 1639 3575 -4446 -4676 4499 4791 -4341 -5140 2739
2076 2739 2036 -4790 -1035 7082 2016 -7512 -2372 6845 2036 -5543 1083 8256 544 -7077 506
2091 506 7784 1223 -3669 3814 6856 -2554 -5421 5387 8340 -2028 -3975 6324 6085 -5036
2105 -5036 -4087 7462 6791 -3988 -3300 5615 2733 -5865 -1440 7651 2250 -7185 -1953 6065 -445
2120 -445 -7971 208 7408 -1520 -9014 -1255 4935 -2605 -6863 1372 4601 -4632 -7767 1523 3944
2135 3944 -4794 -5477 3953 3327 -6978 -6176 4460 3987 -4970 -3548 4531 1863 -6023 -2409 5918
2150 5918 2523 -4709 -923 5370 232 -5552 1152 7472 691 -5292 679 5466 -566 -4090 2797
2165 2797 5968 -1077 -4427 1657 4163 -1787 -2868 3776 3757 -3810 -4410 3031 3293 -3271 -2572 3305
2181 3305 1652 -4761 -3184 2936 1930 -3316 -1982 2146 -257 -4579 -1438 3665 769 -3891 -1332
2196 -1332 2623 -562 -3574 295 3836 309 -3382 -580 2641 185 -1905 1412 3457 -449 -2786
2211 -2786 899 3546 91 -1516 2030 2886 -1133 -2291 1791 3498 18 -1784 1319 2051 -1479
2226 -1479 -2011 2028 2619 -1485 -2194 1238 1096 -2425 -1725 2120 1528 -2636 -2648 957 959 -2378 -1565 1983
2244 1983 565 -3417 -1941 1951 796 -2427 -663 2292 -165 -3121 -412 3071 836 -2109 -15
2259 -15 2756 93 -2343 1079 4090 490 -2122 1140 3106 -244 -1485 2457 3679 -500 -2171
2274 -2171 1770 2951 -596 -1369 2550 2593 -1812 -2180 2236 2194 -1757 -1327 2125 853 -3066 -1716 2069
2291 2069 910 -2937 -1423 1616 -413 -3598 -1169 2239 -323 -3623 -1053 1599 -1059 -2961 234
2306 234 2161 -972 -2975 65 1834 -952 -2032 1239 2328 -1218 -2081 1413 2481 -790 -969 2329
2322 2329 1982 -1409 -847 2643 2001 -885 -424 2312 1396 -1584 -232 2710 1238 -1837 -385 1985
2338 1985 90 -2044 30 2032 -378 -2514 -711 1052 -840 -2454 -318 891 -1582 -2995 -573
2353 -573 626 -1548 -2351 -139 36 -2252 -2352 148 500 -1769 -1670 251 226 -1648 -1022 1163 868 -1233
2371 -1233 -689 1300 668 -843 350 2231 933 -550 617 2109 1096 179 1234 2310 909 -228
2387 -228 1127 2198 966 3 1486 1677 178 -149 1346 1527 83 -356 711 615 -429 -465 829
2404 829 574 -880 -849 198 -15 -1073 -597 305 -351 -1408 -680 -90 -428 -832 -311 81 -498 -965 -380
2423 -380 314 -164 -518 89 370 -376 -258 395 548 35 216 558 308 230 615 754 652 334 410 525 353
2444 353 343 471 560 116 17 235 134 -72 105 175 -261 -410 -191 -345 -688 -411 -216 -630 -922 -907 -556 -695
2466 -695 -1043 -763 -532 -825 -1194 -736 -270 -899 -856 -82 -135 -940 -621 178 23 -594 -139 520 199 -209 163
2487 163 952 575 -163 529 1243 375 -22 1059 1362 257 136 1169 1089 172 210 1087 974 46 80 857
2507 857 714 -466 -167 712 119 -882 -202 733 -423 -1210 -265 344 -830 -1278 -414 94 -974 -1338
2525 -1338 -230 -14 -1316 -1278 120 18 -1198 -790 600 117 -1167 -475 931 119 -743 163 1132 139
2543 139 -431 781 1521 168 -228 1208 1571 -37 -87 1549 1532 -148 272 1650 1206 -367 196 1574
2561 1574 608 -684 386 1343 94 -1034 295 1209 -511 -1366 167 707 -1100 -1470 73 238 -1453
2578 -1453 -1269 253 -132 -1684 -1164 533 -283 -1987 -932 863 -233 -1768 -423 1097 -409 -1514
2594 -1514 243 1239 -399 -962 823 1308 -466 -610 1357 1571 -418 -281 1822 1492 -435 20 2123
2611 2123 1185 -581 296 1894 511 -885 803 1876 119 -1210 565 1476 -394 -1263 607 1005
2627 1005 -989 -1462 309 466 -1469 -1088 569 -113 -1939 -1212 425 -459 -1811 -870 540 -506 -2067
2644 -2067 -665 764 -513 -1476 112 663 -957 -1190 592 824 -808 -627 1028 845 -628 -173 1366
2661 1366 1130 -472 83 1165 487 -367 632 1469 270 -353 631 1009 -108 -339 935 1002 -358 -699
2679 -699 326 410 -514 -284 370 -254 -1132 -679 269 -505 -971 -206 170 -937 -1289 -159 -31 -676 -582 72
2699 72 -401 -958 -548 265 31 -657 197 683 -311 -843 605 1257 40 -272 934 878 -156 260 1562
2718 1562 1119 -154 404 1442 727 -476 640 2084 545 -662 361 1516 6 -696 1067 1294
2734 1294 -761 -988 921 708 -1149 -856 1106 254 -1915 -1238 825 153 -1902 -980 847 -453 -2429
2751 -2429 -706 1091 -741 -1953 -75 908 -1335 -2094 497 1433 -980 -1685 842 1215 -1315 -1110
2767 -1110 1737 1481 -1267 -769 1855 1074 -1320 205 2552 1074 -1451 41 2379 628 -1301 880
2783 880 2575 107 -1636 680 2107 -456 -1300 1153 1655 -1309 -1796 1146 1426 -1474 -1509 1084 723
2800 723 -2291 -1756 1208 504 -2187 -1092 1103 -309 -2716 -648 1659 -148 -2392 -536 1218 -673
2816 -673 -2082 385 1897 -572 -1840 483 1521 -628 -1010 1541 1829 -894 -1082 1671 1852 -429
2832 -429 -94 2036 1311 -946 -325 1937 1494 -530 66 1728 538 -1469 94 1885 521 -1168
2848 -1168 82 1012 -524 -1628 163 1377 -495 -1761 -425 291 -949 -1499 421 694 -1402 -1736
2864 -1736 -262 116 -1210 -1035 555 170 -1528 -1223 502 533 -620 -446 856 168 -1162 -450 1337
2881 1337 885 -384 162 927 135 -631 571 1608 926 -321 256 1036 354 -134 851 1556 382 -844
2899 -844 49 837 177 -115 660 687 -610 -1161 -73 675 -82 -614 -100 -191 -1104 -1223 69 328 -603 -946
2919 -946 -360 -490 -1108 -770 332 332 -947 -1145 -87 56 -568 -267 687 218 -954 -499 770 575 -4
2938 -4 426 882 188 -451 247 1300 860 55 469 951 280 -155 727 1500 458 -284 275 690 163 -90
2958 -90 697 860 -268 -908 -23 505 -317 -494 223 26 -1393 -1228 -102 142 -831 -758 -160 -653 -1327 -833
2978 -833 251 107 -983 -901 -306 -419 -895 -84 842 -75 -1022 -403 474 217 43 692 924 -113 -665
2997 -665 301 1035 709 257 755 882 -12 -197 921 1472 450 81 638 375 -284 139 979 967 -143
3016 -143 -550 137 38 -427 -136 622 -45 -1109 -725 -48 -207 -708 -297 -34 -798 -1283 -682 66 -114 -648
3036 -648 -291 -327 -1071 -985 50 640 -179 -502 -38 25 -390 -66 851 692 56 -318 324 487 231 576 1140
3057 1140 698 -194 165 797 666 438 689 822 304 -387 282 672 501 108 241 299 -421 -578 113 430
3077 430 -254 -570 -235 -376 -745 -563 -11 -117 -637 -981 -574 -523 -773 -528 -70 -355 -875 -597 -159 -256 -457
3098 -457 -23 -6 -334 -458 50 334 130 169 326 269 21 70 511 736 472 484 710 503 104 515 627 532
3120 532 414 403 439 152 217 452 336 79 58 43 -27 -111 -115 -68 -213 -472 -349 -253 -425 -459 -261 -323 -607 -619 -503
3145 -503 -400 -693 -531 -194 -376 -716 -350 -138 -206 -366 -147 147 -164 -213 159 339 110 138 487 381 -17
3166 -17 286 701 425 281 413 681 477 133 509 764 448 121 498 587 160 31 476 421 16 -169 225
3187 225 82 -258 -299 18 -123 -551 -507 61 -340 -808 -517 25 -481 -1003 -311 -107 -586 -710 -418 -81 -413
3208 -413 -613 -88 133 -443 -585 291 242 -337 -139 511 426 -168 239 714 356 -56 433 888 443 88 581
3229 581 807 376 69 651 767 175 106 849 533 -189 -23 687 275 -505 -188 302 17 -660 -270 320
3249 320 -259 -942 -413 118 -608 -992 -238 48 -776 -960 -93 -74 -888 -776 132 -51 -736 -483 286 -49
3269 -49 -532 -151 536 86 -360 371 896 78 -397 485 919 192 -153 747 801 188 29 885 751 67 84
3290 84 838 618 -268 -30 873 258 -404 107 711 -105 -591 89 424 -432 -743 -55 112 -673 -857 13
3310 13 -64 -836 -853 66 -144 -1007 -600 133 -352 -976 -344 369 -246 -739 -89 414 -139 -499 142 603 -47
3331 -47 -259 587 683 53 -36 805 779 -75 216 856 665 137 276 933 498 -136 476 957 312 -356 306
3352 306 634 -56 -382 288 370 -320 -491 150 -65 -626 -598 35 -160 -871 -529 -84 -404 -865 -423 28 -524
3373 -524 -827 -423 13 -509 -540 96 231 -560 -513 158 215 -221 -115 444 330 -152 83 794 474 106 371
3394 371 895 394 110 604 823 279 252 706 610 49 9 551 630 -37 -80 525 148 -367 -14 504 -31 -617
3416 -617 -245 61 -491 -667 -24 48 -601 -976 -343 -52 -736 -677 11 -163 -765 -701 62 6 -598 -168 379
3437 379 -221 -534 -8 603 38 -322 386 516 -171 -238 663 893 209 18 742 711 -143 113 1059 755 -20
3458 -20 112 749 376 -218 355 881 242 -396 47 522 -5 -605 357 475 -444 -962 -124 29 -770 -611
3478 -611 122 -22 -996 -900 9 17 -726 -402 52 -310 -1007 -540 441 139 -564 -258 248 -315 -611 288 621
3499 621 -21 -305 404 437 -43 22 865 870 34 -223 564 679 12 479 1030 580 -264 107 717 527 173
3520 173 92 402 24 -559 -3 563 50 -540 -232 43 -446 -739 20 261 -480 -895 -477 -248 -629 -579 -25
3541 -25 -236 -806 -837 -106 -76 -294 -133 61 -55 -727 -318 437 203 63 100 418 20 -35 206 822 561 48
3563 48 225 415 358 211 834 867 286 28 288 305 296 395 416 283 -151 -234 50 397 208 80 57 -140 -706
3586 -706 -413 -51 82 -321 -446 -579 -701 -616 -295 62 -113 -579 -728 -550 -229 -338 47 83 -230 -542 -382
3607 -382 -115 128 155 318 76 -90 -210 170 612 601 449 306 281 139 223 672 842 564 215 117 223 120
3629 120 435 602 608 155 -299 -67 128 103 194 210 35 -448 -537 -275 32 -2 -208 -290 -608 -798 -647 -196 101
3652 101 -343 -661 -549 -587 -562 -142 71 65 -278 -467 -259 -103 -11 229 414 77 -458 -235 239 298 416 383
3674 383 378 42 -104 295 616 531 477 369 370 0 124 552 805 337 -89 126 -100 -143 67 419 252 -263
3696 -263 -430 -332 -353 -290 -153 -35 -307 -722 -632 -240 -216 -317 -237 -215 -549 -722 -430 -97 -221 -223 -69 -225 -214
3719 -214 -251 105 366 183 -183 135 261 -3 128 673 444 167 257 359 361 185 620 789 374 109 290
3740 290 434 297 269 398 489 -5 -200 128 293 -65 -118 73 -120 -389 -388 41 -87 -275 -335 -316 -405 -640 -530
3763 -530 -143 -329 -514 -417 -169 -504 -514 -113 53 -330 -262 -254 -131 -94 29 195 114 -140 -34 266 239 93 309
3786 309 491 346 186 339 453 456 393 433 518 195 93 355 408 335 85 315 159 -25 -45 218 116 -380 -100
3809 -100 -10 -193 -348 -171 -138 -403 -464 -261 -162 -582 -514 -177 -149 -669 -539 -92 -249 -430 -209 38 -196 -406
3831 -406 -155 -3 -226 28 192 354 -84 -116 243 505 218 86 546 376 61 362 747 294 93 311
3851 311 619 338 89 259 500 88 -82 191 378 -40 -307 236 202 -316 -404 124 20 -422 -333 53 -222
3872 -222 -581 -389 -142 -328 -573 -482 -154 -247 -618 -149 96 -338 -477 31 143 -262 -228 142 231 -241 -132
3893 -132 395 455 -113 117 575 456 -20 274 775 285 -25 310 864 260 -53 451 593 15 -9 459 382
3914 382 11 -226 428 334 -332 -259 315 111 -510 -372 185 -262 -661 -207 7 -394 -648 -258 -51 -578 -756
3935 -756 -180 -34 -444 -625 38 90 -439 -526 280 81 -426 -93 396 147 -235 116 642 260 -92 302 651
3956 651 274 -177 493 799 75 -18 535 712 81 -55 691 447 -107 19 593 194 -248 -27 303 56
3976 56 -526 -60 207 -220 -582 -173 230 -534 -744 -31 -17 -611 -723 -64 -123 -761 -586 -106 -206 -607 -319
3997 -319 83 -75 -626 -57 381 -29 -542 218 545 -40 -312 507 542 69 -102 565 653 21 31 688 731
4018 731 -202 15 662 540 -137 167 726 228 -149 286 500 -21 -311 105 146 -171 -368 103 191 -383 -535
4039 -535 39 2 -670 -453 141 -127 -742 -338 168 -250 -707 -178 25 -286 -627 -263 313 -283 -375 210 362
4060 362 -207 -181 404 425 -103 83 504 443 -153 181 675 424 108 280 769 340 -162 249 664 197 -157
4081 -157 376 500 -167 -220 341 300 -99 -244 211 163 -408 -334 233 24 -546 -504 117 -303 -759 -218 237 -452
4103 -452 -682 -358 33 -440 -524 -100 -15 -406 -429 36 -24 -226 -248 283 178 -269 -197 543 378 -71 261 413
4125 413 245 -141 325 566 393 121 298 439 186 14 495 636 -60 -70 388 258 -186 26 368 48
4145 48 -380 -201 106 -44 -334 -185 -108 -307 -583 -313 -53 -370 -474 -155 -177 -518 -405 63 -145 -384 -253
4166 -253 -109 -198 -183 53 235 35 -132 -62 241 61 -48 355 588 197 -24 295 463 179 380 505 464
4187 464 104 174 435 413 247 229 358 187 -63 115 457 119 -38 -108 65 -290 -210 81 -61 -297 -227 -281
4209 -281 -232 -308 -354 -73 -239 -508 -414 -330 -299 -394 -131 -130 -347 -526 -199 -132 -127 -102 98 91 -228 -38 87 272 210
4234 210 75 332 161 24 201 684 376 209 335 300 210 287 542 488 320 39 141 261 57 26 315 353
4256 353 -223 -230 -150 -135 -237 -56 116 -319 -533 -332 -227 -171 -317 -229 -233 -553 -557 -269 -95 -276 -459 -138 -93 -579
4280 -579 -386 269 31 -94 -64 67 13 -109 222 293 284 30 -121 206 369 236 461 578 298 -126 6 396
4302 396 276 240 280 261 -16 -76 154 388 199 -19 47 94 -404 -320 217 69 -208 -340 -272 -303 -418 -342 -119
4325 -119 -15 -390 -642 -409 -286 -416 -122 176 -238 -669 -326 -135 -95 103 112 216 -276 -309 5 408 164
4346 164 248 258 50 -136 -8 473 666 266 163 284 181 49 474 660 487 187 76 150 15 72 242
4367 242 491 145 -333 -278 34 -37 28 241 -21 -463 -547 -326 -141 0 -105 -130 -333 -579 -554 -101 95 -57
4389 -57 -157 -124 -363 -409 -241 236 271 21 -52 -235 -52 -1 411 507 364 -13 -141 46 254 403 512 389
4411 389 110 106 102 249 510 489 230 29 23 -199 16 304 246 54 -51 -167 -238 -66 -41 3 -21 -261 -639 -465
4435 -465 -111 -154 -390 -44 -331 -615 -398 -229 -37 -358 -192 -154 -198 -522 -235 129 152 -126 -120 141 -37 -211
4457 -211 239 618 148 -6 170 120 100 264 497 479 92 -99 219 352 161 88 574 533 -225 -159 526 186
4479 186 -130 115 343 -48 -431 -141 166 105 -345 -214 117 -408 -692 -50 149 -342 -534 -72 103 -425
4499 -425 -490 44 169 -528 -398 -22 -36 -322 -150 453 167 -443 -74 490 144 -256 273 622 111 -91 373
4520 373 514 210 -16 358 570 -23 -102 476 503 67 -115 546 321 -302 14 401 197 -476 115 325 -83
4541 -83 -512 -84 181 -201 -620 -216 178 -431 -685 -135 -17 -505 -540 -74 -57 -621 -402 119 -28 -502 -82
4562 -82 269 125 -351 -100 419 159 -337 68 451 34 -200 328 594 -7 -129 570 425 -71 105 631
4582 631 560 -21 122 569 295 -161 66 569 91 -429 71 437 -171 -380 103 193 -405 -443 32 7 -429
4603 -429 -384 -128 -144 -635 -473 120 -39 -671 -380 240 -278 -537 -135 280 -197 -549 -40 333 -169 -350 242
4624 242 459 -247 -225 407 369 -295 -38 670 360 -332 232 685 216 -170 355 750 94 -182 422 664 -100
4645 -100 -435 283 545 -198 -272 415 202 -404 -404 255 -44 -687 -325 250 -72 -583 -278 266 -235 -739 -175
4666 -175 229 -412 -798 -72 123 -491 -549 240 210 -506 -275 282 254 -338 -84 515 200 -176 62 630 254
4687 254 -201 255 819 176 -136 504 710 105 -88 514 531 -66 -27 571 363 -101 -164 415 187 -415 -163
4708 -163 513 -23 -577 -88 351 -226 -708 -145 171 -296 -700 -80 55 -421 -731 104 22 -516 -673 252
4728 252 2 -689 -187 270 64 -537 -125 396 3 -392 157 531 5 -261 99 613 12 -192 474 632
4748 632 -204 -222 601 441 -231 4 621 354 -214 107 494 305 -291 -167 440 89 -589 -9 326 -348
4768 -348 -609 -78 267 -437 -570 106 47 -536 -610 24 -33 -620 -517 155 168 -620 -426 290 72 -580 -154
4789 -154 500 247 -498 42 360 -11 -191 203 575 246 -100 378 543 176 -105 334 519 5 28 653
4809 653 378 -84 53 540 282 -176 -16 370 244 -128 -166 163 -33 -634 -187 233 -223 -464 -117 -18 -291
4830 -291 -414 -73 5 -193 -508 -269 66 -267 -469 -174 -37 -245 -252 41 164 -256 -97 185 33 -60 -76 192
4852 192 203 28 -45 269 358 124 -8 308 287 157 -17 227 298 134 121 102 255 152 -4 210 257 79 -172
4875 -172 48 21 -224 -133 39 -24 -351 -338 -77 16 -161 -327 -65 -156 -400 -398 25 -6 -416 -424 -168 -199 -536 -140
4899 -140 321 198 -254 -427 -108 43 -169 118 512 196 -490 61 493 295 -4 405 571 -128 -269 207
4919 207 780 333 -4 395 371 -204 -373 461 725 6 -207 150 -35 -505 -271 638 419 -335 -707 -44
4939 -44 -220 -520 18 545 13 -1008 -609 46 -150 -501 164 444 -524 -1092 -264 400 103 -234 214 218 -591
4960 -591 -845 201 1029 387 -354 232 173 -690 -148 965 898 -110 -236 265 128 -167 236 1219 680 -575
4980 -575 -631 282 229 -215 511 1096 -18 -996 -431 426 301 -173 268 229 -847 -1133 -159 834 135 -446
5000 -446 63 -21 -1098 -860 478 812 -242 -748 -127 -231 -718 -93 937 629 -621 -851 43 229 -236
5019 -236 436 1133 224 -835 -338 541 328 143 707 719 -199 -799 54 874 576 21 289 487 -434 -778
5039 -778 589 1014 208 -217 32 -109 -575 -312 693 650 -251 -640 -127 -270 -543 -160 608 99 -927
5058 -927 -695 -73 -201 -434 192 321 -278 -811 -481 260 272 -76 234 394 -493 -720 56 563 338 -73
5078 -73 358 146 -244 -280 412 749 328 -152 93 241 36 59 616 822 -133 -414 15 230 15 42 350
5099 350 271 -256 -446 144 246 -42 -273 121 14 -677 -476 185 110 -319 -323 -138 -229 -629 -311 148 55 -323
5121 -323 -457 50 9 -436 -118 556 205 -433 -108 358 263 -238 183 445 248 -162 115 425 235 -183 415
5142 415 684 73 -404 385 603 95 -165 305 545 -194 -274 281 560 -267 -394 316 336 -366 -452 348 330
5163 330 -645 -341 227 -100 -803 -360 416 -106 -799 -216 253 -187 -736 -165 541 -172 -868 -76 567 -432
5183 -432 -635 322 570 -369 -533 439 546 -283 -350 494 607 -332 -294 780 716 -384 -63 744 409 -441
5203 -441 70 1030 250 -358 209 657 89 -457 148 801 -32 -797 179 572 -316 -656 319 242 -620 -606 167
5224 167 103 -716 -464 170 -21 -737 -428 262 -67 -690 -203 457 -170 -682 129 545 -145 -581 263 526
5244 526 -301 -249 340 373 -197 -167 439 510 -210 -175 676 502 -227 23 717 142 -364 193 460 -43 -343 294
5266 294 458 -170 -424 126 264 -169 -419 97 163 -459 -327 329 19 -593 -161 197 -197 -596 -186 170
5286 170 -218 -523 -127 218 -422 -435 136 150 -301 -451 308 290 -440 -102 559 89 -238 110 590 198 -117
5307 -117 149 554 138 -183 439 629 -66 -140 268 510 -47 -102 492 204 -180 -73 289 139 -251 -14 339
5328 339 -8 -420 2 295 -276 -609 -2 181 -252 -576 101 96 -566 -418 140 -112 -468 -283 123 -97 -415
5349 -415 -209 236 142 -447 -136 458 -57 -446 188 498 -145 -348 465 382 -250 -42 423 460 -112 -55 527
5370 527 378 -218 -49 619 325 -250 107 547 -51 -389 209 480 -276 -373 151 265 -199 -457 128 232
5390 232 -344 -535 189 145 -672 -362 291 -41 -634 -118 419 -159 -699 62 402 -157 -558 67 222 -56
5410 -56 -471 335 373 -253 -310 693 503 -265 -20 664 317 -326 99 735 321 -135 56 540 279 -276 203
5431 203 735 31 -502 332 500 -193 -349 235 271 -434 -428 347 221 -464 -411 187 147 -555 -515 128 31 -668
5453 -668 -410 409 -117 -756 -154 358 -292 -568 -22 339 -228 -461 113 471 -163 -380 192 400 -182 -417
5473 -417 451 557 -152 -112 422 342 -247 -50 456 331 -125 -99 437 187 -176 90 585 219 -480 -128 435
5494 435 9 -462 15 306 -180 -540 78 201 -184 -439 -45 89 -336 -559 41 370 -271 -388 23 -21
5514 -21 -448 -286 222 209 -182 -294 88 50 -223 -60 467 358 -409 -284 190 333 -53 313 507 132 -198
5535 -198 -30 420 490 147 47 422 58 -421 -34 598 348 -159 52 224 -101 -255 85 636 193 -432
5555 -432 -434 -8 -194 -422 70 391 -340 -847 -389 90 -175 -213 141 180 -543 -805 -144 431 -92 -351 254
5576 254 130 -557 -632 477 813 -85 -303 253 202 -462 -50 771 694 -234 -326 231 346 -321 162 1178 464
5597 464 -715 -293 571 28 -187 532 864 -133 -931 -202 700 262 -433 119 471 -546 -1078 215 826
5616 826 -206 -672 174 64 -895 -853 438 696 -470 -780 -29 84 -942 -502 964 689 -898 -734
5634 -734 414 165 -712 103 1177 156 -1064 -337 767 408 -385 275 972 -99 -1094 173 1317
5651 1317 209 -525 526 835 -565 -791 727 1259 -197 -756 445 564 -653 -713 802 965 -782
5668 -782 -917 452 401 -915 -317 1046 350 -1239 -639 635 180 -863 -212 872 -79 -1315 -311
5685 -311 892 101 -885 190 916 -540 -1117 279 1233 -60 -744 306 882 -498 -688 858 1219
5702 1219 -420 -732 645 823 -457 -311 1275 727 -775 -452 829 466 -597 11 1082 266 -1052
5719 -1052 -383 853 257 -924 -61 713 -240 -1155 -67 825 -176 -900 -43 582 -487 -965 213 809
5737 809 -337 -924 151 537 -697 -785 434 614 -680 -824 528 438 -461 -323 612 487 -646 -302
5755 -302 696 474 -539 -251 838 336 -616 16 937 204 -517 39 738 55 -702 -4 785 210 -541
5774 -541 116 664 -94 -668 -17 621 -202 -691 56 284 -446 -524 100 355 -378 -671 1 220 -391 -674
5794 -674 107 504 -332 -656 293 320 -400 -356 447 297 -414 -510 480 563 -415 -263 669 633 -445 -199 752
5815 752 609 -357 27 762 211 -340 93 790 388 -440 81 681 163 -580 49 1000 26 -677 128 637
5835 637 -255 -704 242 647 -346 -753 111 387 -473 -681 384 531 -672 -971 438 452 -623 -649 599
5854 599 171 -819 -536 736 343 -640 -169 578 49 -887 -202 990 262 -877 -37 867 -149 -731 478
5873 478 1129 -3 -809 248 687 -177 -550 577 879 -367 -693 609 772 -513 -454 629 478 -853
5891 -853 -468 757 278 -648 -273 505 92 -882 -180 770 143 -911 -142 633 -245 -855 155 647 -386
5910 -386 -751 92 422 -482 -415 353 454 -419 -480 511 477 -436 -155 695 487 -684 -162 759 189 -312 124
5931 124 620 22 -412 307 708 25 -358 137 556 -102 -453 392 453 -307 -314 313 50 -473 -207 312 155
5952 155 -489 -286 159 -93 -512 -117 361 -122 -599 -119 242 -207 -398 -35 47 -379 -368 165 181 -83 -57
5973 -57 88 62 -157 85 407 305 -75 120 293 6 5 443 287 -31 -64 378 238 -41 37 364 283 -126
5995 -126 67 286 48 -133 -13 176 -81 -181 -63 245 -177 -279 211 100 -373 -282 48 -17 -260 -64 156
6016 156 -104 -276 -166 153 -176 -379 -37 343 -304 -490 48 238 -201 -372 250 130 -62 -24 296 248 -190
6037 -190 -89 440 277 -267 70 490 241 -257 287 499 -40 -198 423 304 -63 -138 286 293 -279 -113 256
6058 256 111 -380 -309 334 143 -450 -164 173 -194 -658 -91 226 -314 -517 -43 67 -409 -440 75 181 -341
6079 -341 -591 13 296 -420 -330 235 106 -427 -91 305 96 -262 60 410 99 -397 18 528 146 -284
6099 -284 96 655 -58 -265 277 484 -108 -133 448 343 -148 -110 423 290 -162 -98 451 168 -345 -74 385
6120 385 190 -464 -92 375 -74 -348 185 385 -140 -391 192 250 -161 -386 173 328 -285 -279 145 372 -302
6141 -302 -184 409 189 -392 -58 464 91 -319 -22 482 170 -224 15 644 264 -272 158 488 56 -329
6161 -329 304 540 -6 -385 103 244 -246 -376 120 270 -335 -594 91 170 -378 -284 202 171 -423 -334 39
6182 39 -82 -403 -211 311 -100 -442 -306 138 84 -465 -140 348 40 -480 -98 452 108 -239 82 440 -61
6203 -61 -206 199 577 35 -299 46 469 73 -264 418 542 13 -209 249 431 -85 -64 246 200 -292 -288 77
6225 77 254 -166 -401 230 221 -486 -448 281 302 -437 -348 27 -90 -410 -127 341 69 -493 -391 207 -30 -467
6247 -467 -272 453 -51 -774 -173 377 2 -402 67 607 37 -588 40 682 155 -332 302 608 -212 -371
6267 -371 387 802 17 -417 398 495 -235 -230 653 650 -96 -514 271 538 -392 -231 825 361 -694 -535 482
6288 482 328 -373 -209 546 54 -909 -530 560 229 -590 -141 567 -180 -1076 33 828 -53 -785 87
6307 87 494 -394 -663 436 1011 -133 -732 65 577 -294 -677 778 904 -692 -835 618 913 -354
6325 -354 -243 1059 517 -957 -607 855 634 -606 -244 890 266 -1218 -343 1213 388 -869 -26
6342 -26 865 -257 -1035 257 1091 22 -1043 23 694 -361 -1035 414 992 -592 -1260 259 810
6359 810 -628 -735 780 671 -886 -964 737 702 -680 -566 817 488 -1090 -647 1101 555 -866 -278
6377 -278 1105 53 -1195 -151 1157 232 -1001 -119 874 -200 -1234 244 1203 -118 -1195 183
6393 183 820 -510 -1129 568 813 -621 -983 508 571 -814 -723 617 749 -923 -867 783 662 -864
6411 -864 -631 896 519 -938 -581 854 325 -728 -27 1155 217 -905 -53 970 254 -787 261
6428 261 1218 -39 -805 296 1253 172 -423 508 920 -395 -627 685 1049 -20 -528 438 625 -489
6446 -489 -491 739 895 -518 -703 500 240 -748 -276 669 260 -801 -730 353 258 -615 -342 803 -46
6465 -46 -1175 -592 583 27 -757 -105 380 -281 -1058 -137 741 297 -585 -198 527 -406 -780 506 1068
6484 1068 -40 -824 79 461 -148 -480 703 891 -170 -788 151 601 -116 -194 854 669 -612 -890
6502 -890 486 795 -274 -295 707 270 -852 -408 770 714 -616 -498 333 27 -974 -137 937 222
6520 222 -1128 -361 525 -188 -863 12 922 -97 -1192 -290 605 -104 -653 423 687 -616 -1034 275
6538 275 835 -344 -624 604 545 -790 -705 892 954 -388 -437 707 402 -618 -234 1031 774 -803
6556 -803 -247 788 196 -714 162 1175 126 -967 -159 804 142 -628 234 923 -282 -1030 137 972
6574 972 -340 -723 495 619 -843 -816 469 769 -493 -596 388 470 -614 -460 656 412 -692 -335
6592 -335 703 90 -751 -49 969 29 -764 -147 793 147 -680 259 591 -60 -674 203 685 -127 -437
6611 -437 314 502 -465 -410 582 640 -366 -317 483 327 -449 -309 333 205 -602 -249 427 -91 -493 99 515
6632 515 -178 -569 11 386 -126 -387 85 235 -26 -279 -1 290 -201 -218 308 223 -268 -266 318 230 -203 14
6654 14 338 98 -56 37 373 151 193 31 132 -19 -163 164 209 -56 -156 147 191 -133 -222 30 -37 -57 -112
6677 -112 -97 -198 -89 -21 -214 -294 -184 -66 -26 -305 -240 -101 -79 -230 -186 -136 -237 -193 -121 -1 -305 -127 101
6700 101 -37 -205 -280 36 47 -92 -92 127 46 -95 34 227 -101 -126 132 392 -12 -85 298 349 244 50 285
6723 285 327 66 -28 303 214 9 121 487 216 -272 36 391 -42 -267 48 334 -17 -285 67 123 -141
6744 -141 -248 42 263 -191 -300 95 106 -357 -205 174 -2 -414 -139 217 -60 -248 -84 152 36 -151
6764 -151 -108 198 18 -340 156 329 -85 -261 313 295 -87 -200 197 279 -43 -106 351 254 -116 -77 310 134
6786 134 -358 138 428 127 -320 -125 253 21 -259 109 149 -180 -238 23 269 -217 -264 87 177 -289 -457
6807 -457 244 101 -419 -285 107 -42 -393 -160 113 34 -312 -62 353 41 -271 117 349 -32 -406 10
6827 10 401 -139 -291 195 323 -181 -186 259 321 -16 -191 83 195 -217 -142 367 335 -544 -332 341 168 -396
6849 -396 -79 336 62 -384 -105 200 -76 -386 -12 340 -75 -505 -143 319 -98 -335 139 297 -88 -342
6869 -342 87 356 -125 -152 219 264 -202 -113 450 380 -134 -119 305 268 -220 -5 484 325 -109 -8 231 117
6891 117 -94 32 471 112 -270 -183 295 129 -429 15 459 -107 -507 -177 205 -96 -195 115 250 -364 -616
6912 -616 -161 233 5 -342 -46 174 -392 -533 32 345 -216 -273 36 162 -357 -353 284 497 -91 -422 223
6933 223 241 -123 -64 511 336 -188 -207 343 362 -240 143 547 302 -253 -115 594 409 -265 118 609 111
6954 111 -648 -100 623 196 -168 -38 465 -243 -532 -4 509 -174 -547 -150 295 -396 -636 248 531 -461
6974 -461 -712 48 275 -551 -417 353 272 -556 -610 300 402 -547 -270 589 241 -832 -667 631 254 -619
6994 -619 -39 579 179 -736 -140 789 148 -672 68 770 -73 -835 199 971 -23 -666 138 661 -369
7013 -369 -788 407 906 -292 -743 275 528 -644 -618 712 742 -655 -773 565 295 -602 -326 805
7031 805 423 -741 -522 666 376 -623 -32 901 196 -1029 -160 1078 235 -887 100 953 -195 -1078
7049 -1078 262 1061 57 -650 351 732 -511 -659 725 1200 -401 -670 454 617 -669 -564 902
7066 902 869 -762 -655 636 329 -691 -269 1041 327 -1090 -558 721 246 -959 90 943 -203
7083 -203 -1292 -148 1087 114 -846 72 785 -377 -1069 247 1162 -102 -822 247 599 -749 -733 868
7101 868 1085 -524 -856 371 487 -526 -431 949 601 -747 -698 661 414 -558 29 1073 65 -1079
7119 -1079 -298 934 431 -646 -14 635 -212 -969 -57 835 155 -817 -2 372 -548 -854 257 934 -328
7138 -328 -912 73 425 -503 -658 482 658 -433 -896 52 601 -435 -342 613 447 -757 -630 607 511
7157 511 -516 -156 671 332 -637 -406 702 599 -411 -324 630 166 -639 69 865 276 -523 -96 735
7176 735 110 -611 146 894 105 -766 -107 646 -28 -507 182 743 -374 -873 134 737 -320 -530 292
7195 292 577 -550 -815 417 764 -412 -706 224 437 -636 -685 664 500 -488 -457 562 87 -649 -210
7214 -210 832 391 -737 -338 837 277 -716 30 823 84 -929 17 880 32 -627 392 874 -306
7232 -306 -849 342 781 -238 -653 506 785 -509 -736 534 710 -484 -624 639 396 -738 -320
7249 -320 813 340 -952 -426 763 154 -793 -233 855 109 -932 -261 764 -14 -627 176 793 -191
7267 -191 -811 249 901 -258 -771 448 551 -450 -653 455 693 -276 -521 444 363 -486 -272 651 454
7286 454 -577 -338 584 200 -692 -93 750 236 -735 -152 559 106 -588 0 527 -196 -625 42 493 -313
7306 -313 -668 252 369 -380 -583 229 436 -306 -565 212 180 -384 -293 483 250 -430 -83 364 22 -347 104
7327 104 433 207 -308 -9 447 67 -176 172 371 -72 -79 171 303 51 -2 222 341 -141 -153 234 188 -13
7349 -13 -203 245 214 -19 -171 43 158 -116 -40 -2 -75 -127 17 69 -36 -191 -127 70 -22 -150 -114 39 -65
7372 -65 -15 -54 -10 -24 3 78 3 -62 18 100 28 17 -30 -91 227 28 -172 -74 82 125 48 -75 49 187 57 -59
7398 -59 96 205 16 20 -28 26 -83 36 107 129 -186 -223 52 133 -89 -211 29 106 -131 -234 -63 -105 -229 -224
7422 -224 42 -148 -291 -15 -45 -74 -180 44 260 -73 -327 -4 154 114 -229 12 212 -141 -170 87 252
7443 252 -64 -14 190 175 -231 -48 235 215 -36 -13 140 182 -212 47 390 -68 -204 288 245 -110 -162 200
7465 200 258 -32 -267 46 178 -216 -258 154 171 -336 -137 229 20 -303 -106 235 -22 -250 -111 191 -64
7486 -64 -269 9 110 88 -315 -2 174 -134 -207 192 381 -136 -58 208 320 -97 -143 215 220 -121 -19 293
7508 293 215 -221 -55 184 133 -197 -29 334 57 -178 79 109 -203 -353 -84 83 -133 -216 -92 147 -146
7529 -146 -371 -25 196 -165 -231 44 107 -359 -54 28 4 -295 -168 102 138 -296 -142 156 98 -133 -59 263
7551 263 4 -152 49 304 94 -220 -34 213 100 -193 17 270 57 -155 177 334 5 -201 218 269
7571 269 -68 -82 206 337 -143 -136 84 221 -203 -92 40 238 -236 -260 71 102 -326 -84 223 8 -270 -96
7593 -96 -58 43 -248 -105 209 129 -402 -190 318 -5 -143 -53 269 -48 -380 -21 274 38 -95 123 232
7614 232 -21 -307 128 393 153 -220 117 316 -200 -314 332 401 20 -177 268 89 -165 -257 191 276 -90
7635 -90 -326 110 88 -208 -344 206 284 -403 -267 74 56 -342 -234 187 -77 -473 -195 321 65 -373 6
7656 6 414 31 -606 44 468 85 -388 217 429 -81 -400 167 557 43 -461 85 397 -167 -431 379 603
7677 603 -249 -468 316 397 -368 -326 435 274 -409 -452 397 206 -558 -366 460 71 -636 -140 625 50 -731
7698 -731 -153 493 -74 -795 13 578 -13 -732 -102 655 -279 -713 178 608 -245 -733 312 471 -405 -372
7718 -372 508 711 -416 -535 491 534 -422 -401 649 392 -625 -360 687 431 -498 -71 901 159 -724
7737 -724 -91 766 125 -751 24 868 40 -879 181 669 -32 -756 170 678 -404 -648 372 643 -446
7756 -446 -647 298 427 -573 -510 328 550 -623 -798 369 354 -684 -135 749 286 -878 -262 662 360
7775 360 -635 -49 693 83 -803 -53 851 238 -669 118 606 -264 -652 364 771 -144 -576 113 533 -294
7795 -294 -492 389 785 -262 -573 251 444 -435 -396 682 494 -454 -475 371 325 -490 -200 498 218 -787
7815 -787 -346 562 376 -497 -283 444 -100 -797 -119 748 66 -432 -167 370 -220 -614 187 732 44 -738
7835 -738 -79 372 -172 -414 397 695 -224 -648 113 408 -96 -248 485 461 -417 -474 374 514 -282 -304 509
7856 509 318 -672 -460 527 601 -419 -400 295 176 -555 -179 696 299 -531 -290 476 239 -468 24 709
7876 709 105 -754 -153 479 103 -411 90 637 -158 -611 113 753 6 -439 376 515 -301 -641 416 688
7896 688 -215 -522 396 444 -201 -334 518 489 -431 -522 468 364 -596 -271 726 298 -672 -277 551 284 -600
7917 -600 -218 523 -70 -748 -47 615 -71 -743 53 533 -261 -855 271 846 -170 -852 185 704 -464
7936 -464 -519 350 502 -409 -567 500 481 -434 -349 585 349 -633 -108 707 447 -488 -274 535 267 -464 -76
7957 -76 565 161 -457 71 705 -21 -541 102 768 -121 -501 194 560 -150 -448 272 428 -412 -490 220 495
7978 495 -356 -437 229 231 -736 -426 447 328 -640 -395 357 -86 -481 -209 328 76 -415 -109 307 -158 -477
7999 -477 -31 391 -151 -585 71 334 -224 -339 239 215 -116 -271 66 284 -172 -275 124 294 -309 -157
8019 -157 331 188 -243 -62 444 201 -291 -79 281 115 -122 -167 159 -26 -283 -22 208 -34 -190 26
8039 26 341 -56 -257 76 151 -71 -73 68 133 -74 -143 128 65 -85 -38 242 150 -13 56 179 119 -98 0 -48
8063 -48 156 163 -21 47 138 108 -59 44 181 -77 -28 97 152 52 69 105 96 -8 -56 14 140 -11 -121 -128 -27
8088 -27 -94 -14 -44 31 -87 -138 113 57 -2 -92 68 -31 -97 -133 86 161 -135 -159 54 88 -26 -87 97 51 -122 84
8114 84 22 25 -100 -137 127 -19 -141 -47 241 -55 -110 30 -12 -124 -103 48 115 -99 -159 -82 17 -95 -153 110 41
8139 41 -212 -143 261 49 -308 -245 167 -9 -318 -75 6 -49 -154 -130 -8 -44 -223 -201 92 -82 -244 -73 206
8162 206 -20 -183 159 118 11 -91 209 148 -51 -14 271 281 -64 -49 359 132 14 71 427 195 -29 15
8184 15 311 56 15 275 257 68 -167
8191a67
##END NTUPLES=NMR FID
##END=
