##TITLE=1H_BAU-j-1H
 CDCl3, 8 sc, 
 1.4.2019
##JCAMPDX= 6.0         $$ Bruker NMR JCAMP-DX V2.0
##DATA TYPE= NMR FID
##DATA CLASS= NTUPLES
##ORIGIN= UXNMR, Bruker Analytische Messtechnik GmbH
##OWNER= root
$$ XWIN-NMR		Version 3.5
$$ Mon Apr  1 14:26:47 2019 Russian Standard Time (UT+4h)  she@DPX200
##.OBSERVE FREQUENCY= 200.1316
##.OBSERVE NUCLEUS= ^1H
##.DELAY= (6, 6)
##.ACQUISITION MODE= SIMULTANEOUS
##.ACQUISITION SCHEME= undefined
##.AVERAGES= 8
##.DIGITISER RES= 18
##SPECTROMETER/DATA SYSTEM= spect
##.PULSE SEQUENCE= zg30
##.SOLVENT NAME= CDCl3
##.SHIFT REFERENCE= (INTERNAL, CDCl3, 0, 15.7039)
##AUDIT TRAIL= $$ (NUMBER, WHEN, WHO, WHERE, WHAT)
$$ ##TITLE= Audit trail, XWIN-NMR		Version 3.5
$$ ##JCAMPDX= 5.01
$$ ##ORIGIN= Bruker BioSpin GmbH
$$ ##OWNER= she
$$ F:/spectra/data/she/nmr/H-F/1/audita.txt
$$ ##AUDIT TRAIL=  $$ (NUMBER, WHEN, WHO, WHERE, WHAT)
(   1,<2019-04-01 14:25:22.79 +0400>,<she>,<DPX200>,
      <created by zg, POWCHK disabled, PULCHK disabled
       configuration hash MD5:
       00 E9 B6 7A A2 85 ED C7 34 08 36 98 17 FE 4E 26
       data hash MD5: 16K
       A1 1A D1 D9 C8 40 08 9D 10 98 BC EA CC AA 8D A0>)
$$ ##END=
$$ 
$$ hash MD5
$$ A5 2F 4B 46 5E 96 13 4D 48 35 35 27 00 0A 8A 0C
##$RELAX= 
##$RELAX= 
##$RELAX= 
##$RELAX= 
##$RELAX= 
##$RELAX= 
$$ Bruker specific parameters
$$ --------------------------
##$DU= <F:/spectra>
##$EXPNO= 1
##$NAME= <H-F>
##$PROCNO= 1
##$TYPE= <nmr>
##$USER= <she>
##$AMP= (0..31)
100 100 100 100 100 100 100 100 100 100 100 100 100 100 100 100 100 100 
100 100 100 100 100 100 100 100 100 100 100 100 100 100 
##$AQSEQ= 0
##$AQ_mod= 1
##$AUNM= <au_zg>
##$AUTOPOS= <>
##$BF1= 200.13
##$BF2= 200.13
##$BF3= 200.13
##$BF4= 200.13
##$BF5= 200.13
##$BF6= 200.13
##$BF7= 200.13
##$BF8= 200.13
##$BYTORDA= 1
##$CFDGTYP= 0
##$CFRGTYP= 5
##$CHEMSTR= <none>
##$CNST= (0..31)
1 1 145 1 1 1 1 1 1 1 1 1 1 1 1 1 1 1 1 1 1 1 1 1 1 1 1 1 1 1 1 1 
##$CPDPRG= <>
##$CPDPRG1= <>
##$CPDPRG2= <>
##$CPDPRG3= <>
##$CPDPRG4= <mlev>
##$CPDPRG5= <mlev>
##$CPDPRG6= <mlev>
##$CPDPRG7= <mlev>
##$CPDPRG8= <mlev>
##$CPDPRGB= <>
##$CPDPRGT= <>
##$D= (0..31)
0 1.2 0 0 0 0 0 0 0 0 0 0.03 0 0 0 0 0 0 0 0 0 0 0 0 0 0 0 0 0 0 0 0 
##$DATE= 1554114322
##$DBL= (0..7)
120 120 120 120 120 120 120 120 
##$DBP= (0..7)
150 150 150 150 150 150 150 150 
##$DBP07= 0
##$DBPNAM0= <>
##$DBPNAM1= <>
##$DBPNAM2= <>
##$DBPNAM3= <>
##$DBPNAM4= <>
##$DBPNAM5= <>
##$DBPNAM6= <>
##$DBPNAM7= <>
##$DBPOAL= (0..7)
0.5 0.5 0.5 0.5 0.5 0.5 0.5 0.5 
##$DBPOFFS= (0..7)
0 0 0 0 0 0 0 0 
##$DE= 6
##$DECBNUC= <off>
##$DECIM= 24
##$DECNUC= <off>
##$DECSTAT= 4
##$DIGMOD= 1
##$DIGTYP= 9
##$DL= (0..7)
0 120 120 120 120 120 120 120 
##$DP= (0..7)
150 150 150 150 150 150 150 150 
##$DP07= 0
##$DPNAME0= <>
##$DPNAME1= <>
##$DPNAME2= <>
##$DPNAME3= <>
##$DPNAME4= <>
##$DPNAME5= <>
##$DPNAME6= <>
##$DPNAME7= <>
##$DPOAL= (0..7)
0.5 0.5 0.5 0.5 0.5 0.5 0.5 0.5 
##$DPOFFS= (0..7)
0 0 0 0 0 0 0 0 
##$DQDMODE= 0
##$DR= 18
##$DS= 0
##$DSLIST= <SSSSSSSSSSSSSSS>
##$DSPFIRM= 0
$$ [...]
##$SUBNAM2= <"">
##$SUBNAM3= <"">
##$SUBNAM4= <"">
##$SUBNAM5= <"">
##$SUBNAM6= <"">
##$SUBNAM7= <"">
##$SUBNAM8= <"">
##$SUBNAM9= <"">
##$SW= 24.9336934301222
##$SWIBOX= (0..15)
0 0 2 0 0 0 0 0 0 0 0 0 0 0 0 0 
##$SW_h= 4990.01996007984
##$TD= 16384
##$TD0= 1
##$TE= 0
##$TE2= 300
##$TE3= 300
##$TEG= 300
##$TL= (0..7)
0 120 120 120 120 120 120 120 
##$TP= (0..7)
150 150 150 150 150 150 150 150 
##$TP07= 0
##$TPNAME0= <>
##$TPNAME1= <>
##$TPNAME2= <>
##$TPNAME3= <>
##$TPNAME4= <>
##$TPNAME5= <>
##$TPNAME6= <>
##$TPNAME7= <>
##$TPOAL= (0..7)
0.5 0.5 0.5 0.5 0.5 0.5 0.5 0.5 
##$TPOFFS= (0..7)
0 0 0 0 0 0 0 0 
##$TUNHIN= 0
##$TUNHOUT= 0
##$TUNXOUT= 0
##$USERA1= <user>
##$USERA2= <user>
##$USERA3= <user>
##$USERA4= <user>
##$USERA5= <user>
##$V9= 5
##$VALIST= <valist>
##$VCLIST= <CCCCCCCCCCCCCCC>
##$VD= 0
##$VDLIST= <DDDDDDDDDDDDDDD>
##$VPLIST= <PPPPPPPPPPPPPPP>
##$VTLIST= <TTTTTTTTTTTTTTT>
##$WBST= 1024
##$WBSW= 4
##$XGAIN= (0..3)
0 0 0 0 
##$XL= 0
##$YL= 0
##$YMAX_a= 232911
##$YMIN_a= -207466
##$ZGOPTNS= <>
##$ZL1= 120
##$ZL2= 120
##$ZL3= 120
##$ZL4= 120
##$ABSF1= 10
##$ABSF2= 0
##$ABSG= 5
##$ABSL= 3
##$ALPHA= 0
##$AQORDER= 0
##$ASSFAC= 0
##$ASSFACI= 0
##$ASSFACX= 0
##$ASSWID= 0
##$AUNMP= <proc_1d>
##$AZFE= 0.1
##$AZFW= 0.1
##$BCFW= 1
##$BC_mod= 2
##$BYTORDP= 1
##$COROFFS= 0
##$CY= 11.3945322036743
##$DATMOD= 1
##$DC= 2
##$DFILT= <>
##$DTYPP= 0
##$F1P= 18.9103706918063
##$F2P= -1.10871071338519
##$FCOR= 0.5
##$FTSIZE= 0
##$FT_mod= 4
##$GAMMA= 1
##$GB= 0.15
##$INTBC= 1
##$INTSCL= 1
##$ISEN= 128
##$LB= 0.24
##$LEV0= 0
##$LPBIN= 0
##$MAXI= 10000
##$MC2= 0
##$MEAN= 0
##$ME_mod= 0
##$MI= 1.114404
##$NCOEF= 0
##$NC_proc= 0
##$NLEV= 6
##$NOISF1= 3.799351
##$NOISF2= 2.8
##$NSP= 1
##$NTH_PI= 0
##$NZP= 0
##$OFFSET= 15.70392
##$PC= 1
##$PHC0= -9370.954
##$PHC1= 14.60026
##$PH_mod= 1
##$PKNL= yes
##$PPARMOD= 0
##$PSCAL= 0
##$PSIGN= 0
##$REVERSE= no
##$SF= 200.130013532006
##$SI= 16384
##$SIGF1= 3
##$SIGF2= 2
##$SINO= 400
##$SIOLD= 16384
##$SREGLST= <1H.CDCl3>
##$SSB= 0
##$STSI= 0
##$STSR= 0
##$SW_p= 3612.71676300578
##$SYMM= 0
##$S_DEV= 0
##$TDeff= 0
##$TDoff= 0
##$TI= <>
##$TILT= no
##$TM1= 0
##$TM2= 0
##$TOPLEV= 0
##$USERP1= <user>
##$USERP2= <user>
##$USERP3= <user>
##$USERP4= <user>
##$USERP5= <user>
##$WDW= 1
##$XDIM= 8192
##$YMAX_p= 0
##$YMIN_p= 0
$$ End of Bruker specific parameters
$$ ---------------------------------
##NTUPLES= NMR FID
##VAR_NAME=  TIME,          FID/REAL,        FID/IMAG
##SYMBOL=    X,             R,               I
##VAR_TYPE=  INDEPENDENT,   DEPENDENT,       DEPENDENT
##VAR_FORM=  AFFN,          ASDF,            ASDF
##VAR_DIM=   8192,          8192,            8192
##UNITS=     SECONDS,       ARBITRARY UNITS, ARBITRARY UNITS
##FACTOR=    0.0002004,     1,               1
##FIRST=     0,             0,               0
##LAST=      1.6414764,     0,               0
##MIN=       0,             -207466,         0
##MAX=       1.6414764,     232911,          0
$$ Real data points
##PAGE= N=1
##DATA TABLE= (X++(R..R)), XYDATA
0@%%%%qQqJ6j6K4l2L3m1N6p2Q8j04J20j44J69j94K33k73L13l60M10m67N31o03
29c21O84p74Q71r75J092j222J364j518J687j873K077k302K548k820L124l461L836
46B017m258M738n286N918o660P545q622R963j1686J3997j7282K2349l1265N1535
60C3003j75706k6579K96925j53148j04214J42761Q4675j67948K0199J75489l3018
71I2439j79096O3116J01494j11627l7935K42917O1603k65548q6474K34349L7481
82A52719k11427j8773J40391q1284j37738J19002J46506q4784n7732R9752k9143
93C7489j59181O5976J84839j02867k25944Q0030J93020o7218j06296J27724Q1292
104A08864j49952o9699J24490K6465r4144L2071P2865q9859m8744J79951J09523
$$ plain form
0 0 0 0 0 0 -8 0 -8 8 -8 16 -16 17 -24 32 -40 48 -56 64 -80 89 -105 128 -145 168 -192 218 -249 282 -321
29 -321 363 -411 460 -515 577 -645 719 -799 888 -985 1092 -1210 1338 -1482 1642 -1819 2017
46 2017 -2241 2497 -2789 3129 -3531 4014 -4608 5355 -6331 7666 -9616 12733 -18532 33003
60 33003 -142703 -169282 127643 -25505 -129719 13042 97717 -70231 -50032 125457 92439
71 92439 -86657 -23541 77953 -33674 -71609 171308 232911 -32637 -119111 115238 152719
82 152719 -58708 -77481 62910 -18374 -156112 -37110 109396 24612 -33120 66632 37489
93 37489 -121692 -55716 129123 26256 -199688 -119658 73362 6144 -100152 27572 108864
104 108864 -41088 -110787 13703 40168 -53976 -21905 50960 -38899 -87643 92308 201831
115B01831j57504r6184J34544L9820j53162k3259J29034k5776j36281K5359R9258
126C7680k7470l2588N9578k6946j25305J9842J33867k7870j31601L9918J27040
137D6145l4327p7559Q5166Q9579p6278p5934M3725K1125l8569K1731L5082n9999
149b0113l8247R0916O2832p5902n1115O6224K0161q6505k2622P9140J7664o1540
161a9107p286M0501K973N07K4449k7571o5320O655N1414j9116n3794K0528N2251
174G084j6436l6390L3968N0807j5300l7712j684Q451O205K3747P315l0136m153
187d234M2776J5112l2104j0981K0330r286m1500j3938K4407J5284j1709j4181
199b0024l482R228K3748J0555k6406k2963J6517J3489j8909m982K6324J1798j4495
$$ plain form
115 201831 44327 -51857 82687 122507 -30655 -53914 75120 49344 -86937 -61578 37680
126 37680 10210 -22378 37200 10254 -115051 -95209 38658 10788 -120813 -80895 46145
137 46145 11818 -65741 19425 109004 32726 -43208 517 21642 -16927 4804 39886 -20113
149 -20113 -58360 32556 95388 19486 -31629 34595 54756 -31749 -54371 24769 42433 -19107
161 -19107 -26393 14108 17081 17588 42037 14466 -50854 -44199 7215 -11901 -65695 -45167 7084
174 7084 -9352 -45742 -11774 39033 23733 -13979 -15663 -7212 -1007 22740 30055 -81 -4234
187 -4234 38542 53654 21550 10569 30899 21613 -19887 -33825 -9418 5866 -5843 -20024
199 -20024 -23506 -14278 9470 20025 -6381 -29344 -12827 662 -18247 -23229 3095 14893 398
212C98o437J0242J1416N950p282k3586j5009J6674K2249r572j8172J4885K2060
225B3816j2378j4950J7242J1566j9630j5043J918j647L743J5185l293k2420P73
238a5118K3601J09k4595l805J7715m868k1656Q059K6322R10r726Q646N504o676
252D422Q922J2422j5997j7681J3289J3994j3464j0075J5460Q730j8301j2304J2300
265A717M404j5798n873O220o599m400J5833O362j4722M58J7472j309j4645M343
279f537J3871m051j1794N387J3630o69n210O297K426r159J043R102p471j1290
293d425P770O943j0209m291J0050K256r886m326L804l76o111j422K913k758k790
308a2858O396L710o139N51Q483k141o430N301O438k988r23N149K773r9J262J635
$$ plain form
212 398 -6039 4203 15619 21569 14287 -9299 -24308 -7634 14615 5043 -13129 1756 23816
225 23816 11438 -3512 13730 25296 5666 -9377 -7459 -9106 -5363 9822 6529 -15891 -15118
238 -15118 8483 8592 -16003 -19808 -2093 -6961 -28617 -20558 5764 6674 -3052 5594 11098 4422
252 4422 13344 25766 9769 -7912 5377 19371 5907 -4168 11292 20022 1721 -10583 1717
265 1717 6121 -9677 -15550 -9330 -15929 -20329 -4496 1866 -12856 -12398 5074 3765 -10880 -6537
279 -6537 7334 3283 -8511 -3124 10506 9837 4627 10924 13350 4191 5234 14336 6865 -4425
293 -4425 3345 10288 79 -4212 5838 8094 -1792 -6118 -2314 -2690 -8801 -10223 -7310 -10068 -12858
308 -12858 -6462 -2752 -8891 -8340 143 -1998 -8428 -3127 3311 323 -600 4549 7322 7223 8485 10120
324A0120o12k296k89J439k526l426K627J468n234j311L822l023m987J204j39m035
340g198j65J943j364p85J661J155k06p48L73K009p20j468L271K780j735J610M738
357E151q89j460L424N99k884P14J786r83m07Q41L78J50j510j400M83k045l751
374a803K27K87l589m83K596j734j883J782k08k297o1K50o79P67O09J106K920J157
392a036J56L212J402j641J419J989j576L9K852Q4l40J922L82j144m26j569j571
409D154j165k971j704J024j666k506J862N05l432j25J315k887j992J699L6q75
425h728J786K632J845Q41Q45L218J462k671N22M278j407k706M506K850l557O61
441F377M257k599m611J216P82m808l937K213K201m196l114N324K200p065j165
$$ plain form
324 10120 9508 7212 6923 8362 5836 2410 5037 6505 1271 -40 3782 759 -4228 -3024 -3163 -7198
340 -7198 -7363 -5420 -6784 -7569 -5908 -4753 -4959 -5707 -5334 -3325 -4045 -5513 -2242 538 -1197 413 5151
357 5151 4262 2802 6226 6825 3941 4655 6441 5458 5051 5892 6270 6420 4910 3510 3993 1948 -1803
374 -1803 -1576 -1289 -4878 -5361 -2765 -4499 -6382 -4600 -4808 -7105 -7166 -6916 -7595 -6828 -6219 -5113 -2193 -1036
392 -1036 -880 2332 3734 2093 3512 5501 3925 3964 6816 6900 6560 8482 8864 7720 7294 5725 4154
409 4154 2989 18 -1686 -662 -2328 -4834 -2972 -2467 -5899 -6024 -4709 -7596 -9588 -7889 -7853 -8728
425 -8728 -6942 -4310 -2465 -1624 -779 2439 3901 1230 1752 6030 4623 1917 6423 9273 5716 6377
441 6377 10634 8035 3424 4640 5422 614 -3323 -1110 1091 -3105 -6219 -895 1305 -5760 -6925
456f925O347l465p199N168M776o654q63R602J328p228K242R002j995q823K810
471a877R035m085p359Q273P313q820k150J1474k058j2292M627Q865j0780j0072
485i906J0775P639j1991o569J2179M567j3215k379J2706k770j3603O516J1235
498E184j0438n548J7055L262j8328Q89J9355l556j9100M043J5606p363j3822J0865
512a896J2936j1344p020J4538J435j5708O623J7327j3423j7765J7100J6660j7150
525B313j1928J7707P249j9798o539J6297O39j7128J310J1188r825p072J9474O619
539A0506k3068k814K5384N21k2345M718K0953o670j7997Q121J6099n840r245O158
553D481p79j2465N539J5601j1383j9186J3314J7590j3608j1332J8290J0931j6431
$$ plain form
456 -6925 -578 -4043 -11242 -6074 -1298 -7952 -8815 787 2115 -5113 -2871 6131 4136 -4687 -1877
471 -1877 7158 3073 -4286 3987 11300 2480 330 11804 9746 -2546 2081 10946 166 -9906
485 -9906 869 8508 -3483 -10052 2127 6694 -6521 -8900 3806 1036 -12567 -6051 5184
498 5184 -5254 -10802 6253 9515 -8813 -7924 11431 7875 -11225 -7182 8424 1061 -12761 -1896
512 -1896 11040 -304 -7324 7214 8649 -7059 -436 16891 3468 -14297 2803 19463 2313
525 2313 -9615 8092 15341 -4457 -10996 5301 5940 -11188 -9878 1310 -8515 -15587 3887 10506
539 10506 -12562 -15376 10008 10529 -11816 -7098 13855 7185 -10812 -2691 13408 7568 -1677 4481
553 4481 3702 -8763 -3224 12377 994 -18192 -4878 12712 -896 -12228 6062 16993 562
566E62r696J1635P595n483l022l11o419o58J2459J670j6977m044J4706j233j6621
581a5837L401J7075j424j3420n71J0934R292K567n869q273J677J0441K786r722
595C057n597O703J996j0505l890R941N109p799j0663m946Q051J6331j92j8917
609a1321l524J9255Q007j0666j108J1174j013j2998k780Q529L997j134l417j3453
623a0452r875J8487K1685j7688k6920J3125K1374j3254j2001K1204J2521j9892
635a686j0939J4911R128k213N469l760k6630n247L4979J1403l6714j2993L0547
648F255J346l1012R792L6733r175l3694M531K0164j752M230J7360j6178l3896
661b5296J6732M1989j4115l8502J5971K4983l4375k6740M1184K8618l5989k4878
$$ plain form
566 562 -9134 2501 10096 4613 1591 1280 -5139 -5797 6662 8332 -8645 -12689 2017 784 -15837
581 -15837 -12436 4639 3215 -10205 -10776 158 9450 12017 6148 -2125 -448 9993 12779 3057
595 3057 -2540 4163 6159 -4346 -8236 1705 6814 -985 -11648 -16594 -8543 7788 7596 -11321
609 -11321 -14845 4410 12417 1751 643 11817 10804 -2194 -4974 3555 7552 6418 3001 -10452
623 -10452 -20327 -1840 19845 2157 -24763 -11638 9736 -3518 -15519 5685 18206 -1686
635 -1686 -12625 2286 11414 9201 14670 10910 -15720 -20967 14012 25415 -11299 -24292 6255
648 6255 7601 -23411 -13619 23114 13939 -19755 -15224 4940 3188 7418 24778 8600 -25296
661 -25296 -8564 33425 19310 -19192 -3221 21762 -12613 -39353 1831 30449 -5540 -30418
673c0418K0136O394q040K2917J5557l6830k2710M0439K4902l4484q861M1276m836
686B5442n4571N091N6372j278m4564j734J4888j6189K197L6191n458m4641N336
699b2918M0794j0516l0144L0290L4048m2279m1743L9910M1515k6094k3851J5534
711D546o884k2126K3273K7546k9992k7878K7270J3311l3874J978N1223N79n6057
724b7085m682N0591R494k6691O039J0601k5526n162L5532K124l4738M036K3972
737A8505k4957k9073L5341L4893l7188m0196K5399K9047j5472n551K0036j0066
749G18k3934K0059K4707k0794j1361K8715k274m1782O242M9435j853m5764k992
762b0878K9189l768j4314J7333P238k6365k476K8343m124k1792K0937K1566l5283
$$ plain form
673 -30418 -10282 -3888 -11928 10989 26546 -10284 -32994 7445 32347 -2137 -10998 30278 25442
686 25442 -29129 -24038 32334 31056 -13508 -15242 -354 -16543 -14346 21845 16387 -28254 -22918
699 -22918 17876 7360 -22784 7506 41554 -725 -42468 -2558 38957 12863 -10988 4546
711 4546 -2338 -24464 -1191 26355 -3637 -31515 -4245 9066 -24808 -22830 28393 28972 -27085
724 -27085 -31767 18824 28318 1627 7666 18267 -7259 -12421 23111 25235 -9503 -5467 18505
737 18505 -6452 -35525 -184 34709 -2479 -42675 -17276 11771 -3701 -9252 10784 718
749 718 -23216 -3157 21550 756 -10605 18110 15836 -25946 -19704 29731 27878 -17886 -20878
762 -20878 8311 4543 -9771 7562 14800 -11565 -14041 14302 10178 -11614 9323 30889 -4394
775d394k5925L8610K6866l3733k2925K1305N024k0446P146J9887j7072k0062K0044
788e675J1767k4434K558L6735q195m2453J2812M5791p817l1903J2514J8774j9228
801A246q260K5702J241k8926K632K2559j6557k1839K8290K0925l9109k3914L8918
814B908J9571l3303p825K8774n454k5580J6819K4174k0827j6844K4684O239l1567
827a8231L573L9637r372m4446J1431M0975j4143k9824K1904J9546k8251r579L3012
840A6232L231l0352O802K6324j8894k4821K9102K4331l6341k5209L4564J6596
852B1565l4623o689L2211o544l2395J4625K8643j8606j8939K4947J0177l0051
864a5679p63L8101j257l8496M704L5543r466k8485J7833K1967k5926j7652K7687
$$ plain form
775 -4394 -30319 8291 35157 1424 -21501 -196 4828 -15618 -8472 11415 -5657 -25719 -5675
788 -5675 6092 -18342 -15784 20951 12756 -29697 -16885 28906 21089 -10814 1700 20474 1246
801 1246 -7014 18688 19929 -8997 -6365 16194 -363 -22202 6088 27013 -12096 -36010 2908
814 2908 22479 -10824 -18649 10125 4671 -20909 -4090 20084 -743 -17587 7097 13336 -18231
827 -18231 -14658 24979 15607 -28839 -17408 23567 9424 -20400 1504 21050 -7201 -16780 16232
840 16232 19463 -10889 -4087 22237 3343 -21478 7624 31955 -4386 -29595 4969 21565
852 21565 -13058 -19747 12464 5920 -26475 -11850 16793 -1813 -20752 4195 14372 -15679
864 -15679 -16442 21659 20402 -18094 -13390 22153 12687 -15798 2035 24002 -1924 -19576 8111
877H111R655k7319n99K4471j1058k5518J8588K6439k1257k4385K1933J8439k3653
890f153j0141K7527L282k9312J815K6526p210k0135J4522J3718k1968j0491K6023
903H003Q628k5929n044K4222m04k2581P632K3008j1498k0762J4168J5384j5966
916a139p500J8468J29k1439L293K0978n867j9186P593J5001j1903j3283J4897
929D2J1406j6466q413J6411L898j4624L189J4874p018j3201J0053J1710j0243
942A618q431J1151N674j2967m193J3630K078j4288n55J2006l852j0773O823Q413
956F334r241o226J0035M254r215j443R871L99r760J224J0344k272r494M343P996
971G149o562o213Q019L532q647j682Q011m94p497J893P152k519o632L561O395
$$ plain form
877 8111 17766 -9553 -10152 14319 3261 -22257 -3669 22770 1513 -22872 -939 17500 -6153
890 -6153 -16294 11233 14515 -14797 -12982 13544 6334 -13801 721 14439 -7529 -18020 8003
903 8003 16631 -9298 -14342 9880 9476 -13105 -5473 17535 6037 -14725 -557 14827 -1139
916 -1139 -8639 9829 9958 -11481 -8188 12790 6923 -12263 -4670 10331 -1572 -14855 42
929 42 11448 -5018 -13431 2980 6878 -7746 -4557 10317 3299 -9902 151 11861 1618
942 1618 -6813 4338 10012 -2955 -7148 6482 8560 -5728 -6283 5723 1871 -8902 -2079 6334
956 6334 -2907 -9133 902 5156 -4059 -5502 4369 4768 -4992 -3768 6576 4304 -5190 -847 7149
971 7149 587 -5626 2393 5925 -2722 -4404 3607 3113 -4384 -2491 4661 2142 -4490 -929 5466
986E466m547n681O030L929p499k538P355k05p132J694N640l271m768L660M277
1001B410l504l291M602L469m661j545O539J062o087J069N736k606m593L397K613
1016D610m449k580L327J022l846j535L288K58m249L37M635j307m072K940L488
1031A867l204j259M048O10l196K08K932j52k291L14K205o83k618J429K719k231
1047F98k181K897J014l132M34K652j197k032J084J162j081j289L50R09j064j756
1063b532J233J383k280p59K518p2k027J304J832j164m50J407Q15l81k95O86J015
1080B233p29j176J503O48k352n7K066j319j937J584Q32k033m45J324o8j114k64
1097a304Q93L07j411j85J899m73j998J604J650k462m24K837k88k394J356J967
$$ plain form
986 5466 919 -4762 1268 5197 -2302 -4840 2515 2310 -4822 -3128 2512 -759 -5527 -1867 2410
1001 2410 -1094 -4385 217 3686 -975 -2520 4019 5081 -1006 63 5799 3193 -1400 1997 4610
1016 4610 161 -2419 908 1930 -1916 -3451 -163 95 -4154 -3817 818 -489 -4561 -1621 1867
1031 1867 -1337 -2596 1452 2062 -1134 -926 2006 1854 -437 -123 2082 1399 -1219 210 2929 698
1047 698 -1483 1414 2428 -704 -270 2382 1185 -847 237 1399 318 -971 -621 288 -776 -2532
1063 -2532 -1299 84 -2196 -2955 -437 -509 -2536 -1232 600 -564 -1014 393 1208 827 532 1218 2233
1080 2233 1504 328 1831 2479 127 70 2136 817 -1120 464 1296 -737 -1182 142 74 -1040 -1304
1097 -1304 -411 -104 -1515 -1700 199 -274 -2272 -668 982 -1480 -1904 933 645 -1749 -393 1574
1113A574j022j127J241J155q07j080J298R94j982n88K612p22l203J805K574l214
1129d92j843L275M62l262j9K445n49k076P73J933j231j914K182J820l291j058
1145b845M573j0m890J754M744k573l188L386K033l125o55L175j23l156Q22L313
1161C235k002l971L183L731n038l577N683J755o087j42N193j740l935L148K749
1176B185l578j274M342O25n088L79O270j233o916K236O602l651n254M925K994
1191C564n778n35N585j494m549L728M004m898l352O360L573o909l337P126J586
1206D674p513Q5O568l318n741M645K900o296l31P060k192p597L895Q472l677p315
1222e681M664P052n064m637O981K740p708j16P000l743o056O835M054j0296l599
$$ plain form
1113 1574 552 -575 666 1821 1014 -66 1232 2226 244 -344 2268 1546 -1657 148 2722 -492
1129 -492 -2335 940 1402 -1860 -1879 566 17 -2059 -1286 647 -584 -2498 -316 1504 -1787 -2845
1145 -2845 1728 1718 -3172 -1418 3326 753 -2435 951 2984 -141 -796 2379 2256 -900 -78 3235
1161 3235 1233 -2738 445 4176 -862 -4439 1244 2999 -3088 -3230 1963 223 -3712 -564 2185
1176 2185 -1393 -2667 1675 2300 -2788 -2409 3861 2628 -4288 -2052 4550 899 -4355 570 3564
1191 3564 -2214 -2749 2836 1342 -3207 521 4525 -373 -3725 2635 6208 -701 -4038 3088 4674
1206 4674 -2839 -2754 3814 496 -5245 -600 2300 -3996 -4327 2733 541 -7056 -3161 5311 1634 -5681
1222 -5681 -1017 6035 971 -3666 3315 6055 -1653 -1769 5231 1488 -4568 2267 6321 -3975 -7574
1237g574J0863K399j0395j155R472o59q388L332Q169m740o168O859K945q961J352
1252b649J0763n333j2591O605J1329p891r300Q172O210r098l738J0262K437r189
1266d011J184Q580m889o441J0930O310j4281n439J4981K817j4259k75J1854m109
1280B952j1977N107R799o308p061P274K573r993K334J4516m363j5600O665J4966
1294A0884p885j0950J0829P581j2938o049J1972L446j0225k20P365n999p580J1383
1308A614R124j3709q481J4729O051j3751n46J5322k583j5065L321J2205l638p489
1322b896M792J263j0536J37J3689j002j5398J103J3346m338j0735R823J1165j0762
1336c49r766R632Q092n125j304M514m506p196O864R530p064r886N759N453r363
$$ plain form
1237 -7574 3289 5688 -4707 -5862 3610 2951 -5437 -2105 6064 1324 -4844 2015 4960 -4001 -2649
1252 -2649 8114 2781 -9810 -3205 8124 233 -9067 -895 5315 -3783 -7521 2741 5178 -4011
1266 -4011 -2827 5753 864 -5577 5353 11663 -2618 -8057 6924 9741 -4518 -4793 7061 2952
1280 2952 -9025 -3918 5881 -427 -7488 -214 2359 -7634 -5300 9216 4853 -10747 -4082 10884
1294 10884 2999 -7951 2878 10459 -2479 -8528 3444 6890 -3335 -3555 3810 -2189 -9769 1614
1308 1614 10738 -2971 -11452 3277 9328 -4423 -4969 10353 7770 -7295 -3974 8231 4593 -2896
1322 -2896 1896 3159 -7377 -7240 6449 5447 -9951 -8848 4498 160 -10575 -752 10413 -349
1336 -349 -10115 -483 7609 2484 1180 5694 1188 -6008 856 10386 3322 -6564 -805 4648 -4715
1351d715l103J2822L056j3578m447R598M224k870J223R43n757k357P438M872n882
1366A467l996M177r47p734K786J1165j747j2504k437P958L676j420K82J84l215
1381b305j376M868N033j647k709J310j866n106M271R731l117j2625k290Q126K687
1396B985m503n70K781l492n674M306Q183j677m821K318l42n281N126J1351l964
1411F726j3522J366J0794j134p539M117O098q331q443Q865Q737p192m652O592
1425B482k233q630Q227J2448r331j2964Q742J0142r351o293J2095L821j5604m124
1439a0573J5265K447j3070J850R968q985q526J4940Q485j6914o478J7044K950
1452H403j5864K426J7161n849j7894P486J6618q736j2448J1190O106j6153j130
$$ plain form
1351 -4715 -7818 5004 8060 -5518 -9965 -367 3857 987 2210 3153 -2604 -4961 2477 7349 1467
1366 1467 -2529 1648 701 -7033 -4247 6918 5171 -7333 -9770 -1812 1864 444 726 910 -2305
1381 -2305 -3681 1187 6220 4573 1864 3174 1308 -3798 473 10204 7087 -5538 -7828 298 2985
1396 2985 -1518 -2088 693 -2799 -8473 -4167 4016 2339 -2482 -164 -506 -5787 -661 10690 6726
1411 6726 -6796 -5430 5364 4230 -3309 808 6906 -1425 -9868 -1003 7734 542 -4110 2482
1425 2482 249 -8381 -154 12294 2963 -10001 -1259 8883 -468 -6761 5334 9155 -6449 -10573
1439 -10573 4692 7139 -5931 -4081 5887 -3098 -11624 3316 11801 -5113 -11591 5453 8403
1452 8403 -7461 -5035 12126 6277 -11617 -4131 12487 3751 -8697 2493 8599 -7554 -8684
1465h684J9700k502k0820N040J8113q949j4468J3698J2229j7254j1106J8401R141
1478A2539j6848l546J5987m006j6502J0729J7374j4216j5653J5350J0181j7032
1490e643m000J9810j13k2117J266K0602k794j6212P410J1715j3921r231J9220
1503E992Q035j9690m164J7999k408j6600R216J7122j2436j7326J1901J3464j1752
1516f47p440J3753J295j7946J506J9456l542j6516P174J2048j2478q225J7566
1529F004P613j7953n809J5424J944j2739L592J2527q480j3927R795J1867j0673
1542h15p469J2109J359j5082K169J6673l051j4284M539J0653o519o833J0303N958
1556I710j1749n172J1290K412j0422J667R758o435j0590Q013R070q474o165Q246
$$ plain form
1465 -8684 11016 8514 -12306 -7266 10847 1898 -12570 1128 13357 -3897 -15003 3398 12539
1478 12539 -4309 -7855 8132 4126 -12376 -1647 15727 1511 -14142 1208 11389 -5643
1490 -5643 -9643 10167 10054 -12063 -10797 9805 7011 -9201 -1791 9924 -3997 -13228 5992
1503 5992 14027 -5663 -9827 8172 5764 -10836 -1620 15502 3066 -14260 -2359 11105 -647
1516 -647 -8087 5666 6961 -10985 -9479 9977 6435 -10081 -2907 9141 -3337 -11562 6004
1529 6004 13617 -4336 -10145 5279 7223 -5516 -1924 10603 2123 -11804 -2009 9858 -815
1542 -815 -8284 3825 5184 -9898 -7729 8944 5893 -8391 -3852 6801 282 -6551 3752 9710
1556 9710 -2039 -7211 4079 6491 -3931 -2264 7494 1059 -9531 -1518 7552 -922 -7087 1159
1570A159K627q813K07R668m64q679J724P475l369n776O149M578q274l774Q212
1585B650J334p923P19O625k974o080L739N300l441l522M419K821m659r94O100
1600D114L30n749J231M970l133m462L796K524m808k276L355L60l526N3L238n76
1616e59l304J270L516j303j918L214J868l486k72L868j4k644P07J469j826j452
1632h66J480J064j562j583Q25Q18j307K33K170o08k319J184K130j007n33J501
1648A620n60j846M94R88m83p89o48j56m06m13Q05R05j080q99J469Q31m30J339
1666G41J168j160k39J545L80l13M02l93r69l44J59J71m06j322n25L54o93j94J257
1685c81l61j486O36J198n70K53J185n59q18N04P08J9k40l84Mj47n49O98R76r81
$$ plain form
1570 1159 3786 -5027 -4820 4848 4384 -4295 -2571 4904 1535 -4241 1908 6486 -1788 -5562 2650
1585 2650 3984 -3939 -3220 3405 431 -5649 -1910 3390 -51 -3573 846 3667 -992 -1986 4114
1600 4114 4444 -1305 -74 4896 1763 -2699 1097 3621 -1187 -3463 -108 252 -3274 -3221 17 -559
1616 -559 -3863 -2593 923 -380 -2298 916 2784 -702 -974 2894 2880 236 943 2412 586 -866
1632 -866 614 1678 116 -1467 -642 176 -1131 -898 1272 664 -1655 -471 1659 652 119 1620
1648 1620 1060 -786 -292 696 213 -576 -1224 -1380 -1786 -2199 -1394 -489 -1569 -2468 -999 -168 -598 741
1666 741 1909 749 510 2055 2435 2122 2524 2131 1162 818 977 1148 742 -580 -1105 -751 -1444 -1638 -381
1685 -381 -742 -2228 -1592 -394 -964 -711 474 -85 -903 -399 309 328 88 -296 -292 -439 -988 -290 686 -295
1705b95q06J339L65p78J252R17r62k39R65L08l93J10k13m95m94o07L65j05j406
1724a172o17O03p96o93J121J19j228M12J107q6K98Q23Q9M0L97L47N58K67n53K67
1744A303M17o73m9Q98o53q05N33j17o22M28R0q21m0J28m74J8R6n48k13J94m53
1765a363K5K08m29Q0L52l76K37J000l57k01J233K40n99Q92P67n88nP63k17m18
1785A244J67J56l28o72l65O06l14j388K64J011j277r11J422l1j455N87J133r13
1803a064m48J113M04q82p8J002O01r92m08J666K56j716O16J707j202j117J843
1820A301K25j910M88J529j024j392R35J003j061j230R61J170j453r94J800L48
1836F96k170O50J959j519j359K150O35k324M8K254m50j948O16J748o68j632J095
$$ plain form
1705 -295 -1101 238 603 -175 1077 1994 1032 793 1758 2066 1673 1783 1570 1075 581 -26 339 234 -1172
1724 -1172 -1789 -1186 -1982 -2675 -1554 -1435 -2663 -2251 -1144 -1230 -932 -109 -20 20 417 764 1322 1589 1036 1303
1744 1303 1720 1047 998 1896 1243 438 971 854 232 660 750 -71 -111 17 -457 -439 -343 -891 -1104 -910 -1363
1765 -1363 -1338 -1130 -1559 -1479 -1127 -1503 -1266 -266 -623 -824 409 649 50 942 1709 1121 1116 1879 1662 1244
1785 1244 1411 1567 1239 567 202 808 494 -894 -630 381 -896 -1807 -385 -416 -1871 -1284 -151 -1064
1803 -1064 -1512 -399 5 -877 -955 47 648 -344 -752 914 1170 -546 70 1777 575 -542 1301
1820 1301 1526 -384 104 1633 609 -783 152 1155 94 -1136 -175 995 -458 -1452 348 696
1836 696 -1474 -824 1135 -384 -1743 407 1042 -1282 -1234 1020 570 -1378 -762 986 318 -1314 -219
1853b19J584j482j051K298L26k612R59K651j928k238K578J418k933q73K474J48
1869A100k418J04K136p42k140J455K007k254j341L445O47l832O22M168j597l474
1885b114K207K448k681j670K503O71k959k95L021p38l287J829L545l056k914M375
1901H85K377m504q41M727k30m113J591L253k435k736K704J733l598j358M238K60
1917A953n331P17N682j769n037L109M091l873k260M687J023m658J67M146j517
1932A130m047K594L653m196m007M760L444n478k015N677L00n441J950N499k593
1947A230l909L662K535m071p58N244k6o239p3N948r70n675K111M305m380l860
1963d926N156K733m834r11M056j352l580L564M349l804m410L398L667l512k009
$$ plain form
1853 -219 1365 -117 -1168 1130 1456 -1156 -197 2454 526 -1712 866 2284 -649 -1522 952 1100
1869 1100 -1318 -1214 922 180 -1960 -505 1502 -752 -2093 1352 1999 -1833 -1211 2957 1360 -2114
1885 -2114 93 2541 -140 -1810 693 1364 -1595 -1890 1131 393 -2894 -1065 2480 -576 -3490 885
1901 885 3262 -1242 -2083 2644 2414 -1699 -108 3145 710 -2026 678 2411 -1187 -2545 1693 1953
1917 1953 -3378 -2661 3021 1252 -3785 -676 3415 -458 -2718 1969 2992 -1666 -1499 2647 1130
1932 1130 -2917 -323 3330 -866 -4873 -113 3331 -2147 -4162 1515 1815 -3626 -1676 3823 1230
1947 1230 -2679 983 3518 -553 -1311 3933 3907 -2332 -2405 3543 2573 -3102 -991 3314 -1066 -4926
1963 -4926 230 2963 -1871 -2782 1274 -78 -3658 -94 4255 451 -3959 -561 3106 -406 -2415
1978b415M589N68o032j11N635l15l556J851J502l832m72N459J224m611j089L478
1994A873j35l043J908L764k996m953J830L381j706q91J873j974l615K286M047
2009A649j123k476J072J024j940QL773J799l359k475J906J484k72J101K70l191
2025g50j453K374J212r19J84R2j932j219J545K567L73j998j835K60J210J242O71
2042A624j106j522p7K54j6J557R77j996j834N50R97J152J254j038k574J13K340
2059F55R03r17j99N11j080j438J413K707r20k788K41Q33r56J171K192k056l052
2076b780J834K524j372j060J856K29k729n56L229J235k911j100J822n52j342K579
2092I06J377l877j457L752R33k841O26K564j643k871K039L393j258k952R10J343
$$ plain form
1978 -2415 2174 2742 -3290 -3401 2234 1919 -1637 214 1716 -2116 -2588 2871 4095 -516 -1605 1873
1994 1873 1738 -1305 603 4367 1371 -3582 -1752 1629 -77 -968 905 -1069 -4684 -2398 1649
2009 1649 526 -1950 -878 146 -1794 -1786 1987 3786 427 -2048 -142 1342 1070 2171 2441 -750
2025 -750 -2203 171 1383 464 648 740 -1192 -2411 -866 1701 2074 76 -1759 -1499 -289 953 1624
2042 1624 518 -1004 -1081 -827 -843 714 1691 -305 -2139 -1589 -592 560 1814 776 -1798 -1685 655
2059 655 1558 641 442 953 -127 -1565 -152 2555 1635 -1153 -912 -79 -1035 136 2328 272 -2780
2076 -2780 -946 1578 206 -854 1002 1231 -1498 -2054 1175 2410 -501 -1601 221 -331 -1673 906
2092 906 2283 -1594 -3051 701 1634 -1207 -581 1983 340 -2531 -492 2901 1643 -1309 -399 944
2108I44j817J74L259j090m311J051L551j333j907K506Q61l653r15L866J646k535
2124B97j232J240m72j398K257K190l135k814K460J244k116R16K540j970l257J633
2140a617L212j03j249L02j29j408P07K712L3k691m73J235j138n70K598L63l448
2157a664j158K002O95j32R10k47j701j07J958J154n44l13K97j125j062J866J728
2174B557j901j933O49k21j001J544J136k142j288J638P64q10R57J723j031j924
2190a283J155K576n19j690J123O04k573j31K889q12l248R98J926k273j284L012
2206D70R18l008o59L100N62k479O29K906j410k911K298K406l312j805L511J56
2222A372m301N72L856j630l449K494K879k508j926L505K152l350o02M341j63m461
$$ plain form
2108 944 -873 -699 2560 1470 -2841 -1790 1761 428 -1479 1027 1888 -1765 -2680 1186 2832 297
2124 297 -935 305 -167 -1565 692 2882 -253 -3067 -607 637 -1479 -563 1977 7 -3250 -1617
2140 -1617 1595 1492 243 545 416 -992 -285 2427 2460 -231 -704 531 -607 -1177 1421 1784 -1664
2157 -1664 -2822 -820 -125 -257 653 406 -1295 -1402 556 1710 1166 853 1150 25 -1037 829 2557
2174 2557 656 -1277 -628 -849 -1850 -306 830 -1312 -2600 -962 -198 -1008 -51 1672 641 -1283
2190 -1283 -128 2448 1929 239 1362 1966 -607 -738 2151 1339 -1909 -911 1015 -1258 -2542 470
2206 470 1388 -1620 -2279 821 1383 -1096 -467 2439 1029 -1882 416 2822 -490 -2295 1216 1372
2222 1372 -2929 -2357 1499 -131 -3580 -1086 1793 -715 -2641 864 3016 -334 -936 3405 3242 -1219
2238a219J619M284k912l944L179J980m560j553M276O6m867J22M098q85l649K525
2254a440L727l200k886M748K765m579p49M916q49m754K080M397k846m113K616
2269a67K636l417j799M116J058m998l17N375k93m451K183L929l499l136M454K403
2285D077m674j779L807j5m245O66M057j934m496K095L913k655k566M175J741m602
2301b435K7N383om151J345L489k118k764K967K505l799k809L454J338m049m53
2317b076M034j416m399K159L943k597k470K898J635l231n16L739N14l802k57L555
2333A713p49l250J774K808l061k528L424J850l306m63L250l96k698J369L078j133
2349A682k624J499K269j863j774K580P80l565o88L192n34l065P46J989j938j708
$$ plain form
2238 -1219 400 4684 1772 -2172 1007 2987 -1573 -3126 1150 1216 -3651 -3529 569 -316 -3965 -1440
2254 -1440 2287 -913 -3799 949 3714 -865 -1614 3302 2453 -2301 -221 4176 1330 -2783 -167
2269 -167 2469 -948 -2747 1369 2427 -2571 -2888 2487 2194 -2257 -74 3855 356 -2780 1674 4077
2285 4077 -597 -2376 1431 1416 -2829 -2163 1894 -40 -4536 -2441 1472 -1183 -3749 426 2167 -2435
2301 -2435 -2408 2975 2969 -1182 163 3652 1534 -1230 1737 4242 443 -2366 1088 2426 -1623 -2076
2317 -2076 1958 542 -3857 -1698 2245 -352 -2822 76 1711 -1520 -2036 1703 2217 -1585 -1842 1713
2333 1713 964 -2286 -512 2296 -765 -3293 131 1981 -1325 -1788 1462 1066 -1632 -263 2815 1682
2349 1682 -942 557 2826 963 -811 1769 2549 -1016 -1704 1488 954 -2111 -1365 624 -1314 -3022
2365c022K144J448j962j111K160J013j765J31K485k80k412J167K491j346j536
2380c95J742M61k054k31J893k30j751j15J201l00j301P22J343j336j365J654J009
2397I47j470j61J369n35j192Q65R39o34q46L30M07m67l51P70M86r99m38J238L35
2416E93p55M78O17o73k24P46K95l68j50j27p3J1l53l5K22p71m91N29M3l86J78
2437f94J55k56J97K42J49N29j76l35O71L30n08J36O91n84o76N07L72p55l23L20
2457hk3m89j39N25L16q32n7R92n7r32R18Q37j223l81J311Jj224K02P97n61p42
2478g69M42O62n74p89Q14P18j116k68J770q0j567Q49J499j058j039J365M15j466
2496a92j85J093k64j276J13J090o94j382J093J244j535q20K026M98j959N50K022
$$ plain form
2365 -3022 -878 570 -1392 -2503 -343 670 -1095 -964 1521 1241 -1171 -4 2487 1141 -395
2380 -395 1347 1808 -246 -477 1416 1186 -565 -680 521 221 -1080 -358 985 -351 -1716 -62 947
2397 947 -523 -684 685 150 -1042 -177 762 128 -718 -388 19 -448 -799 -29 457 -542 -980 258 593
2416 593 -162 316 933 260 36 782 1077 709 559 432 359 370 17 -18 204 -567 -1058 -529 -486 -872 -694
2437 -694 -539 -795 -598 -356 -207 322 146 -189 482 812 304 440 1131 547 -129 378 750 -5 -328 -8
2457 -8 -31 -520 -659 -134 182 -650 -707 285 228 -704 214 1051 -172 -553 758 759 -465 -263 534 -27 -769
2478 -769 -327 335 -239 -1028 -214 504 -612 -880 890 810 -757 92 1591 533 -506 859 1274 -192
2496 -192 -377 716 452 -824 -711 379 -315 -1697 -604 640 -895 -1715 311 809 -1150 -600 1422
2513A422q64j291J320Q97j348n31J333J73j653q0J628l95k113R08J880j589j427
2530a730K074Q71k242J75K156o69j706J147J345j508j151J581P95k082o94K251
2546F13O9k565N34K378j152j844K044J319k190j10K622l37k068R75K077j367j898
2563i00J528J566k147j470K245N11k871L8K634j302k362K044J610k465p06K861
2579H14K08k661M76K684o87k219J189K107j790j734K472R85l025j9K941j026k701
2596a986K110K273k563j519K639J104k593k84K543m03k696Q06K403j635k240K177
2612A36J208l384l66L551n28l450J241K829j573j829K473J598k496p82K870M60
2628A958k669O79K798j890k798K604K360l381j532L197k2l353Q85L157j606k710
$$ plain form
2513 1422 558 -733 587 1484 136 -395 938 1111 -542 -622 1006 611 -1502 -594 1286 -303 -1730
2530 -1730 344 1215 -1027 -852 1304 635 -1071 76 1421 -87 -1238 343 1138 -944 -1638 613
2546 613 682 -1883 -1349 1029 -123 -1967 77 1396 -794 -904 1718 1381 -687 288 2365 998 -900
2563 -900 628 2194 47 -1423 822 1333 -1538 -1500 1134 -168 -2530 -486 1124 -1341 -2047 814
2579 814 1022 -1639 -1163 1521 834 -1385 -196 1911 121 -1613 859 1844 -1181 -1200 1741 715 -1986
2596 -1986 124 2397 -166 -1685 954 2058 -535 -819 1724 1321 -1375 -569 1834 199 -2041 136
2612 136 1344 -2040 -2406 1145 617 -2833 -1592 1237 -336 -2165 308 1906 -590 -1372 1498 1958
2628 1958 -711 -32 2766 876 -1922 682 3042 -339 -1871 1326 1304 -2049 -1164 1993 387 -2323
2644b323J891J886k274j015L205L70l831P5M020q79l578K052K619l326j844L800
2660H48J110l658J16L091j029k652K354K933k784k554L256K002l578o32M000p19
2676B104m557J567L733k465k851K853J145l840l60M172o9m202P99L681j482l042
2692b814K875K925l657k213M199J100l996N87L698k087l516K945L047l247k342
2707b496L459J349l751l39M436m42m441J252L822k223k933L365J515m447p80M332
2723A678k24m097R44L398k025k918K801K855l024k186L475J514l447K96L888j514
2739A414l673K433L069k953k076L018Q21l522l58L466j33l402M36K966j255k439
2755b188K447J838l059j168L411M32l156N74K659j538k335J758J975j829j713
$$ plain form
2644 -2323 -432 1454 -820 -1835 1370 1740 -2091 -2016 2004 1125 -2453 -401 2218 -1108 -2952 848
2660 848 1958 -1700 -1584 1507 478 -2174 180 3113 329 -2225 1031 3033 -545 -1177 2823 2104
2676 2104 -2453 -886 2847 382 -2469 384 1529 -2311 -2671 1501 1432 -2770 -1971 1710 228 -2814
2692 -2814 61 2986 -671 -2884 1315 2415 -1581 -994 2704 617 -2899 46 3093 -154 -2496
2707 -2496 963 2312 -1439 -1778 2658 2216 -2225 -973 2849 626 -2307 1058 2573 -1874 -2654 1678
2723 1678 1454 -2643 -1699 1699 -326 -3244 -443 2412 -612 -2798 677 2191 -1256 -960 2928 1414
2739 1414 -2259 174 3243 290 -1786 1232 2053 -1469 -1827 1639 1506 -1896 -1460 1506 251 -2188
2755 -2188 259 2097 -962 -2130 1281 1713 -1443 -869 1790 252 -2083 -325 1650 -179 -1892
2770a892J717J093j920k17K436j51k544J054K414j222j514J828P38k042m32J918
2786A264M6j817l03R70k83j100N18J072j145j064J320Q70j052R2J328l84r21P42
2804A53J016l39m65n4J50r5j71N3N8n03n78L94K79k31O8Q3k24M7L87K10M30m3
2826F25q07J49Q79l45p18O32O0j222j69R79or07n1O24j90n85Q02J237q58j021
2846h92J441R96j398j29J813n78j896O96J403j087j299Q93N50j562p09J598N80
2863D20j916j59K218m21j818J442K077j666j429K250Q61k148j38K102m54k256
2879a035M78J830j037j982J377J597k049j395K636R14k564J73K718q42k162J506
2895A63K004j635j594J691Q47k142o78K341J2k844k0K628q23k267J882J962k466
$$ plain form
2770 -1892 -175 918 -1002 -1219 1217 1066 -1478 -424 1990 768 -746 1082 1820 -222 -654 1264
2786 1264 1310 -507 -810 160 -123 -1223 -705 367 -778 -1842 -522 348 -704 -612 716 332 -589 153
2804 153 1169 830 365 311 461 366 195 248 306 -197 -775 -381 -102 -333 -265 -182 -406 -359 28 238 668 625
2826 625 -182 -33 846 501 -217 415 475 -747 -916 63 57 -850 -901 -277 -467 -1052 -250 987 129 -892
2846 -892 549 1545 147 18 1831 1253 -643 53 1456 369 -930 -37 513 -1049 -1758 -160 420
2863 420 -1496 -1655 563 142 -1676 -234 1843 177 -1252 998 1859 -289 -427 1675 1221 -1035
2879 -1035 -557 1273 236 -1746 -369 1228 -821 -2216 420 1334 -1230 -1057 1661 819 -1343 163
2895 163 2167 532 -1062 629 1476 -666 -1344 997 1009 -1835 -1855 773 -50 -2317 -435 1527 -939
2912i39j064K803R88k218J83K124o41k044J012K252j326k357J349J348k200r04
2928a634K512j4l030L37K462p40j525J433J270j743q74K143J217j761p79J805
2944A079q7j999Q75K185j605k226J437J271j562l51J723l64j874M57K036n1j418
2961d74M91J106j020q44J800R66k142r64J564n7j352O53J078j484j334J064J202
2978B53n45o34P05L13j111L73J969J08j725J57J207o15l37J336Mj879m47J074
2996B06K59n39j00J68p73p20R01J387o00j023N16K88o65Q16J400q28j356L72N21
3015B30l4J01L30n50j002j54R86O56o03l32J36m54j19J431P00j051n13M52p1J33
3035B72Q79P2j073o81K19L99J49r1k09m89p95K84J263j5o63J14L1n61P76J200
$$ plain form
2912 -939 -2003 800 1788 -430 -247 1877 1236 -808 204 2456 1130 -1227 122 1470 -730 -1634
2928 -1634 878 864 -2166 -1829 633 -107 -1632 -199 1071 -672 -1546 597 1814 53 -726 1079
2944 1079 992 -1007 -132 2053 448 -1778 -341 930 -632 -983 740 376 -1498 -1041 995 944 -474
2961 -474 17 1123 103 -741 1059 2025 -117 -1081 483 426 -926 -273 805 -679 -2013 -949 253
2978 253 -292 -926 -221 92 -1019 -646 1323 1431 -294 -137 1070 455 118 1454 1458 -421 -868 206
2996 206 465 -74 -174 -6 -779 -1499 -598 789 189 -834 -318 -30 -695 121 1521 693 -663 -291 230
3015 230 196 297 627 77 -925 -1079 -93 563 -40 -372 -236 -690 -809 622 1322 271 -242 210 139 272
3035 272 1151 1223 150 -531 -312 87 236 145 -64 -553 -1348 -1064 199 184 -479 -365 -334 -895 -119 1081
3055A081k99q16J5J28R9M48L89l07r03m72N85N21l58j46J89q44n82J261P81q18
3075d8k74M57m80j29Q93N25p25o18J61L95o7p9L74j84j183J57J092j87o66O02
3095A6J81r56K06J349q5p49J46L70l04j08N96L11q43p21P53L62r04N2Q12q00r89
3116a305R68P24q09l17Q63j62o03M96Q55l38p26L94N63l72n01R26J99j360o0J303
3136G38l79j091Q21M86j137k16J139J14r76J69Q05k34p07M87Q73q83q16J023N18
3155G34j312o1J303n38j331R39R43j079n57J157K56r70O5J193m6j108L31J191
3173A110o08j119J201O18j643k40J601m23j605P98J072j218p89J263M66j142k85
3190i43J361P4j343L89J561p69j343J316J006j663m33J808k89j732O33J446j106
$$ plain form
3055 1081 782 -34 -19 109 208 656 1045 738 -165 -637 -52 469 111 -35 154 -690 -1272 -11 770 -48
3075 -48 -322 135 -345 -474 419 944 219 -399 -238 157 90 11 385 201 -982 -825 267 80 -586 16
3095 16 197 -759 -553 796 711 -38 108 478 174 66 662 973 130 -591 162 524 -380 -328 484 -316 -1305
3116 -1305 -337 387 -422 -739 124 -38 -641 -145 710 372 -354 40 603 231 -270 656 855 -505 -565 738
3136 738 359 -732 89 575 -562 -778 361 475 -501 -332 473 239 -468 19 892 9 -807 216 734
3155 734 -578 -639 664 126 -1205 -266 677 -402 -959 198 454 -516 -451 742 696 -412 -81 1110
3173 1110 502 -617 584 1202 -441 -681 920 497 -1108 -310 762 -456 -1245 18 484 -658 -943
3190 -943 418 492 -851 -462 1099 330 -1013 303 1309 -354 -787 1021 732 -1000 -367 1079 -27
3207b7j051J134Q76j320o06J597L45j699J66J878p38j720J299J301j831p22J903
3224G85N6j970L23J680p89j467J008J308j323r26J709O65j751j41K215n31k008
3241a157J258J645j599j273J946N83k174p1J816l90j877P19J677j205j504J663
3257E7J175k026n70K382J1k449R87K061j489j625J923R25j994n44K061l9k047
3274a201L63K060q82j913J635J565k007r73K519K37k489N54K292j220j993J636
3290A83J337j990r98K095M26k416P2K350n54k367J388K024j923j295K447P86k575
3307a010R5K565q10k199J366J739j753j465K001R61k179o72K483j90k567J003
3323f32K409j666j911K188J210k434m65K598k39k539O91K234j185j962J657J549
$$ plain form
3207 -27 -1078 56 932 -388 -994 603 948 -751 -585 1293 555 -1165 134 1435 -396 -1118 785
3224 785 841 -1129 -806 874 85 -1382 -374 934 -389 -1315 394 1059 -692 -833 1382 851 -1157
3241 -1157 101 1746 147 -1126 820 1403 -771 -842 974 584 -1293 -574 1103 -102 -1606 57
3257 57 1232 -794 -1364 1018 1029 -1420 -433 1628 139 -1486 437 1362 -632 -1176 885 846 -1201
3274 -1201 -838 1222 340 -1573 62 1627 -380 -1353 1166 1403 -1086 -532 1760 540 -1453 183
3290 183 1520 -470 -1468 627 1053 -1363 -1291 1059 505 -1862 -474 1550 -373 -1668 779 1565 -1010
3307 -1010 -915 1650 840 -1359 7 1746 -7 -1472 529 1490 -689 -1361 1122 932 -1635 -632
3323 -632 1777 111 -1800 388 1598 -836 -1301 1297 1058 -1481 -790 1444 259 -1703 -46 1503
3339A503k193j166K625M99k688M09K695j266k185K054J787k291j175K536K82k465
3355a039J61K483p57k467J230J997j836j654K371R26k783j28K858n40k526J281
3371d23K076j804j443K112J038k183o66K307J8k402O11K420j370k102J912J617
3387A718k381p25K579Q9k566O72K259j119j860J478J434j796j176J994O55k336
3403a081j51K357o41k368J424J887j859j190K222N60k211K55K051m33j916R11
3419a83J679j281j403J642J106k128o24K162j69k134P75J902j331j505J622J028
3435A158j694m40J839o9j730M09J681p10j559R92J225j597q82J996K71k053K89
3452h74J703o87j285J359R16j343o51J438M43j275jJ371m29j571P39J301j086
$$ plain form
3339 1503 -690 -1856 769 1268 -1420 -1011 1684 418 -1767 287 2074 -217 -1392 1144 1426 -1039
3355 -1039 -878 1605 848 -1619 -389 1608 -228 -1882 489 1415 -1368 -1496 1362 822 -1704 -423
3371 -423 1653 -151 -1594 518 1556 -627 -1293 1014 1032 -1370 -759 1661 291 -1811 101 1718
3387 1718 -663 -1388 1191 1280 -1286 -614 1645 526 -1334 144 1578 -218 -1394 600 1255 -1081
3403 -1081 -1232 1125 484 -1884 -460 1427 -432 -1622 600 1160 -1051 -796 1255 822 -1094 -183
3419 -183 1496 215 -1188 454 1560 -568 -1192 970 801 -1333 -558 1344 13 -1492 130 1158
3435 1158 -536 -976 863 794 -936 -527 1154 444 -1115 -123 1102 -495 -1377 619 890 -1163 -874
3452 -874 829 142 -1143 216 1132 -211 -862 576 1019 -256 -257 1114 685 -886 -147 1154 68
3469F8j056J333L17j706J18J476l61j227O03J036q44n81J174O51j284l12J225
3486F30N1j214L97J242r45j146J088O44j256j11J144k63j156M50J129m70o69N90
3504A35N97q81m27J199M01j349q9J121o63r62J042O57j250n51Q97J57o31L16Q68
3523E87n42r12M89J143l29n80O98J44j160R2J399j74j135J71M09p72j43J015J04
3542E04r49m63N99L46l12K83N89o18r21P53J028m53l88N06n12p80N88Q94l15p64
3562c85LQ2p8Q7O74J41q95m62Q98M62k87K63J09q80l94R55N15l81k46k87l87m8
3584e41N66M68k25q82k24M34K21J83N40k87r37M8R21K90m4M6m88n65L18O18L35
3605G95l51o02m37J68K86M91K26o27p18J21N67K42L76j08p72l66N42N09K33J8
$$ plain form
3469 68 -988 345 662 -1044 -926 550 189 -1038 -435 601 -243 -824 350 1001 -283 -595 630
3486 630 681 -533 -136 1106 161 -985 103 747 -509 -620 524 261 -895 -445 684 214 -455 135
3504 135 732 -149 -576 623 1024 -325 -414 707 44 -918 124 781 -469 -1020 -123 34 -597 -281 587
3523 587 45 -867 -378 765 436 -144 554 698 -462 -370 1029 855 -280 -109 300 -472 -615 400 504
3542 504 -445 -908 -309 37 -275 8 597 -21 -942 -189 839 386 -2 504 -8 -788 -200 694 379 -385
3562 -385 -382 -300 -378 -291 383 524 -371 -833 65 527 240 503 612 -268 -662 293 808 427 181 -106 -493 -541
3584 -541 25 493 268 -614 -838 -404 -183 0 540 253 -684 -636 285 575 531 577 89 -476 -158 460 795
3605 795 444 -158 -595 -427 -141 350 576 -51 -769 -648 -81 161 537 429 -343 -709 -167 342 575 593
3625E93o53n57J71M30N09Q8o84o06P8L20N66M52l53r05k0M31L20N33J35p77o58
3646e87K66N86L74K9m67o04k46K41P32L69n96p41n6J67L39P01Q4r33n12M55M48
3667D9L65K76l67n60l50L36Q63K62o52m26j29k71N01R30k39r63k95K89J93L81
3687A93L71k71q06k44N64P25k1k93j80l68l43O68R07m91p68J3J2j82O14O14n31
3708A83p40m3N26M29L5L2j84o91r2R32M82n46l79K64n08j95Q44L60p32o04J78
3729d49K09K7K32L88n25o58J93R15R9m79J94O6o38R1J071m6q37L5L18l43j8O18
3751D63N7p02m66N22K98k78pN04l45p94O81Q30o61l75M97j51n64L98O63l58o75
3772d63J82L55k71j55M97K16p71k49J015J42p86L36N58p06l25R24K75q13j14M76
$$ plain form
3625 593 -60 -617 -446 -16 493 581 -103 -709 -631 -311 255 707 354 -551 -571 -140 180 713 848 71 -587
3646 -587 -321 265 639 668 201 -403 -649 -408 324 693 97 -644 -700 -533 -194 507 591 -342 -854 -399 49
3667 49 414 690 323 -237 -587 -251 612 874 222 -204 -333 -604 -103 827 588 -375 -670 -381 -188 193
3687 193 564 293 -513 -757 -193 532 511 218 38 -330 -673 -5 902 411 -357 -344 -332 -514 100 714 183
3708 183 -557 -600 -74 355 390 422 238 -453 -545 387 869 323 -56 208 -300 -495 349 709 -23 -627 -449
3729 -449 -240 -213 19 407 -118 -776 -583 332 431 -48 146 212 -426 -335 736 690 -147 -112 206 -137 -155 463
3751 463 520 -182 -648 -126 172 -106 -113 391 46 -748 -67 763 102 -273 224 73 -491 -93 570 212 -463
3772 -463 -281 74 -197 -352 145 361 -410 -659 356 498 -288 48 606 -100 -425 499 774 -39 -153 323
3792C23j03n86L06N02m69p03L99O13n74l00P50Q7j024M31R33m25n84O13K73n55
3812i3j72P17qp08K5O84j89p63M84N87q11m38R16K12r72L63P99n81n85O78M38
3833E83o82l15P11O0p02mP68k86q60M02Q09o94n47R96J96r53J02J036l43p91O70
3854A56N58n91l89O73L36r24k42R08o6j078M11Q80p39q04R88M82j107q6J083k16
3874B33r47M87Q68n84o64O78N89q79l86J107J09j246K32J168o56r56R70N78j091
3893c90k20J158j9j010K81R44m64q64O71O99q91o48J116K99j339Q1J218n25j078
3912i81Q48Q40r75o11J157K73j085Q8J072j14j140N63R47p53q47J097M87j301
3930d35j25J311l62j239O19J022r00p15J026N05j146k05J124O1j245L23J173n97
$$ plain form
3792 323 220 -366 -60 442 -27 -730 -331 282 -292 -592 158 245 -779 -348 585 160 -424 189 462 -93
3812 -93 -265 452 444 -264 -239 445 256 -507 -23 564 -247 -685 231 443 -529 -166 633 52 -533 145 583
3833 583 -99 -414 297 357 -345 -349 419 133 -727 -325 484 -210 -757 239 435 -518 -416 620 277 -514 156
3854 156 714 123 -266 407 743 -181 -423 485 419 -659 -248 632 -107 -911 77 559 -548 -634 449 233
3874 233 -714 -227 641 57 -607 71 660 -219 -605 502 611 -635 -403 765 109 -847 123 701 -390
3893 -390 -610 548 529 -481 -200 744 280 -584 87 786 -105 -753 363 662 -677 -596 622 97 -981
3912 -981 -133 707 -268 -879 278 551 -534 -446 626 512 -628 -65 882 129 -718 379 866 -435
3930 -435 -560 751 389 -850 -231 791 -109 -824 202 707 -439 -644 480 541 -704 -381 792 195
3948A95j091R49Q89j364l78J332l8j273M35J097o45r19Q76P71r92n64J165L50
3966G95j230l7J372m31j305P72J014j102o96J289K03j317N8J223l80j046N52R83
3984G17q22p45J047N82j227j59J279j40j339O47J097r53r03J181M76j208j10J183
4002F03j55j132L67J119o29r73R05Q03j133o06J407K6j361M00J196p38j019R09
4020a1P16j078l62J102J06j012R0J127l98j092P56J004j045o37J215L89j451J39
4038d42J231n08j045O80Q31p71o82R06M31j103j43J175p6j235M75J173q72r35
4056i10J131M76j135j56J181k43j011L93R31o20o97Q53M70q70m06J109J38j156
4074e22K35J090o31r68Q97O55r88l85J006Q1j039J37R99m30p95N33P58p40n97
$$ plain form
3948 195 -896 53 942 -422 -800 532 494 -779 -344 753 108 -811 65 836 -156 -720 445 795
3966 795 -435 -472 900 469 -836 -64 950 -152 -848 441 644 -673 -615 608 228 -818 -266 717
3984 717 -105 -850 197 779 -448 -607 672 532 -807 -160 937 -16 -919 262 738 -470 -580 603
4002 603 448 -684 -317 802 173 -800 105 908 -225 -831 576 602 -759 -359 837 99 -920 -11
4020 -11 705 -373 -735 367 473 -539 -449 678 280 -812 -56 948 -97 -734 481 870 -581 -442
4038 -442 789 281 -764 -84 747 -24 -706 200 631 -472 -615 560 484 -751 -276 897 25 -910
4056 -910 221 697 -438 -594 587 344 -667 -274 657 37 -660 193 663 -207 -613 496 634 -522
4074 -522 -287 803 172 -796 101 756 -232 -617 389 470 -569 -432 567 137 -658 -125 633 -107 -704
4093g04R65L62j028l9J109l64r80O62Q02q75n58Q80K46q28l8P65o6q07K75Q45
4113F24n34p39Q10N13r73k62J047r0r66M21O75n88n64O02M17n87l74P59J39q26
4133d96J21Q74k04q82N56O03o76k92Q19R7q67N9P04j67n91L26L27m04m96O76L76
4154D63o40k70P25j33p04N07O68n49n08N22J61m49R2N33k26n82Q1N34j05l02K41
4175E9K31n66k49Q22J89o66J34L14l17k26N73K33n24l07L39N4j56P3L24k70o25
4196e61K20O58k42k67K83n2n14K71O35j59l87Q3M4j63M5N29r1m43k79L51K03j96
4218c2J25K84n56m03O41L77l59p6J55l87j87M63L33k52l24j3J38p6J31L45j00
4239B27o78nN78mj97K70q3n42M6O64M6k03j47n5j38O8L59K27k64n16J62K45m8
$$ plain form
4093 -704 261 623 -405 -444 665 301 -679 -17 785 -90 -648 232 478 -350 -388 377 311 -496 -221 624
4113 624 90 -649 161 674 -299 -561 486 396 -570 -149 526 -62 -626 -24 393 -194 -568 191 330 -496
4133 -496 -375 499 295 -587 -31 572 -104 -396 423 520 -347 -288 416 249 -342 -16 311 -93 -589 87 463
4154 463 -177 -447 278 145 -559 -52 616 67 -441 81 242 -207 -115 418 192 -390 -309 225 120 -182 59
4175 59 290 -276 -525 297 486 -180 -46 268 -49 -275 298 531 7 -300 39 93 -63 10 334 64 -561
4196 -561 -341 317 75 -192 91 39 -475 -204 431 272 -115 -32 12 -151 -106 423 332 -111 -390 -39 164 -32
4218 -32 93 377 -179 -582 59 436 77 1 156 -231 -418 45 378 126 -198 -211 -73 -149 -18 327 227
4239 227 -451 -456 122 118 -79 191 108 -434 -388 276 322 119 -28 -83 -221 -153 206 433 169 -347 -185 60 12
4262A2O7L18m57m82L75M30q2j14N2l10k38K85M07J25m22k80K83%p3L72K23o88
4284a97k69N27J35j44J55P6m81k28M66L36j39l00o3J03k22J74M90j43o06q9M51
4305C2n9L3K19m8n01R4L27J53j21k14R9j46p0K84K42k23m09J55K18j64J76K62
4327C39l38l04J72K91P8o2o0j54j70J18K28K44l55k63J34j7k8L07O5m14k23L53
4349e9J19m2J26m5k66m6J82K50K0k49q8O2j08J44K65q6m38L6J31k3J58J83l15
4372h9j62P8J05K11K5o3j33r5k1K02K22j55k77Q8m1n7K98Q3l38k6P7j0N5K73r3
4397A57k30n9Q4K08N6j63P2j25j98J06L25j05l47J79p1k09K00K39j37k10J25R3
4419a0j3j8J55L3k00r8K84Q2k68Q5J86k65j28L19Q5l58n1K58j19j37K10R6j17
$$ plain form
4262 12 79 397 -60 -542 -167 263 181 67 119 -191 -429 -144 263 388 -34 -314 -31 -31 -104 268 491 -197
4284 -197 -466 61 196 52 207 283 -198 -426 40 376 237 -63 -126 -23 -245 -71 419 276 -330 -419 32
4305 32 -27 6 225 177 -324 -230 97 250 129 -85 14 -132 -202 82 324 101 -308 -153 65 -99 77 339
4327 339 1 -303 -131 160 238 176 116 -38 -208 -90 138 382 27 -236 -102 -119 -147 160 225 -189 -412 -59
4349 -59 60 18 144 99 -167 -213 -31 219 239 -10 -98 -36 -144 0 265 179 -259 -223 -92 -115 43 226 -89
4372 -89 -251 -173 -68 143 168 105 -28 -123 -144 58 280 125 -152 -64 -105 -162 136 219 -119 -145 -68 -78 -23 250 157
4397 157 -73 -132 -48 160 216 53 125 0 -198 -92 233 128 -219 -40 -111 -320 -120 119 -18 -228 -103 -10
4419 -10 -23 -41 114 147 -53 -151 133 215 -53 32 218 -47 -175 144 229 -129 -180 78 -41 -178 32 128 11
4442A1j44J14J67j81r9K69J06l88PM30k35k93K57J89m05l4L58p7k57J22K59j27
4464D9k79K19K66j36k28K67J79m84jM41j17m19K78J74l21j74L39P3k91m9K28L7
4486E1l19J07L95j05m02K98K93m18j29M87k2n35J77M07k41k70K58J21k18j79L88
4507A44J14l40j21M71m1n02L35L59m65k56M75O7m50P6L78j99l52J65L25k10k69
4528b96K60K32l34q0M59L0n60K65L84k89k81M01J01m16k8L22kl72J27L56k44l73
4550c38L20L26l61j59L67K5n37K42L92l19k59L79J19l83n8L86K0l80N9L84r4m00
4572b69K59L52l99l12N90J03n42Q3N29k70l56L30J70l41j43L79M3l40p5M14n0
4593A55n13J94M52l81k55M88J36n08k4N09j43l71K15L27k35k73L81J66l89j73
$$ plain form
4442 11 -133 -19 148 -33 -132 137 243 -145 -138 292 57 -236 21 210 -195 -229 129 52 -205 -83 176 49
4464 49 -230 -11 255 119 -109 158 337 -147 -148 293 176 -243 35 209 -112 -286 53 126 -165 -214 14 51
4486 51 -268 -161 234 129 -273 25 318 -100 -229 258 236 -299 -122 285 44 -226 32 153 -65 -244 144
4507 144 258 -82 -203 268 227 -275 60 419 -46 -302 173 240 -210 -134 244 45 -307 -142 183 -27 -296
4528 -296 -36 196 -138 -218 241 271 -289 -24 360 71 -210 191 292 -124 -152 170 168 -204 -77 279 35 -338
4550 -338 -18 308 -53 -212 155 180 -357 -115 277 -42 -301 78 197 -186 -244 142 162 -218 -159 225 131 -269
4572 -269 -10 342 -57 -369 221 324 -218 -135 394 124 -232 98 268 -73 -216 163 206 -134 -209 205 155
4593 155 -358 -164 288 -93 -348 140 276 -232 -256 253 110 -261 -46 281 46 -227 154 320 -69 -242
4613b42M78M7n25J44M39k80l65M29K00m97l3M71j59l43J51L59k46l02K26K99l10
4634e9k91M85J60n77M6O01k29n02M31K91m38j38M38M4m26O2L57q8l15J20L06k28
4656E0m12N00K04n07o7N05j61n05L38L28l46k33L53O7k88j22M13K8m28J95L50
4677B62j86m14L69L26m90j12M96l0m80K10L56k77k35K35K95l60j79L08J44l32
4697i4j00M28r6m82L04L20l62j83M12R3n04J28L64j40l01J23L01k34k60L11K70
4718B98l60j78M69l8m66K81L56l86j98L79J04l79m3L09m0l61N9L74j16l31J68
4739i9L18k56k31M41N4m87J47L83k24k21J82K06k38j13L08Lj99j17L11K6l82J10
4761g8L22j86k49K97M2k53l2L13j23k39J38J95j84j18J56J14j86j05K65J10l63
$$ plain form
4613 -242 236 283 -242 -98 341 61 -304 125 325 -172 -205 266 107 -236 -85 274 28 -274 -48 251 -59
4634 -59 -350 135 295 -282 -236 365 136 -366 65 356 -82 -220 218 262 -164 -102 255 167 -148 -28 278 50
4656 50 -362 138 342 -165 -232 273 112 -393 -55 273 -73 -306 47 114 -174 -296 117 145 -283 -88 262
4677 262 76 -338 31 357 -133 -245 251 221 -259 -49 307 30 -205 30 325 -35 -214 94 238 -94
4697 -94 -194 234 138 -344 -40 280 -82 -265 147 240 -264 -136 228 88 -213 -90 211 -23 -283 28 298
4718 298 -62 -240 229 191 -275 6 362 -24 -222 157 261 -118 -161 148 108 -253 -194 180 64 -267 -99
4739 -99 219 -37 -268 173 227 -260 -113 270 46 -175 7 213 -25 -138 170 173 -26 -143 168 194 -188 -78
4761 -78 244 58 -191 106 148 -105 -137 176 53 -186 -48 147 -37 -155 1 115 -71 -176 89 199 -164
4782a64J9L19j21k53L05R2k90M8J46ro1l0J26j09j32J04J10l8k39J96J1j67K5
4805a12K25m7k74J97Q4k35Q4J74p8j35N7R2l1n4O0Q2j18p5Q0J80k09KJ99j70j48
4830a70K05J63k53K4P9j4n3K5R9j40r0K7J90o1j91K20pk12J1K85j53j33J07R2
4854E0j89J14J03L9j60m4N6Q6j10N5J91j89j66J92J70j78j09J90p1j77J29J43
4876A25j35o6Q7P2j37m6K01M2k90K4K40n0j85O8K51l32k1L27k8j77K4M3q9l2J31
4901D7J17r5j34Q7J28j66r8K46L6l07Q0K01j43q9M8J02j58KP0Q0j01n7P8L5q3
4926g4L3K12j23j86J17J80j93o1J46k2o5J33j2o4r2NJ83k0j42L8J19j20j10K57
4950A39qk37L7R7j36M8N5M0p8j13R1P4N1j12L1J36k30M6J71M0j92P4L0j53R1J05
$$ plain form
4782 -164 -145 174 53 -200 105 197 -93 -45 101 92 31 1 127 18 -114 -10 100 62 -177 19 30 -137 -112
4805 -112 113 66 -208 -11 73 -162 -78 96 18 -117 -60 32 1 -53 7 89 -29 -104 -24 156 -53 -51 148 -22 -170
4830 -170 35 198 -55 -31 48 34 -19 6 105 -35 -125 -98 92 31 -160 60 53 -159 -148 137 -16 -149 -42 50
4854 50 -139 -25 78 117 -43 -87 -31 55 -55 0 191 2 -164 28 198 20 -89 101 30 -147 -18 125
4876 125 -10 -76 11 83 -54 -100 101 143 -147 -123 117 67 -118 -50 201 -131 -152 175 147 -30 -6 37 -52 -84 47
4901 47 164 69 -65 22 150 -16 -114 132 168 -139 -59 142 -1 -90 -42 60 -98 -96 -26 54 -47 -104 -26 9 -74
4926 -74 -41 171 48 -138 -21 159 -34 -95 51 29 -36 97 85 21 -71 -66 117 97 -45 -7 112 -8 -118 139
4950 139 131 -106 -69 28 -108 -60 -5 35 -43 -156 -65 9 60 -52 -21 115 -115 -69 102 142 -50 24 54 -99 -8 97
4976I7p0l5j19P7R2N4n6l5Jj65O7J75nj18jm5o8J38J30n9n8j44L7J35O2p1K7J0
5004E3j73N7J90l6o7L8k4j20J52P7J1r4j34K6R8l2k6P1o2k12O4K01M6j44j5k7
5030h2N1RO8N4o0j84J32J33o6o2J25r0j41R2J88q5j09J5P0j03J5P5J01j74q6J64
5056E0j7j19N2J83j84j21J08K40k61m8J46j1p8L7J35Lk48M2J82q8j47K27O2k77
5080a32L4K27Q7k45QJ38j15j30J82J58k35j26Q2J52j98j2K17m8k50R0K45j07j39
5103a17Q2Q6k11Q7K48l8k26KK33n7r6L2J62j88j77J91J55j48j28K35j29j69J59
5126a2J61j61j51J46R4j01r0K31k3j92r7K34J11k75K19Q5k23j51K03J47j46m6
5148c7J03mo5jK27q8k87R5J37p1j53L06p6k39N8K22j19o7P2j7m1j14J15J58j57
$$ plain form
4976 97 27 -8 -127 -50 42 96 40 5 6 -159 -92 83 78 -40 -41 -86 -154 -16 114 55 -3 -147 -110 25 87 16 43 53
5004 53 -120 -63 127 91 24 62 38 -82 70 147 158 64 -70 -44 54 22 -4 67 5 -207 -143 58 104 -40 -55 -82
5030 -82 -31 -22 46 100 40 -144 -12 121 55 -7 118 28 -113 -21 167 82 -27 -12 58 -45 -30 45 146 -28 -114 50
5056 50 33 -86 -34 149 -35 -156 -48 192 -69 -117 29 18 -60 -23 112 115 -133 -91 91 3 -144 83 145 -132
5080 -132 -98 129 216 -29 -21 117 2 -128 54 212 -23 -149 -67 85 -113 -125 92 44 -206 -116 129 22 -117
5103 -117 -35 51 -160 -73 175 137 -89 -87 146 89 -7 25 187 -1 -178 13 168 20 -108 127 -2 -171 -12
5126 -12 149 -12 -163 -17 77 -24 -114 117 94 -98 -195 39 150 -125 94 179 -44 -195 8 155 9 -37
5148 -37 66 62 -3 -4 223 135 -152 -57 80 9 -144 162 86 -153 -95 127 8 -59 13 -4 -45 -159 -44 114 -43
5173d3r6J30N7j41N7J60j12j26J43K8l0J7M2n2r7L9J10L1j07N1J3j13J6Q3jq7
5199b8m6P9n2j9M9J9j06M7J18r0J9M8o7PPK7P0j69qJ80m1r9R2K4l5j04J73L4j78
5228d9L3O8n3nl2P4q6j8Q5K1m8q9J58r8p4J32K5j11k9J58L6j88J48M7o9q8J34
5255H2k5k5j8K5J9o8n2J70n3j20O0Q3q1m9J01Lr2o8J94p6r6O0L3n9n9J09K6j06
5283h2l0J19L7j44M2J79j37n4J32M3j42J9J23o3m5o5J19Jj57J18O2j11j14J89
5307C9L7j42J7J55n7j62R9J3j4p3Q6M9n7r7J16J9j35K0J64l1j58J46J1m4LN1o6
5334a1pL4j0Rl1O6Ll0m0L4Rr5k0J75m6j23J36l5j25J8J56l3j18J01J9l1l3M8O
5363B6j8o3L6P9n3l5J24lo8k5Q3j59j5R0J0p1J9R2k4o0rJ08k4q4K4O0o3n2J40
$$ plain form
5173 -43 -139 -9 48 -93 -36 124 12 -114 29 57 27 44 86 34 -63 -24 86 117 10 61 74 -39 -23 60 59 -28
5199 -28 -74 5 -47 -66 -17 2 -104 -57 61 -29 -10 38 -29 -22 -15 12 82 -87 -95 85 44 -55 37 61 26 -78 95 129 -49
5228 -49 -16 52 -1 -6 -38 36 -50 -68 17 38 -10 -99 59 -39 -113 19 44 -67 -96 62 98 -90 58 105 36 -52 82
5255 82 57 32 14 39 58 -10 -62 108 55 -65 -5 78 -3 -52 49 52 -40 -108 86 10 -86 -26 7 -52 -111 -2 24 -82
5283 -82 -112 7 44 -100 -58 121 -16 -70 62 105 -37 -18 105 42 -3 -68 51 52 -105 13 75 -36 -150 39
5307 39 76 -66 -49 106 49 -113 -14 -1 -15 -88 -2 47 -10 -107 9 28 -107 -87 77 46 -112 34 45 1 4 55 -11
5334 -11 -18 16 6 15 -16 50 53 23 -17 17 26 -69 -89 86 40 -83 53 18 -107 -89 67 34 -84 17 36 5 -28 20 26
5363 26 8 -55 -19 60 7 -28 96 93 25 0 83 -76 -91 -1 9 -62 -43 49 25 -35 -44 64 40 -44 -20 40 -23 -75 65
5392F5p1J1k4P8q1J9K3Ml5lP7J3p9n0J49k2j54P3J00j16j2R9r7r2J36m4k7M9m8
5421e9N3NOoJ7o2P1j2K2mq7J84j13k2Q4J0j52Q1P0n1q6N4K7k5L9j7L8j7o6K4J
5452Go0l1J47j55P6N0jj19jM7m4P6M8rq3O8o9P6n2k9J14m7o9J61lq5k5J7J1Kl8
5483b0%Qj1K1J9n4q7Q9J30j54o3J79k9q7mJ37m8p1P4M0r1PL9R3j07p2J40M7j76
5512e1lJ65o0j96J95K4j46M0N9j1r8O8N3J3j84R4LJ10j63j8J27r9r6J91N7j93
5538a19J05J37j35q1J41N1j4r1mM8l4n0J00l2j61N8J62j10m2J19M5n5q8J54Jj43
5564c8p0J48J2j33P7P3lk01J10J06n9j63J70Nq3k7K20o8j10n2J47n8n5J09J20
5589A77j71j69K09M7j51pJ59o4j91P4J39k7p6P8nq0j7P8J23j44m5O7Qr1L6K07
$$ plain form
5392 65 -6 5 -19 59 -22 -3 20 24 -11 -14 63 76 -3 -53 96 74 -80 -7 93 -23 -35 64 -33 -125 11 -33 -60 -11 -59
5421 -59 -6 -1 5 -1 16 -46 25 13 35 31 -56 128 15 -7 77 87 -65 16 86 35 -51 3 30 5 44 27 65 48 -18 6 7
5452 7 -53 -84 63 -92 -16 34 33 -86 -87 -40 -84 -8 40 31 -52 16 -53 23 -29 -58 56 9 -60 101 98 13 -12 5 16 18 -20
5483 -20 -20 -12 -23 -2 17 -37 -124 -35 95 -59 -122 57 28 -59 -63 74 26 -45 29 69 -22 -15 24 117 10 -62 78 125 -51
5512 -51 -54 111 51 -145 50 74 -72 -32 27 16 -82 -14 39 52 -132 -38 -35 75 -88 -106 21 -78 -174 17 74 -119
5538 -119 -14 123 -12 -93 48 99 85 -6 -10 38 4 -46 54 22 -139 -81 81 -29 -71 48 93 38 -50 104 105 -38
5564 -38 -108 40 52 -81 -4 69 66 -135 -25 81 22 -141 29 34 -49 -76 144 76 -34 -86 61 3 -52 57 177
5589 177 6 -163 46 93 -58 -65 94 30 -161 -87 52 25 -51 27 22 -58 -75 3 126 -18 -63 4 12 -79 -43 164
5615A64k05j13J68Q5n0l0Q5nj32k3J86K0j56m3J03j07m7J25J08k07l9K11n1o9
5639b2K3O1l3p7NJ45Oj86K1Q4j31L3J07J02k35J6K00n6m8K0J05j17j60J12J60
5664A35j57o6J26K3j56J1J01N9k07N7J56q8q4J15J16j94l7J08J31j64J6J19o9
5687E1j36J3J74p2q3J00N8j40j9J70l3j54q6J92J07k10Q9N8n5j26J24Q6j44q9
5711a25J62Qj83J44J09k6j81MJ04K0j03J22J03j60m0P7M1j31m2J04j0j32J29J39
5735A33j32j11J07P2p1k7N3M9j59k7J65J1o9M4Rp1m1Q0R4j10n0R9No7MJ00l8j65
5763a13J00Q3pj79J33O4j40LQ5k0o4L5jN4j41J02Q5k7r1P4N0j45L4L1L9j09K8
5790c7J12m1p2O3K7n8K8RL4j60N9R5Rq9K3Q7j49P4Q1l3o9Mk6N5M7l2Ok9l7l0R7
$$ plain form
5615 164 -41 -154 14 99 49 19 104 99 -33 -56 130 150 -6 -49 54 -53 -100 25 133 -74 -113 98 47 -22
5639 -22 1 62 29 -48 -43 102 108 -78 -57 27 -104 -71 36 138 -97 -81 119 63 15 35 140 23 -137 -25 135
5664 135 -22 -88 38 61 -95 -84 17 76 -131 -74 82 -6 -90 25 141 -53 -90 18 149 -15 1 120 51
5687 51 -85 -72 102 30 -53 47 105 -35 -54 116 83 -71 -157 35 142 -68 21 79 24 -102 22 108 -36 -125
5711 -125 37 45 -138 6 115 89 -92 -88 16 36 -67 55 158 -2 -42 35 76 -55 -97 7 -3 -135 -6 133
5735 133 1 -110 -3 69 -2 -29 24 73 -86 -113 52 63 -6 38 47 -24 -65 15 109 -1 -51 48 53 -14 -10 90 52 -113
5763 -113 -13 70 63 -116 17 81 -59 -56 29 9 -55 -20 -21 33 -108 -6 79 52 -39 35 85 -60 -26 5 44 -65 -37
5790 -37 75 34 -38 25 52 -6 22 31 65 -95 -36 59 68 -21 2 89 -60 14 95 62 -7 -3 -29 26 73 41 47 18 -19 -49 48
5821D8J3q1p1Q4o0M7lN8k1Nq5J1J43p9L7J1MJ9p7K1j0l3J1m5k7L5K3rNn1M6L4
5853Co7n9J77n2p6J43l3J5n8l5O4p7K2N6M1j6l2J08l1j28R9k0j10kR5Om4MK7k4
5883dN4j22J10m5j6O2ko2jJ12n8r2PJ01l6n2M3P4r3M2J1oKq2L3N7j17J22K3l3
5913C2j45J17O6j39QL4kj5L1L5k6Kj2Q4m8p4J17Pp6KJ2P3o7J8O8j32kK0O9q5J5
5944a3P1L2n2o2J68j62lPJ00j03l4K1M2k5p9R9j03K2R2rp2L3P7j6o7K7L5k9K8
5973B5Nj1K1r6J38l2j10L9M1j4n2O8kL2j04J08l2j1o0P8K4j44P6M4j7JRJ9p3L4
6003Dj8N6o3MK1Kp4J12pm5m3M4O3o6j7J03r8o2P3J3n6LN2L7l9lm7RL4m1K1K6j0
6036a2k4Q3j08RN5m5R2M1j26NO7Jj4O0j03L2J0j5j4O2l4q2J29o5K4k6L5l4o1Q7
$$ plain form
5821 48 61 -20 -91 -7 -67 -20 -23 35 14 19 -66 -55 88 9 46 57 61 80 3 24 14 -19 -8 -53 -80 -45 -22 -31 -26 -77 -31 3
5853 3 -64 -123 54 2 -74 69 36 51 -7 -42 22 -55 -33 23 64 48 16 124 93 -35 64 44 -66 -68 27 33 -11 -7 20 -4
5883 -4 50 -72 38 -7 -23 39 37 -25 -26 86 28 -64 -57 44 8 -44 -1 73 -20 22 33 27 29 -53 -20 37 -80 42 65 32
5913 32 -113 4 70 -69 -61 -27 -29 -44 -13 22 -4 -2 -14 70 22 -52 65 72 -4 -2 10 83 16 34 102 -30 -32 -12 57 -28 -13
5944 -13 58 90 38 -24 144 -18 -21 -14 86 -17 -51 -30 12 -13 -92 7 -96 -74 18 9 -63 -30 47 31 -36 -9 26 -3 25
5973 25 30 19 40 -56 82 50 -60 -21 20 6 -46 22 20 52 -52 56 24 13 -47 31 55 -89 -13 31 14 15 24 43 -30 4
6003 4 -14 42 -21 -17 4 6 -68 44 37 -8 -51 -7 56 -10 -27 76 -22 -84 -11 2 -54 -51 1 38 -1 -4 -51 -42 -8 -49 -28 -2 -12
6036 -12 -36 47 -61 -52 3 -42 50 91 -35 -30 37 38 24 84 -19 13 23 8 -6 56 22 -60 69 4 28 2 37 3 -58 29
6066B9M5n8n8%J05j15N2M8j4q1N3L5o8J3O5N5j47M0J8K9q3L9Q0p1o2M9M2l7m4
6095d1Q9l3o5L4J5Ln7M3L7q4J0M3k6mj6J15J5m2ONq5LJ05j5j01J4L5j1l6N4M2
6126E2j05j0J9P8m5J9lJ3p5K0J12p6j17J38K7n6N5Kk9o4J0J01l5nn0J1%k6J09
6155G0m7n7k0R5k8n6oP8r1l0R3M8q9O3j3j8p7Q1nL8j24R8O2o1j04P6J37j32M1
6184B2M5l9p7J09j5K6o4kN3m4l8N1N8j65j9J01J7l4O0J9k6j08O6L4m8M2K4o3k1
6213c6m0J20l8Ll8J08o8k8L0n8M6p3J47n4K0m3L0l9L4N0l1J2m5l6J17j44PQ3N3
6242H9j02jN6m9J6l2P6j30J2M7J18j09l9kN6K1j2oJ9m3K9m9m0O9Kk3N1k2j5K5
6272A2j4nj0l3J9N7Ko5n0N6mM4o5M7O3r5L7K6J9O4p1l6K7n7J2J7J1mk8J04%q1
$$ plain form
6066 29 74 16 -42 -42 63 -52 0 48 34 -47 6 41 -27 -14 51 106 -41 -1 17 46 -37 2 82 11 -51 -2 40 3 -41
6095 -41 48 15 -50 -16 -1 2 -55 -12 25 -59 -49 -6 -32 -36 -52 63 78 36 42 47 -38 -35 70 55 -46 -32 3 -8 -44 10 52
6126 52 -53 -63 -44 34 -11 8 5 18 -57 -37 75 -1 -118 20 47 -9 46 48 19 -45 -35 66 31 26 -24 -13 -13 -39 70
6155 70 23 -34 -54 41 13 -43 -49 29 -62 -92 1 49 -40 23 10 -8 -85 -4 -9 29 -95 3 65 4 -100 -24 113 -19 22
6184 22 67 28 -49 60 45 71 7 5 58 14 -24 27 85 -80 -99 2 19 -15 45 64 38 -70 -4 30 -18 24 48 -15 -36
6213 -36 -76 44 6 9 -29 79 11 -17 13 -45 1 -72 75 21 41 -2 28 -11 23 73 42 54 9 -27 90 -54 -47 36 89
6242 89 -13 -14 42 -7 9 -23 53 -77 -65 -18 100 -9 -48 -50 6 27 15 9 28 -15 14 -35 -75 -6 -4 -27 24 2 -13 12
6272 12 -2 -7 -17 -50 -31 26 28 -37 -87 -31 -35 9 -56 -9 54 -41 -4 22 41 105 34 -2 25 -32 -20 -3 8 4 -24 80 80 -1
6304anJ9j4r0K5P9M3j19L7J02p0m0P9mr3L6N7J7j61N2O6m1J6oP4m7m8R7p9j0l4
6335f3J60n4j17R7K6n4n3J2J34j17m6N6P5j57R6Q4j12j4R1O0j10k5N2Q7q9j77
6361a58K01Rp3l1Q0o3l1M1J31j91l0J64M8j47k8P5K6j33Q3J28o0j09M7O3k4j18
6387a00J12R5j48N0J7L2r4j6J38j5j54K4J09l1n0J9J17j26o1O6O5m7oKM0p0K4
6414hO7k4p6M3P7m6m5J6M0j13kJ24j7l7M0N5l8j36J00O3j53O4P4N8j93L6J05L2
6442A06j63M4M2oj35J22O8o4r2P0L5o8m7J41q7j17J16J04n7m7M9J23j48q9J21
6467B1P7j38k0J43j2j14j7J79j13j34J54P0j07p0R4M4j20l4J52J7j68P9Q0r5r3
6492a25K05j0j10j22J84J04j91M5J38m1j74P4J72j68r7J16R3j67l6K17k1k31P7
$$ plain form
6304 -1 -6 13 -1 -91 -66 13 56 -63 -26 76 6 -34 45 41 -52 -16 41 58 -103 -51 15 -26 -10 -16 58 11 -37 60 -19 -29 -63
6335 -63 97 43 -74 23 49 -5 -58 -46 88 -29 -75 -19 56 -101 -5 79 -33 -47 44 104 -6 -31 21 108 19 -158
6361 -158 43 52 -21 -52 28 -35 -66 -25 106 -85 -115 49 97 -50 -78 -3 23 -110 -27 101 41 -68 -21 42 18 -100
6387 -100 12 107 -41 9 26 58 -36 -52 86 71 -83 -59 50 19 -31 -12 105 -21 -82 -16 49 2 -4 -2 38 -32 -8
6414 -8 59 35 -41 2 79 33 -12 4 44 -69 -71 53 36 -1 39 94 56 -80 20 83 -70 -6 68 126 -67 -31 74 106
6442 106 -57 -13 29 23 -112 10 78 14 -78 -8 27 -41 -88 53 -34 -151 -35 69 12 -35 14 137 -11 -100 21
6467 21 98 -40 -60 83 71 -43 -60 119 6 -128 26 96 -11 -81 13 57 -63 -97 55 72 -96 -17 63 -32 -125
6492 -125 80 70 -40 -162 22 126 -65 -20 118 77 -97 -23 149 -19 -116 0 93 -74 -110 107 86 -145 -68
6515f8J98l9k52J22K26k22j05J98mj79P1J54j7k04O3J61q9j82J61Q3p8j31J75
6538D2Q5j48J9J01J4k41P4K07j20r5O8J34k05K5R8N8j85k8J89l9j22Q2J03j43
6562b7o7J80K1j38p1J64L6k22P7K00j35j79J53N9m9r1J11O0j72K6J93o5j09KN4
6587A1k5j01J34K7n9q2J34n0j23J67N2o5r5O7Q2j06k2O0M5j27N2Q3o0m2K4Q8k4
6614D5j37J33l0rm8J20m2l8oN3m0mQ4r2m0lM7j2J9PO3l3o9j8L7oL3j9k7O5j0J9
6646D2o3o5N3K9l8M4qm9J5MM0pK6m2J8M8l6j3K9nJ7k7j1J4K4o8M9j4oL7L3j22
6678e2O3L8p6N0j9J9p3L0L6Pn0N1o8K5PK8j01J20j4p7R2J0k4r0O6K0k3j0j8O5
6708C2Lj05P1O9m3l8J06q6n8N2K9jm5k6J28j10J2N8k0j05MJ58j4j40P3ll8k1R1
$$ plain form
6515 -68 130 91 -161 -39 187 -35 -140 58 54 -125 -54 100 83 -121 -58 103 14 -168 -7 76 -2 -133 42
6538 42 127 -21 -2 99 113 -128 -54 153 33 -62 6 140 -65 -40 58 116 -69 -97 92 53 -69 13 116 -27
6562 -27 -94 86 107 -31 -102 62 98 -124 -47 153 18 -161 -8 51 2 -89 22 82 -90 -64 129 64 -45 -43 11
6587 11 -14 -115 19 46 -13 -95 39 -11 -134 33 85 20 -75 -8 74 -32 -54 6 51 -76 -24 59 -1 -43 -19 69 45
6614 45 -92 41 11 2 -46 74 32 -6 -12 41 1 -3 81 -11 -51 -54 -7 -19 0 7 70 37 -32 -50 -13 -19 14 -5 -32 33 23 42
6646 42 -21 -86 -33 -4 -42 2 -6 -55 -40 -36 4 -3 23 -19 -1 47 11 -2 27 22 39 12 1 15 39 -29 20 6 0 37 70 -52
6678 -52 11 49 -27 23 4 23 -50 -20 16 23 -27 24 -44 -19 -12 16 -85 35 21 -56 36 46 22 -68 -2 18 -5 -15 -33 32
6708 32 35 -70 1 70 27 -11 95 9 -49 3 32 31 -14 -40 88 -22 -10 48 28 -77 -73 85 71 -69 4 1 -37 -58 33
6737C3J3o9k0J38n7o1mO8p3N2o5L5K2n5J08j6n4K2O4p1m1M2Ll2Oj8K3pj8Q5p1
6768a8k0K7pLp6O6P0k0j21J08L5j26M5lJ9j3O5L4r8JK4J2RlN1m8J2j0N6r4ON5
6800D1o7K4J4L7Op4K5j8N1q0M1J1l4qQ5l7q8N1l2P5Nj6N2j04j1P7o7M5j1m3L2
6831a8j0J0Pl7M6kM8l2J3j3Om3l2J00j12R9l0PNk1Qj3M1nK6j6o8K9L1J7k9j3K
6864An8N5L0r0R6K3q0L4mJ6o4RM0m8j7K5OM0M2o0N1n9L2k6Opj8J6Lm3P1j6l9m5
6898g8J38o1n0MM9oL7RJj42P8M3K7o3KK7M5j16N7N4K3j19Q9L8q5rQ3n8j23M4R7
6929C5L9k13J07J48j1j97J14Q0j59K0Q1k4p4k2J00j7n0J28j9l7j04J08oq8j3J07
6955C3N4k04Q5J09j16n1Q9P1j07n7J65N4j42pK16j41j29O3J78j77r7J01Q9j41
$$ plain form
6737 33 46 -23 -43 95 38 -23 -27 41 -32 20 -45 -10 12 -43 65 49 -5 17 81 10 -31 11 14 -18 -12 -30 -7 -14 -32 53 -18
6768 -18 -38 -11 -18 -15 -91 -25 45 25 -96 12 47 -79 -34 -37 -18 -31 34 68 -30 -29 -5 7 16 13 64 16 28 18 74 -20 -14 41
6800 41 -26 -2 12 49 55 -19 6 -12 39 -41 0 11 -23 -31 54 17 -71 -20 -52 23 28 12 64 -40 -51 26 -41 4 -7 -50 -18
6831 -18 -28 -18 -11 -48 -2 -4 44 12 25 12 18 -25 -57 43 -69 30 0 7 12 -9 -1 -14 27 22 48 32 -36 -7 24 41 12 -1 1
6864 1 -57 -2 28 -62 34 57 -23 11 7 23 -41 -32 8 -40 -57 -32 -26 14 56 -4 47 -12 20 -6 0 -7 -25 -9 -6 -49 22 6 -33 -78
6898 -78 60 -1 -51 -47 2 -4 33 42 43 -99 -21 22 49 -14 -12 15 60 -56 1 55 78 -41 48 86 1 -8 75 17 -106 -62 35
6929 35 74 -139 -32 116 105 -92 22 102 -57 -37 44 20 -54 -76 24 7 -43 85 66 29 -75 33 27 -61 -74 33
6955 33 87 -117 -32 77 -39 -90 -1 70 -37 -94 71 125 -17 -24 192 51 -78 -15 163 -14 -111 -10 79 -62
6979f2n8K51k4k03L6J57k6j91R3J76r6k06J45Q8j16o2J72J6j24L7J45j02j58P1
7003d1J56j64q1J63J23k80N1J73p9j14O2J72j77j29J39J36j86m9J40J64k87P1
7025c7J17n6r0P9J60r0j57J60M1k09k6J24Q3j37kJ65j31j10N0J48j45k8R6O8o3
7050A0p6R6N0j33L9J37p8j12J23Ql8j23N1J31k02L3J46k5j23M2J39o7p9L7Q5m4
7076B7j21R8R8j46KO4Pq4mJ42p3q9O5J03q1j15J34k9n8pJ03N2j80L6J38j2j23
7103e3PJ26o0p6Q5M6m3j21J45M5j17JN7j7j39J03Q2r9m5O4Q7o9r3J03K4j59j2
7130a28J40K8p9JJ71j45J1QM0p9j8J23J8j76K4J71n0j21P3J07j08k6N8M6j34K1
7156b4Q3Kn3j03J69j2j23N3R4j16n0J03M1o7p6J12K9j25j2P6M0q9J6R2k5p9M4
$$ plain form
6979 -62 -120 131 107 -96 -60 97 71 -120 -27 149 53 -153 -8 80 -36 -98 74 90 -34 3 148 46 -112 -41
7003 -41 115 -49 -130 33 156 -124 -73 100 21 -93 -31 141 -36 -165 -26 110 -76 -125 15 179 -108 -37
7025 -37 80 24 -66 13 173 83 -74 86 127 -82 -108 16 99 -38 -40 125 -6 -116 -66 82 -63 -91 5 73 10
7050 10 -66 30 80 -53 -14 123 45 -67 56 64 26 -97 -46 85 -117 -84 62 37 -86 -44 95 28 -51 -14 71 27
7076 27 -94 4 102 -44 -42 22 29 -55 -59 83 10 -79 -14 89 8 -107 27 -2 -60 -67 36 88 -92 -56 82 70 -53
7103 -53 -46 80 20 -56 29 75 32 -89 56 101 -16 -15 42 25 -114 -11 71 -28 -73 -9 78 9 -84 19 43 -116 -128
7130 -128 12 40 -39 -38 133 -12 -1 7 47 -32 -50 73 91 -85 -61 110 60 -61 12 119 11 -15 43 89 -45 -24
7156 -24 59 61 8 -95 74 62 -61 -8 86 -30 -80 23 64 -3 -79 33 62 -63 -75 1 41 -48 -32 60 35 -44 0
7183@P8o7m5Q2j0j17L6Q5n0n5L8K9K6o4R3j0l2j6L2l0m2J8P2n2m2LJ8M4k3J5M3
7214E7j09lJ26j52J22p7J16rj33P3J9m7M7Jm8J6oJ6O3q7j7J3K4qJ4j4J1N3K6j41
7244e4N9PJ5pn3J9PRnN3k2n1Q6p3J17k6o3j6k8M9jOj08J34r7K3M6j2l3k4P9p2
7276c6qL2P8k4j05Q0M5l1m9O3K6j32O0P9j14l3P5O1p0n3J44j3j24J9K2K6j12R4
7304@NLq5J10M4j01k9O0l0o1P5J3K1m2kO8j9RJ6Pj17n7K28j08m6K1J12j00n1P5
7334A9L9l4r1Q1Nj7m0J20m6r7M6P3p0m1R4L3j02K3P6j5j01K6J31p4r7K3R3j06
7362d9l5R7J8n3M8%K1o8L5K2n0m6Q1J6p4JM7Op4k5J08J6o8mM2n0j4O8P5j02k6
7393c7Q5j04L2O6M0q2mM1L7o8l0L3J7o0L9jKPJJ3k5k5J19j48K4M4J4J1m0k9O4
$$ plain form
7183 0 78 11 -34 48 38 -79 -43 42 -8 -63 -25 4 30 -34 59 49 17 1 33 3 -39 -21 51 -1 -43 -40 -22 22 -1 14 57
7214 57 -52 -55 71 -81 41 -36 80 71 -62 11 30 -17 30 31 -17 -1 -7 9 72 -15 -32 -19 5 -3 11 -3 8 61 87 -54
7244 -54 5 12 27 20 -33 -14 -7 2 -3 50 28 -23 63 -10 107 81 18 2 -26 23 22 28 -80 54 -43 -20 26 14 -19 -43 36 -36
7276 -36 -44 -12 66 42 -63 17 62 31 -18 45 71 -61 -1 78 -36 -69 6 67 -3 -56 88 75 -49 -30 -8 18 -94 0
7304 0 5 8 -77 33 77 -24 -53 7 -23 -84 -9 4 25 -17 -19 49 30 39 55 62 -55 -112 116 8 -38 -17 95 -5 -56 19
7334 19 58 24 -67 14 19 2 -38 82 36 -61 -15 58 -12 -53 41 74 -28 -5 71 56 -45 -19 112 38 -59 -36 57 -49
7362 -49 -84 13 31 -22 26 26 47 -21 14 36 -14 -60 21 37 -37 -36 11 17 -57 -82 26 42 -26 -30 12 -38 -52 16 91 -11 -37
7393 -37 48 -56 -24 42 82 0 -4 37 74 6 -24 9 26 -34 5 4 6 13 14 27 2 -23 96 -52 -28 16 30 41 1 -28 36
7424C6k0k5L7qjj7P1l1n8l6N5M4m6mKj6PN3l6nj9N4m5q5M9%K1p9L7L2k7Q9OL2
7458F7r2J%K0O2m2ll1P2m2Lj3K0m2N4N9p2l3O2o3O2l1o4PJ9J18q5n5j6N2O0m4
7490A0l3NJ1N5o6J0P3r6N6m5J3J3M4k6J8m3J6M7j38Q6MJ3n4J7j7K4m2K1P8p1m4
7521f1J20j3p9P1J2rq6oR3q6N0%l1Kj0K0K0m1M5J4n9l5M7R1o5n0P1Qn9Q1q1J0
7553a6o9O0O3k0q0J56j7j16k5N1l4K5J2N3j8o3K8Q9j79J01M7n2n8K2J09k0k3k8
7581bJ25j58RJ15n6o7k6P8k4j5J00J4p7j00J18j6o8O3mrj1K2k4K1rK3M6n8j09
7610i9R1N2o0J8N8o0p6J37j5j5r7J17m0m7L5J5m2K6m9J05j8q7O7J6j08j4R4M6
7638E0q6K2N6n9oL2qkK9J8Mm8j5j5J46j43N3K2n7n9J03Jo3j5Q5k6k1n1P7n3pj7
$$ plain form
7424 36 16 -9 28 20 19 2 73 42 -16 -52 3 47 1 -3 -1 -17 -10 43 7 2 -17 37 -8 -93 -44 -44 -23 -102 -65 -33 -60 29 35 67
7458 67 -25 -24 -24 -4 58 16 13 -18 54 12 15 2 22 -20 34 93 21 -12 50 -13 49 18 -46 -39 -20 98 13 -42 -58 -6 54 10
7490 10 -23 -18 -7 48 -18 -8 65 -31 25 -20 -7 6 50 24 42 -1 15 62 -76 10 14 27 -27 -10 -27 -3 -45 -24 54 -17 -61
7521 -61 59 46 -33 38 50 41 -45 -51 42 -44 6 6 -25 -23 -33 -13 7 -34 11 25 -34 -69 -22 69 4 -46 25 33 -26 55 -26 -16
7553 -16 -85 -25 38 18 -62 94 77 -39 -64 -13 -47 -22 -10 43 25 -38 -10 79 -100 1 48 -4 -62 -40 69 49 26 -2
7581 -2 123 -35 -26 89 33 -34 -60 18 -6 -21 79 93 16 -84 34 18 -50 13 9 0 -11 11 -13 8 -1 22 68 10 -99
7610 -99 -8 44 -16 2 60 0 -76 61 46 31 -66 51 11 -36 -1 14 -28 -2 -51 54 36 -51 16 32 -76 -90 4 50
7638 50 -36 -14 42 -17 -23 9 1 -1 28 46 50 2 -13 -28 118 -25 28 50 -7 -66 37 38 -25 -40 45 19 -2 -53 24 -29 -36 -53
7670e3N0k3pJ6J3k3J5j3M1K6j7p8J04J3j12K4J3L5n8J06q0KK4k3O2m0j0j7K2J6
7700B8o9M4L2m6K3J3J5q2K5RJ8r2J09O6q1o0P1l7Jj25K35j00p4R6O8j38J4L0O8
7729F1r7n9J50l3p8M7M7k7J7l0O8r1o4O9O8o7k9J30j7j81P8R9m6j09M7L8k2m9
7757h0Q1O4j29k3Q5N9j14l5J50l5n2Q8nr6j0M7O5r5k1J36J8j99P3J59r0j31J39
7784D9Q2j59l9O4P0r0n6J41j9j53J03O9m4j42J01J16j11o1J48K8j68L7J00p2m4
7809e0M1R1j08j26J20J16j02r6J38O7j75K9J70p7j79J13J24j38n2R2J17j57rJ01
7833E0O6j89pJ18J6j58J19N3p1q0J63j0j42L1L8J01j96k5K37j30o0M7J35j21r4
7858a09J48L0j33j2J46k3j00M9M4jj46J7J88q6j25Q5J39j50mJ23Mj57m4K02o1
$$ plain form
7670 -53 -3 -26 -33 -17 -4 -27 -12 -25 16 42 25 -53 51 64 -48 -24 -11 24 -34 72 -8 -6 18 -5 57 17 7 -10 12 28
7700 28 -41 3 35 -11 12 25 40 -42 -17 -8 10 -82 27 93 12 -48 23 -14 -13 -138 97 -3 -77 19 87 -51 -37 -7 61
7729 61 -36 -95 55 22 -56 -9 38 11 28 -2 66 -25 -89 -20 48 -19 -48 82 65 -116 -38 61 15 -94 -47 -9 -31 -80
7757 -80 1 65 -64 -87 -2 57 -57 -92 58 23 -29 59 54 -42 -52 -5 60 -35 -56 80 98 -101 -28 131 41 -90 49
7784 49 131 -28 -67 -3 67 -23 -79 62 43 -110 -7 62 18 -124 -23 93 -18 -79 69 97 -71 -34 66 -6 -50
7809 -50 -9 82 -26 -152 -32 84 -18 -114 24 91 -84 -55 115 38 -141 -28 96 -42 -94 -2 115 -42 -51 50
7833 50 116 -73 -80 38 54 -104 15 68 -3 -83 80 70 -72 -41 -3 98 -98 -123 114 -16 -76 -29 106 -15 -109
7858 -109 39 69 -64 -76 70 47 -53 -4 40 39 -107 -90 98 12 -113 -28 111 -39 -43 80 84 -73 -117 85 24
7883B4q7O2M7k5j08O2J17r7j17J81n7p6N8N0M6k09P9J91q6j85J93P8r5j01J07
7908E2K3j48N3N5Jj09P0J15q1j51J87j1j40j6K07Kj97k2J55O5j03p2J41m9j74
7933a47J62J06j97K1K1P0j16L9J13m5j30J04J28o7j66J11N3j40j6J22J02k10M7
7956c5O2M5j38R6P6k03n5J88P2q1p6R2O6j76k0R6jj02P6J31j65%J8Q6r5m3J19
7983C3j2o4K1R8L6j91M0J09k7j44J70N4k93J86J6Nr3M9O3m6j24P0J23j41m9J13
8009BR9j52m6J49m8o1R8L6j00m3J4J13q1q8J34j3q8O5N8k5j40J67K2j04k1N6L5
8036C8o5MJ01n2j25O5R4r8N8n9O6m9m8Q6K4o5l5R1J2j08Q3Ll6o5Q0J0Lm6J7J5
8066aj3k5J1oj9O6m2k2O4K0j5p3K0J12j22N9PKn5K8J8o9k9Q8L1L0j13N6k3K7n3
$$ plain form
7883 24 -63 -1 46 21 -87 -25 92 -5 -122 59 2 -74 -16 34 80 -129 -50 141 55 -130 63 141 46 -55 52
7908 52 75 -73 -20 35 36 -73 -3 112 31 -120 67 56 -84 -100 107 109 -88 -110 45 110 7 -65 76 27 -147
7933 -147 15 121 -76 -55 -34 36 -80 -41 72 27 -103 1 129 62 -104 7 60 -80 -96 26 128 -82 -35
7956 -35 27 72 -66 30 106 -97 -152 36 108 27 -49 43 109 -67 -87 9 8 -94 -18 113 -52 -52 -34 52 -43 -86 33
7983 33 21 -43 -22 76 112 -79 -39 70 43 -101 69 123 -170 16 32 37 -56 -7 56 10 -114 -44 79 -62 -111 2
8009 2 101 -51 -97 52 4 -57 41 77 -23 -66 -52 61 -20 -108 26 13 -75 -10 48 23 -117 50 72 -32 -53 3 38
8036 38 -27 -23 78 26 -99 -34 60 -38 20 -39 27 -22 -70 16 40 -25 -60 31 43 -65 18 21 -15 -80 0 10 13 -33 -16 -1
8066 -1 -14 -39 -28 -34 -53 13 -29 -51 13 33 18 -55 -35 77 -45 14 21 23 -32 -4 14 -55 -84 4 35 65 -48 8 -15 12 -41
8097d1k8J11j4J6m2N5o5k1NJ0L7n6J07o9M4n3o3R4mo6kN5K6l1N4m1J4l6k5R5o8
8128bk6K5n5Q1p3K3k9L7J7N1o3J5RJ6n4K0M9p6LNL4J3J0l5J0k7j3N7K0l8m0J18
8160H2o4j6J9M2m1l5m1P2rm6N2o7N0o8P8K8n0Q6n0j9k7J7n3O0rO0r9Q0l4k9L2
$$ plain form
8097 -41 -69 42 28 44 2 57 -8 -29 -24 -14 23 -33 74 5 49 -4 -67 27 23 -43 -45 10 36 5 59 18 32 -4 -29 66 -2
8128 -2 -28 -3 -58 23 -50 -27 -56 -19 -2 49 -14 1 10 26 -28 -8 41 -35 -32 -27 7 20 30 -5 5 -22 -35 22 42 4 -36 82
8160 82 18 2 21 63 22 -13 -54 18 9 -37 15 -52 -2 -70 8 36 -14 72 22 3 -24 -7 -60 0 -9 51 -48 32 -2 -31 1
8191A
$$ Imaginary data points
##PAGE= N=2
##DATA TABLE= (X++(I..I)), XYDATA
0@%%%%%%%%%%%%%%%%%%%%%%mQqRj2J7k0K1k3K7l1L4m0M6n3N9o3P3q5R1r9J10j21
45f4J33j46J60j73J88k00K08k14K13j93J35Jl27J204m264K9883J75536j60495
63D1585j99266J52733J20857j20875N903J97561k1938j93857K0132J08864j16990
74e291r4081J60269L9998k52848n5513K81362Q9073k13150l5116J56652n7136
85A4219j62321Q5719J35322j02657r4010J11022M0935j01258O8429J76047j00290
96G1157k31783O8681J95608q0733j49154J07942J11933j15589m8361J61638N9500
107A50839j15197j6730N8149q3577p3919J31482Q0448j65136r4290J59936Q0142
118A12147j41351m0094J22435k7580j58201J0634J15374j9463n2287O1642K2718
$$ plain form
0 0 0 0 0 0 0 0 0 0 0 0 0 0 0 0 0 0 0 0 0 0 0 0 -4 4 -4 5 -7 10 -10 11 -12 15 -16 18 -22 24 -29 30 -33 40 -45 46 -53 57 -64
45 -64 69 -77 83 -90 98 -102 106 -108 105 -88 47 48 -279 925 -3339 26544 202080 41585
63 41585 -157681 -4948 115909 -4966 937 198498 176560 -17297 2835 111699 -5291
74 -5291 -99372 60897 100895 -151953 -207466 73896 162969 -50181 -85297 71355 14219
85 14219 -148102 -62383 72939 -29718 -123728 -12706 28229 -73029 -4600 171447 71157
96 71157 -160626 -91945 103663 22930 -126224 -18282 93651 -21938 -70299 91339 150839
107 150839 35642 18912 77061 -6516 -80435 51047 131495 -33641 -127931 32005 112147
118 112147 -29204 -69298 53137 25557 -132644 -122010 -6636 -26099 -78386 -16744 5974
129E974p1865M1609J38597k8516j47603J7929J18003m2118r9748O9662R6438o9144
141B9218p2280O8418N0589m8407j4983J6609n9699m6608P5685N6980p3942m5262
153f3682Q3139M4988p2982k4697P3119M525q7799k4805M7310Q670j1318K1513
165b019m443l6470K4062O0809j7459o1817J0050M6245j9733l8881L6203N7121
177E3668j2875l5843J2060K4364o09k483j3500m1284j5196L3868J1637l2845p017
190b6055L1218L482l0920m992K7520O984k6363k0476M447J7938K3409J1117j6714
203E95j1137K5085J8618k1538j5795J5366J582k4392q147J7555J6025M270n629
216A2458j3662m683J7464J3724j9591k6720Q165K0016j0479j3574K0482J7380
$$ plain form
129 5974 -65891 -24282 114315 85799 -61804 -43875 74128 32010 -67738 1924 98362 29218
141 29218 -43062 25356 75945 27538 12555 29164 -30535 -77143 -1458 55522 -18420 -63682
153 -63682 19457 64445 -8537 -33234 39885 44410 -43389 -68194 -20884 -12214 -23532 -2019
165 -2019 -6462 -42932 -18870 41939 24480 -37337 -27287 18958 -775 -39656 -3453 53668
177 53668 40793 4950 17010 41374 40765 38282 24782 -16502 -31698 2170 13807 -19038 -26055
190 -26055 5163 8645 -22275 -27267 253 7237 -19126 -39602 -35155 -17217 6192 17309 595
203 595 -10542 14543 33161 11623 -4172 11194 12776 -11616 -19763 -2208 13817 18087 12458
216 12458 -1204 -5887 11577 25301 5710 -21010 -12845 7171 -3308 -16882 3600 20980
228B0980j7655j4872P639K196m292L374p613k0207N082K8805O190j8181K079K3155
242A6680l89k1250L915K1778n663j9231M912J0560m006N195J1079j3932j8349
255h701J0447J0801j8668j6336J1719Q567j5526p643J9015J1916j2535n177J0347
268a774j638o449J0843N691j4192o3K0043K809j3153M658J4288n914j5431K051
282A769J0342m679j0199L436M553o489K22R430n425j2514N175O547j1525p040
296a6397J0020L781q773j589Q597L342m160n83L792r29k907N040M746m550N42
311b8R923O92o369M338O182n328n093K899O59l208q82O18j162k108o79N65k829
328a810m448P78J233m913j674N167N2l707L058L148k599J23K993p06r14K449K069
$$ plain form
228 20980 3325 -11547 -3908 -1712 -6004 -2630 -10243 -30450 -25368 3437 9627 -8554 -6475 16680
242 16680 16291 -4959 -1044 20734 15071 -4160 752 11312 7306 12501 23580 9648 -8701
255 -8701 1746 12547 -6121 -22457 -10738 -2171 -17697 -25340 -6325 5591 -6944 -12121 -1774
268 -1774 -3412 -9861 982 6673 -7519 -7582 12461 15270 2117 6775 21063 15149 -282 1769
282 1769 12111 7432 -2767 669 5222 -1267 -1045 8385 2960 -9554 -4379 2168 -9357 -16397
296 -16397 -6377 -2596 -11369 -12958 -4361 -1019 -5179 -5762 -1970 -2899 -5806 -766 3980 -570 -28
311 -28 9895 10587 4218 8556 14738 9410 4317 7216 7875 4667 3785 4403 3241 1133 454 1019 -1810
328 -1810 -6258 -5480 -4247 -9160 -10834 -5667 -5615 -9322 -6264 -3116 -5715 -5592 -2599 -3305 -4219 -1770 299
345B99P73P08J758K502J02j809J621J811l100r93L410j113k759K587J155l644
361C308q26J042k682k743m68q39q44r49o32J347Jk233O67J468k740j121L029l72
379e587j366L353K679m11J803K521Q2N37N59k02J168L27p59K043J784j669M37
396G299J864k664k446M96k126l411k52l83j803j64j0p09o7j423j602P82r19k651
414a0189J841K466j334J549M496M19k20L244J246j459P26J571L30J7O28K397J737
431I465k035n18L032k286n594R49R46n742j990L694j521m060K312K527l578l194
447g593K217J764m105l153N138L913m600K08Q593K43o165M562N778o651l381Q011
463D779J303p571J823R483q07q157K348Q491m610j0016M482O105r578n114J0585
$$ plain form
345 299 1072 1780 3538 6040 6142 4333 5954 7765 4665 3672 7082 5969 3210 5797 6952 3308
361 3308 2482 3524 842 -1901 -2369 -3208 -4052 -5001 -5633 -4286 -4285 -6518 -5851 -4383 -7123 -8244 -5215 -5587
379 -5587 -6953 -3600 -921 -1332 471 2992 3074 3611 4170 3968 5136 5463 4704 6747 8531 6862 7299
396 7299 9163 6499 4053 4549 2423 -988 -1240 -1623 -3426 -3590 -3600 -4309 -4376 -5799 -7401 -6619 -7538 -10189
414 -10189 -8348 -5882 -7216 -5667 -1171 -752 -972 2272 3518 2059 2785 4356 4686 4703 5331 7728 9465
431 9465 7430 6912 9944 7658 2064 3013 3959 -1783 -3773 -79 -1600 -5660 -3348 -821 -4399 -7593
447 -7593 -5376 -3612 -7717 -10870 -5732 -1819 -6419 -6211 2382 2625 -3540 1022 6800 149 -3232 4779
463 4779 6082 -1489 334 9817 9010 853 3201 11692 7082 -2934 1548 7653 -1925 -7039 3546
478C546O41j1488L608J0478q699j0633R720P548j2441p365J2569O857j1100j880
492h639J4494Q83j3039M331J1871r440r244J3533M382j7263J6K0340j386j9027
506h188L799J6806o512j5756Q263J3018j1072r661J3988N900j4194L092J6317
519A5800j1118j9185J3796J5902j8675j5336J7104R825j8110n906J9000M016j6952
532i839k93J3808n610q885J5419P831k0464l107K6463K977k3571J711K0651p381
546I710k1138O332J6352p446j3060O060N109q217M004J4351r155j8458J1889J8306
560A4639j3490j4201J6661J1543j6870r817J4641Q547r683p333M70l150n44R557
574I70J469j4281j872J7651L210j4315L337J7244k938j5834O84J2886N664l909
$$ plain form
478 3546 4187 -7301 -3693 6785 -1914 -12547 -2827 4721 -7720 -15085 -2516 4341 -6759 -8639
492 -8639 5855 6738 -6301 -1970 9901 461 -8783 4750 9132 -8131 -8115 12225 10839 -8188
506 -8188 -4389 12417 5905 -9851 -1588 11430 358 -9303 4685 10585 -3609 -517 15800
519 15800 4682 -14503 -707 15195 -3480 -18816 -1712 8113 -9997 -15903 3097 7113 -9839
532 -9839 -10132 3676 -1934 -10819 4600 12431 -8033 -11140 15323 18300 -5271 -3560 17091 9710
546 9710 -11428 -5096 11256 3810 -9250 -3190 1919 -6298 -2294 12057 2902 -15556 -3667 14639
560 14639 1149 -13052 3609 15152 -1718 -11535 3106 11653 1970 -5363 -4893 -8043 -8587 970
574 970 2439 -11842 -13714 3937 7147 -7168 -3831 13413 10475 -5359 -4675 8211 13875 9966
588I966q068n827L883R281m73j1978o555O009K520r012k518J1313N535q258o693
603a0875L513J1225J1668m275j8719k463J9621O554j4741m812J0395q45j2686
616f440j248J0386K360o881o006o840k207J7828J7628j7220k4075J6546K6359
629B0190j1678j6243J6791J0745k2265j2363J7924J0917q721l245k655j6823l46
642a7772L1588Q049l7532j3897L3717Q759k8480O584L5519r685l5877P394K8241
655A6608k155q805O730j3241k7064J6932L9229j5344m1988J3260L1084k4817k4593
668c4164L9555K8170l9895k7439K9775J9004j0617J0011J1048l1423j9688L9527
680A3864K4641l8450j9405L4939k07m8897O155N7240l503n2904j977L0046n256
$$ plain form
588 9966 1898 -3929 -46 9235 8762 -3216 -9771 -3762 -1242 -10254 -12772 -1459 4076 -4182 -10875
603 -10875 -7362 3863 15531 11256 -7463 -9926 9695 16249 1508 -3304 7091 6246 -6440
616 -6440 -7688 2698 5058 -1823 -7829 -14669 -16876 952 18580 1360 -22715 -6169 20190
629 20190 8512 -7731 9060 19805 -2460 -14823 3101 14018 5297 2052 -603 -17426 -17772
642 -17772 13816 21865 -15667 -29564 4153 12912 -15568 -8984 26535 16850 -19027 -11633 16608
655 16608 14453 5648 12378 -863 -27927 -10995 28234 12890 -29098 -15838 15246 -9571 -34164
668 -34164 5391 33561 -6334 -33773 -3998 15006 4389 14400 25448 -5975 -25663 13864
680 13864 38505 55 -19350 15589 15382 -33515 -27360 29880 26377 -26527 -28504 1542 -3714
693c714m019K7172m765m1574O048M5079n306l4187J9955L0335l8678l8954M1883
706g25M2508l4690l5644J8608Q348j7200J7506K6093k7296k8598K9217K2442k8155
719g586l614M3180j540n4937j987N5715Q572l9982m590J5762j7740q321L0703
732A3635K494l7604j109K8707j3989k4606L2340L2595l7190l8009L2872L7529
744B7665j8303j6848J7275k754k1723J6543K5797k0666j9516K3008L022l5797
756b2297M984M6446m920m9392j331L8565J460k0446J0732J0006k2748n066K8344
769A4337j87k5622J1353K0348k9567k4180L7858K6483l7807k6816K6923J4415
781G538j9826K237K0730j1941j9429K0268J8310k0215l460L1097n697l9957J1328
$$ plain form
693 -3714 -7733 19439 14674 -26900 -20852 24227 18921 -15266 4689 35024 -3654 -42608 -725
706 -725 41783 7093 -28551 -9943 -1595 -18795 -1289 24804 -2492 -31090 -1873 20569 -7586
719 -7586 -11200 31980 30440 -24497 -26484 29231 37803 -2179 -6769 8993 -8747 -17068 13635
732 13635 16129 -21475 -22584 6123 -7866 -32472 -132 32463 -4727 -42736 -9864 27665
744 27665 9362 -7486 9789 7035 -14688 1855 27652 6986 -12530 10478 13500 -22297
756 -22297 -17313 29133 24213 -25179 -26510 12055 13515 -6931 3801 13807 -8941 -14007 14337
769 14337 14150 -11472 -119 20229 -9338 -33518 4340 30823 -6984 -33800 -6877 7538
781 7538 -12288 -10051 10679 -1262 -20691 -423 17887 -2328 -5788 25309 19612 -20345 -9017
794i017M5148j0658m0625Q445K4167j6551j3910K1811L290k9165o00K5381r238
807a522k1874K2637K1406l4119k1950M0889K3539l5742j3912L1077J347k6747
819a4971J1927K5188j9302k1218K2596J1747k7549q50L5718p063m2859J0720M3898
832B7982j2167l5817J7797K4671k5302j4226L1280O084l2808O50K7548j3429k5829
845b3566K3710K3916l3909k5475L5981K1855l4292j1615L3813M43l1787J1777
857i149L1859j6116k3673K2181J4987k6957m699L4421q91l9420K326L6924p191
870A4602l2733J2821K4547k2539k0179K7238J4019k7968n458K5712n304k4557
882a9799J5459K6364k0085k5716K1889K2066k2438j4133K5621O304k8971o58K8326
$$ plain form
794 -9017 36131 25473 -15152 -6707 17460 909 -13001 8810 12100 -17065 -17665 7716 -1522
807 -1522 -23396 -759 20647 -13472 -35422 5467 29006 -6736 -20648 10429 11776 -14971
819 -14971 -3044 22144 2842 -18376 4220 15967 -11582 -12432 23286 16223 -26636 -15916 27982
832 27982 15815 -20002 -2205 22466 -2836 -17062 14218 20302 -12506 -11856 15692 2263 -23566
845 -23566 144 24060 -9849 -35324 657 22512 -11780 -23395 10418 10861 -20926 -9149
857 -9149 22710 6594 -17079 5102 20089 -6868 -11567 22854 21963 -17457 -15131 21793 14602
870 14602 -18131 -5310 19237 -3302 -23481 3757 17776 -10192 -15650 10062 4758 -19799
882 -19799 -4340 22024 1939 -23777 -1888 20178 -2260 -16393 9228 15532 -13439 -14097 14229
895A4229m277k3613J0801J6715j8207j1578K4776R642k6406p050K5177K511k3209
908a0489M029K2893r885k2399J2801J8356j5204j1926J6910L170k0484J761K1408
921A0941m761k0211O606J7333r359j3701J3822J2788j5681j0045J6816O693j5318
934d077j09J4800n340j4096Q668J2389j0479j0495J0194O499j2408n193J3261
947C614L039j4217j434J3410j499j1232N745R750p971p131R971N581r452k547
961d373R659Q95r774L56R954j918j0225L002Q663n609p353P424M927q505k593
976e470Q468N78p695J282P289k341o885K970O625m104o172N338M710p084l425
991e916P645J070p267J163O600k252m929L915M826l403l495M220L376m572k611
$$ plain form
895 14229 9952 -13661 -2860 13855 -4352 -15930 8846 18488 -7918 -14968 10209 12720 -10489
908 -10489 -6460 16433 6548 -15851 -3050 15306 102 -11824 5086 8256 -12228 -10467 10941
921 10941 6180 -14031 -7425 9908 549 -13152 670 13458 -2223 -12268 4548 11241 -4077
934 -4077 -4186 10614 5274 -8822 -154 12235 1756 -8739 1455 7954 -4454 -9647 3614
947 3614 6653 -7564 -8998 4412 2913 -8319 -2574 7176 -795 -7926 2045 7626 -1826 -4373
961 -4373 5286 6181 -3593 -3237 6717 4799 -5426 -2424 6239 630 -6723 701 5628 -2877 -5470
976 -5470 2998 3576 -4119 -2837 4452 2111 -4774 -1804 4821 717 -5455 -117 4593 -2491 -5916
991 -5916 1729 2799 -4468 -3305 3295 1043 -3886 29 4855 1452 -2043 2177 5553 981 -1630
1006a630N485J174o603l43N754k302n593K647L282m240k767L708J682l507j035
1021d288L647J228l360L29M898n71m302K480M027k980k294L720R92l796j31K931
1037B530l98k622l8K126n95k502R36K722j862k565K653J432l108l42K756r33k555
1054b365J060J500j146j069N36J049n53j300J271J858j598q73K657O04k078J064
1070F17K174j257j012J310N52j012n49L08L41q95j285R99O98k177n56K048p99
1087d95k052J502J363j932m90J761K36j088kJ029L74r78k66J702N8j873J201J961
1105B011j899j020K852J80k746J025K047j222j566J112R86j004j256Q62R91j801
1121d48j074K205k09l076J146K899k601k190L346J227l254j23K956k58k152P10
$$ plain form
1006 -1630 3855 5029 -1574 -1917 3837 1535 -4058 -1411 1871 -2369 -5136 -1428 254 -3253 -4288
1021 -4288 -641 587 -2773 -2444 2454 1883 -2419 61 4088 1108 -1186 2534 3526 -270 -401 2530
1037 2530 2132 -490 -528 1598 1003 -1499 -563 2159 297 -2268 385 1817 -1291 -1633 1123 190 -2365
1054 -2365 -1305 195 -951 -2020 -1484 -435 -988 -2288 -1017 841 -757 -1630 1027 1631 -447 617
1070 617 2791 1534 522 1832 2384 1372 823 1131 1472 577 -708 291 989 -1188 -1744 304 -495
1087 -495 -2547 -1045 318 -1614 -2104 -343 -107 -1195 -1197 -168 206 -772 -1038 664 722 -1151 50 2011
1105 2011 112 -908 1944 2124 -622 403 2450 1228 -338 774 1760 756 -500 362 1353 -448
1121 -448 -1522 683 474 -2602 -1456 1443 -1158 -3348 -2 1225 -2029 -2152 804 546 -1606 -896
1137h96K026q35j792J778K119k671j426M089N81m830J005M862k191m061K970K579
1153C307l333j421L027J54l351K64L095j563l866K461L945m151l775N610K794
1168C197o064p33N854o98m585K656L396l253j975M127J015m783j09N602q12o732
1184c897J574O945l008o133M449M282n355j689N892o25n043K627M154m382l772
1199c981N586L276o808l729P016K460p568j000P000j670o294M108M677n305j421
1214c653P131p26p134L375Q318l622p972M085P154m838n895N679L465p663j816
1229d112P279j948o789N099M974q717l637J0952L210j0675j603J0101M55q643
1243d054J944Q322m055p548N686M562p987r13R626l513j1940O129J2211p152j0337
$$ plain form
1137 -896 1130 295 -1497 281 2400 -271 -1697 2392 2973 -1857 -852 4010 1819 -2242 728 3307
1153 3307 -26 -1447 1580 1734 -1617 -1353 1742 179 -3687 -1226 2719 -1432 -5207 403 3197
1168 3197 -2867 -3600 2254 1556 -3029 -373 3023 -230 -2205 1922 2937 -1846 -1955 3647 2835 -3897
1184 -3897 -2323 4622 1614 -4519 -70 4212 -1143 -2832 3060 2435 -2608 19 4173 -209 -3981
1199 -3981 1605 4881 -1927 -5656 1360 3820 -3748 -4748 2252 582 -5712 -1604 3073 -2232 -3653
1214 -3653 3478 2752 -4382 -1007 7311 3689 -4283 -198 6956 2118 -3777 1902 5367 -2296 -4112
1229 -4112 3167 1219 -5570 -471 4503 -4214 -7851 3101 6311 -4364 -5967 4134 4589 -4054
1243 -4054 -2110 6212 2157 -5391 295 4857 -3130 -4043 5583 2070 -9870 -3741 8470 1318 -9019
1258i019Q171P987q326m507J0163L298r693p15Q868l002p637P739N959j3310o244
1273a0268J4495M102j5095j976J3002k133j1875M886J1286n505q276O921N282
1286D846q091M56J2424l419j5378N585J5562p433j3252R003Q776j2292o849J2663
1300B601M832j1331k045Q765k707o866R151Q546j2678q983J4632P685j4235l459
1314f092J4334j681j5832K940J3595l737j0338L565M088p431l3J2511l71j4747
1328i229J242J5102k033j1372P518J0984j0538j0596J0690R244p568n380L944
1341B008k211o013N943Q167p401j0334O065P863p057l706J1451K829j3454l552
1355i402J2272N009o026j780J186l833j369O826L524p066n274M418J629n547K317
$$ plain form
1258 -9019 -848 7139 -1187 -5694 4469 7767 -1926 -2641 6227 3225 -4412 3327 9286 -4024 -10268
1273 -10268 4227 8329 -6766 -8742 4260 2127 -9748 -4862 6424 919 -7357 -436 4846
1286 4846 -3245 -2789 9635 6216 -9162 -3577 11985 4552 -8700 303 9079 -3213 -10062 2601
1300 2601 7433 -3898 -5943 2822 115 -6751 2400 10946 -1732 -10715 3917 11602 -2633 -6092
1314 -6092 8242 6561 -9271 -6331 7264 3527 -6811 -3246 842 -6589 -6622 5889 5518 -9229
1328 -9229 -7987 7115 5082 -6290 1228 12212 1674 -8922 1768 11012 3444 -1936 2008
1341 2008 -203 -6216 -273 7894 493 -9841 -3776 4087 -2970 -6676 4775 7604 -5850 -9402
1355 -9402 2870 7879 1853 73 1259 -2574 -3943 2883 6407 -659 -5933 -1515 114 -5433 -3116
1370c116R804k540j2191L5J1050M012m145j710K65j864l91M493L350l712m819
1385a479N96M2l117L164P169m631j2105K44J0923L265n892j763L347j239l482
1400d958M702P726k831o918J725K339l375L158Q397n359j3295K418J2269q96r198
1415d096K183O244o414p116R128R200q022p123O681J449p235N643J0638r362j3285
1430a1487Q946J1837q929q249J0386M553j4033l897J5872L664j4351n66J1619
1443E365n121q731J2489Q611j6156p697J7219M946j6400l21J6261m531j7758O641
1457e183J7563q211j5016R620R159j3697l381J8208q82k0669L786J9860o627j6080
1471a1550J1399J3119j5687j1507J8186J0568j7850o768J6184j23j6012P609J6975
$$ plain form
1370 -3116 6688 4148 -8043 -8008 3042 7054 2909 1199 1464 -400 -791 3702 7052 3340 -1479
1385 -1479 -883 -841 -3958 -794 6375 1744 -10361 -10117 806 4071 -1821 -3584 -237 -1476 -4958
1400 -4958 -256 7470 4639 -2279 -554 1785 -1590 1568 9965 4606 -8689 -6271 5998 5102 -4096
1415 -4096 -1913 4331 -2083 -9199 -71 9129 1107 -6016 665 2114 -5121 522 11160 1798 -11487
1430 -11487 -2541 9296 367 -7882 2504 7057 -6976 -10873 4999 8663 -5688 -6254 5365
1443 5365 244 -8487 4002 12613 -3543 -11240 5979 10925 -5475 -5796 10465 5934 -11824 -5183
1457 -5183 12380 4169 -10847 -1227 7932 -5765 -9146 9062 8180 -12489 -8703 11157 4530 -11550
1471 -11550 -151 12968 -2719 -14226 3960 14528 -3322 -10090 6094 5971 -10041 -2432 14543
1484A4543j2923j7003J4783J3158j6142o847J8341J502k1238R61K1984j722j8566
1497i169M787J3782j0571j0117J7085Q671j9953o594J8983R73j7077N965J6616
1510A3381j1537j7694J2397J5829j1666j0680J2504M236j5800N16J9350k293j8385
1523i842N146J4400r612r618J5425P615j8392p137J6859M136j4166O46J2223o602
1537A081j3331R453J3188j0125r830J1284M442j3339R55J6445k665j5717L713
1550d446J2595n258q589Q384O013j1574n793J1452L905j1009o30R956m451j0191
1564i636P666J0210q222p646Q489M488q220r05R459l30r448R27Q096k438o813
1579d323M666M994p672m313Q380K566q022k53P306j727o030L672N851l402m353
$$ plain form
1484 14543 1620 -15383 -600 12558 -3584 -10431 7910 9412 -11826 -10865 11119 9397 -9169
1497 -9169 -4382 9400 -1171 -11288 5797 14468 -5485 -12079 6904 7877 -9200 -3235 13381
1510 13381 1844 -15850 -3453 12376 710 -9970 2534 6770 -9030 -8514 10836 8543 -9842
1523 -9842 -4696 9704 92 -9526 5899 13514 -4878 -12015 4844 8980 -5186 -4540 7683 1081
1537 1081 -12250 -2797 10391 266 -9564 1720 6162 -7177 -6222 10223 7558 -8159 -4446
1550 -4446 8149 2891 -5698 2686 8699 -2875 -8668 2784 6689 -4320 -4950 5006 555 -9636
1564 -9636 -1970 8240 18 -7628 861 5349 -2871 -3776 5683 5353 -4095 -3168 4928 2490 -4323
1579 -4323 343 5337 -2335 -6648 1732 4298 -3724 -3977 3329 1602 -4428 -756 5095 1693 -2660
1594b660L997L158m486j922N183N71o412M4N232k528n036L430L282m560k318M153
1610h72J450l157K77L613q8k863J300L622r08k657K259J889l500j309L679j4l727
1627a006J57J804j586j452J614J106j545j364J357J296p94j66J859k67k405R24
1643d68K343j151j464J053l67j739M64J433n63r84j65L76L51K13Q28R86o75p65
1661b94J688J180q55L50Q15j447q17J152N1j326l66m49j028l07M16Q0l95q54m0
1680b446J024J4J2J303J05j290P46J605l73l07P89m45j042N78P49l64m71l75J53
1699c5K12j41M23R00q03q81J321O57r52L59Q23j191q85Q88O7r65l60k67o59l75
1719a864j98L99K19r68j58J250N4l21J298P29q91N30J411Mo9N63n1m30J78L3k1
$$ plain form
1594 -2660 1337 4495 9 -1913 3270 3841 -2571 -2527 2705 177 -4859 -1429 1853 -2707 -5025 -872
1610 -872 578 -2579 -2302 1311 1223 -1640 -340 3282 2374 -283 1976 3865 365 -944 2735 2721 -1006
1627 -1006 -849 955 -631 -2083 -469 637 -908 -2272 -915 381 -413 -579 1280 1013 -1392 -468
1643 -468 1875 724 -740 313 -54 -1793 -1329 104 -459 -1443 -1608 -1232 -881 -668 160 1146 471 -294
1661 -294 1394 2574 1719 2069 2884 1437 620 1772 1823 497 131 -318 -1346 -1653 -1237 -1157 -1552 -2406 -2446
1680 -2446 -1422 -1408 -1396 -93 12 -1278 -532 1073 700 393 1182 737 -305 273 1022 658 187 -188 -35
1699 -35 177 36 459 1359 556 -325 996 1653 701 1060 1883 692 -193 695 762 -203 -563 -830 -1489 -1864
1719 -1864 -2062 -1663 -1444 -2412 -2570 -1320 -1266 -1587 -289 440 -451 79 1490 1494 1425 1988 1937 1507 1685 1718 1697
1740A697j59q36k18K86o21m85O19m96r45M27K91o94K35L01p67k2N14k50j35M29
1760h29k54j03M80J1J29N21j15J29O32m7J73Q61j34n81R07K61r88K86O34r67o56
1781C50N91m19q64o4J03m48m35k68N22qr20J31J356o72q44J550N52j306M42J513
1801H62p47n53J139M63q82j60Q87N23j075m94J321K54j658O4J695j034j516J406
1819D95N81k005L3J663p92j553J021J087j029r93R16J215j145j081J744P35j942
1836a050J17K123r85j712J969J021k353j79K356k99k075O11J868n88j634Q76J578
1853A644j287j396J920Q14k673J63K718j582k528K205J862k937j149K677N94k399
1869a354n5K243k65k008J027K260j773j685K867J040l669o0L946j199l902J812
$$ plain form
1740 1697 1538 702 484 770 149 -336 283 -213 -1158 -731 -440 -1134 -899 -598 -1365 -1387 -873 -1123 -1258 -829
1760 -829 -1083 -1186 -706 -695 -566 -45 -160 -31 601 554 727 1588 1454 873 1780 2041 1053 1339 1973 1006 350
1781 350 941 522 -342 -406 -303 -751 -1186 -1454 -932 -940 -1860 -1729 -373 -1045 -1889 -339 213 -1093 -651 862
1801 862 115 -438 701 1164 282 122 1009 1532 457 -37 1284 1538 -120 -56 1639 605 -911 495
1819 495 1076 -929 -896 767 -25 -1578 -557 530 -499 -1492 -576 639 -506 -1587 157 892 -1050
1836 -1050 -933 1190 205 -1507 462 1483 -870 -1049 1307 1008 -1067 -456 1412 824 -810 66 1644
1853 1644 357 -1039 881 1695 -978 -815 1903 321 -2207 -2 1860 -1077 -2226 451 1045 -1354
1869 -1354 -1409 834 569 -1439 -412 1848 75 -1610 1257 2297 -1372 -1432 2514 1315 -2587 -775
1885g75K939k614k100K685J171k867k82L020j09l027J338L592k353l174L797K791
1901D032m553j784M674K07m587Q46L589k161l119K486K213l216j580M011Q76m775
1917b841L69N670j071n561K582M686l590l149M305J583m818n61M349r38m133J919
1933a199L882l415l765M618L952m970k720N824J350n550R44N731k456m821L110
1948E15L049l922j728M478J0o003j51O080l50n926J335M890l164l866N086L459
1964C792m983j829M591k11l567K642M006l906m569L643M130l417k822L948J076
1979B524n444j59O078P5m709J065K506k829q10M901O80n347j391L929M61l259
1995a729Q88L182k808m587K506M372j586k257J797o00k589K626M342j608l274
$$ plain form
1885 -775 2164 -450 -2550 135 1306 -1561 -1843 1177 1068 -1959 -621 2971 618 -2556 1241 4032
1901 4032 -521 -2305 2369 2576 -2011 -1165 2424 263 -2856 -370 1843 -1373 -2953 1058 1934 -2841
1917 -2841 -2472 3198 2127 -3434 -852 3834 244 -2905 1400 2983 -1835 -2396 1953 1015 -3118 -1199
1933 -1199 2683 -732 -4497 121 4073 -897 -3617 2207 3557 -1993 -1049 4682 2226 -2595 515
1948 515 3564 -358 -2086 2392 2402 -3601 -3752 2328 1978 -3948 -2613 2277 -887 -4753 333 3792
1964 3792 -1191 -3020 1571 1360 -2207 435 4441 535 -4034 -391 3739 322 -2500 1448 2524
1979 2524 -2920 -3079 2999 3074 -1635 -570 1936 -893 -1703 3198 3878 -1469 -2860 1069 1530 -1729
1995 -1729 -841 2341 -467 -5054 -2548 1824 238 -2019 -222 -822 -3411 -785 3557 1949 -1325
2010a325J058J758j147k40K946P48l894k531K625K117j029l41p1k608r27K995
2026A34J569j747n52J83j101m69K133K041o74k449j366J170J833P15l45j408j400
2043a733M87J111K77P57L85j949j472J514J688M14J68j170k208N84K740N29j702
2060D20p30M16n07r29J272K172j315k951N11J905m12K62J570j815k714K178K909
2077B242j546j793J457N56k269m48L134R74l217j377K414M61j583J660J398l357
2093a294j449M054J315l184j75K545j295k630J914L217j772l406R04K236j229
2108b49o29K542p38l928J115M110r94k746J909J267l209o91L906J250l324j628
2124b037J745M03j242J494J720k882k626K892K214k031m6K304j549k923K107L457
$$ plain form
2010 -1325 -267 1491 344 104 3050 3798 -96 -2627 -2 2115 1086 745 674 -1934 -2861 134
2026 134 1703 -44 -596 -413 -1514 -1983 150 2191 1517 -932 -2298 -1128 705 1420 1075 -333 -1733
2043 -1733 -1246 -135 142 899 1284 -665 -2137 -623 1065 1479 1647 477 -1731 -1147 1593 2122 420
2060 420 -310 106 -401 -1330 -58 2114 799 -2152 -1641 264 -148 114 1684 -131 -2845 -667 2242
2077 2242 696 -1097 360 916 -1353 -1801 1333 2307 -910 -2287 127 588 -995 665 2063 -1294
2093 -1294 -2743 1311 2626 -558 -733 1812 517 -2113 -199 3018 1246 -2160 -1256 980 -249
2108 -249 -878 1664 926 -3002 -1887 2223 1229 -1517 392 1659 -1550 -2241 1665 2915 -409 -2037
2124 -2037 -292 111 -1131 363 2083 -799 -3425 -533 1681 -350 -396 1908 359 -2564 -457 3000
2140C000p57k301l9L10p79M96K010m25l064o30J953k21p68K033K69l220o10L031
2158B88J185q22J48j36j394K31J924P15j316r93J11n97p79J467J455k169k041
2175b723J219R99o50J134J254j890j135K227J243r66L46J228j152j875J002K336
2191B597r97k429N67Q59j956n17K716l96l155Q09K742j602j293K792J196k873
2207i40o95L111P20k688j60K705j194l014J685K661k960k294L470Q77l887M14
2223b189M236r41l449K277L266k194k357L099K103l382j597L660Km552N18M124
2239B624k530m438K795K884l978j642M469R27m450K91M788j38l546J911L794k654
2255A107l275M082K896m745k007M579j71n082J394M451k664m470K745L482l032
$$ plain form
2140 3000 2243 -58 -97 213 -566 -70 1940 1515 -1549 -2179 -226 -447 -1215 818 1087 -2133 -2743 288
2158 288 1473 651 799 663 -731 -500 1424 2139 823 -170 -59 -656 -1435 32 1487 -682 -2723
2175 -2723 -1504 -505 -1155 -21 1233 -657 -1792 435 1678 712 1058 2286 1134 -741 261 2597
2191 2597 1600 -829 -262 597 -1359 -1876 840 444 -2711 -1902 840 -762 -2055 737 1933 -940
2207 -940 -1635 1476 2196 -492 -652 2053 859 -2155 -470 2191 -769 -3063 407 1284 -2603 -2189
2223 -2189 2047 1106 -2343 -66 3200 1006 -1351 1748 3851 469 -1128 2532 2534 -2018 -1500 2624
2239 2624 94 -4344 -1549 1335 -2643 -4285 184 1111 -3339 -3048 1740 1602 -1944 -33 3761 1107
2255 1107 -2168 1914 4810 65 -1942 2637 2466 -2616 -1222 3229 565 -3905 -1160 2322 -710
2270g10k095L871J510m528o45N405R3m916J114M096l025l647L956K554m738k304
2286d009M115P75l906M60M203j183m222K260M800k173l176L712K271m366o97N094
2302C958p1m993M60L585j971l223K263K403l634k841L511K106l710q95M156m75
2318F29m153K025M412k216l295K866K166l069r20L495L96l910l66L564k24l387
2334a987J261L046k472k618L422K350l459r30L268J13k937Q99K928j406l007J188
2350c41K245j847k145J955J207l301q48L314J66l144P23K628j271j572K237J878
2366A884j909j133K194J223j679n22K105j82k721Q35K413j547k154J399Q72k042
2382i64m61K019k09j906j4J674p2j188M70J372r15j339J558J293j534o93J542
$$ plain form
2270 -710 -2805 1066 2576 -1952 -2597 2808 2901 -2015 -901 3195 170 -3477 479 3033 -1705 -4009
2286 -4009 106 881 -3025 -2565 1638 455 -3767 -1507 3293 1120 -2056 1656 3927 -439 -1136 3958
2302 3958 3887 -1106 -646 2939 968 -2255 8 2411 -1223 -4064 -553 1553 -2157 -3052 1104 629
2318 629 -3524 -1499 2913 697 -2598 268 2434 -635 -1555 1940 2336 -1574 -1940 1624 1400 -1987
2334 -1987 -726 2320 -152 -2770 652 3002 -457 -1387 1881 1994 -943 -44 2884 1478 -1529 -341
2350 -341 1904 57 -2088 -133 1074 -2227 -3075 239 405 -2739 -2016 612 -659 -2231 6 1884
2366 1884 -25 -1158 1036 2259 580 58 2163 1981 -740 95 2508 961 -1193 206 1078 -964
2382 -964 -1425 594 385 -1521 -1535 139 67 -1121 -651 721 -194 -1533 25 1318 -216 -909 633
2399F33l02j214P12J188q36r81N02O67k76l29O06M22q54l36J157M40r64L2O54
2418I21o96n19P36J20o99k74r8%l9j70O6J97l99k64O65N30l64R6M08r7J75K65
2440E60J65J20j65m05K71L43o45k48N51n20r64O12N38p63l22M99R2k48P6M97L07
2461C51o12m7R00M6j029O33Q22j121p16J280J32j344RJ050m27q44O45P59m46o93
2481f52P55Q32q35n20J492J08j733L98J520j012j409J281N07j452n44J293l8j286
$$ plain form
2399 633 331 -883 -171 1017 181 -800 -298 369 93 -236 370 792 -62 -398 759 1199 235 267 921
2418 921 225 -294 442 562 -137 -411 -509 -509 -548 -718 -652 -455 -854 -1118 -453 77 -287 -191 217 120 295 560
2440 560 725 845 680 275 546 889 244 -4 547 27 -937 -325 213 -550 -872 -373 -281 -529 -453 44 351
2461 351 -261 -308 592 638 -391 242 1064 -57 -773 507 639 -705 -696 354 -73 -917 -272 487 41 -652
2481 -652 103 935 100 -420 1072 1180 -553 -155 1365 353 -1056 225 732 -720 -1264 29 -9 -1295
$$ [...]
8191e7
##END NTUPLES=NMR FID
##END=
